##TITLE=1H_TG-2384
 200.13MHz, DMSO,
 8 sc
 
 3.3.2025
##JCAMPDX= 6.0         $$ Bruker NMR JCAMP-DX V2.0
##DATA TYPE= NMR SPECTRUM
##DATA CLASS= NTUPLES
##ORIGIN= UXNMR, Bruker Analytische Messtechnik GmbH
##OWNER= pz
$$ XWIN-NMR		Version 3.5
$$ Mon Mar  3 14:04:12 2025 Russian Standard Time (UT+4h)  she@DPX200
##.OBSERVE FREQUENCY= 200.1313
##.OBSERVE NUCLEUS= ^1H
##.ACQUISITION MODE= SIMULTANEOUS
##.ACQUISITION SCHEME= undefined
##.AVERAGES= 8
##.DIGITISER RES= 18
##SPECTROMETER/DATA SYSTEM= spect
##.PULSE SEQUENCE= zg30
##.SOLVENT NAME= DMSO
##.SHIFT REFERENCE= (INTERNAL, DMSO, 0, 15.5112)
##AUDIT TRAIL= $$ (NUMBER, WHEN, WHO, WHERE, WHAT)
$$ ##TITLE= Audit trail, XWIN-NMR		Version 3.5
$$ ##JCAMPDX= 5.01
$$ ##ORIGIN= Bruker BioSpin GmbH
$$ ##OWNER= she
$$ F:/spectra/data/she/nmr/H-C/1/pdata/1/auditp.txt
$$ ##AUDIT TRAIL=  $$ (NUMBER, WHEN, WHO, WHERE, WHAT)
(   1,<2025-03-03 14:02:40.50 +0400>,<she>,<DPX200>,
      <created by zg, POWCHK disabled, PULCHK disabled
       configuration hash MD5:
       00 E9 B6 7A A2 85 ED C7 34 08 36 98 17 FE 4E 26
       data hash MD5: 16K
       65 E1 21 BA 83 E0 DF 7F 99 36 DF E9 44 7A 48 F6>)
(   2,<2025-03-03 14:02:46.01 +0400>,<she>,<DPX200>,
      <Start of raw data processing
       efp BC_mod = 2 LB = 0.25 FT_mod = 6 PKNL = 1 PHC0 = -464.5904 PHC1 = 11.99222 SI = 16K 
       data hash MD5: 16K
       E9 02 1F 97 2D 9E 6A 5B C6 2D CF CD 71 C3 58 47>)
(   3,<2025-03-03 14:03:11.20 +0400>,<she>,<DPX200>,
      <pk PHC0 = -5.832307 PHC1 = 4 
       data hash MD5: 16K
       94 0F D4 35 2D 48 E7 AD CB E4 B1 F9 92 EE D3 A4>)
(   4,<2025-03-03 14:03:15.04 +0400>,<she>,<DPX200>,
      <abs ABSG = 5 
       data hash MD5: 16K
       8E A5 F1 3D 3A F8 46 EB F8 73 30 ED AC AD 21 E9>)
$$ ##END=
$$ 
$$ hash MD5
$$ EF E7 15 15 D4 0A F6 3A 0A 84 6E D4 FD 51 B1 CD
##$RELAX= 
##$RELAX= 
##$RELAX= 
##$RELAX= 
##$RELAX= 
##$RELAX= 
$$ Bruker specific parameters
$$ --------------------------
##$DU= <F:/spectra>
##$EXPNO= 1
##$NAME= <H-C>
##$PROCNO= 1
##$TYPE= <nmr>
##$USER= <she>
##$AMP= (0..31)
100 100 100 100 100 100 100 100 100 100 100 100 100 100 100 100 100 100 
100 100 100 100 100 100 100 100 100 100 100 100 100 100 
##$AQSEQ= 0
##$AQ_mod= 1
##$AUNM= <au_zg>
##$AUTOPOS= <>
##$BF1= 200.13
##$BF2= 200.13
##$BF3= 200.13
##$BF4= 200.13
##$BF5= 200.13
##$BF6= 200.13
##$BF7= 200.13
##$BF8= 200.13
##$BYTORDA= 1
##$CFDGTYP= 0
##$CFRGTYP= 5
##$CHEMSTR= <none>
##$CNST= (0..31)
1 1 145 1 1 1 1 1 1 1 1 1 1 1 1 1 1 1 1 1 1 1 1 1 1 1 1 1 1 1 1 1 
##$CPDPRG= <>
##$CPDPRG1= <>
##$CPDPRG2= <>
##$CPDPRG3= <>
##$CPDPRG4= <mlev>
##$CPDPRG5= <mlev>
##$CPDPRG6= <mlev>
##$CPDPRG7= <mlev>
##$CPDPRG8= <mlev>
##$CPDPRGB= <>
##$CPDPRGT= <>
##$D= (0..31)
0 0.7 0 0 0 0 0 0 0 0 0 0.03 0 0 0 0 0 0 0 0 0 0 0 0 0 0 0 0 0 0 0 0 
##$DATE= 1740996159
##$DBL= (0..7)
120 120 120 120 120 120 120 120 
##$DBP= (0..7)
150 150 150 150 150 150 150 150 
##$DBP07= 0
##$DBPNAM0= <>
##$DBPNAM1= <>
##$DBPNAM2= <>
##$DBPNAM3= <>
##$DBPNAM4= <>
##$DBPNAM5= <>
$$ [...]
##$SUBNAM3= <"">
##$SUBNAM4= <"">
##$SUBNAM5= <"">
##$SUBNAM6= <"">
##$SUBNAM7= <"">
##$SUBNAM8= <"">
##$SUBNAM9= <"">
##$SW= 18.0517328524113
##$SWIBOX= (0..15)
0 0 2 0 0 0 0 0 0 0 0 0 0 0 0 0 
##$SW_h= 3612.71676300578
##$TD= 16384
##$TD0= 1
##$TE= 0
##$TE2= 300
##$TE3= 300
##$TEG= 300
##$TL= (0..7)
0 120 120 120 120 120 120 120 
##$TP= (0..7)
150 150 150 150 150 150 150 150 
##$TP07= 0
##$TPNAME0= <>
##$TPNAME1= <>
##$TPNAME2= <>
##$TPNAME3= <>
##$TPNAME4= <>
##$TPNAME5= <>
##$TPNAME6= <>
##$TPNAME7= <>
##$TPOAL= (0..7)
0.5 0.5 0.5 0.5 0.5 0.5 0.5 0.5 
##$TPOFFS= (0..7)
0 0 0 0 0 0 0 0 
##$TUNHIN= 0
##$TUNHOUT= 0
##$TUNXOUT= 0
##$USERA1= <user>
##$USERA2= <user>
##$USERA3= <user>
##$USERA4= <user>
##$USERA5= <user>
##$V9= 5
##$VALIST= <valist>
##$VCLIST= <CCCCCCCCCCCCCCC>
##$VD= 0
##$VDLIST= <DDDDDDDDDDDDDDD>
##$VPLIST= <PPPPPPPPPPPPPPP>
##$VTLIST= <TTTTTTTTTTTTTTT>
##$WBST= 1024
##$WBSW= 4
##$XGAIN= (0..3)
0 0 0 0 
##$XL= 0
##$YL= 0
##$YMAX_a= 360344
##$YMIN_a= -371187
##$ZGOPTNS= <>
##$ZL1= 120
##$ZL2= 120
##$ZL3= 120
##$ZL4= 120
##$ABSF1= 15.51
##$ABSF2= -2.541849
##$ABSG= 5
##$ABSL= 3
##$ALPHA= 0
##$AQORDER= 0
##$ASSFAC= 0
##$ASSFACI= 0
##$ASSFACX= 0
##$ASSWID= 0
##$AUNMP= <proc_1d>
##$AZFE= 0.1
##$AZFW= 0.1
##$BCFW= 0
##$BC_mod= 2
##$BYTORDP= 0
##$COROFFS= 0
##$CY= -3
##$DATMOD= 1
##$DC= 0
##$DFILT= <>
##$DTYPP= 0
##$F1P= 0
##$F2P= 0
##$FCOR= 1
##$FTSIZE= 16384
##$FT_mod= 6
##$GAMMA= 0
##$GB= 0
##$INTBC= 1
##$INTSCL= 3.241238e-09
##$ISEN= 128
##$LB= 0.25
##$LEV0= 0
##$LPBIN= 0
##$MAXI= 10000
##$MC2= 0
##$MEAN= 0
##$ME_mod= 0
##$MI= 1.114404
##$NCOEF= 0
##$NC_proc= -4
##$NLEV= 6
##$NOISF1= 3.799351
##$NOISF2= 2.8
##$NSP= 0
##$NTH_PI= 0
##$NZP= 0
##$OFFSET= 15.51121
##$PC= 1
##$PHC0= -470.4227
##$PHC1= 15.99222
##$PH_mod= 1
##$PKNL= yes
##$PPARMOD= 0
##$PSCAL= 0
##$PSIGN= 0
##$REVERSE= no
##$SF= 200.130002099008
##$SI= 16384
##$SIGF1= 3
##$SIGF2= 2
##$SINO= 0.751879
##$SIOLD= 32768
##$SREGLST= <19F.Aceton>
##$SSB= 0
##$STSI= 16384
##$STSR= 0
##$SW_p= 3612.71676300578
##$SYMM= 0
##$S_DEV= 0
##$TDeff= 16384
##$TDoff= 0
##$TI= <>
##$TILT= no
##$TM1= 0
##$TM2= 0
##$TOPLEV= 0
##$USERP1= <user>
##$USERP2= <user>
##$USERP3= <user>
##$USERP4= <user>
##$USERP5= <user>
##$WDW= 1
##$XDIM= 16384
##$YMAX_p= 513714501
##$YMIN_p= -115437
$$ End of Bruker specific parameters
$$ ---------------------------------
##NTUPLES= NMR SPECTRUM
##VAR_NAME=  FREQUENCY,     SPECTRUM/REAL,   SPECTRUM/IMAG
##SYMBOL=    X,             R,               I
##VAR_TYPE=  INDEPENDENT,   DEPENDENT,       DEPENDENT
##VAR_FORM=  AFFN,          ASDF,            ASDF
##VAR_DIM=   16384,         16384,           16384
##UNITS=     HZ,            ARBITRARY UNITS, ARBITRARY UNITS
##FACTOR=    0.220516191357247, 1,           1
##FIRST=     3104.25857823343, 0,            0
##LAST=      -508.458184772348, 0,           0
##MIN=       -508.458184772348, -115437,     0
##MAX=       3104.25857823343, 513714501,    0
$$ Real data points
##PAGE= N=1
##DATA TABLE= (X++(R..R)), XYDATA
$$ [...]
$$ plain form
9170 21308 34372 44926 2210 -47077 12806 6571 18144 -581 14234 26723 28961 27813
9158 27813 8573 20515 10361 5652 18345 24033 47150 57765 48859 53204 25592 28536 52779
9145 52779 61648 60072 76434 51317 13341 33978 33220 23579 3965 1419 -14135 -19486 12697
9132 12697 3632 17542 34189 34553 17858 5146 13769 22699 49128 30600 24455 21381 30909
9119 30909 28687 219 11480 4180 18615 23000 42445 61584 27906 -3333 -4328 17810 15181
9106 15181 -23515 13386 16434 29164 28145 7083 59619 55040 41376 35344 27949 22677 25682
9093 25682 26780 45219 14773 12105 -1625 -16790 1582 32929 27795 14873 16912 23663 12426
9080 12426 20582 72145 56914 26301 10577 6525 25056 -1319 -66 13873 21341 33570 22714
$$ packed form
9170B1308J3064J0554m2716m9287N9883o235J1573j8725J4815J2489K238j148
9158B7813j9240J1942j0154m709J2693N688K3117J0615q906M345k7612K944K4243
9145E2779Q869j576J6362k5117l7976K0637p58r641j9614k546j5554n351L2183
9132A2697r065J3910J6647L64j6695j2712Q623Q930K6429j8528o145l074R528
9119C0909k222k8468J1261p300J4435M385J9445J9139l3678l1239r95K2138k629
9106A5181l8696L6901L048J2730j019k1062N2536m579j3664o032p395n272L005
9093B5682J098J8439l0446k668j3730j5165J8372L1347n134j2922K039O751j1237
9080A2426Q156N1563j5231l0613j5724m052J8531k6375J253J3939P468J2229j0856
$$ plain form
9067 22714 5694 2707 -1759 527 18068 37466 32390 25353 38465 11596 -44349 -33428 -22476
9054 -22476 7206 15447 2878 -11785 -19154 -15876 -4900 -14366 -20615 -5896 -4301 -16987 -7236
9041 -7236 3658 12087 28135 27816 18422 20879 -3990 -7570 -27696 -28662 -41856 -46738 -13670 -16274
9027 -16274 -5570 8511 -17074 -31012 -350 16867 8726 8489 25607 10595 -12970 -33344
9015 -33344 -13131 -13430 -29565 -24347 -25906 -12318 -7073 -10866 13427 -15684 -19168 -1345 14652
9002 14652 2118 10340 -376 5779 -1572 -12203 6145 -21891 -39766 -27473 -27319 -16055 4190
8989 4190 -17939 -18984 -8506 -15545 -30507 -31692 -3330 -2012 15908 11616 -1067 25577 22927
8976 22927 28588 23544 2218 7219 -8934 9041 -303 -19391 -2788 17068 5100 20760 -2304
$$ packed form
9067B2714j7020k987m466K286J7541J9398n076p037J3112k6869n5945J0921J0952
9054b2476K9682Q241j2569j4663p369L278J0976r466o249J4719J595j2686R751
9041g236J0894Q429J6048l19r394K457k4869l580k0126r66j3194m882L3068k604
9027a6274J0704J4081k5585j3938L0662J7217q141k37J7118j5012k3565k0374
9015c3344K0213k99j6135N218j559J3588N245l793K4293k9111l484J7823J5997
9002A4652j2534Q222j0716O155p351j0631J8348k8036j7875J2293J54J1264K0245
8989D190k2129j045J0478p039j4962j185K8362J318J7920m292j2683K6644k650
8976B2927N661n044k1326N001j6153J7975r344j9088J6603J9856j1968J5660k3064
$$ plain form
8963 -2304 -225 2115 6959 6487 -16623 -22879 -27112 -2970 -19129 -5271 5481 -198 12052 -23701
8949 -23701 -10406 -5363 9922 7288 -16532 14358 4210 -6913 2515 -15941 4331 -18993
8937 -18993 -7127 26767 -11412 19002 16301 4780 -3408 -4868 -15423 -33039 -23241 -18031 -4217
8924 -4217 -3046 -18459 15373 40408 18513 -14652 -47212 -46388 16877 7764 2791 16290 11209
8911 11209 27807 13342 -5560 6310 22917 26574 49795 55834 33834 7089 0 -592 -17642
8898 -17642 4974 -26023 -25229 -20616 -27003 12874 -24108 -32099 -33557 -27910 9974 17904 -20955
8885 -20955 -19372 -6741 -2947 -18783 -6139 -11925 -5209 26862 20475 15463 -1055 12839 -1814
8872 -1814 -33859 -3365 21389 -20238 -41184 -23241 6415 -3358 -10777 2343 8322 23665 33391
$$ packed form
8963b304K079K340M844m72k3110o256m233K4142j6159J3858J0752n679J2250l5753
8949b3701J3295N043J5285k634k3820L0890j0148j1123R428j8456K0272k3324
8937a8993J1866L3894l8179L0414k701j1521q188j460j0555j7616R798N210J3814
8924d217J171j5413L3832K5035k1895l3165l2560Q24O3265r113m973J3499n081
8911A1209J6598j4465j8902J1870J6607L657K3221O039k2000k6745p089n92j7050
8898a7642K2616l0997P94M613o387L9877l6982p991j458N647L7884P930l8859
8885b0955J583J2631L794j5836J2644n786O716L2071o387n012j6518J3894j4653
8872a814l2045L0494K4754m1627k0946J7943K9656r773p419J3120N979J5343R726
$$ plain form
8859 33391 -9133 -14247 -5056 -2019 8616 -568 -14725 -18684 -40530 -19932 -35913 -26598 -8522
8846 -8522 10734 24823 19654 7882 8866 18286 28210 -4130 19355 -4389 -47086 -35238 16088
8833 16088 -7273 -53901 -52287 -48274 -26401 -27159 -27052 -53660 -4505 -19137 -14798 -2489 -12628
8820 -12628 -40780 -34828 -24880 -1437 80 7859 -297 -27334 -2379 -25376 -27865 -46951 -25026
8807 -25026 -7710 -39015 -18956 -21367 -26007 -24820 -13321 -13040 -33974 -24508 -9908 -15300 -24149
8794 -24149 -28074 5501 -6044 -43982 -1038 20232 15318 11017 -3405 1263 17877 19621 5647
8781 5647 -25083 -25202 -1958 -32990 -40295 -39471 -27978 -13803 -10898 212 1456 20002 -10062
8768 -10062 -41039 56 -15393 -12521 -30223 -29064 463 -17052 3618 -11775 -3141 -2040 -32048
$$ packed form
8859C3391m2524n114R191L037J0635r184j4157l959k1846K0598j5981R315J8076
8846h522J9256J4089n169j1772R84R420R924l2340K3485k3744m2697J1848N1326
8833A6088k3361m6628J614M013K1873p58J07k6608M9155j4632M339J2309j0139
8820a2628k8152N952R948K3443J517P779q156k7037K4955k2997k489j9086K1925
8807b5026J7316l1305K0059k411m640J187J1499K81k0934R466J4600n392q849
8794b4149l925L3575j1545l7938M2944K1270m914m301j4422M668J6614J744j3974
8781E647l0730j19K3244l1032p305Q24J1493J4175K905J1110J244J8546l0064
8768a0062l0977M1095j5449K872j7702J159K9527j7515K0670j5393Q634J101l0008
$$ plain form
8755 -32048 -16859 -13361 -21186 -18758 -39889 -54812 -5022 -2717 -26106 -15778 -35253 -37940 -28769
8742 -28769 -28583 -11685 -10381 -2481 -13096 -21144 5553 -16580 5636 40108 -21224 8436 240
8729 240 -37762 -20788 -20874 -24823 -33964 878 -12656 -2600 17514 49902 53114 24764 12386
8716 12386 498 -10576 -20879 -37949 -54285 -19205 -23897 -31648 -36688 -34900 -29279 -19731 -20507
8703 -20507 11499 -12852 -22737 -4101 -29210 -40267 -16269 -15590 -11818 7228 -8789 16892 3571
8690 3571 -414 2802 -35463 -21862 3384 -3126 -16594 -24573 -13078 3881 -7381 -35711 -58565
8677 -58565 -43214 -30615 14635 39414 48024 -9163 -27655 -6286 4025 32874 -11995 -19604
8665 -19604 -15930 -17330 -9942 -11677 -39005 -26565 -19567 -16026 -10862 10365 -5431 -23450 -40522
$$ packed form
8755c2048J5189L498p825K428k1131j4923M9790K305k3389J0328j9475k687R171
8742b8769J86J6898J304P900j0615q048K6697k2133K2216L4472o1332K9660q196
8729B40l8002J6974q6l949r141L4842j3534J0056K0114L2388L212k8350j2378
8716A2386j1888j1074j0303j7070j6336L5080m692p751n040J788N621R548p76
8703b0507L2006k4351r885J8636k5109j1057K3998O79L772J9046j6017K5681j3321
8690C571l985L216l8265J3601K5246o510j3468p979J1495J6959j1262k8330k2854
8677e8565J5351J2599M5250K4779Q610n7187j8492K1369J0311K8849m4869p609
8665a9604L674j400P388j735k7328J2440O998L541N164K1227j5796j8019j7072
$$ plain form
8652 -40522 -9421 -11624 8431 11930 6845 14776 -7628 2350 -31221 -27932 -14551 -15589 -17530
8639 -17530 -54174 -16839 -170 -15190 -17909 -28025 -40440 -16473 22458 2367 31261 19652
8627 19652 10469 1090 5672 27721 -4992 -14573 -4973 -28681 -14205 -12897 -37243 6950 -1317
8614 -1317 -19987 -996 -12505 -26435 -19677 -33932 -10246 -18007 -50081 -38675 -53005 -47179 -55837
8601 -55837 -58655 -27361 -6439 -7961 -35600 -23313 -30131 2117 -3161 -43123 -35767 -39082 -61829
8588 -61829 -42468 -43624 -55314 -25820 -34629 -25310 -15134 7910 18401 7689 28116 8047
8576 8047 -40436 -62674 -94117 -65627 -23147 -23202 -20066 -27720 -8671 -9116 -16605 -7927 -23423 -14042
8562 -14042 -9596 -9829 11572 26558 25481 19545 2759 -3622 -19620 -26819 -4628 69 -18846
$$ packed form
8652d0522L1101k203K0055L499n085P931k2404R978l3571L289J3381j038j941
8639a7530l6644L7335J6669j5020k719j0116j2415K3967L8931k0091K8894j1609
8627A9652r183r379M582K2049l2713r581R600k3708J4476J308k4346M4193q267
8614a317j8670J8991j1509j3930O758j4255K3686p761l2074J1406j4330N826q658
8601e5837k818L1294K0922j522k7639J2287o818L2248n278l9962P356l315k2747
8588f1829J9361j156j1690K9494q809R319J0176K3044J0491j0712K0427k0069
8576H047m8483k2238l1443K8490M2480n5L136p654J9049m45p489Q678j5496R381
8562a4042M446k33K1401J4986j077n936j6786o381j5998p199K2191M697j8915
$$ plain form
8549 -18846 -20386 -29629 -17849 6737 17402 -12814 -5662 709 -2923 -10303 -6784 -19368 -8421
8536 -8421 4979 -15854 -20235 3862 45320 31635 26886 573 19025 -732 -19206 -23102 -30177
8523 -30177 -15312 1138 -9022 -6837 -7346 -47507 -28418 -32448 -25914 -14757 -41972 -38664 -19980
8510 -19980 -19399 -12821 -19651 -28319 -37364 -14464 -33121 -67169 -22073 -16897 -33019 -32008 -28046 -33585
8496 -33585 -53700 -37262 -41958 -28531 -46459 -47487 -13920 15472 2887 -11677 -47498 -10504
8484 -10504 -12267 7334 24786 4661 3253 6670 19690 -29141 -21951 -23571 -1526 7602 -7730
8471 -7730 -15709 10069 9141 -1752 5665 -995 -2414 13969 5410 -11884 500 7879 -18081 -32751
8457 -32751 -38553 -28666 -15613 -5682 7350 -40529 -46427 -28475 -31818 -28685 -44009 -60829 -75144
$$ packed form
8549a8846j540r243J1780K4586J0665l0216P152O371l632p380L519j2584J0947
8536h421J3400k0833m381K4097M1458j3685m749k6313J8452j9757j8474l896p075
8523c0177J4865J6450j0160K185n09m0161J9089m030O534J1157k7215L308J8684
8510a9980N81O578o830q668r045K2900j8657l4048M5096N176j6122J011L962n539
8496c3585k0115J6438m696J3427j7928j028L3567K9392j2585j4564l5821L6994
8484a0504j763J9601J7452k0125j408L417J3020m8831P190j620K2045R128j5332
8471g730p979K5778r28j0893P417o660j419J6383q559j7294J2384P379k5960j4670
8457c2751n802R887J3053R931J3032m7879n898J7952l343L133j5324j6820j4315
$$ plain form
8444 -75144 -41007 -42442 -57805 -66076 -72818 -69711 -60724 -36066 -18391 -42673 -44163 -80547 -63838
8431 -63838 -29045 6260 1081 1387 7818 4932 21301 -13068 2558 7858 -25123 -46609 -33144
8418 -33144 -42022 -37044 -42563 -19122 -1041 12152 34273 10241 -2713 11641 11974 -26865 -13134
8405 -13134 -4193 16209 -148 -10543 -30324 -45562 -55692 -69541 -28161 -13416 -6013 -21951
8393 -21951 -32821 -143 4105 -24590 -13836 -11534 12414 -4588 -15177 -32148 -16362 1282
8381 1282 14913 -10534 -2806 22346 7574 -13444 -17693 1744 -16996 -3917 1336 3924 778
8368 778 17019 24096 14081 -11850 -44906 -40023 -17962 -14711 -35833 -32707 -21288 10341 19078
8355 19078 15315 19763 12091 14789 15747 19164 -11253 -12673 62 6652 4761 3219 -39873 -11473
$$ packed form
8444g5144L4137j435j5363q271o742L107Q987K4658J7675k4282j490l6384J6709
8431f3838L4793L5305n179L06O431k886J6369l4369J5626N300l2981k1486J3465
8418c3144q878M978n519K3441J8081J3193K2121k4032j2954J4354L33l8839J3731
8405a3134Q941K0402j6357j0395j9781j5238j0130j3849M1380J4745P403j5938
8393b1951j0870L2678M248k8695J0754K302K3948j7002j0589j6971J5786J7644
8381A282J3631k5447P728K5152j4772k1018m249J9437j8740J3079N253K588l146
8368G78J6241P077j0015k5931l3056M883K2061L251k1122L126J1419L1629Q737
8355A9078l763M448p672K698R58L417l0417j420J2735O590j891j542m3092K8400
$$ plain form
8341 -11473 13870 -16199 -39623 -31198 3693 -34512 -78619 -45449 1005 20496 -13875 -33202
8329 -33202 -19502 -29096 -39680 -35169 -19391 -11633 -34227 -22900 -33696 -51924 -28448 8406
8317 8406 -936 -48438 -26637 -6633 -6952 -6730 -37205 -17986 -12726 -45184 -8669 744 3615 -1691
8303 -1691 419 14782 21222 26752 57830 28597 16180 1911 -3511 -26638 -11580 -24378 -26065
8290 -26065 8709 -31006 -36097 -14602 -31044 -49314 -40875 -30405 -28546 -4411 -13819 -27839 -31802
8277 -31802 -34751 -6391 4954 -26274 -35537 -39848 -58874 -39868 -46499 -25382 -9845 -20604 -2847
8264 -2847 -22574 -19334 3968 -33247 -45567 -22033 -12103 -28475 -21772 -24569 -1735 -1470 -32397
8251 -32397 -32897 -15734 -11934 1677 -23769 12380 23863 3933 -3828 -5444 2451 -8468 5176
$$ packed form
8341a1473K5343l0069k3424Q425L4891l8205m4107L3170M6454J9491l4371j9327
8329c3202J3700r594j0584M511J5778P758k2594J1327j0796j8228K3476L6854
8317H406r342m7502K1801K0004l19K22l0475J9219N260l2458L6515R413K871n306
8303a691K110J4363O440N530L1078k9233j2417j4269n422k3127J5058j2798j687
8290b6065L4774l9715n091K1495j6442j8270Q439J0470J859K4135r408j4020l963
8277c1802k949K8360J1345l1228r263m311j9026J9006o631K1117J5537j0759J7757
8264b847j9727L240K3302l7215j2320K3534R930j6372O703k797K2834K65l0927
8251c2397n00J7163L800J3611k5446L6149J1483j9930p761j616P895j0919J3644
$$ plain form
8238 5176 -18111 -10283 23309 20380 14007 29832 20458 3939 -27352 2218 20469 -10250 -30296
8225 -30296 -33527 -15137 -14921 -11352 -25395 -61945 -54130 -12918 14302 -2104 -19581 -42753 -44726
8212 -44726 -7748 12726 -15710 -7904 10713 1906 -1552 -41086 -13849 -487 1777 8825 -1929
8199 -1929 11266 8679 -509 6081 4986 1408 -16106 -115437 -88070 9524 -10021 -12672 25278
8186 25278 4905 -35470 -33259 -34969 16011 14544 -24465 -687 -10657 -15385 396 277 23019
8173 23019 26147 -23805 -28923 -10013 -27439 -33283 -14158 -9788 -10712 2386 -14262 -18431 -15904
8160 -15904 -9407 -19234 -32371 -2937 -2877 -4696 9653 10320 6127 -22923 -39958 -28636 -9054 -24717
8146 -24717 -14042 -34557 -12616 3011 -22211 -4551 -10735 4810 5640 -15123 -16281 -6287 0
$$ packed form
8238E176k3287P828L3592k929o373J5825r374j6519l1291K9570J8251l0719k0046
8225c0296l231J8390K16L569j4043l6550P815M1212K7220j6406j7477k3172j973
8212d4726L6978K0474k8436P806J8617q807l458l9534K7237J3362K264P048j0754
8199a929J3195k587r188O590j095l578j7514r9331K7367R7594j9545k651L7950
8186B5278k0373m0375K211j710N0980j467l9009K3778r970m728J5781j19K2742
8173B3019L128m9952n118J8910j7426n844J9125M370r24J3098j6648m169K527
8160a5904O497r827j3137K9434O0j819J4349O67m193k9050j7035J1322J9582j5663
8146b4717J0675k0515K1941J5627k5222J7660o184J5545Q30k0763j158R994O287
$$ plain form
8133 0 9700 -11737 -38642 -60763 -49746 -42826 -52806 -47697 -20959 -21515 -21214 -12429 -27446 -16183
8119 -16183 -5310 2856 574 7067 496 -41747 -38944 -43080 -12017 -29234 -30482 -21549 -24311 -19125
8105 -19125 -19695 -50136 -57309 7066 11623 5534 10135 -7313 3156 -7578 -16766 7602 -19158
8092 -19158 -22417 -15250 -15898 -9778 17561 -12923 -32117 -41416 14349 23720 -10565 -10600 -13119 -22452
8078 -22452 -24249 -13656 26619 12704 3919 -10405 -11139 -8625 1378 14427 -12167 -16434 6510
8065 6510 13448 -10154 -12523 -3361 -28546 -29899 -118 -13361 -14556 -18349 2780 7201 -12870
8052 -12870 -31001 -28147 -61432 -73145 -63679 -53817 -49883 -49038 -57363 -60648 -40643 -28032 -31540 -7648
8038 -7648 769 -4673 -4150 -19823 -10483 -37050 -51530 -34209 -43473 -38763 -39092 -15177 -23155 -44567
$$ packed form
8133@R700k1437k6905k2121J1017O920r980N109K6738n56L01Q785j5017J1263
8119a6183J0873Q166k282O493o571m2243K803m136L1063j7217j248Q933k762N186
8105a9125n70l0441p173O4375M557o089M601j7448J0469j0734r188K4368k6760
8092a9158l259P167o48O120K7339l0484j9194r299N5765R371l4285l5k519r333
8078b2452j797J0593M0275j3915q785j4324p34K514J0003J3049k6594m267K2944
8065F510O938k3602k369R162k5185j353K9781j3243j195l793K1129M421k0071
8052a2870j8131K854l3285j1713R466R862L934Q45q325l285K0005J2611l508K3892
8038g648Q417n442N23j5673R340k6567j4480J7321r264M710l29K3915p978k1412
$$ plain form
8024 -44567 -30508 -39792 -77271 -77209 -46430 -33493 -47830 -8394 -15216 -40365 -43939 -5089 2718
8011 2718 4177 -36380 -54168 -74871 -55614 -27726 -35346 -38700 -18372 -20086 -26741 -8747 -27858
7998 -27858 -6889 -5181 -25781 9041 33514 -9957 3332 -383 -19614 -22828 -27662 -6805 1221
7985 1221 -8882 -18760 -34397 -17099 -38195 -2642 1510 -4305 7171 20119 16872 -22806 -65858
7972 -65858 -28902 -4740 -12112 -13141 -4609 -13209 -53365 -37484 -38225 -32070 6846 -8993 -9581 -39369
7958 -39369 -31664 -29327 -11383 -5479 -11661 -5748 -47827 -25092 -26562 -15728 4470 -24480 -5072
7945 -5072 -8510 -21878 -17276 -34552 -25662 -34167 -14655 -35872 -59459 -23986 -12608 -36587 -3496
7932 -3496 26597 12207 6343 17396 1507 -5302 -13222 -22532 -4225 -27439 -57546 -40218 -56510
$$ packed form
8024d4567J4059r284l7479O2L0779J2937j4337L9436o822k5149l574L8850P807
8011B718J459m0557j7788k0703J9257K7888p620l354K0328j714o655J7994j9111
7998b7858K0969J708k0600L4822K4473m3471J3289l715j9231l214m834K0857Q026
7985A221j0103r878j5637J7298k1096L5553M152n815J1476J2948l247l9678m3052
7972f5858L6956K4162p372j029Q532q600m0156J5881p41O155L8916j5839n88k9788
7958c9369P705K337J7944N904o182N913m2079K2735j470J0834K0198k8950J9408
7945e072l438j3368M602j7276Q890q505J9512k1217k3587L5473J1378k3979L3091
7932c496L0093j4390n864J1053j5889o809p920r310J8307k3214l0107J7328j6292
$$ plain form
7919 -56510 -44234 -35329 -32489 10201 -4289 -14628 320 -12297 -26680 -4724 7038 -9912
7907 -9912 -23080 -25206 -13373 -9577 -15751 -2001 -28700 -19615 -4754 -10430 3096 -6183 -5403 -11066
7893 -11066 -12978 -16802 -31971 -14852 328 -828 18820 5059 -20841 -40150 -55182 -31706
7881 -31706 -33417 -26480 2653 12299 -27709 -25252 -32913 -10778 19719 5162 -30566 -23209 -38625
7868 -38625 -40681 -10059 -9888 409 -20239 -38830 -36910 -45925 -50497 -16169 1610 4171 -2919
7855 -2919 -24799 -9012 -4860 3492 -5758 -41515 -54542 -34097 -24495 -34348 -23073 -33261 -4134
7842 -4134 26299 27546 25377 15768 -16599 -21441 -43117 -30332 -46827 -24509 -5701 3972 27857
7829 27857 11879 -8820 -7782 -34079 -36942 -13897 11309 13156 -3893 17494 15556 -13228 -25161
$$ packed form
7919e6510J2276Q905K840M2690j4490j0339J4948j2617j4383K1956J1762j6950
7907i912j3168k126J1833L796o174J3750k6699R085J4861n676J3526r279P80n663
7893a1066j912l824j5169J7119J5180j156J9648j3761k5900j9309j5032K3476
7881c1706j711O937K9133R646m0008K457p661K2135L0497j4557l5728P357j5416
7868c8625k056L0622J71J0297k0648j8591J920r015m572L4328J7779K561p090
7855b919k1880J5787M152Q352r250l5757j3027K0445R602r853J1275j0188K9127
7842d134L0433J247k169r609l2367m842k1676J2785j6495K2318J8808R673K3885
7829B7857j5978k0699J038k6297k863K3045K5206J847j7049K1387j938k8784j1933
$$ plain form
7816 -25161 -4496 31142 24812 27195 48355 18928 16054 55327 27089 -22950 -27110 -44927 -51667
7803 -51667 -25482 -27382 -35416 -32102 5248 10972 -44490 -29404 -12199 -15245 -2153 26592 33559
7790 33559 29683 -5358 -38471 -27485 -29629 -24784 -17946 3228 -13571 -19559 -19306 -16833 -26252 -25490
7776 -25490 2685 -36624 -9538 32778 50393 8058 -5108 -14256 -1134 15514 -43880 -19730
7764 -19730 -20273 -42603 -22494 -36624 -24069 -19793 -18262 -15823 -37905 -23229 -25046 -40948 -61055
7751 -61055 -47041 -37228 -24399 13981 11802 -493 -1563 361 -23712 -14873 -38018 -40258 -21928
7738 -21928 -21269 16993 1439 -11284 -14906 -33297 -30998 -27519 -9520 12517 -13641 -34791 -8387
7725 -8387 1325 -4343 -38248 -25231 -18460 -15928 -52432 -52082 -19629 11513 43233 22847 15584
$$ packed form
7816b5161K0665L5638o330K383K1160k9427k874L9273k8238n0039m160j7817o740
7803e1667K6185j900q034L314L7350N724n5462J5086J7205l046J3092K8745O967
7790C3559l876l5041l3113J0986k144M845O838K1174j6799n988K53K473r419P62
7776b5490K8175l9309K7086M2316J7615m2335j3166r148J3122J6648n9394K4150
7764a9730n43k2330K0109j4130J2555M276J531K439k2082J4676j817j5902k0107
7751f1055J4014R813J2829L8380k179j2295j070J924k4073Q839k3145k240J8330
7738b1928O59L8262j5554j2723l622j8391K299L479J7999K2037k6158k1150K6404
7725h387R712n668l3905J3017O771K532l6504L50L2453L1142L1720k0386p263
$$ plain form
7712 15584 3691 -11994 -34641 -35848 3238 11140 -11060 -9534 -10597 4045 -5541 10890 20406
7699 20406 -16409 -21340 -7265 12714 -26796 -20177 2819 13894 16245 21548 11408 -720 31030
7686 31030 4323 30535 12525 -3503 -3293 -1216 -11747 10810 19724 22374 -12075 -17082 -1244
7673 -1244 26885 50562 16127 22051 57976 65059 25382 742 36480 44315 91078 113679 86086
7660 86086 67885 77443 93284 97407 91586 51711 48807 25999 22644 22745 33011 38579 41266 76659
7646 76659 85105 43952 48997 41361 38182 30175 42634 50061 47182 30042 50021 46213 51777 65562
7632 65562 85250 58405 57981 74020 62712 66862 57941 48268 43902 49781 13490 -17752 -13156
7619 -13156 18294 42322 32767 48623 29128 26935 39439 41255 34884 37485 30750 3482 5225
$$ packed form
7712A5584j1893j5685k2647j207L9086P902k2200J526j063J4642r586J6431R516
7699B0406l6815m931J4075J9979l9510O619K2996J1075K351N303j0140j2128L1750
7686C1030k6707K6212j8010j6028K10K077j0531K2557Q914K650l4449n007J5838
7673a244K8129K3677l4435N924L5925P083l9677k4640L5738P835M6763K2601k7593
7660H6086j8201R558J5841M123n821l9875k904k2808l355J01J0266N568K687L5393
7646G6659Q446m1153N045p636l179q007J2459P427k879j7140J9979l808N564J3785
7632F5562J9688k6845m24J6039j1308M150q921r673m366N879l6291l1242M596
7619a3156L1450K4028r555J5856j9495k193J2504J816o371K601o735k7268J743
$$ plain form
7606 5225 -8728 -8717 10980 7609 -7157 18026 32165 27888 24150 28733 14750 1207 3850 15904
7592 15904 243 4451 -4201 28458 12082 8938 -11506 2473 22440 5329 27139 8910
7580 8910 -8631 -7554 -12856 -7526 530 -727 -2209 3137 -7282 -46001 -15027 -27244 -35147 8353
7566 8353 7556 -28120 -63080 -16414 -3348 -38786 -5513 7047 -28993 -3852 14827 69
7554 69 14666 17764 36115 10246 1957 2716 6379 21704 -8363 10430 44960 43966 4550 -4883
7540 -4883 -6842 -16505 -35379 -33514 -9666 -14369 -8391 -4128 6163 -20488 -19496 -13137 -4968 -3803
7526 -3803 -4862 12058 -12855 -5499 -10115 -9310 35180 40494 25652 -9151 -25060 -7795 12208
7513 12208 14450 18058 11938 23848 5508 -24040 -4484 -21646 -33922 -23170 8583 48901
$$ packed form
7606E225j3953J1J9697l371j4766K5183J4139m277l738M583j3983j3543K643J2054
7592A5904j5661M208q652L2659j6376l144k0444J3979J9967j7111K1810j8229
7580H910j7541J077n302N330Q056j257j482N346j0419l8719L0974j2217p903M3500
7566H353p97l5676l4960M6666J3066l5438L3273J2560l6040K5141J8679j4758
7554F9J4597L098J8351k5869q289P59L663J5325l0067J8793L4530r94l9416r433
7540d883j959r663j8874J865K3848m703N978M263J0291k6651R92O359Q169J165
7526c803j059J6920k4913P356m616Q05M4490N314j4842l4803j5909J7265K0003
7513A2208K242L608o120J1910j8340k9548J9556j7162j2276J0752L1753M0318
$$ plain form
7501 48901 28484 -2354 15237 24967 1119 -10260 22504 6638 -21887 -30873 949 9549
7489 9549 6915 -15237 -11976 -15741 -12308 -15558 -25343 -3557 15491 23957 189 18662 23031 -6381
7475 -6381 -485 -7699 -6027 -3971 36442 13391 -39594 -48332 -19241 -34987 -30759 -41907 -16827
7462 -16827 2994 7050 -1582 -53243 -23952 -7501 -1488 -14791 8366 322 -18725 -12750 27551
7449 27551 7127 4997 7734 12015 6705 3652 -5021 -9286 -5527 26718 9750 12202 5743 -12830
7435 -12830 -18939 -18260 -14118 -10656 -8452 3819 16222 10794 -12917 -21256 3450 33688 55062
7422 55062 42540 28850 26480 46099 54912 23657 1020 -16132 15654 19434 -6688 11825
7410 11825 39424 32375 16890 47664 64366 55424 38600 37454 30476 73333 80189 35254 38064
$$ packed form
7501D8901k0417l0838J7591R730k3848j1379L2764j5866k8525q986L1822Q600
7489I549k634k2152L261l765L433l250r785K1786J9048Q466k3768J8473M369k9412
7475f381N896p214J672K056M0413k3051n2985q738K9091j5746M228j1148K5080
7462a6827J9821M056q632n1661K9291J6451O013j3303K3157q044j9047N975M0301
7449B7551k0424k130K737M281n310l053q673m265L759L2245j6968K452o459j8573
7435a2830o109O79M142L462K204J2271J2403n428k3711q339K4706L0238K1374
7422E5062j2522j3690k370J9619Q813l1255k2637j7152L1786L780k6122J8513
7410A1825K7599p049j5485L0774J6702q942j6824j146o978M2857O856m4935K810
$$ plain form
7397 38064 23766 21558 31381 37897 25224 5198 1673 6087 3898 37423 59107 50425 38155
7384 38155 49677 31135 -11985 -18565 -33009 13945 37064 22634 1216 -1187 -2970 12976
7372 12976 20717 36805 15014 -12169 9830 5855 -9768 -21506 -21966 -37705 -3899 16898 -2537
7359 -2537 -25318 -23730 -34742 -42282 -40933 -22307 -7348 -28667 12552 19458 -20172 -3762 16473
7346 16473 -7123 194 -19200 11815 21879 4696 -1464 -12098 -12933 -15202 -32709 -6705 -1352
7333 -1352 10893 -7267 -3353 15346 -7480 13077 24413 10882 -11553 -18606 4718 15368
7321 15368 32941 3664 8604 -4687 18533 37352 30826 33552 14387 3091 -4348 15725 5477
7308 5477 23380 12235 22522 39437 4007 -36774 -22392 10308 22782 24673 11599 28866
$$ packed form
7397C8064j4298k208R823O516j2673k0026l525M414k189L3525K1684q682j2270
7384C8155J1522j8542m3120o580j4444M6954K3119j4430k1418k403j783J5946
7372A2976P741J6088k1791k7183K1999l975j5623j1738m60j5739L3806K0797j9435
7359b537k2781J588j1012p540J349J8626J4959k1319M1219O906l9630J6410K0235
7346A6473k3596P317j9394L1015J0064j7183o160j0634q35k269j7507K6004N353
7333a352J2245j8160L914J8699k2826K0557J1336j3531k2435p053K3324J0650
7321A5368J7573k9277M940j3291K3220J8819o526K726j9165j1296p439K0073j0248
7308E477J7903j1145J0287J6915l5430m0781J4382L2700J2474J891j3074J7267
$$ plain form
7296 28866 11586 -19217 -8631 -29675 20293 22750 6086 -4070 9505 5570 1323 13479
7284 13479 4785 -2509 -21929 -15260 -28570 -4399 14438 -7384 13784 -10684 -19027 17776 19574
7271 19574 38304 21017 4695 -3845 21588 45301 49778 67732 61264 41240 13464 14844 17390
7258 17390 -920 16151 15302 32970 35615 11374 19753 14324 29870 25081 25434 61606 40293
7245 40293 21059 41214 41550 25563 -11403 -24229 8012 -12980 16444 22666 17642 25541 7463
7232 7463 5411 14404 30388 28865 43094 31108 67528 46992 15826 7545 993 4011 21789
7219 21789 29322 25135 35579 42342 45166 46716 60074 76158 55500 42535 82655 74316 46179
7206 46179 36351 26657 56001 59095 86665 86061 103504 95460 90714 84764 96282 115856 84389
$$ packed form
7296B8866j7280l0803J0586k1044M9968K457j6664j0156J3575l935m247J2156
7284A3479q694p294j9420O669j3310K4171J8837k1822K1168k4468q343L6803J798
7271A9574J8730j7287j6322q540K5433K3713M477J7954o468k0024k7776J380K546
7258A7390j8310J7071q49J7668K645k4241Q379n429J5546m789L53L6172k1313
7245D0293j9234K0155L36j5987l6966j2826L2241k0992K9424O222n024P899j8078
7232G463k052Q993J5984j523J4229j1986L6420k0536l1166q281o552L018J7778
7219B1789P533m187J0444O763K824J550J3358J6084k0658j2965M0120q339k8137
7206D6179r828r694K9344L094K7570o04J7443q044m746n950J1518J9574l1467
$$ plain form
7193 84389 76831 90009 111707 113095 116142 126579 135537 164405 159295 164232 177884 172450 176663
7180 176663 203178 209689 169647 181624 245233 241563 234061 243577 254255 307496 328297 344860
7168 344860 391827 409753 428972 464870 549796 608477 618037 667203 707386 754041 823807 894911
7156 894911 960775 986299 1005729 999716 941552 957260 989061 987412 988822 1015753 979385 970556
7144 970556 954417 902547 881416 835148 786526 750672 678114 596553 562636 538507 476392 433600
7132 433600 386649 360784 325404 319226 291771 269096 277576 244204 223019 221100 229618 238307 212437
7119 212437 177521 176387 182285 179285 196138 138918 149096 135617 107564 105866 71017 59356
7107 59356 83125 72470 86162 103599 102656 104196 86721 93174 68917 83578 68559 64293 44745
$$ packed form
7193H4389p558J3178K1698J388L047J0437Q958K8868n110M937J3652n434M213
7180A76663K6515O511m0042J1977O3609l670p502R516J0678N3241K0801J6563
7168C44860M6967J7926J9219L5898Q4926N8681R560M9166M0183M6655O9766P1104
7156H94911O5864K5524J9430o013n8164J5708L1801j649J410K6931l6368q829
7144I70556j6139n1870k1131m6268m8622l5854p2558q1561l3917k4129o2115m2792
7132D33600m6951k5865l5380o178k7455k2675Q480l3372k1185j919Q518Q689k5870
7119B12437l4916j134N898l000J6853n7220J0178j3479k8053j698l4849j1661
7107E9356K3769j0655J3692J7437r43J540j7475O453k4257J4661j5019m266j9548
$$ plain form
7094 44745 56790 50357 52434 86376 69244 36927 13732 23535 45624 36282 55118 85932 59414
7081 59414 48320 36901 48113 45041 32803 45525 51146 64603 51903 23171 40201 51497
7069 51497 46455 42502 31333 10416 27900 22388 22269 34389 -4589 -11531 -376 -13657 4199
7056 4199 14539 6395 -19162 20190 10935 20552 72388 12214 14869 32333 49952 51848 43946
7043 43946 45978 -3566 -12313 22195 39709 27422 40233 11432 -26875 11557 17867 8772 -82
7030 -82 609 5117 -10223 6100 1600 -17007 42649 34049 25065 4135 -14697 7360 14905 -7052
7016 -7052 720 -12641 11883 11101 357 6330 -988 -3113 -3624 14872 22731 16821 31927 11873
7002 11873 19937 12470 -18666 18983 51389 11878 39174 36553 15010 27367 7524 18883
$$ packed form
7094D4745J2045o433K077L3942j7132l2317k3195R803K2089r342J8836L0814k6518
7081E9414j1094j1419J1212l072j2238J2722N621J3457j2700k8732J7030J1296
7069E1497n042l953j1169k0917J7484n512j19J2120l8978o942J1155j3281J7856
7056D199J0340q144k5557L9352r255R617N1836o0174K655J7464J7619J896p902
7043D3946K032m9544q747L4508J7514j2287J2811k8801l8307L8432O310r095q854
7030h2O91M508j5340J6323m500j8607N9656q600q984k0930j8832K2057P545k1957
7016g052P772j3361K4524p82j0744N973p318k125n11J8496P859n910J5106k0054
7002A1873Q064p467l1136L7649L2406l9511K7296k621k1543J2357j9843J1359
$$ plain form
6990 18883 -4961 -5227 17694 17861 10257 -7710 -4794 4869 5206 -18256 -18638 6139 1131 -10888
6976 -10888 -16094 8939 -11680 8754 453 -27476 -25846 -18479 -14761 -11473 19771 33701 6275
6963 6275 -18090 -32180 -15701 18321 13046 15259 -18784 -8204 2648 -6870 18653 32471 29440
6950 29440 15076 6438 -17238 10389 -6405 -1826 29823 37223 29137 22466 19110 21349 -13746
6937 -13746 -18273 8199 3789 27116 12375 5969 14815 7448 -16616 -5518 -3045 -18472 -8001
6924 -8001 -29284 -19974 -13363 -19772 -19770 -29652 -13291 -13419 -6883 -7570 312 12461 5392 19644 -840
6909 -840 5619 23329 35688 23003 -10629 15349 14365 28969 -1650 33163 34173 27746 6644
6896 6644 -13780 -8846 -9171 -7711 16282 31214 15440 6639 -31227 -28330 -28267 -13177 -13700 14738
$$ packed form
6990A8883k3844k66K2921J67p604j7967K916R663L37k3462l82K4777n008j2019
6976a0888n206K5033k0619K0434q301k7929J630P367L718L288L1244J3930k7426
6963F275k4365j4090J6479L4022n275K213l4043J0580J0852r518K5523J3818l031
6950B9440j4364q638k3676K7627j6794M579L1649P400q086o671l356K239l5095
6937a3746m527K6472m410K3327j4741o406Q846p367k4064J1098K473j5427J0471
6924h001k1283R310O611o409Kr882J6361j28O536o87P882J2149p069J4252k0484
6909h40O459J7710J2359j2685l3632K5978r84J4604l0619L4813J010o427k1102
6896F644k0424M934l25J460K3993J4932j5774q801l7866K897O3J5090n23K8438
$$ plain form
6882 14738 28199 24174 23212 1753 -27581 7246 15678 -11645 -7112 -12481 -30829 -35821 -59792
6869 -59792 -20582 -9539 23258 9445 -20354 -25993 35377 9828 -30809 -32306 -3751 -4144 -12802
6856 -12802 -17583 -38618 -17334 -4674 -1952 -16676 -27421 7410 7936 14659 24169 10773 35395
6843 35395 32988 24167 22048 -1511 -12450 -27790 -24185 -14432 -53449 -24194 -23748 -7743 -20661
6830 -20661 -21675 -6470 -17926 -26186 -48392 -34644 2891 -800 -24837 -23921 19868 1749 -944
6817 -944 -22297 -5319 12661 -15840 -18177 -39427 -40541 -23155 -27668 -1607 -3031 1100 -19699
6804 -19699 5035 32848 16694 18498 23144 34081 33119 4192 4013 7900 11711 11108 25938 3452
6790 3452 -3643 -15242 18104 30221 3995 -2297 -4636 5021 8770 -10554 -21828 11624 740
$$ packed form
6882A4738J3461m025r62k1459k9334L4827Q432k7323M533n369j8348m992k3971
6869e9792L9210J1043L2797j3813k9799n639O1370k5549m0637j497K8555l93q658
6856a2802m781k1035K1284J2660K722j4724j0745L4831N26O723R510j3396K4622
6843C5395k407q821k119k3559j0939j5340L605R753l9017K9255M46J6005j2918
6830b0661j014J5205j1456q260k2206J3748L7535l691k4037R16M3789j8119k693
6817i44k1353J6978J7980k8501k337k1250j114J7386m513K6061j424M131k0799
6804a9699K4734K7813j6154J804M646J0937r62k8927j79L887L811o03J4830k2486
6790C452p095j1599L3346J2117k6226o292k339R657L749j9324j1274L3452j0884
$$ plain form
6777 740 -10530 -29550 -35857 -11666 37042 -18391 -12789 5479 -762 11091 -9753 -11485 -18574
6764 -18574 11715 40555 19711 9315 -12548 -29369 -10027 5928 -20330 -11090 -1932 -19805
6752 -19805 -63219 -55642 -19043 11298 24719 -16223 -1536 26032 1520 -11050 -9536 9891
6740 9891 3414 4165 -8030 6322 28808 -16990 -5061 -19697 -15112 18300 26889 3367 8733
6727 8733 11517 24761 8918 11704 15837 13253 -9687 3454 -9720 -29576 -26306 -18447 -7534
6714 -7534 -21861 -28814 -23907 -15716 -18215 5475 8572 17875 21724 22561 -2154 -32398 -50380 -48504
6700 -48504 -23535 4486 28644 26915 -18373 -6589 770 -9274 -8462 4707 27656 41865 35948
6687 35948 35013 7330 -2062 6441 -19533 2677 10984 -33142 -42980 -35031 -13689 17207 27921
$$ packed form
6777G40j1270j9020o307K4191M8708n5433N602J8268o241J1853k0844j732p089
6764a8574L0289K8840k0844j0396k1863j6821J9342J5955k6258R240R158j7873
6752a9805m3414P577L6599L0341J3421m0942J4687K7568k4512j2570J514J9427
6740I891o477P51j2195J4352K2486m5798J1929j4636M585L3412Q589k3522N366
6727H733K784J3244j5843K786M133k584k2940J3141j3174j9856L270P859J0913
6714g534j4327o953M907Q191k499K3690L097R303L849Q37k4715l0244j7982J876
6700d8504K4969K8021K4158j729m5288J1784P359j0044Q12J3169K2949J4209n917
6687C5948r35k7683r392Q503k5974K2210Q307m4126r838P949K1342L0896J0714
$$ plain form
6674 27921 16763 2439 -15027 -22559 -44339 -21481 5563 14499 -11675 -32877 -41591 -16193
6662 -16193 -1362 4005 -5836 -2323 2376 -16804 -33165 -6319 -5527 -6615 -6401 -28965 -33070 -7817
6648 -7817 10517 12301 28917 11479 -6338 14318 21439 -2171 -9441 -39539 -48956 -7562 -1326
6635 -1326 3262 15172 -3338 8107 -756 -13244 8033 43013 22153 -12557 -12727 19654 4820
6622 4820 -7080 12120 24553 3327 -21557 -10120 -1275 -1944 7555 6389 15160 34542 54973
6609 54973 44511 -5842 -33546 -41159 -54543 -36848 -25786 -12027 -27962 2994 58191 53629
6597 53629 47371 9096 -701 -21045 -7084 51428 10688 773 2274 -30354 -41720 -48286 -37204
6584 -37204 -17774 -21186 -38315 -7537 20644 19820 -1477 1069 -9650 -25817 -34084 -32826 -32128
$$ packed form
6674B7921j1158j4324j7466p532k1780K2858K7044Q936k6174k1202q714K5398
6662a6193J4831N367r841L513M699j9180j6361K6846P92j088K14k2564m105K5253
6648g817J8334J784J6616j7438j7817K0656P121k3610p270l0098r417M1394O236
6635a326M588J1910j8510J1445q863j2488K1277L4980k0860l4710j70L2381j4834
6622D820j1900J9200J2433k1226k4884J1437Q845o69R499j166Q771J9382K0431
6609E4973j0462n0353k7704p613j3384J7695J1062J3759j5935L0956N5197m562
6597E3629o258l8275r797k0344J3961N8512m0740r915J501l2628j1366o566J1082
6584c7204J9430l412j7129L0778K8181q24k1297K546j0719j6167q267J258O98
$$ plain form
6571 -32128 -20347 -615 -22919 -62711 -41570 -4702 -29988 -25722 -78666 -56956 -14125 -30073
6559 -30073 -18658 -3010 -16283 -19751 -31153 -22295 10235 26561 8424 -8237 16635 15177
6547 15177 -3240 -8445 35715 40119 38023 15328 995 -6658 -35680 -6546 -3012 -26075 -21567
6534 -21567 -11949 5489 11611 8382 -3780 -13880 -1759 6912 11744 18675 -10589 -5223 -3156
6521 -3156 -12091 24735 7006 -2875 5902 2640 34584 3467 -27053 -23374 -14864 17940 24498
6508 24498 -17754 -13300 10981 6556 12137 -48773 -53019 -27902 -34086 -19637 -14858 25483 51462
6495 51462 38382 38477 -4006 -1957 -26651 -37779 15489 14528 6850 10569 5008 -9215 -2180 10649
6481 10649 4270 18189 13854 20073 34954 27723 41981 53654 44630 26801 -620 -16682 -478
$$ packed form
6571c2128J1781J9732k2304l9792K1141L6868k5286M266n2944K1710M2831j5948
6559c0073J1415J5648j3273l468j1402Q858L2530J6326j8137j6661K4872j458
6547A5177j8417n205M4160M404k096k2695j4333p653k9022K9134L534k3063M508
6534b1567R618J7438O122l229j2162j0100J2121Q671M832O931k9264N366K067
6521c156q935L6826j7729r881Q777l262L1944l1117l0520L679Q510L2804O558
6508B4498m2252M454K4281m425N581o0910m246K5117o184J4449M779M0341K5979
6495E1462j3080R5m2483K049k4694j1128N3268r61p678L719n561j4223P035J2829
6481A0649o379J3919m335O219J4881p231J4258J1673r024j7829k7421j6062J6204
$$ plain form
6468 -478 8348 10675 35453 45889 19962 -7583 -477 -23235 -5378 -21209 -33747 -22003 -17198
6455 -17198 13322 7136 39262 24121 7387 -22110 -27011 -35786 -30661 -25956 -3002 10550 23262
6442 23262 23742 16594 3026 11908 20533 -15873 6837 -8253 8373 17618 -8009 5608 -3759
6429 -3759 -2825 23533 18716 12827 8011 -9928 -8342 4494 28468 -9069 -1513 7167 13825 874
6415 874 -59377 -51826 7733 -18942 -17537 -22778 -17492 49734 40747 24398 30326 11823 19409 51196
6401 51196 48825 41060 41956 30161 3770 -12332 -36139 -20867 -6565 -12951 -4549 9725 29978
6388 29978 31374 12648 18971 135 -14125 -22534 -11098 9915 -15485 -23305 2463 -3862 -21666
6375 -21666 -18310 -19816 -9125 -751 -3305 2339 15219 41579 13048 -5825 16076 22273 11008
$$ packed form
6468d78Q826K327K4778J0436k5927k7545P106k2758J7857j5831j2538J1744M805
6455a7198L0520o186L2126j5141j6734k9497m901q775N125M705K2954J3552J2712
6442B3262M80p148j3568Q882Q625l6406K2710j5090J6626R245k5627J3617r367
6429c759R34K6358m817n889m816j7939J586J2836K3974l7537P556Q680O658j2951
6415H74o0251P551N9559k6675J405n241N286O7226q987j6349N928j8503P586L1787
6401E1196k371p765Q96j1795k6391j6102k3807J5272J4302o386Q402J4274K0253
6388B9978J396j8726O323j8836j4260q409J1436K1013k5400p820K5768o325j7804
6375b1666L356j506J0691Q374k554N644J2880K6360k8531j8873K1901O197j1265
$$ plain form
6362 11008 4490 16757 11155 13137 25775 8998 37555 21701 14371 28044 -169 -6801 21438
6349 21438 31824 49416 40936 10110 -8914 11903 9592 -37695 -36900 -21626 -28985 -25173 -17918
6336 -17918 -9153 -2804 4587 30471 37408 51070 51635 32359 13545 26448 19820 -14942 23947
6323 23947 26083 34573 31084 37858 41271 32281 17164 16842 25780 5198 45922 31444 9567 -9993
6309 -9993 -8403 8540 22715 8286 14674 33603 8501 -9340 13458 61063 48402 22556
6297 22556 1632 6193 13144 513 -2956 7789 23019 -16378 -24084 -565 -792 4561 18050
6284 18050 -7766 -1560 7895 25475 46871 15756 6213 22760 20264 10201 -22460 -16903 -11164
6271 -11164 -755 2349 19398 1563 -10382 26115 40871 32407 -500 20655 21396 11438 17957
$$ packed form
6362A1008o518J2267n602J982J2638j6777K8557j5854p330J3673k8213o632K8239
6349B1438J0386J7592q480l0826j9024K0817k311m7287P95J5274p359L812P255
6336a7918Q765O349P391K5884O937J3662N65j9276j8814J2903o628l4762L8889
6323B3947K136Q490l489O774L413q990j5117l22Q938k0582M0724j4478k1877j9560
6309i993J590J6943J4175j4429O388J8929k5102j7841K2798M7605j2661k5846
6297B2556k0924M561O951j2631l469J0745J5230l9397p706K3519k27N353J3489
6284A8050k5816O206R455J7580K1396l1115r543J6547k496j0063l2661N557N739
6271a1164J0409L104J7049j7835j1945L6497J4756q464l2907K1155P41r958O519
$$ plain form
6258 17957 -11728 -397 -7445 -17275 24497 54986 53445 3377 10816 38758 20835 939 27026
6245 27026 48705 27499 7405 25587 39035 11010 9673 6713 9471 32852 22501 -20490
6233 -20490 -19335 -9977 -31691 -10046 10639 -16120 -22697 2491 3457 1555 13242 16505 -1852
6220 -1852 2765 6856 8383 -16644 -29833 -17015 7116 -16341 -3963 17381 25415 13346 25525
6207 25525 4687 -13366 -15051 -20740 -49677 -7871 26909 15673 12303 8260 30106 15611 23391
6194 23391 8700 258 27924 33049 28390 43655 44255 32747 27525 42101 37045 37967 60173 83105
6180 83105 70369 37116 10611 19438 16927 33315 31080 -7669 -8532 9062 32455 34673 736
6167 736 7689 7272 27757 12852 -25239 -12406 -73 -9744 -348 -5140 -2557 31874 51976 71620
$$ packed form
6258A7957k9685J1331p048r830M1772L0489j541n0068P439K7942j7923j9896K6087
6245B7026K1679k1206k0094J8182J3448k8025j337k960K758K3381j0351m2991
6233b0490J155R358k1714K1645K0685k6759o577K5188R66j902J1687L263j8357
6220a852M617M091J527k5027j3189J2818K4131k3457J2378K1344Q034j2069J2179
6207B5525k0838j8053j685n689k8937M1806L4780j1236l370m043K1846j4495P780
6194B3391j4691q442K7666N125m659J5265O00j1508n222J4576n056R22K2206K2932
6180H3105j2736l3253k6505Q827k511J6388k235l8749q63J7594K3393K218l3937
6167G36O953m17K0485j4905l8091J2833J2333r671R396m792K583L4431K0102J9644
$$ plain form
6153 71620 52004 45416 42615 48991 47417 19378 34784 27461 22341 5055 -14532 1218 14650
6140 14650 27889 21123 14602 30277 23911 45643 58083 65591 49524 31133 22969 31519 37462
6127 37462 68955 60979 69703 47781 61828 39866 25498 50316 36610 15854 -13965 11966
6115 11966 29224 26452 9164 789 32467 25790 15902 35765 17920 22097 58284 34912 -15801
6102 -15801 4127 33828 50450 50801 56622 39011 32097 43292 34375 29339 13013 5343 28092
6089 28092 15458 24840 52822 39366 22878 49429 40442 44048 38272 52707 45029 53906 57883
6076 57883 51970 75738 94241 53395 73799 66562 34239 9600 5279 44437 50215 49336 40152
6063 40152 49931 49667 67744 81239 69700 62143 65041 68224 90097 82394 71514 54385 70560
$$ packed form
6153G1620j9616o588k801O376j574k8039J5406p323n120j7286j9587J5750J3432
6140A4650J3239o766o521J5675o366K1732J2440P508j6067j8391q164Q550N943
6127C7462L1493p976Q724k1922J4047k1962j4368K4818j3706k0756k9819K5931
6115A1966J7258k772j7288q375L1678o677r888J9863j7845M177L6187k3372n0713
6102a5801J9928K9701J6622L51N821j7611o914J1195q917n036j6326p670K2749
6089B8092j2634R382K7982j3456j6488K6551q987L606n776J4435p678Q877L977
6076E7883n913K3768J8503m0846K0404p237l2323k4639m321L9158N778q79r184
6063D0152R779k64J8077J3495j1539p557K898L183K1873p703j0880j7129J6175
$$ plain form
6050 70560 97798 64974 66936 59669 62287 78412 91333 46602 47422 45215 81248 72010 78539
6037 78539 64098 91482 86029 62262 57585 44382 75441 93343 98814 85955 71032 58337
6025 58337 59232 55141 75167 74702 67484 58507 75825 74024 64811 38626 57831 67700 75147 65526
6011 65526 80171 64804 64932 66166 65157 52368 55190 47987 69673 88914 89588 78467 50238
5998 50238 85520 91093 97316 132016 117320 80082 93321 101841 91833 99548 102880 74533 55573
5985 55573 87131 104863 82553 102624 110097 66204 96133 99128 84523 75313 93953 86825 77570
5972 77570 81682 79096 86240 68963 77150 80333 100367 93591 98153 91918 88124 88354 58906 68755
5958 68755 80417 109385 99506 142990 149512 126717 141499 116130 111587 87969 104553 111722 98899
$$ packed form
6050G0560K7238l2824J962p267K618J6125J2921m4731Q20k207L6033r238O529
6037G8539j4441K7384n453k3767m677j3203L1059J7902N471j2859j4923j2695
6025E8337Q95m091K0026m65p218q977J7318j801r213k6185J9205R869P447r621
6011F5526J4645j5367J28J234j009j2789K822p203K1686J9241O74j1121k8229
5998E0238L5282N573O223L4700j4696l7238J3239Q520j0008P715L332k8347j8960
5985E5573L1558J7732k2310K0071P473m3893K9929K995j4605r210J8640p128r255
5972G7570M112k586P144j7277Q187L183K0034o776M562o235l794K30k9448R849
5958F8755J1662K8968r879M3484O522k2795J4782k5369m543k3618J6584P169j2823
$$ plain form
5945 98899 109504 170374 163338 109205 112562 134289 138067 97674 87743 101650 95301 90615 92215
5932 92215 91970 82041 128331 169460 168029 179930 158845 138962 152671 148749 155281 194137 194500
5919 194500 182430 156803 158739 157055 187969 174672 158203 142778 129124 135520 128556 140582
5907 140582 141276 149253 175471 131195 125762 146922 156595 148988 161081 174068 170068 141736 149981
5894 149981 173639 152322 180024 179033 203397 201808 181520 181497 168807 176508 198439 170432 178901
5881 178901 190329 192836 188213 180621 160991 147758 190989 189673 202650 226902 228619 181751 158675
5868 158675 180388 216493 206896 199791 216504 208183 231813 227158 236742 223071 220663 249406 275384
5855 275384 227137 227475 266383 273552 293489 275660 268730 269784 282105 301778 315245 319499 339973
$$ packed form
5945I8899J0605O0870p036n4133L357K1727L778m0393r931J3907o349m686J600
5932I2215k45r929M6290M1129j431J1901k1085j9883J3709l922O532L8856L63
5919A94500j2070k5627J936j684L0914j3297j6469j5425j3654O396o964J2026
5907A40582O94P977K6218m4276n433K1160R673p607J2093J2987m000k8332Q245
5894A49981K3658k1317K7702r91K4364j589k0288k3j2690P701K1931k8007Q469
5881A78901J1428K507m623p592j9630j3233M3231j316J2977K4252J717m6868k3076
5868A58675K1713L6105r597p105J6713q321K3630m655R584j3671k408K8743K5978
5855B75384m8247L38L8908P169J9937j7829o930J054J2321J9673J3467M254K0474
$$ plain form
5842 339973 325635 291410 328462 299168 290272 284049 295810 287305 260929 281413 313617 272852
5830 272852 256447 275550 286322 247276 251965 256944 259800 287586 278562 320111 308213 274801
5818 274801 258720 295852 307768 278330 306367 311980 307018 299412 308907 313969 338938 323083 346109
5805 346109 348721 340483 333023 321909 361541 378953 355427 362300 418013 411723 380478 364488 388943
5792 388943 391759 395512 415243 434898 456074 428649 440509 435259 415394 410033 435831 420314
5780 420314 429446 444001 429525 444983 467547 462547 444411 439725 444353 463322 438189 445134 430633
5767 430633 452758 438799 463227 456468 469426 462034 422962 441018 444455 445913 451908 458868 472608
5754 472608 458667 473922 496840 499548 499442 475075 477400 486491 500494 513246 508513 521791 521953
$$ packed form
5842C39973j4338l4225L7052k9294q896o223J1761q505k6376K0484L2204m0765
5830B72852j6405J9103J0772l9046M689M979K856K7786r024M1549j1898l3412
5818B74801j6081L7132J1916k9438K8037N613m962p606R495N062K4969j5855K3026
5805C46109K612q238p460j1114L9632J7412k3526O873N5713o290l1245j5990K4455
5792C88943K816L753J9731J9655K1176k7425J1860n250j9865n361K5798j5517
5780D20314R132J4555j4476J5458K2564n000j8136m686M628J8969k5133O945j4501
5767D30633K2125j3959K4428o759J2958p392l9072J8056L437J458N995O960J3740
5754D72608j3941J5255K2918K708j06k4367K325R091J4003J2752m733J3278J62
$$ plain form
5741 521953 510205 527974 562603 556037 548937 550275 544738 539231 549195 567725 571333 588341 581213
5728 581213 576673 594836 588357 584233 603140 631936 628643 641970 642350 613172 620007 669530 687019
5715 687019 688349 663479 658253 657511 708373 742210 765718 753584 740202 712890 758821 804862
5703 804862 800600 792862 807304 815624 831090 838448 865471 868719 881446 880590 863467 863713 854100 860060
5689 860060 880539 919604 954325 979912 991575 1013220 1026271 1034362 1062581 1076270 1080051 1053650
5677 1053650 1029708 1039629 1062059 1096954 1105460 1088334 1075783 1078993 1088867 1112786 1067950 1051683
5665 1051683 1011429 1015877 1010374 996052 1002483 1000823 987021 1018650 1025549 1019347 1039225 1062281 1055519
5652 1055519 1087976 1095519 1081864 1083847 1086135 1131120 1111669 1104708 1133306 1137916 1174290 1195978
$$ packed form
5741E21953j1748J7769L4629o566p100J338n537n507R964J8530L608J7008p128
5728E81213m540J8163o479m124J8907K8796l293J3327L80k9178O835M9523J7489
5715F87019J330k4870n226p42N0862L3837K3508j2134j3382k7312M5931M6041
5703H04862m262p738J4442Q320J5466P358K7023L248J2727q56j7123K46r613N960
5689H60060K0479L9065L4721K5587J1663K1645J3051Q091K8219J3689L781k6401
5677A053650k3942R921K2430L4895Q506j7126j2551L210R874K3919m4836j6267
5665A051683m0254M448n503j4322O431j660j3802L1629O899o202J9878K3056o762
5652A055519L2457P543j3655J983K288M4985j9451o961K8598M610L6374K1688
$$ plain form
5640 1195978 1201353 1202012 1175257 1170696 1167332 1142210 1149483 1128545 1141946 1159134 1187749 1201687 1216023
5627 1216023 1229723 1242462 1267628 1317851 1337099 1343024 1399824 1445615 1447554 1494540 1540863 1585708
5615 1585708 1595345 1669752 1728555 1744920 1780154 1809938 1854103 1878567 1909895 1981705 2049500 2137848
5603 2137848 2236553 2279559 2302132 2362645 2356488 2364800 2411124 2429545 2456320 2497006 2462100 2448379
5591 2448379 2453255 2484425 2509618 2520999 2534923 2589454 2619569 2655549 2685167 2689395 2728431 2789416
5579 2789416 2808022 2823402 2865013 2875997 2923484 2946543 2936812 2990063 2989674 2974333 2981246 2981609 2990647
5566 2990647 3010454 3105840 3114480 3169860 3241694 3305948 3372088 3411007 3461473 3500231 3555788 3647732
5554 3647732 3732066 3822730 3920658 4033780 4169039 4314213 4409998 4483810 4582578 4703059 4788171
$$ packed form
5640A195978N375O59k6755m561l364k5122P273k0938J3401J7188K8615J3938J4336
5627A216023J3700J2739K5166N0223J9248N925N6800M5791J939M6986M6323M4845
5615A585708R637P4407N8803J6365L5234K9784M4165K4464L1328P1810O7795Q8348
5603B137848R8705M3006K2573O0513o157Q312M6324J8421K6775M0686l4906j3721
5591B448379M876L1170K5193J1381J3924N4531L0115L5980K9618M228L9036O0985
5579B789416J8606J5380M1611J0984M7487K3059r731N3251l89j5341O913L63R038
5566B990647J9807R5386Q640N5380P1834O4254O6140L8919N0466L8758N5557R1944
5554C647732Q4334R0664R7928J13122J35259J45174R5785P3812R8768J20481Q5112
$$ plain form
5543 4788171 4903972 4995707 5121908 5198140 5301942 5435244 5582857 5700027 5852821 6012906
5533 6012906 6129178 6245594 6424213 6585292 6774436 6987855 7190056 7415893 7690975 7955708
5523 7955708 8234290 8479037 8761109 9068538 9413201 9760172 10109623 10477002 10888861 11358744
5513 11358744 11894757 12450623 13043713 13704213 14379478 15151312 16003617 16868074 17825636
5504 17825636 18904792 20063790 21353806 22832174 24498374 26478053 28765299 31253598
5496 31253598 33730358 36103429 38360933 40521351 42547442 43993724 44815934 45805357
5488 45805357 47278849 49206392 51491473 54216897 57331881 60853320 64827008 69259729
5480 69259729 74115471 79483128 85491668 92231036 99522907 107581253 116616319 126801002
$$ packed form
5543D788171J15801R1735J26201P6232J03802J33302J47613J17170J52794J60085
5533F012906J16272J16416J78619J61079J89144K13419K02201K25837K75082K64733
5523G955708K78582K44747K82072L07429L44663L46971L49451L67379M11859M69883
5513A1358744N36013N55866N93090O60500O75265P71834Q52305Q64457R57562
5504A7825636J079156J158998J290016J478368J666200J979679K287246K488299
5496C1253598K476760K373071K257504K160418K026091J446282Q22210R89423
5488D5805357J473492J927543K285081K725424L114984L521439L973688M432721
5480F9259729M855742N367657O008540O739368P291871Q058346R035066J0184683
$$ plain form
5472 126801002 138090842 150677089 164459109 180158901 199152226 223667829 255579036
5465 255579036 295622118 341914725 397452246 456327872 498310441 513714501 506549375
5458 506549375 480243725 433969054 379171027 327376826 283542679 248746078 219275684
5451 219275684 190818792 165324150 144789657 128119160 114476789 103165429 93775313
5444 93775313 85780962 78894384 72892468 67609813 62952050 58865628 55239258 52006864
5436 52006864 49023065 46218236 43533123 41075813 38830244 36761079 34873303 33116129
5428 33116129 31458640 29971655 28560842 27210176 25915492 24694420 23476276 22363160
5420 22363160 21367308 20441547 19603930 18825251 18082890 17439684 16793350 16157952 15552760
$$ packed form
5472A26801002J1289840J2586247J3782020J5699792J8993325K4515603L1911207
5465B55579036M0043082M6292607N5537521N8875626M1982569J5404060p165126
5458E06549375k6305650m6274671n4798027n1794201m3834147l4796601k9470394
5451B19275684k8456892k5494642k0534493j6670497j3642371j1311360r390116
5444I3775313p994351o886578o001916n282655m657763m086422l626370l232394
5436E2006864k983799k804829k685113k457310k245569k069165j887776j757174
5428C3116129j657489j486985j410813j350666j294684j221072j218144j113116
5420B2363160r95852r25761q37617p78679p42361o43206o46334o35398o05192
$$ plain form
5411 15552760 14963613 14400982 13865373 13356229 12889467 12461197 12071692 11687524 11300077
5402 11300077 10907403 10572383 10215232 9916393 9573587 9257281 9010606 8776391 8540715
5393 8540715 8323085 8102784 7884108 7686884 7485280 7298209 7130628 6921677 6775905 6624766
5383 6624766 6455909 6272066 6097406 5938632 5810532 5640750 5509288 5404098 5292717 5162074
5373 5162074 5020798 4934003 4852573 4778809 4750622 4691137 4588498 4500812 4469096 4378907 4272831
5362 4272831 4184059 4115438 4031991 3990973 3865681 3777839 3736153 3645681 3586295 3552048 3465532
5351 3465532 3372999 3271930 3189787 3083972 3008960 2937299 2848119 2783572 2723337 2642468 2576401
5340 2576401 2524105 2489779 2461275 2434918 2390321 2370828 2333267 2306601 2278696 2256387 2237596
$$ packed form
5411A5552760n89147n62631n35609n09144m66762m28270l89505l84168l87447
5402A1300077l92674l35020l57151k98839l42806l16306k46675k34215k35676
5393H540715k17630k20301k18676j97224k01604j87071j67581k08951j45772j51139
5383F624766j68857j83843j74660j58774j28100j69782j31462j05190j11381j30643
5373E162074j41276q6795q1430p3764k8187n9485j02639q7686l1716r0189j06076
5362D272831q8772o8621q3447m1018j25292q7842m1686r0472n9386l4247q6516
5351C465532r2533j01069q2143j05815p5012p1661q9180o4547o0235q0869o6067
5340B576401n2296l4326k8504k6357m4597j9493l7561k6666k7905k2309j8791
$$ plain form
5329 2237596 2193168 2131373 2073344 2064752 2046791 2039393 1991278 1975079 1950691 1935155 1911086 1885265
5317 1885265 1887643 1900031 1920696 1984369 2019951 2044843 2080678 2103063 2077170 2074399 2081610 2069187
5305 2069187 2082079 2114394 2159929 2207885 2223632 2237224 2172708 2166785 2164364 2104340 2072759 2040736
5293 2040736 2030827 2036640 1957209 1936350 1895933 1870088 1821230 1759520 1730063 1680471 1621662 1562559
5281 1562559 1504009 1443496 1412768 1391141 1346150 1297412 1307476 1318791 1281666 1276266 1244330 1225349
5269 1225349 1197528 1182894 1150468 1131228 1126299 1102788 1084733 1070663 1049544 1021997 1003731 996897
5257 996897 960275 930828 891554 874437 888831 884209 861459 794359 742529 737190 720421 703110
5245 703110 690469 658131 653629 632406 631443 638269 620725 578236 562603 546003 580980 572472 596885
$$ packed form
5329B237596m4428o1795n8029q592j7961p398m8115j6199k4388j5536k4069k5821
5317A885265K378J2388K0665O3673L5582K4892L5835K2385k5893k771P211j2423
5305B069187J2892L2315M5535M7956J5747J3592o4516n923k421o0024l1581l2023
5293B040736r909N813p9431k0859m0417k5845m8858o1710k9457m9592n8809n9103
5281A562559n8550o0513l0728k1627m4991m8738J0064J1315l7125n400l1936j8981
5269A225349k7821j4634l2426j9240m929k3511j8055j4070k1119k7547j8266o834
5257I96897l6622k9447l9274j7117J4394m622k2750o7100n1830n339j6769j7311
5245G03110j2641l2338m502k1223r63O826j7544m2489j5633j6600L4977q508K4413
$$ plain form
5232 596885 624099 634493 622761 597714 573362 593273 613390 600964 597838 590810 532711 522963
5220 522963 514657 528266 540912 521104 529237 554363 550879 524524 521965 550029 516742 508944 516135
5207 516135 524361 536558 496592 475908 497815 522597 505958 482580 502042 536280 508363 534942
5195 534942 523966 497485 496613 506462 500105 474154 507070 505603 498365 491717 479058 502019 491870
5182 491870 482702 466206 462779 441269 452144 492551 519065 481938 476588 472313 487766 439125
5170 439125 433676 407587 384973 401293 370604 342214 389695 383105 400260 410688 386321 398493
5158 398493 361765 362561 347400 334237 306302 318532 297033 308112 329622 352987 355183 342694
5146 342694 308039 265143 271599 299964 303362 289406 286799 280816 288345 298296 270831 259951 258060
$$ packed form
5232E96885K7214J0394j1732k5047k4352J9911K0117j2426l126p028n8099r748
5220E22963q306J3609J2646j9808Q133K5126l484k6355k559K8064l3287p798P191
5207E16135Q226J2197l9966k0684K1907K4782j6639k3378J9462L4238k7917K6579
5195E34942j0976k6481q72R849o357k5951L2916j467p238o648j2659K2961j0149
5182D91870r168j6496l427k1510J0875M0407K6514l7127n350m275J5453m8641
5170D39125n449k6089k2614J6320l0689k8390M7481o590J7155J0428k4367J2172
5158C98493l6728P96j5161j3163k7935J2230k1499J1079K1510K3365K196j2489
5146C42694l4655m2896O456K8365L398j3956k607n983P529R951k7465j0880j891
$$ plain form
5133 258060 258480 275469 305200 283746 303828 318752 279745 279035 281437 270858 276152 284701 277035
5120 277035 265011 256165 279530 259270 257018 249376 243504 281961 248564 274429 302928 285189
5108 285189 290088 246131 239635 209222 229839 244149 220342 198533 203380 211768 253902 245936 224000
5095 224000 209452 223213 251892 243840 233117 224778 232490 206109 206956 194498 210453 208891 190959
5082 190959 184200 195052 209838 175064 167473 176714 184716 198194 153130 132406 158459 133650
5070 133650 136435 194547 169722 181102 189736 181180 156958 170617 175839 180302 143070 180114 203192
5057 203192 206922 182189 169804 171863 190865 194339 157208 164015 177942 181132 196591 153613 149138
5044 149138 169081 167254 165601 165821 166060 132779 146518 163792 141135 145486 164773 162217 179034
$$ packed form
5133B58060M20J6989K9731k1454K0082J4924l9007p10K402j0579N294Q549p666
5120B77035j2024q846K3365k0260k252p642n872L8457l3397K5865K8499j7739
5108B85189M899m3957o496l0413K0617J4310k3807k1809M847Q388M2134p966k1936
5095B24000j4548J3761K8679q052j0723q339P712k6381Q47j2458J5955j562j7932
5082A90959o759J0852J4786l4774p591R241Q002J3478m5064k0724K6053k4809
5070A33650K785N8112k4825J1380Q634q556k4222J3659N222M463l7232L7044K3078
5057B03192L730k4733j2385K059J9002L474l7131O807J3927L190J5459m2978m475
5044A49138J9943j827j653K20K39l3281J3739J7274k2657M351J9287k556J6817
$$ plain form
5031 179034 157786 148491 143237 149939 163241 155596 131406 143431 132483 156925 130527 102350
5019 102350 117881 132152 109613 104492 145120 162788 143732 137523 137192 137019 123325 120739 102653
5006 102653 99442 135839 136090 117218 95747 78116 65540 56255 87733 100252 115555 113977 103842
4993 103842 102111 101852 101743 128642 129081 99867 112397 118415 97475 79784 89728 138943 103608
4980 103608 102380 130402 143488 138188 109377 80770 95521 119838 96117 108093 101766 96829
4968 96829 122614 103848 103397 89817 111024 129100 118484 125228 130686 102172 49821 60826 87303
4955 87303 79241 70395 84935 116453 88497 94204 124804 97507 127607 127797 112694 90099 108347
4942 108347 78888 63404 100422 108560 87611 111700 100360 114842 109743 70786 119927 125574
$$ packed form
5031A79034k1248r295n254O702J3302p645k4190J2025j0948K4442k6398k8177
5019A02350J5531J4271k2539n121M0628J7668j9056o209l31j73j3694k586j8086
5006A02653l211L6397K51j8872k1471j7631j2576r285L1478J2519J5303j578j0135
4993A03842j731k59j09K6899M39k9214J2530O018k0940j7691R944M9215l5335
4980A03608j228K8022J3086n300k8811k8607J4751K4317k3721J1976o327m937
4968I6829K5785j8766m51j3580K1207J8076j0616O744N458k8514n2351J1005K6477
4955H7303q062q846J4540L1518k7956N707L0600k7297L0100J90j5103k2595J8248
4942A08347k9459j5484L7018Q138k0949K4089j1340J4482n099l8957M9141N647
$$ plain form
4930 125574 99197 71549 71013 81608 93700 117680 103865 111155 128485 128755 129897 105670 75028
4917 75028 85718 87648 90206 92165 108132 121458 115504 116017 141189 150716 163892 150868 159718
4904 159718 164328 177953 177545 157430 138599 134878 156276 157885 163708 128857 155036 182302 208050
4891 208050 183193 167994 150275 141323 150269 139653 154548 156718 176774 173919 140301 115087
4879 115087 129125 122726 111347 104166 100084 87731 72511 111041 112977 95094 83832 92929 117707
4866 117707 98021 61433 74399 70857 66534 72833 74692 101254 90603 61623 100184 96333 76816
4853 76816 114170 118454 84206 60983 73829 78671 68212 59018 79174 49671 79774 68884
4841 68884 62554 70755 81259 80463 96945 129427 134130 102335 79979 77533 69774 98037 50296
$$ packed form
4930A25574k6377k7648n36J0595J2092K3980j3815P290J7330K70J142k4227l0642
4917G5028J0690J930K558J959J5967J3326n954N13K5172R527J3176j3024Q850
4904A59718M610J3625m08k0115j8831l721K1398J609N823l4851K6179K7266K5748
4891B08050k4857j5199j7719q952Q946j0616J4895K170K0056k855l3618k5214
4879A15087J4038o399j1379p181m082j2353j5220L8530J936j7883j1262R097K4778
4866A17707j9686l6588J2966l542m323O299J859K6562j0651k8980L8561l851j9517
4853G6816L7354M284l4248k3223J2846M842j0459r194K0156k9503L0103j0890
4841F8884o330Q201J0504p96J6482L2482M703l1795k2356k446p759K8263m7741
$$ plain form
4828 50296 52901 78949 70603 92453 97517 90423 98879 83713 89444 81062 97114 111544 84566
4815 84566 78097 67604 83794 85164 79140 84703 86415 80643 85878 91416 56657 71235 76554 96588
4801 96588 121280 84902 86803 87346 106525 106508 107574 118167 131718 96497 93774 77293 82887 135367
4787 135367 146710 140092 139371 121409 101276 122033 112588 117626 152160 164966 145799 127694 95329
4774 95329 136706 140584 97157 51435 108285 125451 106517 125881 132647 98259 124884 104039
4762 104039 93550 116029 104615 101057 94949 94803 95294 84722 84646 87862 134023 136590 118736 112684
4748 112684 103959 95431 97700 111388 97618 101960 139578 95804 114862 127206 125609 134955 128958
4735 128958 145278 108680 116854 104134 121430 163384 171449 113556 137578 126693 119695 150863
$$ packed form
4828E0296K605K6048q346K1850N064p094Q456j5166N731q382J6052J4430k6978
4815H4566o469j0493J6190J370o024N563J712n772N235N538l4759J4578N319K0034
4801I6588K4692l6378J901N43J9179j7J066J0593J3551l5221k723j6481N594N2480
4787A35367J1343o618p21j7962k0133K0757r445N038L4534J2806j9167j8105l2365
4774I5329M1377L878m3427m5722N6850J7166j8934J9364O766l4388K6625k0845
4762A04039j0489K2479j1414l558o108j46M91j0572p6L216M6161K567j7854o052
4748A12684q725q528K269J3688j3770M342L7618m3774J9058J2344j597R346n997
4735A28958J6320l6598Q174j2720J7296M1954Q065n7893K4022j0885o998L1168
$$ plain form
4723 150863 150953 160129 161769 153744 159070 156638 178000 178352 164388 140427 179721 190331 172576 177033
4709 177033 177073 185729 170186 180615 174198 167412 172555 175599 190012 204900 207916 207576 199618 193928
4695 193928 212551 213347 220740 226252 244045 243168 207043 207345 208210 214434 222157 218421 231622 206450
4681 206450 212210 200029 207751 206696 212279 258575 246923 263099 272123 277164 261819 238879 269208
4668 269208 276763 299662 323490 340757 323940 327646 338764 338554 363908 388546 389742 424716 424177
4655 424177 404407 428894 433404 454755 476549 490331 501107 535965 516779 534573 590102 604601
4643 604601 634249 684250 740045 776238 807641 874851 911820 936402 979752 997611 1047974 1127868
4631 1127868 1207649 1334949 1432468 1486217 1538444 1625305 1712560 1848037 2002900 2084119 2193114
$$ packed form
4723A50863R0R176J640q025N326k432K1362L52j3964k3961L9294J0610j7755M457
4709A77033M0Q656j5543J0429o417o786N143L044J4413J4888L016l40p958n690
4695A93928J8623P96P393N512J7793q77l6125L02Q65O224P723l736J3201k5172
4681B06450N760j2181P722j055N583M6296j1652J6176R024N041j5345k2940L0329
4668B69208P555K2899K3828J7267j6817L706J1118k10K5354K4638J196L4974n39
4655D24177j9770K4487M510K1351K1794J3782J0776L4858j9186J7794N5529J4499
4643F04601K9648N0001N5795L6193L1403O7210L6969K4582M3350J7859N0363P9894
4631A127868P9781J27300R7519N3749N2227Q6861Q7255J35477J54863Q1219J08995
$$ plain form
4620 2193114 2324593 2476558 2621701 2782451 2947162 3130104 3340826 3575592 3824575 4090528
4610 4090528 4409435 4789684 5216984 5654901 6188512 6798377 7456538 8097833 8718544 9315816
4600 9315816 9833001 10413367 11075721 11774932 12542827 13302460 14009052 14548701 14997368 15323172
4590 15323172 15587254 15930046 16412261 16892468 17261812 17393485 17290884 17007247 16541934
4581 16541934 16038161 15611990 15280894 14981919 14598968 14052665 13384954 12623907 11821866
4572 11821866 11044386 10340804 9727534 9136559 8578204 7957401 7279829 6617493 5975586
4563 5975586 5405874 4885948 4460205 4086829 3741612 3439976 3194561 2930437 2716352 2565428
4553 2565428 2395041 2262066 2132420 2008645 1911566 1787343 1698481 1638135 1595018 1492194
$$ packed form
4620B193114J31479J51965J45143J60750J64711J82942K10722K34766K48983K65953
4610D090528L18907L80249M27300M37917N33611O09865O58161O41295O20711N97272
4600I315816N17185N80366O62354O99211P67895P59633P06592N39649M48667L25804
4590A5323172K64082L42792M82215M80207L69344J31673j02601k83637m65313
4581A6541934n03773m26171l31096k98975l82951n46303o67711p61047q02041
4572A1821866p77480p03582o13270n90975n58355o20803o77572o62336o41907
4563E975586n69712n19926m25743l73376l45217l01636k45415k64124k14085j50924
4553B565428j70387j32975j29646j23775r7079j24223q8862o0346m3117j02824
$$ plain form
4543 1492194 1399237 1337458 1279171 1209855 1188198 1147391 1105413 1067103 1004381 973111 957341
4532 957341 920640 876155 825344 778569 729476 735038 723650 667228 671596 669529 646490 619542
4520 619542 599210 563667 556998 538133 498147 493073 488679 460672 452827 470759 470655 457455 424939
4507 424939 414624 400386 375864 391159 392680 369756 329284 339237 350396 325202 313293 314204
4495 314204 300837 292759 291836 300217 280385 283852 326866 333598 323728 293799 287755 277667 263426
4482 263426 246078 221517 245712 236051 209847 207924 184813 164450 198688 190972 183374 151785
4470 151785 152392 142972 186890 232342 198066 167220 136659 167255 171305 156377 133231 130692 130361
4457 130361 125454 124943 139754 153823 158859 142246 148883 149066 129093 131599 130030 105905 101535 130904
$$ packed form
4543A492194r2957o1779n8287o9316k1657m0807m1978l8310o2722l1270j5770
4532I57341l6701m4485n0811m6775m9093N562j1388n6422M368k067k3039k6948
4520F19542k0332l5543o669j8865l9986n074m394k8007p845J7932j04j3200l2516
4507D24939j0315j4238k4522J5295J521k2924m0472R953J1159k5194j1909R11
4495C14204j3367q078r23Q381j9832L467M3014O732r870k9929o044j0088j4241
4482B63426j7348k4561K4195r661k6204j923k3111k0363L4238p716p598l1589
4470A51785O07r420M3918M5452l4276l0846l0561L0596M050j4928k3146k539l31
4457A30361m907n11J4811J4069N036j6613O637J83j9973K506j569k4125m370K9369
$$ plain form
4443 130904 82954 76960 147338 148548 119205 92281 88659 116471 127373 99514 108634 116813 118645
4430 118645 109107 85497 74413 92777 104789 109377 109052 124081 119045 85697 108582 66075 80627
4417 80627 105915 87774 112726 100218 91530 84399 93750 80406 98947 98247 100197 108633 78686
4404 78686 91320 103769 123054 81904 61552 80769 85150 82905 52152 43525 49959 39136 66441
4391 66441 74373 62602 77369 66664 51454 58166 39562 45187 63085 90648 98800 66640 49660
4378 49660 45496 56236 55121 35321 42563 35518 17849 36492 27399 52389 79438 42985 26082
4365 26082 12755 -11757 -1289 16972 32392 66052 90084 75050 68767 56218 67405 53968
4353 53968 51623 75768 97468 80392 65191 59427 46620 37830 26183 31199 38852 39103 36097
$$ packed form
4443A30904m7950n994P0378J210k9343k6924l622K7812J0902k7859R120Q179J832
4430A18645r538k3610j1084J8364J2012M588l25J5029n036l3348K2885m2507J4552
4417H0627K5288j8141K4952j2508q688p131R351j3344J8541p00J950Q436k9947
4404G8686J2634J2449J9285m1150k0352J9217M381k245l0753q627O434j0823K7305
4391F6441P932j1771J4767j0705j5210O712j8604N625J7898K7563Q152l2160j6980
4378D9660m164J0740j115j9800P242p045j7669J8643r093K4990K7049l6453j6903
4365B6082j3327k4512J0468J8261J5420L3660K4032j5034o283j2549J1187j3437
4353E3968k345K4145K1700j7076j5201n764j2807q790j1647N016P653K51l006
$$ plain form
4340 36097 45225 53378 62815 26652 33184 41905 39948 31322 37079 27472 27964 16451 13615 18475
4326 18475 16180 51503 35072 38982 44643 49278 47571 62927 78659 63579 44505 41616 47834
4313 47834 55365 36975 45708 46636 9346 29464 24742 19006 40796 41984 52537 62081 57777 41718
4299 41718 48583 64898 51736 62272 46035 72225 63398 34375 54560 53386 57217 50849 107151
4286 107151 129001 102469 90407 108060 128708 135834 142542 157129 94234 104803 155290 145863
4274 145863 165589 144639 150769 99886 118996 118173 94854 101265 100924 111119 120411 104311 116141
4261 116141 116761 84838 92380 84318 66269 89646 107028 63468 53558 54124 75318 51151 -7142
4248 -7142 44128 60515 36239 45669 23335 30022 56451 29723 55783 25982 -5869 19488
$$ packed form
4340C6097R128Q153R437l6163O532Q721j957q626N757r607M92j1513k836M860
4326A8475k295L5323j6431L910N661M635j707J5356J5732j5080j9074k889O218
4313D7834P531j8390Q733R28l7290K0118m722n736K1790J188J0553R544m304j6059
4299D1718O865J6315j3162J0536j6237K6190q827k9023K0185j174L831o368N6302
4286A07151K1850k6532j2062J7653K0648P126O708J4587o2895J0569N0487r427
4274A45863J9726k0950O130n0883J9110q23k3319O411l41J0195R292j6100J1830
4261A16141O20l1923P542q062j8049K3377J7382m3560r910N66K1194k4167n8293
4248g142N1270J6387k4276R430k2334O687K6429k6728K6060k9801l1851K5357
$$ plain form
4236 19488 25921 12599 13043 18923 5716 22818 33267 38412 40920 45955 8029 -912 19964
4223 19964 56363 42846 30684 30440 41670 20435 -14661 -32850 -22338 -29315 17315 38079
4211 38079 49050 34344 -21817 1766 -4546 31056 37023 -2880 3052 5637 37457 11222 140
4198 140 -9415 10800 18366 28245 38703 12906 43908 7029 -3248 -25284 -5723 9939 12216
4185 12216 18527 409 12311 4285 7226 -4212 -10329 -15232 -7426 33145 11316 -6946 -23918
4172 -23918 -24533 -5124 -8216 -17129 -8060 4485 13291 16347 21704 12349 19349 15925 -41518 -33448
4158 -33448 -44192 4544 1805 -20915 145 -691 -1116 14061 23692 -12561 -10625 11470 28977
4145 28977 -6060 -33856 13779 5640 1978 42312 19670 7982 25216 1397 8394 7504 2325
$$ packed form
4236A9488O433j3322M44N880j3207J7102J0449N145K508N035l7926q941K0876
4223A9964L6399j3517j2162k44J1230k1235l5096j8189J0512o977M6630K0764
4211C8079J0971j4706n6161K3583o312L5602N967l9903N932K585L1820k6235j1082
4198A40r555K0215P566R879J0458k5797L1002l6879j0277k2036J9561J5662K277
4185A2216O311j8118J1902q026K941j1438o117m903P806M0571k1829j8262j6972
4172b3918o15J9409l092q913R069J2545Q806L056N357r355P000l424n7443Q070
4158c3448j0744M8736k739k2720K1060q36m25J5177R631l6253J936K2095J7507
4145B8977l5037k7796M7635q139l662M0334k2642j1688J7234k3819O997q90n179
$$ plain form
4132 2325 3893 2381 -37 -10489 15804 -4681 668 9724 18809 7681 20336 29319 7135
4119 7135 -44320 -9411 19242 5341 20106 29558 7633 4055 -31074 -15842 -7483 -15687 -42445
4106 -42445 -21680 -424 12081 22514 -8280 9064 34586 -23960 -26371 -28517 -35313 3895
4094 3895 -12248 -13917 8083 30073 -1394 2135 9212 33081 23350 3915 13519 24256 7078
4081 7078 -408 6612 32895 -2735 -21261 6268 6810 10895 15165 -21341 -14596 15554 5497
4068 5497 4932 -8731 -5666 2715 -3962 -9830 -35965 3581 -23687 -14081 11072 33364 28199 3160
4054 3160 23761 26586 8943 -23700 -39482 -17374 -19916 -24770 -15089 243 8040 8093 15007 20702
4040 20702 20640 -4441 1362 470 3387 11277 -12129 -17908 14371 16725 15378 -5443 -30042 6783
$$ packed form
4132B325J568j512k418j0452K6293k0485N349R056R085j1128J2655Q983k2184
4119G135n1455L4909K8653j3901J4765R452k1925l578l5129J5232Q359q204k6758
4106d2445K0765K1256J2505J0433l0794J7344K5522n8546k411k146o796L9208
4094C895j6143j669K2000K1990l1467L529P077K3869r731j9435R604J0737j7178
4081G078p486P020K6283l5630j8526K7529N42M085M270l6506O745L0150j0057
4068E497n65j3663L065Q381o677n868k6135L9546k7268R606K5153K2292n165k5039
4054C160K0601K825j7643l2643j5782K2108k542m854R681J5332P797N3O914N695
4040B0702o2k5081N803q92K917P890k3406n779L2279K354j347k0821k4599L6825
$$ plain form
4026 6783 10753 -20921 -29481 -25859 -34141 13195 20232 -13441 -26518 -7880 13445 13985 -13844
4013 -13844 2015 36960 30018 16542 -18255 -22824 27872 51883 28650 6241 24300 37873
4001 37873 8189 -13551 -17310 18999 10112 8801 -14620 -14700 -5142 2670 2937 37335 510 2838
3987 2838 3307 3739 9035 -14705 9696 -5561 -42552 -33740 -1684 -2220 5075 16412 24920 30734
3973 30734 43621 2475 -4872 6126 16334 5145 -25849 -43208 -23287 -14579 2121 -13526
3961 -13526 -2862 20001 4278 3478 10765 7452 -23224 -17551 -21897 24607 31897 11146 3663
3948 3663 21269 -14861 -30394 20513 13110 -35771 -12701 -7512 18099 7764 6961 6797 31697
3935 31697 42316 6897 -1640 -9178 -17801 -24911 12765 12347 32678 30116 24623 -14729 -33817
$$ packed form
4026F783L970l1674q560L622q282M7336P037l3673j3077J8638K1325N40k7829
4013a3844J5859L4945o942j3476l4797m569N0696K4011k3233k2409J8059J3573
4001C7873k9684k1740l759L6309q887j311k3421q0R558P812K67L4398l6825K328
3987B838M69M32N296k3740K4401j5257l6991Q812L2056n36P295J1337Q508N814
3973C0734J2887m1146p347J0998J0208j1189l0994j7359J9921Q708J6700j5647
3961a3526J0664K2863j5723q00P287l313l0676N673m346M6504P290k0751p483
3948C663J7606l6130j5533N0907p403m8881K3070N189K5611j0335q03j64K4900
3935C1697J0619l5419q537p538q623p110L7676m18K0331k562n493l9352j9088
$$ plain form
3922 -33817 -9339 -8891 4142 41263 21071 8331 -157 -6702 -1008 24805 14612 18595 22031
3909 22031 7890 2830 -7216 11399 -6114 -20981 -16548 -7879 -15112 -20535 3374 9915 16789
3896 16789 2581 -435 2736 -6973 13055 -9142 11202 35965 34137 -6565 -28556 -728 1091
3883 1091 10103 11735 15151 -917 15263 33135 23998 1066 7133 -21598 -28890 -18083 -18130 -4356
3869 -4356 4764 -9781 -948 7498 -23265 -41667 -13870 -13079 12550 -1238 -18252 -20639 -18051
3856 -18051 2206 20256 17849 -10504 -27383 -40999 -2592 -3225 11825 -8649 -38348 -55443
3844 -55443 -20885 -2606 -1607 14181 9442 -2754 11098 20369 -3261 -10921 -15375 1036 -2735
3831 -2735 5241 16515 8119 14443 10108 15052 -7757 -25300 -23982 -15917 -9791 -29264 -10204 15000
$$ packed form
3922c3817K4478M48J3033L7121k0192j2740q488o545N694K5813j0193L983L436
3909B2031j4141n060j0046J8615j7513j4867M433Q669p233n423K3909O541O874
3896A6789j4208l016L171r709K0028k2197K0344K4763j828m0702k1991K7828J819
3883A091R012J632L416j6068J6180J7872r137k2932O067k8731p292J0807m7J3774
3869d356R120j4545Q833Q446l0763j8402K7797P91K5629j3788j7014k387K588
3856a8051K0257J8050k407k8353j6879j3616L8407o33J5050k0474k9699j7095
3844e5443L4558J8279R99J5788m739j2196J3852R271k3630p660m454J6411l771
3831b735P976J1274q396O324m335M944k2809j7543J318Q065O126j9473J9060K5204
$$ plain form
3817 15000 552 -20674 -40265 -15347 8580 21319 -2862 26349 28666 30519 751 -1455
3805 -1455 -17107 -22976 -4599 3372 19996 18980 17494 -525 -12484 1744 44047 41277 19454
3792 19454 18546 28515 25153 34684 32385 42566 6947 2630 -21024 -2243 1080 6050 9097 2898
3778 2898 559 -13002 5132 15964 -3866 -5793 4745 8816 -15186 -13277 -4473 6986 30299
3765 30299 15243 83 26480 18086 16748 39771 40717 11255 12292 20886 23087 8573 -15305
3752 -15305 -13737 -37460 -12204 14131 31815 19163 18191 33905 49449 33670 25630 40835 5882
3739 5882 8823 17620 -7819 -9464 -24827 -37966 -163 -19041 -23846 -12978 -13565 -26502 -21496
3726 -21496 2896 17793 28085 -3151 6371 3457 12901 31204 17485 22218 7770 -42785 -22517
$$ packed form
3817A5000j4448k1226j9591K4918K3927J2739k4181K9211K317J853k9768k206
3805a455j5652n869J8377P971J6624j016j486j8019j1959J4228M2303k770k1823
3792A9454r08R969l362R531k299J0181l5619m317k3654J8781L323M970L047o199
3778B898k339j3561J8134J0832j9830j927J0538M071k4002J909Q804J1459K3313
3765C0299j5056j5160K6397q394j338K3023R46k9462J037Q594K201j4514k3878
3752a5305J568k3723K5256K6335J7684j2652r72J5714J5544j5779q040J5205l4953
3739E882K941Q797k5439j645j5363j3139L7803j8878m805J0868n87j2937N006
3726b1496K4392J4897J0292l1236R522k914R444J8303j3719M733j4448n0555K0268
$$ plain form
3713 -22517 -3138 -17378 -11519 3701 4139 -12476 -4911 11696 2257 -9100 -8090 -16657 -30594
3700 -30594 -30556 -6863 25313 -14461 -19916 12061 24101 11811 38753 26041 8472 -11220 298
3687 298 8301 23552 35997 40517 59161 36404 -1167 14574 -1216 -27415 -143 10444 14062
3674 14062 20585 13223 -7680 -11769 -10388 -13569 5364 22053 20658 28300 9250 -2973 9235
3661 9235 13880 -29392 -24652 3540 9901 -2565 6300 20845 22589 4612 2812 12933 -5298
3648 -5298 -3175 12074 -33856 -27032 11447 27303 25843 7408 12660 -1728 2163 -3882 8807
3635 8807 12777 -1849 -1485 -11131 3703 13426 3687 25793 4986 26149 40014 2630 -10486
3622 -10486 -27087 -8716 -12361 -15503 -32061 -36424 -23921 2977 37111 44501 51045 43530 10740
$$ packed form
3713b2517J9379j4240N859J5220M38j6615P565J6607r439j1357J010q567j3937
3700c0594L8K3693L2176l9774n455L1977J2040j2290K6942j2712j7569j9692J1518
3687B98Q003J5251J2445M520J8644k2757l7571J5741j5790k6199K7272J0587L618
3674A4062O523p362k0903m089J381l181J8933J6689j395P642j9050j2223J2208
3661I235M645m3272M740K8192O361j2466Q865J4545J744j7977j800J0121j8231
3648e298K123J5249m5930O824L8479J5856j460j8435N252j4388L891o045J2689
3635H807L970j4626L64r646J4834R723r739K2106k0807K1163J3865l7384j3116
3622a0486j6601J8371l645l142j6558m363J2503K6898L4134P390O544p515l2790
$$ plain form
3609 10740 11055 -6896 -194 -31174 -13064 23986 -2348 1346 20133 18805 20829 -7410 -38406
3596 -38406 -19279 -511 19371 42983 51868 13766 -730 24268 7080 -9330 -19206 -10873
3584 -10873 16500 15468 -9112 1588 34482 21726 48380 21570 -1649 -7762 20598 61115
3572 61115 41049 45200 28758 35181 32021 24116 12439 48450 43243 24241 27268 19943 15934
3559 15934 7387 29412 24673 1359 17975 -6752 -16371 -1845 20323 40617 35324 -2378 1765
3546 1765 -2612 -5377 6941 2180 -8059 7098 43331 30635 -6854 -3808 17752 -6390 9705
3533 9705 -18519 -7369 -6879 -39261 -19178 2202 3203 19805 1687 -5416 -9166 -2176 15108
3520 15108 13052 3026 -13898 7870 2313 24605 36165 18318 11339 1719 21920 -3154 -24233
$$ packed form
3609A0740L15j7951O702l0980J8110L7050k6334L694J8787j328K024k8239l0996
3596c8406J9127J8768J9882K3612Q885l8102j4496K4998j7188j6410r876Q333
3584a0873K7373j032k4580J0700L2894j2756K6654k6810k3219o113K8360M0517
3572F1115k0066M151j6442O423l160p905j1677L6011n207j9002L027p325m009
3559A5934q547K2025m739k3314J6616k4727r619J4526K2168K0294n293l7702M143
3546A765m377k765J2318m761j0239J5157L6233j2696l7489L046K1560k4142J6095
3533I705k8224J1150M90l2382K0083K1380J001J6602j8118p103l750O990J7284
3520A5108k056j0026j6924K1768n557K2292J1560j7847o979r620K0201k5074k1079
$$ plain form
3507 -24233 -4196 3520 -14005 -15986 -17995 -54 10577 -7789 6202 16734 -24267 -2889
3495 -2889 4931 -3442 -9977 1642 -548 -23425 -39892 -74786 -59914 -26915 -47703 -29169 -25148
3482 -25148 -10808 11314 -463 -25338 -10127 15124 15495 4802 10781 13501 9069 -1570 4559
3469 4559 18656 46467 50304 9440 9498 29651 2983 1353 -3429 -4328 9024 38568 40248 37298
3455 37298 51767 36515 37623 35634 16082 631 -7576 12451 47612 39586 25889 8189 11924
3442 11924 32131 77743 80168 57415 32341 11954 41947 54209 26440 23955 63750 79981
3430 79981 73720 72742 86135 76669 73103 61145 60355 80731 67969 91380 86082 94649 81860 99399
3416 99399 113682 49767 30709 52618 47081 36768 47425 55103 16041 28494 48845 41682
$$ packed form
3507b4233K0037P716j7525j981k009J7941J0631j8366J3991J0532m1001K1378
3495b889P820q373o535J1619k190k2877j6467l4894J4872L2999k0788J8534M021
3482b5148J4340K2122j1777k4875J5211K5251L71j0693N979K720m432j0639O129
3469D559J4097K7811L837m0864N8K0153k6668j630m782q99J3352K9544J680k950
3455C7298J4469j5252J108j989j9552j5451q207K0027L5161q026j3697j7700L735
3442A1924K0207M5612K425k2753k5074k0387K9993J2262k7769k485L9795J6231
3430G9981o261r78J3393r466l566j1958p90K0376j2762K3411n298Q567j2789J7539
3416I9399J4283o3915j9058K1909n537j0313J0657P678l9062J2453K0351p163
$$ plain form
3404 41682 19800 38184 42574 34360 40863 57153 52635 67603 28572 36143 19704 22919 20594
3391 20594 28896 21470 32664 45093 36308 40382 30207 17004 26073 40947 32441 43061 53534
3378 53534 33289 24267 41407 25740 22322 48844 59224 49242 26035 27253 21810 47460 48609
3365 48609 18136 3200 12618 16999 45024 117087 83789 72320 73807 83801 73601 67946 103387
3352 103387 109325 80782 103795 143249 129249 119416 104141 71944 98014 102618 88128 84863
3340 84863 76398 72845 83296 94863 87017 66635 87639 59333 61010 43379 52469 31970 21558
3327 21558 40946 41682 41461 36108 37674 44327 51619 27604 31991 51379 48135 29491 31032 69007
3313 69007 24340 -6515 4199 6948 2422 38733 67362 61103 22612 20184 17952 -6085 7357
$$ packed form
3404D1682k1882J8384M390q214O503J6290m518J4968l9031P571j6439L215k325
3391B0594Q302p426J1194J2429q785M074j0175j3203R069J4874q506J0620J0473
3378E3534k0245r022J7140j5667l418K6522J0380r982k3207J218n443K5650J149
3365D8609l0473j4936R418M381K8025P2063l3298j1469J487R994j0200n655L5441
3352A03387N938k8543K3013L9454j4000r833j5275l2197K6070M604j4490l265
3340H4863q465l553J0451J1567p846k0382K1004k8306J677j7631R090k0499j0412
3327B1558J9388P36k21n353J566O653P292k4015M387J9388l244j8644J541L7975
3313F9007m4667l0855J0714K749m526L6311K8629o259l8491k428k232k4037J3442
$$ plain form
3300 7357 -6116 -19337 35659 33981 5980 38117 36101 51763 30760 47135 52871 18236 -539
3287 -539 25759 35247 27802 50486 39033 47681 34779 40224 11986 -7583 15412 13120 -5182
3274 -5182 6098 13866 25957 16714 14363 9101 -7533 -19182 -30665 -14259 -5822 26759 19872
3261 19872 36585 56303 35702 14047 32389 8160 -763 12078 4467 19937 26069 19062 10890
3248 10890 -2243 6636 22908 16682 18575 46522 24727 40222 41428 36401 43742 6732 6237
3235 6237 15691 37581 32157 33790 27127 30834 36749 16837 -21176 -2633 -20968 11287 21959
3222 21959 2064 -3309 5716 22475 49530 42025 32910 43969 10502 8131 16990 20167 4197
3209 4197 7332 5424 5141 -14426 27286 7918 14964 27763 31202 31039 21789 31527 8451 14888
$$ packed form
3300G357j3473j3221N4996j678k8001L2137k016J5662k1003J6375N736l4635j8775
3287e39K6298R488p445K2684j1453Q648j2902N445k8238j9569K2995k292j8302
3274e182J1280P768J2091r243k351n262j6634j1649j1483J6406Q437L2581o887
3261A9872J6713J9718k0601k1655J8342k4229q923J2841p611J5470O132p007q172
3248A0890j3133Q879J6272o226J893K7947k1795J5495J206n027P341l7010m95
3235F237R454K1890n424J633o663L707N915j9912l8013J8543j8335L2255J0672
3222B1959j9895n373R025J6759K7055p505r115J1059l3467k371Q859L177j5970
3209D197L135j908k83j9567M1712j9368P046J2799L439j63r250R738k3076O437
$$ plain form
3195 14888 32520 22261 7233 -24652 -5882 3858 8939 -784 -995 3334 31961 19668 -11222
3182 -11222 -19999 -23188 -15103 7587 30519 64067 56891 28416 42538 28837 35694 35167 26413
3169 26413 34668 25298 7369 -19156 -8825 -11227 6119 6960 18706 37536 31444 -6601 13903
3156 13903 -2957 -3667 -4013 -13744 13646 53949 67862 27530 9575 -22013 27928 40962 -14130
3143 -14130 -17613 -28279 490 10168 -5596 26403 24313 -6024 -11076 30880 50696 34301 9958
3130 9958 -3224 -11787 -18862 -20388 -14396 12871 24251 22304 18937 -5227 -41349 -42598 -6471
3117 -6471 -26701 27118 14153 38830 18932 11300 25538 -15741 -36696 -14810 3220 2015
3105 2015 -11284 29413 50629 17366 -1939 -8877 -32779 8319 22413 -4105 -27282 850
$$ packed form
3195A4888J7632j0259j5028l1885J8770R740N081r723k11M329K8627j2293l0890
3182a1222q777l189Q085K2690K2932L3548p176k8475J4122j3701O857n27q754
3169B6413Q255r370j7929k6525J0331k402J7346Q41J1746J8830o092l8045K0504
3156A3903j6860p10l46r731K7390M0303J3913m0332j7955l1588M9941J3034n5092
3143a4130l483j0666K8769R678j5764L1999k090l0337n052M1956J9816j6395k4343
3130I958j3182q563p075j526N992K7267J1380j947l367k4164l6122j249L6127
3117f471k0230N3819j2965K4677j9898p632J4238m1279k0955K1886J8030j205
3105B015j3299M0697K1216l3263j9305o938k3902M1098J4094k6518k3177K8132
$$ plain form
3093 850 -2211 3490 -12124 -16059 -25 10074 23623 9753 11883 20165 29985 37995 57809 35760
3079 35760 19835 20700 4100 10432 -1487 -9971 -17392 -12443 -6322 -12807 -10028 -5062 6686 26660
3065 26660 29685 -277 22073 11309 19816 22495 49708 21373 40134 37566 10456 -6783 -8846
3052 -8846 14783 29767 11845 11209 13831 8161 48386 47421 28119 11616 -7686 12204 14131
3039 14131 2437 40069 37583 31322 9085 -7135 9475 18606 -2918 19315 27496 -2388 8172
3026 8172 4950 5146 -15069 -16912 3000 12982 -30951 -11671 7809 35744 19474 -13334 10377
3013 10377 -3277 -28136 2259 4331 -11897 8507 13296 30649 8941 -17871 5414 17815
3001 17815 7723 16164 -4270 -5338 10155 28787 19424 20510 9822 -20200 -38629 -19934 -11963
$$ packed form
3093H50l061N701j5614l935J6034J0099J3549j3870K130Q282R820Q010J9814k2049
3079C5760j5925Q65j6600O332j1919q484p421M949O121o485K779M966J1748J9974
3065B6660L025k9962K2350j0764Q507K679K7213k8335J8761k568k7110j7239k063
3052h846K3629J4984j7922o36K622n670M0225r65j9302j6503j9302J9890J927
3039A4131j1694L7632k486o261k2237j6220J6610R131k1524K2233Q181k9884J0560
3026H172l222J96k0215j843J9912R982m3933J9280J9480K7935j6270l2808K3711
3013A0377j3654k4859L0395K072j6228K0404M789J7353k1708k6812K3285J2401
3001A7815j0092Q441k0434j068J5493J8632r363J086j0688l0022j8429J8695P971
$$ plain form
2988 -11963 -18004 13938 34551 34955 46225 36407 19896 -8752 -8439 338 22370 45110 28168
2975 28168 19480 3930 -7009 -15595 8833 -7153 -29637 -34360 -8025 -33194 -47563 4734
2963 4734 25250 3728 -14397 -30963 -20272 -13922 17244 -4926 -26583 12992 44050 21649
2951 21649 13962 31491 25474 11388 -10156 11199 -6133 -4484 -17883 23124 8594 -11357
2939 -11357 8078 12513 50599 45995 7853 -22023 18830 -1455 -21150 -387 12610 39690
2927 39690 49738 38314 25277 -1973 -10075 -17823 5467 -6328 19651 29116 -33445 -29583 -10561
2914 -10561 11512 10134 14794 30526 7417 4981 7873 -15727 19669 21550 5640 30914 28163
2901 28163 26062 -455 24514 16357 -46 3339 7735 28530 -556 -310 -18162 -21005 -36988
$$ packed form
2988a1963o041L1942K0613M04J1270r818j6511k8648L13Q777K2032K2740j6942
2975B8168q688j5550j0939q586K4428j5986k2484m723K6335k5169j4369N2297
2963D734K0516k1522j8125j6566J0691O350L1166k2170k1657L9575L1058k2401
2951B1649p687J7529o017j4086k1544K1355j7332J649j3399M1007j4530j9951
2939a1357J9435M435L8086m604l8142k9876M0853k0285j9695K0763J2997K7080
2927C9690J0048j1424j3037k7250q102p748K3290j1795K5979R465o2561L862J9022
2914a0561K2073j378M660J5732k3109k436K892k3600L5396J881j5910K5274k751
2901B8163k101k6517K4969q157j6403L385M396K0795k9086K46j7852k843j5983
$$ plain form
2888 -36988 9033 29527 18469 -939 18656 39756 21355 26965 50631 45127 33398 28622
2876 28622 13508 11793 20724 6673 10885 -22024 -50272 -28159 -31068 -33545 10146 4983 6155
2863 6155 -1306 245 4126 -12441 -9522 -40252 -21404 3103 -2784 -5130 -12581 -17928 2944 28882
2849 28882 42725 32471 48824 20702 -8034 -6647 -4886 -1311 -20158 -14730 -10237 -15375 -4819
2836 -4819 -610 -23208 22494 10580 -19301 3276 1123 -54195 -61031 -10446 19714 16656 12458
2823 12458 27041 -3574 4514 21865 19725 15949 -7856 -33763 -49208 -40658 74 -1660 -10369
2810 -10369 -4077 -6821 -9242 -27566 -38640 -532 -31791 -51460 -24001 -13800 -19894 -19378 -26164
2797 -26164 7409 7317 -26977 -5671 -8284 -4159 -10786 -10734 -644 3443 4912 23843 24106 2939
$$ packed form
2888c6988M6021K0494j1058j9408J9595K1100j8401N610K3666n504j1729m776
2876B8622j5114j715Q931j4051M212l2909k8248K2113k909k477M3691n163J172
2863F155p461J551L881j6567K919l0730J8848K4507n887k346p451n347K0872K5938
2849B8882J3843j0254J6353k8122k8736J387J761L575j8847N428M493n138J0556
2836d819M209k2598M5702j1914k9881K2577k153n5318o836N0585L0160l058m198
2823A2458J4583l0615Q088J7351k140l776k3805k5907j5445Q550M0732j734q709
2810a0369O292k744k421j8324j1074L8108l1259j9669K7459J0201o094N16o786
2797b6164L3573r2l4294K1306k613M125o627N2J0090M087J469J8931K63k1167
$$ plain form
2783 2939 11418 11085 -25641 -8583 -20166 -16357 20835 12523 -539 4136 -2048 -24915 4242
2770 4242 -23067 -25389 -22410 13951 26411 13952 7319 -5965 -25868 -1655 17035 29087 36282
2757 36282 26676 1580 -31292 -37020 -23480 -8241 33259 -5596 -17423 -12500 -35698 -31843 -14297
2744 -14297 10725 -4611 -17578 -19400 -23320 -18066 1567 -3776 -17229 -18424 -10849 -25488 -18958
2731 -18958 10088 12334 3854 -14385 -39328 -24427 -9193 9731 8172 1347 -21086 -21265 -1261
2718 -1261 27878 -6499 -29480 -22478 25648 21703 17006 19334 -6946 -13716 -10860 10716 29778
2705 29778 -8150 -10116 -22873 -22244 14248 -14598 -18747 -16485 -23812 -7518 25840 5809 -8019
2692 -8019 -11354 -10774 4901 -18743 -10849 -12078 -6517 -13299 2758 35941 2267 -10419 7943
$$ packed form
2783B939Q479l33l6726J7058j1583L809L7192q312j3062M675o184k2867K9157
2770D242k7309k322K979L6361J2460j2459o633j3284j9903K4213J8690J2052P195
2757C6282r606k5096l2872n728J3540J5239M1500l8855j1827M923k3198L855J7546
2744a4297K5022j5336j2967j822l920N254J9633n343j3453j195P575j4639O530
2731a8958K9046K246q480j8239k4943J4901J5234J8924j559o825k2433j79K0004
2718a261K9139l4377k2981P002M8126l945m697K328k6280o770K856K1576J9062
2705B9778l7928j966j2757O29L6492k8846m149K262p327J6294L3358k0031j3828
2692h019l335N80J5675k3644P894j229N561o782J6057L3183l3674j2686J8362
$$ plain form
2679 7943 -11095 -12321 3465 781 14412 19444 25677 644 -11108 -15010 -9901 -26011 -33998
2666 -33998 -21443 -30503 -36245 -31314 -12707 -15114 -31600 -49709 -30718 -16122 -12789 1099 10310
2653 10310 7693 11058 34624 -3160 -29466 -45102 -25215 -24894 -30197 -47645 -64984 -51775 -26969
2640 -26969 2732 -5036 -9846 8554 11848 1778 15979 7375 -17709 -48233 -42845 -19839 -25669
2627 -25669 -4317 -4457 -15469 34757 30789 4692 4004 -2087 -27327 -31094 -20462 -13068 -19264 -2765
2613 -2765 -372 8374 -5626 14594 21984 -4958 -10203 -30668 -9581 -12210 8837 4160 -14773
2600 -14773 -605 -5231 -9382 -16432 -17396 12477 10972 -6733 -27225 -9963 -18799 -7136 24783
2587 24783 -5297 -42872 -27146 -11417 1982 -25351 -31786 4581 9570 2321 9913 -10778 -522
$$ packed form
2679G943j9038j226J5786k684J3631N032O233k5033j1752l902N109j6110p987
2666c3998J2555r060n742M931J8607k407j6486j8109J8991J4596L333J3888R211
2653A0310k617L365K3566l7784k6306j5636J9887L21n303j7448j7339J3209K4806
2640b6969K9701p768m810J8400L294j0070J4201q604k5084l0524N388K3006n830
2627b5669K1352j40j1012N0226l968k6097o88o091k5240l767J0632P394o196J6499
2613b765K393Q746j4000K0220P390k6942n245k0465K1087k629K1047m677j8933
2600a4773J4168m626m151p050r64K9873j505j7705k0492J7262q836J1663L1919
2587B4783l0080l7575J5726J5729J3399k7333o435L6367M989p249P592k0691J0256
$$ plain form
2574 -522 3599 -31842 -5202 9720 -179 1705 -3881 -2682 4455 -23857 -19440 6215 9273 4479
2560 4479 -11079 -10300 17564 4312 19365 26947 16929 -5673 -63229 -53875 -19339 16391 -3633
2547 -3633 15830 16907 -5061 -1489 -12419 -11851 -4281 -10811 -3457 35809 4181 20309 5817
2534 5817 -12619 1067 -2563 -13570 -8779 8008 27117 22578 12500 -14386 -19918 -32624 -24144
2521 -24144 -9448 -14130 -26790 -328 -4120 -16671 4815 -29114 -73294 -44283 -7989 -14865
2509 -14865 -11468 684 11682 -4427 -12044 -14563 -37741 -24535 -5647 -21343 -36060 -38204 -10752
2496 -10752 2962 -13555 -7217 9242 -12818 -25064 -13363 -18660 -7779 5701 -36463 -52628
2484 -52628 -40980 -3463 -7572 -13437 21456 19526 29000 42763 23599 -7772 -28356 -29225 -52013
$$ packed form
2574e22M121l5441K6640J4922r899J884n586J199P137k8312M417K5655L058m794
2560D479j5558P79K7864j3252J5053P582j0018k2602n7556R354L4536L5730k0024
2547c633J9463J077k1968L572j0930N68P570o530P354L9266l1628J6128j4492
2534E817j8436J3686l630j1007M791J6787J9109m539j0078k6886n532j2706Q480
2521b4144J4696m682j2660K6462l792j2551K1486l3929m4180K9011L6294o876
2509a4865L397J2152J0998j6109p617k519k3178J3206J8888j5696j4717k144K7452
2496a0752J3714j6517O338J6459k2060j2246J1701n297J0881J3480m2164j6165
2484e2628J1648L7517m109n865L4893j930R474J3763j9164l1371k0584q69k2788
$$ plain form
2471 -52013 -37813 -22436 -27869 -32698 -55816 -43979 -3966 -15897 -43396 -28192 -4938 -23074
2459 -23074 -1302 -1350 10370 8744 -6905 18648 37853 18952 -4621 17796 12033 -25307 -40467
2446 -40467 -34495 -40171 -33439 -22892 -20520 5986 2167 -15913 -32335 -58394 -67200 -57897 -33060
2433 -33060 -36811 -38687 -52744 -45803 -30588 -12154 -89 16907 -20062 -49169 -16308 -28500
2421 -28500 -9532 -3634 -26147 -23537 28476 -14044 -12335 27647 20751 31344 16120 -13936 -14906
2408 -14906 -2466 1605 30543 39598 1987 12766 6932 1653 2797 365 13220 16980 45011
2395 45011 -1296 -18822 -14898 -28463 -25148 -5933 9368 4802 23812 14589 -2749 4548 13147
2382 13147 1205 -8629 16631 -4452 4307 -27330 -43945 -48284 -54379 9961 37325 21282 26608
$$ packed form
2471e2013J4200J5377n433m829k3118J1837M0013j1931k7499J5204K3254j8136
2459b3074K1772m8J1720j626j5649K5553J9205j8901k3573K2417n763l7340j5160
2446d0467N972n676O732J0547K372K6506l819j8080j6422k6059q806R303K4837
2433c3060l751j876j4057O941J5215J8434J2065J6996l6969k9107L2861j2192
2421b8500J8968N898k2513K610N2013m2520J709L9982o896J0593j5224l0056r70
2408a4906J2440M071K8938R055l7611J0779n834n279J144k432J2855L760K8031
2395D5011m6307j7526L924j3565L315J9215J5301m566J9010r223j7338P297Q599
2382A3147j1942r834K5260k1083Q759l1637j6615m339o095O4340K7364j6043N326
$$ plain form
2369 26608 1420 3450 21203 -21427 -975 17919 4825 4492 18829 7183 -4250 -19190
2357 -19190 -12150 -104 -4120 789 -19747 -3307 -31861 -36519 -36711 -23881 -52688 -46796 -32831
2344 -32831 -29098 -15191 -28292 -22931 -2754 6749 12090 -31895 -55820 -1666 10566 34015 28767
2331 28767 -36747 -56445 -21404 12017 -8336 -26898 -35987 -24720 -14667 -13124 -1662 24205
2319 24205 5054 -20537 -17295 -16521 -7258 -21324 -19401 -39855 -37939 -5683 1433 -22078 -33249
2306 -33249 506 -6957 25664 50365 19737 1471 -13220 -1071 -15857 -14791 8874 18713
2294 18713 15849 -20556 -27963 -7561 -9025 -9875 -10778 -2109 -26187 -10265 -17991 -5752 -11998 -41357
2280 -41357 -23247 23876 22657 11885 9838 -11097 -9657 24001 -3218 26054 27895 -308 -16823
$$ packed form
2369B6608k5188K030J7753m2630K0452J8894j3094l33J4337j1646j1433j4940
2357a9190P040J2046m016M909k0536J6440k8554m658j92J2830k8807N892J3965
2344c2831L733J3907j3101N361K0177R503N341m3985k3925N4154J2232K3449n248
2331B8767o5514j9698L5041L3421k0353j8562r089J1267J0053J543J1462K5867
2319B4205j9151k5591L242P74R263j4066J923k0454J916L2256P116k3511j1171
2306c3249L3755p463L2621K4701l0628j8266j4691J2149j4786J066K3665R839
2294A8713k864l6405p407K0402j464q50r03Q669k4078J5922p726J2239o246k9359
2280d1357J8110M7123j219j0772k047k0935J440L3658k7219K9272J841k8203j6515
$$ plain form
2267 -16823 -49256 -41645 -6650 -9561 -14760 -8099 -32851 -24189 -20592 -1806 11104 916 134
2254 134 2413 15172 18909 19956 11112 15344 31677 18241 -35175 -43565 -2529 14558 12683 -21489
2240 -21489 -51110 -26789 489 -3553 -13835 -27116 -20747 -7137 -9106 -18151 -828 1571 -26361
2227 -26361 -15879 -25075 -41634 -7835 -4297 14590 31876 -23092 -32391 -708 8075 44358 26240
2214 26240 9880 3133 -1891 -20550 -46897 -33324 998 -3552 -34429 -40986 -13387 2845 -11637
2201 -11637 -5673 -34932 -46092 -32893 -42003 -29949 -50201 -41475 -36494 -15253 -14915 -16664 -9582
2188 -9582 20395 -4664 -862 14881 14268 10086 -2470 -25273 -33271 -42261 -37852 -17014 -49257
2175 -49257 -28330 -13409 -8379 -10173 -24452 -5756 -13093 -15898 -9286 -14530 6771 -281 14614
$$ packed form
2267a6823l2433P611L4995k911n199O661k4752Q662L597J8786J2910j0188p82
2254A34K279J2759L737J047q844M232J6333j3436n3416q390M1036J7087j875l4172
2240b1489k9621K4321K7278m042j0282j3281O369J3610j969r045J7323K399k7932
2227b6361J0482r196j6559L3799L538J8887J7286n4968r299L1683Q783L6283j8118
2214B6240j6360o747n024j8659k6347J3573L4322m550l0877o557K7599J6232j4482
2201a1637N964k9259j1160J3199r110J2054k0252Q726M981K1241L38j749P082
2188i582K9977k5059L802J5743o13m182j2556k2803p998q990M409K0838l2243
2175d9257K0927J4921N030j794j4279J8696p337k805O612n244K1301p052J4895
$$ plain form
2162 14614 -32484 -14188 -1678 -9172 -20672 -23700 -21219 -14081 -42350 -30462 13650 -11381 -40424
2149 -40424 -36219 -12795 -17445 -1481 18735 16175 6405 -29733 -2011 -21470 -23625 13133 10648
2136 10648 12823 -32237 -56903 -39028 -43184 -16790 -1862 800 -17327 -52769 -28164 19978
2124 19978 27916 5140 10828 -13131 -2258 -3001 -9849 -1891 10406 12292 26673 18903 27900 29304
2110 29304 -4700 -23255 13317 18348 -11463 -4825 18783 13285 -3815 -21419 -2241 6724 37810
2097 37810 -1966 -38306 -58171 -49022 -50516 -39647 -3862 22822 654 -47851 -21066 -19641
2085 -19641 -25863 -47765 -22423 5530 -16279 -23526 -17921 -27476 -14068 -14714 -24452 -16447 -7246 19401
2071 19401 12065 11096 12302 -12208 -22847 -1662 6322 2715 -4128 -21365 -20349 -26738 14758 17677
$$ packed form
2162A4614m7098J8296J2510p494j1500l028K481P138k8269J1888M4112k5031k9043
2149d0424M205K3424m650J5964K0216k560r770l6138K7722j9459k155L6758k485
2136A0648K175m5060k4666J7875m156K6394J4928K662j8127l5442K4605M8142
2124A9978P938k2776N688k3959J0873p43o848P958J2297J886J4381p770Q997J404
2110B9304l4004j8555L6572N031k9811O638K3608n498j7100j7604J9178Q965L1086
2097C7810l9776l6340j9865R149j494J0869L5785K6684k2168m8505K6785J425
2085a9641o222k1902K5342K7953k1809p247N605r555J3408o46r738Q005R201K6647
2071A9401p336r69J206k4510j0639K1185P984l607o843j7237J016o389M1496K919
$$ plain form
2057 17677 36662 -2003 -3825 9001 -32150 -21685 -10584 5958 1055 -19065 -23855 -1140
2045 -1140 -6676 -31133 -6499 6122 4015 -263 4044 25305 18982 10635 -9772 13431 33081
2032 33081 5224 -5216 -12755 -11039 -17171 -23551 -27206 -18140 4890 3282 484 13462 14411 1250
2018 1250 7204 -9175 -12570 -12753 -8750 -1607 -2394 12827 -2833 7332 -41190 -19305 474 7268
2004 7268 -10078 -63422 -66182 -78891 -23002 9870 -13585 -3924 -25600 10977 13664 20365 262
1991 262 -11736 10492 -27648 -32024 -11488 -9811 22493 18694 -4338 10897 -7135 454 -5474
1978 -5474 -817 -25766 -44020 -43961 -33114 -24978 -20438 -30697 -42993 -40021 -42235 -28954 -41612 -36722
1964 -36722 -25755 -807 11777 15984 48311 45218 24419 13264 -20557 -25177 -4307 1928 -19912
$$ packed form
2057A7677J8985l8665j822J2826m1151J0465J1101J6542m903k0120m790K2715
2045a140n536k4457K4634J2621k107m278M307K1261o323q347k0407K3203J9650
2032C3081k7857j0440p539J716o132o380l655R066K3030j608k798J2978R49j3161
2018A250N954j6379l395j83M003P143p87J5221j5660J0165m8522K1885J9779O794
2004G268j7346n3344k760j2709N5889L2872k3455R661k1676L6577K687O701k0103
1991B62j1998K2228l8140m376K0536J677L2304l799k3032J5235j8032P589n928
1978e474M657k4949j8254N9J0847Q136M540j0259j2296K972k214J3281j2658M890
1964c6722J0967K4948J2584M207L2327l093k0799j1155l3821m620K0870O235k1840
$$ plain form
1951 -19912 124 4157 -37605 -10158 11711 -133 1019 14608 -10356 -3415 19518 47823
1939 47823 39906 21957 34083 22949 3789 14564 12987 -15195 -5995 -2898 29120 38963 5431
1926 5431 -7493 -14919 -19912 -7762 4251 9021 -26280 -31137 -17411 1226 -10756 -3978 28647
1913 28647 -3207 -12538 -35114 -51124 -58593 -21723 -19593 -4684 -15359 -24901 -5592 11503 24022
1900 24022 25292 20592 8418 -8388 29817 12489 -4158 -1651 9991 -38489 -45836 -22357 -7657
1887 -7657 12503 2361 -12102 -2892 -5369 14837 8042 -45991 -19744 -19697 -58741 -38404 -25765
1874 -25765 -30565 -15225 -2472 -12662 505 -5551 -11367 -812 -19041 -20734 -15430 -5300 -4313
1861 -4313 21219 -10344 -36897 -42474 -7521 11686 7363 -14014 -24142 -19194 2064 20231 -14163
$$ packed form
1951a9912K0036M033m1762K7447K1869j1844J152J3589k4964O941K2933K8305
1939D7823p917j7949J2126j1134j9160J0775j577k8182R200L097L2018R843l3532
1926E431j2924p426m993J2150J2013M770l5301m857J3726J8637j1982O778L2625
1913B8647l1854r331k2576j6010p469L6870K130J4909j0675r542J9309J7095J2519
1900B4022J270m700j2174j6806L8205j7328j6647K507J1642m8480p347K3479J4700
1887g657K0160j0142j4463R210k477K0206o795n4033K6247M7l9044K0337J2639
1874b5765m800J5340J2753j0190J3167o056n816J0555j8229j693N304J0130R87
1861d313K5532l1563k6553n577L4953J9207m323k1377j0128M948K1258J8167l4394
$$ plain form
1848 -14163 -25267 -35251 -35153 -7808 -40154 -40154 -1443 570 -39583 -51316 -29356 15379 -8065 -45748
1834 -45748 -43668 -19718 -3473 -15046 -11458 11581 5385 780 -22056 -17461 -13034 -22186 -11158
1821 -11158 -11479 -26933 -24882 -10130 -3785 -28450 -62643 -17193 -31170 -28565 -8686 10831 13716
1808 13716 -25436 -2984 9057 11576 -5660 -5649 -28005 -50239 -49250 -17676 -23135 -28919 -6476
1795 -6476 32669 16786 9483 24732 -25710 -16908 -11933 -18338 -14854 -12621 -25233 -31337 -11106
$$ packed form
1848a4163j1104r984R8K7345l2346%L8711K013m0153j1733K1960M4735k3444l7683
1834d5748K080K3950J6245j1573L588K3039o196m605k2836M595M427r152J1028
1821a1158l21j5454K051J4752O345k4665l4193M5450j3977K605J9879J9517K885
1808A3716l9152K2452J2041K519j7236J1k2356k2234R89L1574n459n784K2443
1795f476L9145j5883p303J5249n0442Q802M975o405L484K233j2612o104K0231
$$ [...]
##END NTUPLES=NMR SPECTRUM
##END=
