##TITLE=1H_TG-2384-0
 200.13MHz, DMSO,
 8 sc
 
 3.3.2025
##JCAMPDX= 6.0         $$ Bruker NMR JCAMP-DX V2.0
##DATA TYPE= NMR SPECTRUM
##DATA CLASS= NTUPLES
##ORIGIN= UXNMR, Bruker Analytische Messtechnik GmbH
##OWNER= pz
$$ XWIN-NMR		Version 3.5
$$ Mon Mar  3 14:11:34 2025 Russian Standard Time (UT+4h)  she@DPX200
##.OBSERVE FREQUENCY= 200.1313
##.OBSERVE NUCLEUS= ^1H
##.ACQUISITION MODE= SIMULTANEOUS
##.ACQUISITION SCHEME= undefined
##.AVERAGES= 8
##.DIGITISER RES= 18
##SPECTROMETER/DATA SYSTEM= spect
##.PULSE SEQUENCE= zg30
##.SOLVENT NAME= DMSO
##.SHIFT REFERENCE= (INTERNAL, DMSO, 0, 15.5145)
##AUDIT TRAIL= $$ (NUMBER, WHEN, WHO, WHERE, WHAT)
$$ ##TITLE= Audit trail, XWIN-NMR		Version 3.5
$$ ##JCAMPDX= 5.01
$$ ##ORIGIN= Bruker BioSpin GmbH
$$ ##OWNER= she
$$ F:/spectra/data/she/nmr/H-C/1/pdata/1/auditp.txt
$$ ##AUDIT TRAIL=  $$ (NUMBER, WHEN, WHO, WHERE, WHAT)
(   1,<2025-03-03 14:10:22.17 +0400>,<she>,<DPX200>,
      <created by zg, POWCHK disabled, PULCHK disabled
       configuration hash MD5:
       00 E9 B6 7A A2 85 ED C7 34 08 36 98 17 FE 4E 26
       data hash MD5: 16K
       6D DB F5 BF DA E6 7B 89 AA 3D 72 30 1F E9 7D C0>)
(   2,<2025-03-03 14:10:24.65 +0400>,<she>,<DPX200>,
      <Start of raw data processing
       efp BC_mod = 2 LB = 0.25 FT_mod = 6 PKNL = 1 PHC0 = -470.4227 PHC1 = 15.99222 SI = 16K 
       data hash MD5: 16K
       51 A7 BF 6C C3 94 84 6D D2 E2 E0 D4 49 77 B4 16>)
(   3,<2025-03-03 14:10:38.59 +0400>,<she>,<DPX200>,
      <pk PHC0 = -2.716256 PHC1 = 3.4 
       data hash MD5: 16K
       96 23 3E 35 72 05 F3 3B B9 AE 56 D4 EA 21 84 36>)
(   4,<2025-03-03 14:10:42.81 +0400>,<she>,<DPX200>,
      <abs ABSG = 5 
       data hash MD5: 16K
       D6 A9 06 76 FD FD 0B B2 2B D8 B3 6B 2C DA 27 BE>)
$$ ##END=
$$ 
$$ hash MD5
$$ 8A FE 4C 69 78 63 6F 96 E5 CA 60 24 B0 C9 DD D2
##$RELAX= 
##$RELAX= 
##$RELAX= 
##$RELAX= 
##$RELAX= 
##$RELAX= 
$$ Bruker specific parameters
$$ --------------------------
##$DU= <F:/spectra>
##$EXPNO= 1
##$NAME= <H-C>
##$PROCNO= 1
##$TYPE= <nmr>
##$USER= <she>
##$AMP= (0..31)
100 100 100 100 100 100 100 100 100 100 100 100 100 100 100 100 100 100 
100 100 100 100 100 100 100 100 100 100 100 100 100 100 
##$AQSEQ= 0
##$AQ_mod= 1
##$AUNM= <au_zg>
##$AUTOPOS= <>
##$BF1= 200.13
##$BF2= 200.13
##$BF3= 200.13
##$BF4= 200.13
##$BF5= 200.13
##$BF6= 200.13
##$BF7= 200.13
##$BF8= 200.13
##$BYTORDA= 1
##$CFDGTYP= 0
##$CFRGTYP= 5
##$CHEMSTR= <none>
##$CNST= (0..31)
1 1 145 1 1 1 1 1 1 1 1 1 1 1 1 1 1 1 1 1 1 1 1 1 1 1 1 1 1 1 1 1 
##$CPDPRG= <>
##$CPDPRG1= <>
##$CPDPRG2= <>
##$CPDPRG3= <>
##$CPDPRG4= <mlev>
##$CPDPRG5= <mlev>
##$CPDPRG6= <mlev>
##$CPDPRG7= <mlev>
##$CPDPRG8= <mlev>
##$CPDPRGB= <>
##$CPDPRGT= <>
##$D= (0..31)
0 0.7 0 0 0 0 0 0 0 0 0 0.03 0 0 0 0 0 0 0 0 0 0 0 0 0 0 0 0 0 0 0 0 
##$DATE= 1740996621
##$DBL= (0..7)
120 120 120 120 120 120 120 120 
##$DBP= (0..7)
150 150 150 150 150 150 150 150 
##$DBP07= 0
##$DBPNAM0= <>
##$DBPNAM1= <>
##$DBPNAM2= <>
##$DBPNAM3= <>
##$DBPNAM4= <>
##$DBPNAM5= <>
$$ [...]
##$SUBNAM3= <"">
##$SUBNAM4= <"">
##$SUBNAM5= <"">
##$SUBNAM6= <"">
##$SUBNAM7= <"">
##$SUBNAM8= <"">
##$SUBNAM9= <"">
##$SW= 18.0517328524113
##$SWIBOX= (0..15)
0 0 2 0 0 0 0 0 0 0 0 0 0 0 0 0 
##$SW_h= 3612.71676300578
##$TD= 16384
##$TD0= 1
##$TE= 0
##$TE2= 300
##$TE3= 300
##$TEG= 300
##$TL= (0..7)
0 120 120 120 120 120 120 120 
##$TP= (0..7)
150 150 150 150 150 150 150 150 
##$TP07= 0
##$TPNAME0= <>
##$TPNAME1= <>
##$TPNAME2= <>
##$TPNAME3= <>
##$TPNAME4= <>
##$TPNAME5= <>
##$TPNAME6= <>
##$TPNAME7= <>
##$TPOAL= (0..7)
0.5 0.5 0.5 0.5 0.5 0.5 0.5 0.5 
##$TPOFFS= (0..7)
0 0 0 0 0 0 0 0 
##$TUNHIN= 0
##$TUNHOUT= 0
##$TUNXOUT= 0
##$USERA1= <user>
##$USERA2= <user>
##$USERA3= <user>
##$USERA4= <user>
##$USERA5= <user>
##$V9= 5
##$VALIST= <valist>
##$VCLIST= <CCCCCCCCCCCCCCC>
##$VD= 0
##$VDLIST= <DDDDDDDDDDDDDDD>
##$VPLIST= <PPPPPPPPPPPPPPP>
##$VTLIST= <TTTTTTTTTTTTTTT>
##$WBST= 1024
##$WBSW= 4
##$XGAIN= (0..3)
0 0 0 0 
##$XL= 0
##$YL= 0
##$YMAX_a= 363120
##$YMIN_a= -357432
##$ZGOPTNS= <>
##$ZL1= 120
##$ZL2= 120
##$ZL3= 120
##$ZL4= 120
##$ABSF1= 15.51121
##$ABSF2= -2.540639
##$ABSG= 5
##$ABSL= 3
##$ALPHA= 0
##$AQORDER= 0
##$ASSFAC= 0
##$ASSFACI= 0
##$ASSFACX= 0
##$ASSWID= 0
##$AUNMP= <proc_1d>
##$AZFE= 0.1
##$AZFW= 0.1
##$BCFW= 0
##$BC_mod= 2
##$BYTORDP= 0
##$COROFFS= 0
##$CY= -3
##$DATMOD= 1
##$DC= 0
##$DFILT= <>
##$DTYPP= 0
##$F1P= 0
##$F2P= 0
##$FCOR= 1
##$FTSIZE= 16384
##$FT_mod= 6
##$GAMMA= 0
##$GB= 0
##$INTBC= 1
##$INTSCL= 3.241238e-09
##$ISEN= 128
##$LB= 0.25
##$LEV0= 0
##$LPBIN= 0
##$MAXI= 10000
##$MC2= 0
##$MEAN= 0
##$ME_mod= 0
##$MI= 1.114404
##$NCOEF= 0
##$NC_proc= -5
##$NLEV= 6
##$NOISF1= 3.799351
##$NOISF2= 2.8
##$NSP= 0
##$NTH_PI= 0
##$NZP= 0
##$OFFSET= 15.51452
##$PC= 1
##$PHC0= -473.1389
##$PHC1= 19.39222
##$PH_mod= 1
##$PKNL= yes
##$PPARMOD= 0
##$PSCAL= 0
##$PSIGN= 0
##$REVERSE= no
##$SF= 200.130001437535
##$SI= 16384
##$SIGF1= 3
##$SIGF2= 2
##$SINO= 0.751879
##$SIOLD= 32768
##$SREGLST= <19F.Aceton>
##$SSB= 0
##$STSI= 16384
##$STSR= 0
##$SW_p= 3612.71676300578
##$SYMM= 0
##$S_DEV= 0
##$TDeff= 16384
##$TDoff= 0
##$TI= <>
##$TILT= no
##$TM1= 0
##$TM2= 0
##$TOPLEV= 0
##$USERP1= <user>
##$USERP2= <user>
##$USERP3= <user>
##$USERP4= <user>
##$USERP5= <user>
##$WDW= 1
##$XDIM= 16384
##$YMAX_p= 298362978
##$YMIN_p= -827053
$$ End of Bruker specific parameters
$$ ---------------------------------
##NTUPLES= NMR SPECTRUM
##VAR_NAME=  FREQUENCY,     SPECTRUM/REAL,   SPECTRUM/IMAG
##SYMBOL=    X,             R,               I
##VAR_TYPE=  INDEPENDENT,   DEPENDENT,       DEPENDENT
##VAR_FORM=  AFFN,          ASDF,            ASDF
##VAR_DIM=   16384,         16384,           16384
##UNITS=     HZ,            ARBITRARY UNITS, ARBITRARY UNITS
##FACTOR=    0.220516191357247, 1,           1
##FIRST=     3104.92084815601, 0,            0
##LAST=      -507.795914849768, 0,           0
##MIN=       -507.795914849768, -827053,     0
##MAX=       3104.92084815601, 298362978,    0
$$ Real data points
##PAGE= N=1
##DATA TABLE= (X++(R..R)), XYDATA
$$ [...]
$$ plain form
8846 20832 36460 127161 93634 35841 -14878 99695 73390 12951 37596 112858 102265 102429
8834 102429 58017 30955 52952 5398 61306 42799 67972 164755 72079 51857 110609 108287
8822 108287 57851 24116 98776 93711 101649 76700 50753 118681 162123 130723 127806 61784
8810 61784 155747 113164 57031 125749 191590 208565 135531 143122 126137 130612 166388 147673
8798 147673 75929 81843 144677 148644 203115 163031 124325 167834 169122 207844 161349 211581
8786 211581 223031 177455 193979 279872 279966 246843 227076 218211 286943 310214 282437 264033
8774 264033 298416 312862 378507 363460 314394 290625 276195 289283 334713 326023 294803 319988
8762 319988 340334 257560 311558 301650 262439 231745 258461 233345 202576 245988 247128 257674
$$ packed form
8846B0832J5628R0701l3527n7793n0719J14573k6305o0439K4645P5262j0593J64
8834A02429m4412k7062K1997m7554N5908j8507K5173R6783r2676k0222N8752k322
8822A08287n0436l3735P4660n065P938k4949k5947O7928M3442l1400k917o6022
8810F1784R3963m2583n6133O8718O5841J6975p3034P591j6985M475L5776j8715
8798A47673p1744N914O2834L967N4471m0084l8706M3509J288L8722m6495N0232
8786B11581J1450m5576J6524Q5893R4l3123j9767q865O8732K3271k7777j8404
8774B64033L4383J4446O5645j5047m9066k3769j4430J3088M5430q690l1220K5185
8762C19988K0346q2774N3998r908l9211l0694K6716k5116l0769M3412J140J0546
$$ plain form
8750 257674 269992 267547 179604 129301 128731 185026 125141 178532 227590 252980 226607 168873
8738 168873 116851 142154 123879 84581 60957 65728 133445 57349 101309 132977 132588 93790
8726 93790 82339 96062 105913 79539 47257 39110 26916 40165 17396 62739 53958 80402
8714 80402 54422 19416 47656 18598 -9635 5865 20376 -9232 9237 45090 21716 -6484
8702 -6484 48898 75249 5279 -1526 14376 8514 30729 45644 33286 -5807 29889 -33576
8690 -33576 -13946 24983 -15710 -11567 44381 84026 41468 47471 113144 125480 29011 16460
8678 16460 -6710 -39516 -39443 -80094 -47069 -39274 -49177 -34457 331 29169 9851 -16215 20579
8665 20579 -35812 -40586 -49023 -31371 -28812 -28187 5412 5391 -35175 -50454 68475 -9824 -29399
$$ packed form
8750B57674J2318k445q7943n0303n70N6295n9885N3391M9058K5390k6373n7734
8738A68873n2022K5303j8275l9298k3624M771O7717p6096M3960L1668l89l8798
8726I3790j1451J3723R851k6374l2282q147j2194J3249k2769M5343q781K6444
8714H0402k5980l5006K8240k9058k8233J5500J4511k9608J8469L5853k3374k8200
8702f484N5382K6351o9970o805J5902n862K2215J4915j2358l9093L5696o3465
8690c3576J9630L8929m0693M143N5948L9645m2558O003O5673J2336r6469j2551
8678A6460k3170l2806P3m0651L3025P795r903J4720L4788K8838j9318k6066L6794
8665B0579n6391m774q437J7652K559O25L3599k1m0566j5279J18929p8299j9575
$$ plain form
8652 -29399 -27808 -31594 -15765 -29835 -49455 -54891 -29224 -42635 -31096 -77029 -55888 -52090 -68445
8639 -68445 -44948 -31548 -33807 27555 -37307 -52251 51521 687 -25981 2716 6445 -35509
8627 -35509 -112094 -100510 -32851 -8152 -21234 -32219 -52572 -13574 -19337 -85564 -112714 -61410
8615 -61410 -1113 -39451 -37048 -98768 -67715 -1561 29380 9057 -41354 -14345 -16643 -28541
8603 -28541 -11160 -23966 -49901 -123079 -63348 -2301 -29048 -85704 -64953 -6377 -6128 20413
8591 20413 14591 -32238 -86530 -108443 -87475 -41950 -76324 -117722 -83851 -64289 -38668 -108627
8579 -108627 -78773 -11182 -73575 -6193 -7179 -59045 -107092 -101416 -109531 -140355 -51862 -107707
8567 -107707 -68722 -64488 -117428 -88537 -43655 -37888 -65084 -19302 -45943 -85218 -42147 -39280
$$ packed form
8652b9399J591l786J5829j4070j9620n436K5667j3411J1539m5933K1141L798j6355
8639f8445K3497J3400k259O1362o4862j4944J03772n0834k6668K8697L729m1954
8627c5509p6585J1584O7659K4699j3082j0985k0353L8998n763o6227k7150N1304
8615f1410O0297l8338K403o1720L1053O6154L0941k0323n0411K7009k298j1898
8603b8541J7381j2806k5935p3178N9731O1047k6747n6656K0751N8576K49K6541
8591B0413n822m6829n4292k1913K0968M5525l4374m1398L3871J9562K5621o9959
8579a08627K9854O7591o2393O7382r86n1866m8047N676q115l0824Q8493n5845
8567a07707L8985M234n2940K8891M4882N767k7196M5782k6641l9275M3071K867
$$ plain form
8555 -39280 -113995 -61221 14550 -66213 -87814 -49941 -34702 -40549 -42815 -65778 -51010 -39430
8543 -39430 -25212 -12457 -6051 -7022 -87360 -135450 -22562 -36153 -49850 -64923 -50055 -1258
8531 -1258 -43774 -38293 -42150 20390 6185 -29932 -141191 -92215 -7064 -10420 23758 69646
8519 69646 -32399 -98107 -79784 25703 -48882 -51380 -57577 -88655 -90042 -97134 -31242 -79319
8507 -79319 -53528 -86033 -124292 -187185 -129348 -116856 -113815 -59019 -13313 -63698 -45257 -40794
8495 -40794 -19873 -29271 -18262 6368 -59538 -20495 -42151 -83008 -130207 -124881 -111288 -123598
8483 -123598 -90517 -78626 -73497 -59779 -68222 -64349 -42452 -56356 -83853 -49438 -6277 -17481
8471 -17481 -32159 -55760 -38119 -72178 -54836 -36849 -29019 -14061 -16424 -10433 -60470 -15385
$$ packed form
8555c9280p4715N2774P5771q0763k1601L7873J5239n847k266k2963J4768J1580
8543c9430J4218J2755O406r71q0338m8090J12888j3591j3697j5073J4868M8797
8531a258m2516N481l857O2540j4205l6117j11259M8976Q5151l356L4178M5888
8519F9646j02045o5708J8323J05487p4585k498o197l1078j387p092O5892m8077
8507g9319K5791l2505l8259o2893N7837J2492L041N4796M5706n0385J8441M463
8495d0794K0921r398J1009K4630o5906L9043k1656m0857m7199N326J3593j2310
8483a23598L3081J1891N129J3718q443L873K1897j3904k7497L4415M3161j1204
8471a7481j4678k3601J7641l4059J7342J7987P830J4958k363N991n0037M5085
$$ plain form
8459 -15385 -40401 8730 49389 6636 -33954 -30731 -41009 32983 52596 8005 -1893 -44821
8447 -44821 -62914 -43491 -136294 -196956 -147325 -135156 -59920 -14085 -39944 -49517 -61707 -45312
8435 -45312 -55945 -96878 -73364 -73636 -39451 -10472 -39954 -61772 -107099 -61531 -106923 -91960
8423 -91960 -66535 1681 -18375 -68082 -42627 -74349 -95764 -81824 -63823 -75046 -49613 -4970
8411 -4970 20574 -1158 52674 51007 2580 -45000 -59834 -112757 -99795 -40188 -14613 40053
8399 40053 1729 -69530 -83119 -92451 -16114 34807 -1736 -1453 -36428 -9365 -17526 -39154 -49890
8386 -49890 -15316 -11631 -13567 12573 18225 31461 -82932 -97067 -65699 -76934 -130143 -88432
8374 -88432 -80413 -48577 -18397 43322 -52579 -68538 -49295 -60377 -17407 5486 -3856 -19097
$$ packed form
8459a5385k5016M9131M0659m2753m0590L223j0278P3992J9613m4591r898m2928
8447d4821j8093J9423r2803o0662M9631J2169P5236M5835k5859r573j2190J6395
8435d5312j0633m0933K3514k72L4185K8979k9482k1818m5327M5568m5392J4963
8423i1960K5425O8216k0056m9707K5455l1722k1415J3940J8001j1223K5433M4643
8411d970K5544k1732N3832j667m8427m7580j4834n2923J2962N9607K5575N4666
8399D0053l8324p1259j3589r332P6337N0921l6543K83l4975K7063q161k1628j0736
8386d9890L4574L685j936K6140N652J3236j14393j4135L1368j1235n3209M1711
8374h8432Q019L1836L0180O1719r5901j5959J9243j1082M2970K2893r342j5241
$$ plain form
8362 -19097 -39938 -45671 -43671 -16082 -55323 -82498 -41903 -42724 -145323 -148655 -84056 -25893 29874
8349 29874 -24257 -31307 -50596 -120991 -151264 -93085 -82434 -94166 -50689 2082 -40638 -96250
8337 -96250 -103466 -118430 -80420 -40298 -69418 -70339 -39431 -21286 -10926 4304 -32990 -64767
8325 -64767 -86154 -76371 -37830 54034 7236 -17076 11834 -18105 -49315 -12065 -32396 -73920
8313 -73920 -7676 31818 21003 -12919 4682 -46433 -18459 -8768 -51611 -22925 -7440 13905
8301 13905 -39767 -30820 -60697 -118391 -207149 -147739 -103365 -80123 -115091 -85000 -21953 -52136
8289 -52136 -47031 -58875 -75110 -107601 -91356 -68108 -56992 -27990 -8861 -55128 -89283 -81096
8277 -81096 -103028 -100305 -107144 -56724 -484 -10653 1777 -11281 -53626 -66398 34586 -3359
$$ packed form
8362a9097k0841n733K000K7589l9241k7175M0595q21j02599l332O4599N8163N5767
8349B9874n4131p050j9289p0395l0273N8179J0651j1732M3477N2771m2720n5612
8337i6250p216j4964L8010M0122k9120r21L0908J8145J0360J5230l7294l1777
8325f4767k1387R783L8541R1864m6798k4312K8910k9939l1210L7250k0331m1524
8313g3920O6244L9494j0815l3922J7601n1115K7974R691m2843K8686J5485K1345
8301A3905n3672Q947k9877n7694q8758N9410M4374K3242l4968L0091O3047l0183
8289e2136N105j1844j6235l2491J6245K3248J1116K9002J9129m6267l4155Q187
8277h1096k1932K723o839N0420N6240j0169J2430j3058m2345j2772J00984l7945
$$ plain form
8265 -3359 -42593 -96921 -77582 -65161 -79347 -75232 -100791 -152116 -108224 -79252 -87355 -58842
8253 -58842 -108760 -36147 -33556 -89132 -30179 -29154 -38560 -67230 -89686 -125554 -83833 -53760
8241 -53760 -27683 -85018 -111653 -51446 -34754 -25910 -92207 -49874 -51802 -67210 -117275 -99051
8229 -99051 -9847 17248 -39733 -61312 -16854 39766 3710 8200 -6965 -4863 -48410 -44694
8217 -44694 -2301 8872 -37549 -76727 -92293 -74855 -3429 64071 -44483 -115945 -112493 -115468
8205 -115468 -110972 -74819 -127645 -114727 -92200 -62393 -82592 -12622 -101128 -64226 -100172 -120120
8193 -120120 -333431 -827053 -308863 -118807 -59448 -96036 -53069 -104342 -62087 -45212 -30806
8182 -30806 -10604 -20048 -45704 -66128 -41359 -71930 -145835 -162875 -40566 -59863 -72773 -39465
$$ packed form
8265c359l9234n4328J9339J2421j4186M115k5559n1325M3892K8972q103K8513
8253e8842m9918P2613K591n5576N8953J025r406k8670k2456l5868M1721L0073
8241e3760K6077n7335k6635O0207J6692Q844o6297M2333j928j5408n0065J8224
8229i9051Q9204K7095n6981k1579M4458N6620l6056M490j5165K102m3547L716
8217d4694M2393J1173m6421l9178j5566J7438P1426O7500j08554p1462L452k975
8205a15468M496L6153n2826J2918K2527K9807k0199O9970q8506L6902l5946j9948
8193a20120k13311m93622N18190J90056N9359l6588M2967n1273M2255J6875J4406
8182c0806K0202r444k5656k0424K4769l0571p3905j7040J22309j9297j2910L3308
$$ plain form
8170 -39465 17338 -55092 -39816 -7925 -7393 -60653 -102400 -94168 -79842 -23435 -85018 -86570 -27122
8157 -27122 -64147 -17342 -48464 -49951 -86693 -17457 -21322 -50999 -25623 -34886 -96267 -70982
8145 -70982 -66055 -41395 4754 -35452 -53342 -53313 -61155 -79830 -78880 -91016 -89467 -68816 -40549
8132 -40549 -40552 -51450 8503 36272 17850 10439 -58488 -58458 -62482 -30208 -34418 -36990 -42914 -61249
8118 -61249 -89408 -94129 -92856 -100361 -51426 -52875 -4470 35662 -44889 -78033 -66438 -39735 -73597
8105 -73597 -90252 -122960 -134422 -89808 -51966 -73403 -72556 -34860 -41020 -23310 -14292 -59194 -87646
8092 -87646 -36147 -67726 -23502 9688 39025 9755 -42577 -40776 -66805 -35205 1754 -49471
8080 -49471 -55939 -32830 -78633 -94687 -79497 -29644 -9922 -54400 -64343 -38542 -25811 -7650
$$ packed form
8170c9465N6803p2430J5276L1891N32n3260m1747Q232J4326N6407o1583j552N9448
8157b7122l7025M6805l1122j487l6742O9236l865k9677K5376r263o1381K5285
8145g0982M927K4660M6149m0206j7890K9p842j8675R50j2136J549K0651K8267
8132d0549lj0898N9953K7769j8422p411o8927L0m024L2274m210k572n924j8335
8118f1249k8159m721J273p505M8935j449M8405M0132q0551l3144J1595K6703l3862
8105g3597j6655l2708j1462M4614L7842k1437Q47L7696o160J7710R018m4902k8452
8092h7646N1499l1579M4224L3190K9337k9270n2332J801k6029L1600L6959n1225
8080d9471o468K3109m5803j6054J5190M9853J9722m4478r943K5801J2731J8161
$$ plain form
8068 -7650 -80831 -44657 -47738 -64163 -68671 -20105 -51070 -77823 -55353 -64956 -54103 -53659 -34860
8055 -34860 -84034 -127214 -168163 -87662 -65823 -46893 -24651 -50693 -55990 -78527 -55278 29196
8043 29196 -10206 -44665 -87183 -55285 -43223 -121956 -90249 -45160 -21483 27716 -15184 -16985
8031 -16985 -22703 16778 25784 12938 -48527 -89442 -67763 4224 26369 -12023 -11434 -18819 41313
8018 41313 38630 -35867 -47432 26245 28627 -1857 -30518 2302 31111 -27401 -31695 -20208
8006 -20208 -18566 -22618 -34405 -23664 -14817 -64254 -72979 -34589 -85456 -65673 -68951 -17030 1549
7993 1549 -23709 -40031 -97416 -43019 -44761 -69406 2976 -53377 -47864 -4865 -8067 -23886 31046
7980 31046 12246 -29521 -27535 -76680 -98210 -70758 -22747 -10173 2556 934 -20955 63856
$$ packed form
8068g650p3181L6174l081j6425m508M8566l0965k6753K2470r603J0853M44J8799
8055c4860m9174m3180m0949Q0501K1839J8930K2242k6042n297k2537K3249Q4474
8043B9196l9402l4459m2518L1898J2062p8733L1707M5089K3677M9199m2900j801
8031a6985n718L9481R006j2846o1465m0915K1679P1987K2145l8392N89p385O0132
8018D1313k683p4497j1565P3677K382l0484k8661L2820K8809n8512m294J1487
8006b0208J642m052j1787J0741Q847m9437q725L8390n0867J9783l278N1921J8579
7993A549k5258j6322n7385N4397j742k4645P2382n6353N513M2999l202j5819N4932
7980C1046j8800m1767J986m9145k1530K7452M8011J2574J2729j622k1889Q4811
$$ plain form
7968 63856 6084 -34471 -54269 -3121 -2652 -77522 -58936 -29648 -39301 -63563 -42488 3083
7956 3083 21045 -106659 -43614 -84325 -14917 -7794 -26217 -38214 -60549 17611 22841 44964
7944 44964 -4230 -20682 -70889 -27193 41805 29537 24176 15226 -11630 -14829 4562 -48331
7932 -48331 -91056 -36769 -43092 -38820 -25638 -79262 -118714 -89509 -45729 15500 40383 19756
7920 19756 3351 -22079 -43956 -104604 -43917 -729 5315 -44401 -53576 -781 -4060 -15955
7908 -15955 -58729 -34146 -14623 -15757 16894 6286 -7629 19427 10567 -19509 -1508 -13780
7896 -13780 -66732 -19577 3028 -22885 -4401 -47405 -7414 -3059 -26436 1586 21995 12277
7884 12277 4874 14281 13565 -15664 -119754 -84641 -39930 -14528 83798 100643 69617 42911
$$ packed form
7968F3856n7772m0555j9798N1148M69p4870J8586K9288r653k4262K1075M5571
7956C083J7962j27704O3045m0711O9408P123j8423j1997k2335P8160N230K2123
7944D4964m9194j6452n0207M3696O8998j2268n361q950k6856l199J9391n2893
7932d8331m2725N4287o323M272J3182n3624l9452K9205M3780O1229K4883k0627
7920A9756j6405k5430k1877o0648O0687M3188O044m9716r175N2795l279j1895
7908a5955m2774K4583J9523j134L2651j0608j3915K7056q860l0076J8001j2272
7896a3780n2952M7155K2605k5913J8484m3004L9991M355k3377K8022K0409r718
7884A2277p403R407p16k9229j04090L5113M4711K5402R8326J6845l1026k6706
$$ plain form
7872 42911 59042 64048 60593 96622 102021 5001 -48866 -47939 13577 70267 -14880 16910 31631
7859 31631 -10497 4482 55472 76892 29307 4280 24329 60119 43182 72655 59948 11907
7847 11907 32581 -9267 27741 -6448 -19106 22882 -50598 -73205 -48679 -68093 -63682 -70505
7835 -70505 -22147 -28005 -48680 587 -21528 14361 -11996 -19645 25098 -28513 -21157 -8703
7823 -8703 -24595 912 11655 36699 6789 30197 5519 -25579 -7379 28860 37364 -26870
7811 -26870 -25691 -26116 -43129 -110599 -89055 -76751 -36430 -3896 11550 22014 -34786 -6252
7799 -6252 187 9032 -8788 8005 -31562 -44327 -26286 21093 38828 -5676 10826 72850
7787 72850 33883 32301 27200 -13894 -13136 6349 17741 37560 42837 -21135 -31610 2833 50910
$$ packed form
7872D2911J6131N006l455L6029N399r7020n3867R27O1516N6690q5147L1790J4721
7859C1631m2128J4979N0990K1420m7585k5027K0049L5790j6937K9473j2707m8041
7847A1907K0674m1848L7008l4189j2658M1988p3480k2607K4526j9414M411o823
7835g0505M8358n858k0675M9267k2115L5889k6357p649M4743n3611P356J2454
7823h703j5892K5507J0743K5044k9910K3408k4678l1098J8200L6239Q504o4234
7811b6870J179m25j7013o7470K1544J2304M0321L2534J5446J0464n6800K8534
7799f252O439Q845j7820J6793l9567j2765J8041M7379J7735m4504J6502O2024
7787G2850l8967j582n101m1094P58J9485J1392J9819N277o3972j0475L4443M8077
$$ plain form
7774 50910 7083 -7443 21166 8748 -11958 -46272 -42284 7660 -12985 -64042 -59471 -11584
7762 -11584 -17958 2431 42821 30238 36417 1234 14069 46482 -7659 -10821 34341 74361
7750 74361 46064 14256 -24418 2946 38583 14563 -30513 -37772 -22240 6519 -2687 10009
7738 10009 -4815 32613 -40182 -21259 53282 68604 7489 38555 37221 -45174 41011 62103
7726 62103 5756 -33730 -9497 -53572 -1094 -37408 -8949 12286 71105 41684 42641 41676 8356
7713 8356 12067 2543 29658 39734 71791 64299 63040 -18130 -16304 2895 -7256 -5122 -25558
7700 -25558 -22888 59446 120752 86003 47768 35041 -9787 2177 37831 41091 60995 40781
7688 40781 14709 17238 19726 23068 17669 -37241 -13476 14714 -68428 -91314 -46256 -30064 -12340
$$ packed form
7774E0910m3827j4526K8609j2418k0706l4314L988M9944k0645n1057M571M7887
7762a1584o374K0389M0390j2583O179l5183J2835L2413n4141l162M5162M0020
7750G4361k8297l1808l8674K7364L5637k4020m5076p259J5532K8759r206J2696
7738A0009j4824L7428p2795J8923P4541J5322o1115L1066j334q2395Q6185K1092
7726F2103n6347l9486K4233m4075N2478l6314K8459K1235N8819k9421R57r65l3320
7713H356L711r524K7115J0076L2057p492j259q1170J826J9199j0151K134k0436
7700b5558K670Q2334O1306l4749l8235j2727m4828J1964L5654L260J9904k0214
7688D0781k6072K529K488L342n399n4910K3765K8190q3142k2886M5058J6192J7724
$$ plain form
7675 -12340 55091 34976 32141 72972 16973 23762 90147 115074 72527 42199 -7758 -16124
7663 -16124 45237 95770 61826 91950 72340 44065 74289 172412 108707 123982 125128 110563
7651 110563 108690 24014 106799 58503 56773 99345 185465 190847 121141 164912 139707 160616
7639 160616 165316 134475 112666 110023 138766 84069 119378 130322 121247 149376 170585 173508
7627 173508 154545 168503 242051 225081 223326 199940 220455 246565 192014 146383 199158 193480
7615 193480 171488 143823 119460 148534 209169 150338 101121 131895 153378 116614 88511 106122
7603 106122 80536 205605 176690 176009 173422 135218 148224 105127 82273 149373 164779 136178
7591 136178 129714 80038 59468 58749 80392 82291 126274 140202 135415 189820 176535 123249 119384
$$ packed form
7675a2340O7431k0115k835M0831n5999O789O6385K4927m2547l0328m9957q366
7663a6124O1361N0533l3944L0124j9610k8275L0224R8123o3705J5275J146j4565
7651A10563j873q4676Q2785m8296j730M2572Q6120N382o9706M3771k5205K0909
7639A60616M700l0841k1809k643K8743n4697L5309J0944r075K8129K1209K923
7627A73508j8963J3958P3548j6970j755k3386K0515K6110n4551m5631N2775n678
7615A93480k1992k7665k4363K9074O0635n8831m9217L0774K1483l6764k8103J7611
7603A06122k5586J25069k8915o81k587l8204J3006m3097k2854O7100J5406k8601
7591A36178o464m9676k0570p19K1643J899M3983J3928m787N4405j3285n3286l865
$$ plain form
7578 119384 126806 124425 91051 117479 91156 133092 121366 113251 54069 5816 13580 42640
7566 42640 82479 73442 104913 47857 79854 27836 97410 99969 16342 81658 97694 101203
7554 101203 132731 90764 130449 159904 95883 107842 144263 63030 64526 127462 126204 152008
7542 152008 118779 88243 113211 140022 94213 43490 65435 103917 140225 111746 124161 115049
7530 115049 151642 177112 133356 120718 138938 153794 48100 81180 134790 196120 144363
7519 144363 54994 54903 97969 99220 74800 107566 52087 47851 79850 131187 102006 144577 182040
7506 182040 177609 152175 199492 215984 203522 135882 135473 121992 93668 208966 164619 153789
7494 153789 133310 163876 153606 111135 137541 161726 162466 189113 209525 171134 121974 108294
$$ packed form
7578A19384P422k381l3374K6428k6323M1936j1726q115n9182m8253P764K9060
7566D2640L9839r037L1471n7056L1997n2018O9574K559q3627O5316J6036L509
7554A01203L1528m1967L9685K9455o4021J1959L6421q1233J496O2936j258K5804
7542A52008l3229l0536K4968K6811m5809n0723K1945L8482L6308k8479J2415r112
7530A15049L6593K5470m3756j2638J8220J4856j05694L3080N3610O1330n1757
7519A44363q9369r1M3066J251k4420L2766n5479m236L1999N1337k9181M2571L7463
7506A82040m431k5434M7317J6492j2462o7640m09j3481k8324J15298m4347j0830
7494A53789k0479L0566j0270m2471K6406K4185P40K6647K0412l8391m9160j3680
$$ plain form
7482 108294 100994 142677 218527 255116 222605 187063 192334 168909 165771 260604 195091 225287
7470 225287 307352 223776 172053 166902 137638 149189 179738 221103 213179 201649 245424 177579
7458 177579 175626 249119 267214 195506 153860 141741 160993 180208 169826 182775 184650 127040
7446 127040 180707 208927 200321 211433 192644 221319 196140 219906 208208 206431 222207 252527
7434 252527 162645 140031 223966 245372 277919 218827 208066 237622 231532 212648 299551 254443
7422 254443 271021 278502 270287 248807 232524 171991 175434 179172 192240 176568 259863 344228
7410 344228 317948 334532 343090 350129 250595 274018 303018 306645 313624 333746 330581 332909 339128
7397 339128 370288 365757 319074 351571 343252 321368 362363 356136 426371 410641 348907 353328
$$ packed form
7482A08294p300M1683P5850L6589l2511l5542N271k3425l138R4833o5513L0196
7470B25287Q2065q3576n1723n151k9264J1551L0549M1365p924j1530M3775o7845
7458A77579j953P3493J8095p1708m1646j2119J9252J9215j0382J2949J875n7610
7446A27040N3667K8220q606J1112j8789K8675k5179K3766j1698j777J5776L0320
7434B52527q9882k2614Q3935K1406L2547n9092j0761K9556o090j8884Q6903m5108
7422B54443J6578P481q215k1480j6283o0533L443L738J3068j5672Q3295Q4365
7410C44228k6280J6584Q558P039r9534K3423K9000L627O979K0122l165K328O219
7397C39128L1160m531m6683L2497q319k1884M0995o227P0235j5730o1734M421
$$ plain form
7385 353328 348064 371928 370655 406046 373143 362503 358029 349061 340023 283966 344586 304978 256675
7372 256675 288655 385417 378202 372990 334407 323999 271618 299500 325937 343343 299625 302299
7360 302299 326464 275892 289048 336137 260545 241581 280794 342223 443887 409038 308398
7349 308398 334243 372673 353858 326706 338410 339458 340707 344628 250757 248146 330236 361620
7337 361620 320985 367636 398536 362027 277826 318258 294228 386248 390838 397199 386407 351056
7325 351056 367165 332685 353574 369054 433789 444989 436360 422619 380545 386936 374176 417926
7313 417926 448801 400844 335912 413727 446710 399559 365809 447970 493217 520417 469198 415147
7301 415147 434932 404933 450057 490095 534586 555858 510353 526644 548543 508233 431339 398041
$$ packed form
7385C53328n264K3864j273L5391l2903j0640m474q968r038n6057O0620l9608m8303
7372B56675L1980R6762p215n212l8583j0408n2381K7882K6437J7406m3718K674
7360C02299K4165n0572J3156M7089p5592j8964L9213O1429J01664l4849j00640
7349C08398K5845L8430j8815k7152J1704J048J249L921r3871k611Q2090L1384
7337C61620m0635M6651L0900l6509q4201M0432k4030R2020M590O361j0792l5351
7325C51056J6109l4480K0889J5480O4735J1200q629j3741m2074O391j2760M3750
7313D17926L0875m7957o4932P7815L2983m7151l3750Q2161M5247K7200n1219n4051
7301D15147J9785k9999M5124M0038M4491K1272m5505J6291K1899m0310p6894l3298
$$ plain form
7289 398041 419214 419218 419116 445344 494790 505774 559571 591841 559604 553341 524358 604262 635196
7276 635196 645222 600837 577618 601216 579350 575996 594409 673643 692213 721051 731580 724176
7264 724176 684198 693639 678785 759077 761086 721416 787355 758665 794392 801977 784249 766186
7252 766186 812677 812377 804891 902037 937199 907180 859444 930381 965112 956503 1005975 997646 931253
7239 931253 868488 920334 1002714 996414 1049524 1072717 1084251 1099743 1120606 1099886 1141406 1180374
7227 1180374 1185827 1187532 1237757 1254228 1240369 1238405 1353693 1401334 1376968 1404882 1422381 1483978
7215 1483978 1535612 1599361 1618455 1660856 1714232 1774366 1761513 1757464 1829744 1878121 1946922 1997462
7203 1997462 2056248 2167987 2164543 2133929 2229094 2310858 2399486 2409546 2422514 2520514 2670172
$$ packed form
7289C98041K1173Mj02K6228M9446J0984N3797L2270l2237o263k8983P9904L0934
7276F35196J0026m4385k3219K3598k1866l354J8413P9234J8570K8838J0529p404
7264G24176l9978R441j4854Q0292K009l9670O5939k8690L5727P585j7728j8063
7252G66186M6491l00p486R7146L5162l0019m7736P0937L4731q609M9472q329o6393
7239I31253o2765N1846Q2380o300N3110K3193J1534J5492K0863k0720M1520L8968
7227A180374N453J705N0225J6471j3859j964J15288M7641k4366K7914J7499O1597
7215A483978N1634O3749J9094M2401N3376O0134j2853m049P2280M8377O8801N0540
7203A997462N8786J11739l444l0614R5165Q1764Q8628J0060J2968R8000J49658
$$ plain form
7192 2670172 2724172 2701300 2814639 2927566 2976933 3099910 3156276 3227392 3378726 3457810 3528958
7181 3528958 3645584 3793556 3917237 4031090 4137266 4300754 4440087 4510399 4682627 4822993
7171 4822993 5062597 5168560 5295781 5530846 5733497 5889827 6041334 6270865 6497960 6714119
7161 6714119 6919817 7134154 7335521 7491579 7647216 7866727 8086249 8344891 8518304 8743445
7151 8743445 8848265 8943492 9077640 9218344 9339625 9487564 9653320 9710652 9652189 9703190
7141 9703190 9629547 9617757 9592465 9470058 9369986 9280784 9175879 8957877 8808716 8639430
7131 8639430 8425977 8199564 8004292 7837544 7573506 7373032 7163435 6940034 6751116 6498184
7121 6498184 6311211 6084533 5913936 5671848 5453838 5248401 5075531 4949019 4813294 4664354
$$ packed form
7192B670172N4000k2872J13339J12927M9367J22977N6366P1116J51334P9084P1148
7181C528958J16626J47972J23681J13853J06176J63488J39333P0312J72228J40366
7171D822993K39604J05963J27221K35065K02651J56330J51507K29531K27095K16159
7161F714119K05698K14337K01367J56058J55637K19511K19522K58642J73413K25141
7151H743445J04820R5227J34148J40704J21281J47939J65756N7332n8463N1001
7141I703190p3643j1790k5292j22407j00072q9202j04905k18002j49161j69286
7131H639430k13453k26413j95272j66748k64038k00474k09597k23401j88918k52932
7121F498184j86973k26678j70597k42088k18010k05437j72870j26512j35725j48940
$$ plain form
7111 4664354 4510771 4277766 4059117 3930392 3838145 3753030 3634978 3490557 3332969 3240500
7101 3240500 3121911 3003954 2855299 2807554 2758386 2642251 2594046 2524125 2489144 2421703 2314287
7090 2314287 2237789 2167545 2093397 2067008 1984158 1880476 1870778 1899376 1827384 1710047 1673920
7079 1673920 1665582 1631379 1561769 1508503 1462216 1510121 1426911 1413442 1431697 1384465 1332570 1315898
7067 1315898 1223229 1203008 1165309 1147358 1131932 1043869 1071057 1065526 1086326 1095250 1069890 1010187
7055 1010187 921959 923405 880239 829995 894776 893791 849498 884714 874619 827922 771988 790436
7043 790436 764138 729268 746232 792963 774979 655109 746482 760519 660726 665647 639772 647265
7031 647265 625695 589007 574102 528400 552050 588453 573146 572700 554457 479411 552315 518203
$$ packed form
7111D664354j53583k33005k18649j28725r2247q5115j18052j44421j57588r2469
7101C240500j18589j17957j48655m7745m9168j16135m8205o9921l4981o7441j07416
7090B314287p6498p0244p4148k6389q2850j03682r698K8598p1992j17337l6127
7079A673920q338l4203o9610n3266m6287M7905q3210j3469J8255m7232n1895j6672
7067A315898r2669k0221l7699j7951j5426q8063K7188n531K0800Q924k5360n9703
7055A010187q8228J446m3166n0244O4781r85m4293L5216j0095m6697n5934J8448
7043G90436k6298l4870J6964M6731j7984j19870R1373J4037r9793M921k5875P493
7031F47265k1570l6688j4905m5702K3650L6403j5307m46j8243p5046P2904l4112
$$ plain form
7019 518203 439110 434654 470064 442140 492284 434623 497576 485524 457290 473170 465131 478433
7007 478433 504963 472335 497098 531949 515050 504572 448935 428716 405904 408907 430323 482437
6995 482437 416803 396632 391974 367348 330252 334516 337427 324710 331228 324203 321597 346395 341872
6982 341872 361940 406032 342975 297269 268415 275178 255477 296720 229005 176195 218896 256284
6970 256284 226759 258784 348919 329334 312696 252977 224172 261018 243004 210291 226497 223316
6958 223316 229326 241640 280361 362469 352733 312189 272346 188876 204766 197000 193901 185217 216976
6945 216976 190658 172870 199322 245225 257614 280781 221831 240719 236472 248897 213750 191008
6933 191008 220209 196991 166432 207168 196838 226087 199068 167389 173639 180841 190457 276910
$$ packed form
7019E18203p9093m456L5410k7924N0144n7661O2953j2052k8234J5880q039J3302
7007D78433K6530l2628K4763L4851j6899j0478n5637k0219k2812L003K1416N2114
6995D82437o5634k0171m658k4626l7096M264K911j2717O518p025k606K4798m523
6982C41872K0068M4092o3057m5706k8854O763j9701M1243o7715n2810M2701L7388
6970B56284k9525L2025R0135j9585j6638n9719k8805L6846j8014l2713J6206l181
6958B23316O010J2314L8721Q2108r736m0544l9843q3470J5890p766l099q684L1759
6945B16976k6318j7788K6452M5903J2389K3167n8950J8888m247J2425l5147k2742
6933A91008K9201k3218l0559M0736j0330K9249k7019l1679O250P202R616Q6453
$$ plain form
6921 276910 277290 181623 171960 166743 86541 98007 136629 165406 196194 192717 285781 230491 177964
6908 177964 206734 248538 191426 200692 133091 214576 290211 287405 225436 180553 136779 164669
6896 164669 225155 160811 109367 158184 192159 149522 176545 144445 150278 122161 168827 194923
6884 194923 145231 145224 148314 177918 171380 216906 164811 170337 136177 117188 158637 150176 143745
6871 143745 141843 174840 176013 173950 169365 141235 95533 83232 103247 157894 235189 235565 96883
6858 96883 67166 134582 150557 153623 120392 142134 270664 219246 126061 141623 140640 123997
6846 123997 204953 197772 196941 153251 120514 169998 124748 107860 112333 131703 129226 67863 66990
6833 66990 72785 113414 129301 150992 125820 109879 162008 170900 166684 164069 199072 195821 174157
$$ packed form
6921B76910L80r5667r663n217q0202J1466L8622K8777L0788l477R3064n5290n2527
6908A77964K8770M1804n7112R266o7601Q1485P5635k806o1969m4883m3774K7890
6896A64669O0486o4344n1444M8817L3975m2637K7023l2100N833k8117M6666K6096
6884A94923m9692pL090K9604o538M5526n2095N526l4160j8989M1449q461o431
6871A43745j902L2997J173k063m585k8130m5702j2301K0015N4647P7295L76j38682
6858I6883k9717O7416J5975L066l3231K1742J28530n1418r3185J5562r83j6643
6846A23997Q0956p181q31m3690l2737M9484m5250j6888M473J9370k477o1363q73
6833F6990N795M0629J5887K1691k5172j5941N2129Q892m216k615L5003l251k1664
$$ plain form
6820 174157 165857 191100 234501 199410 141385 239841 222079 132740 75702 120855 144722 149581
6808 149581 127909 134119 170894 179307 172550 152912 152503 81345 109206 158381 140043 161352 138367
6795 138367 161623 123851 113797 127464 138359 201579 134433 88102 113461 65671 93527 109402
6783 109402 72780 64609 88740 148861 151042 170221 167167 203268 159549 117365 117836 120482 150356
6770 150356 157551 98926 88040 115052 73600 80729 67927 73822 107163 108384 22822 49496
6758 49496 91197 81965 123837 138466 146003 141395 132900 158349 149318 124978 158124 151809 110251
6745 110251 110557 146641 147614 130468 153922 176137 201824 222843 149437 97038 127011 94194
6733 94194 81513 85194 121813 127191 132819 177392 113837 118005 82528 51321 99879 115432 74124
$$ packed form
6820A74157q300K5243M3401l5091n8025R8456j7762q9339n7038M5153K3867M859
6808A49581k1672O210L6775Q413o757j9638m09p1158K7861M9175j8338K1309k2985
6795A38367K3256l7772j0054J3667J0895O3220o7146m6331K5359m7790K7856J5875
6783A09402l6622q171K4131O0121K181J9179l054L6101m3719m2184M71K646K9874
6770A50356P195n8625j0886K7012m1452P129j2802N895L3341J221q5562K6674
6758D9496M1701r232M1872J4629P537m608q495K5449r031k4340L3146o315m1558
6745A10251L06L6084R73j7146K3454K2215K5687K1019p3406n2399K9973l2817
6733I4194j2681L681L6619N378N628M4573o3555M168l5477l1207M8558J5553m1308
$$ plain form
6720 74124 78382 56339 45639 85117 123269 144356 142412 138690 91066 63208 74552 140866
6708 140866 122137 110315 203016 211081 136422 90577 138516 148290 176219 223019 151430 100895
6696 100895 72459 71030 97658 101767 125009 100346 140444 172791 186799 120571 133369 177419
6684 177419 176963 186800 158666 161091 203278 202739 162246 177290 196133 103522 98117 138248 158735
6671 158735 215094 193488 124901 183408 249246 185047 113844 116211 137023 127764 113305 174442
6659 174442 195479 136730 132310 97523 100848 141123 150719 123814 34469 57041 72221 97253
6647 97253 160978 84514 157349 203391 179634 142544 169514 263187 201256 152546 166952 107624
6635 107624 119504 85607 116789 136690 83143 132404 207489 184865 166505 91655 121018 144405
$$ packed form
6720G4124M258k2043j0700L9478L8152K1087j944l722m7624k7858J1344O6314
6708A40866j8729j1822R2701Q065p4659m5845M7939R774K7929M6800p1589n0535
6696A00895k8436j429K6628M109K3242k4663M0098L2347J4008o6228J2798M4050
6684A77419m56R837k8134K425M2187n39m0493J5044J8843r2611n405M0131K0487
6671A58735N6359k1606o8587N8507O5838o4199p1203K367K0812r259j4459O1137
6659A74442K1037n8749m420l4787L325M0275R596k6905q9345K2572J5180K5032
6647I7253O3725p6464P2835M6042k3757l7090K6970R3673o1931m8710J4406n9328
6635A07624J1880l3897L1182J9901n3547M9261P5085k2624j8360p4850K9363K3387
$$ plain form
6623 144405 87275 135350 131552 118173 115920 117676 192609 170632 191676 176674 144929 154601
6611 154601 165825 119341 158034 153339 124023 202037 84249 85913 81716 67897 158472 101624
6599 101624 120490 153539 151764 162937 171606 186426 164713 204291 203333 219762 183348 157313
6587 157313 183493 149052 104104 60768 91338 167426 100371 156763 159070 138178 79361 125829
6575 125829 114930 101126 145194 129794 78472 95354 130051 132693 153829 178907 210081 131258
6563 131258 150213 188358 172692 176631 232155 242001 190866 124751 183546 247447 219819 198940
6551 198940 193440 216440 174081 200591 191279 164632 194720 173014 162308 125448 173366 237533
6539 237533 306135 253239 236261 207097 185533 203369 185860 213448 208456 219262 225704 165497
$$ packed form
6623A44405n7130M8075l798j3379k253J756P4933k1977K1044j5002l1745R672
6611A54601J1224m6484L8693m695k9316P8014j17788J664m197j3819R0575n6848
6599A01624J8866L3049j775J1173Q669J4820k1713L9578r58J6429l6414k6035
6587A57313K6180l4441m4948m3336L0570P6088o7055N6392K307k0892n8817M6468
6575A25829j0899j3804M4068j5400n1322J6882L4697K642K1136K5078L1174p8823
6563A31258J8955L8145j5666L939N5524R846n1135o6115N8795O3901k7628k0879
6551A98940n500K3000m2359K6510r312k6647L0088k1706j0706l6860M7918O4167
6539B37533O8602n2896j6978k9164k1564J7836j7509K7588m992J0806O442o0207
$$ plain form
6527 165497 170454 170671 211972 215234 163808 146277 195062 242083 270918 196087 159413 203189
6515 203189 207311 255705 280245 238123 214632 238855 279001 293299 246244 225893 188589 193600
6503 193600 167852 164163 123092 113507 163132 124504 102091 100937 89868 187622 222164 242458
6491 242458 221315 198923 174293 206216 159096 169906 207129 211338 226906 140682 181807 147584
6479 147584 142291 164805 215972 214459 176809 207522 231289 158495 110967 151274 169310 195040
6467 195040 224263 186096 167950 139344 180561 197883 126966 165793 232097 183040 206628 244893
6455 244893 245542 217097 156113 167289 151062 200419 181724 127195 173422 238655 257732 267196
6443 267196 235534 190360 182342 222318 237192 231906 279441 265160 262577 266127 227799 296570
$$ packed form
6527A65497M957K17M1301L262n1426j7531M8785M7021K8835p4831l6674M3776
6515B03189M122M8394K4540m2122k3491K4223M0146J4298m7055k0351l7304N011
6503A93600k5748l689m1071r585M9625l8628k2413j154j1069R7754L4542K0294
6491B42458k1143k2392k4630L1923m7120J0810L7223M209J5568q6224M1125l4223
6479A47584n293K2514N1167j513l7650L0713K3767p2794m7528M0307J8036K5730
6467A95040K9223l8167j8146k8606M1217J7322p0917L8827O6304m9057K3588L8265
6455B44893O49k8445o0984J1176j6227M9357j8695n4529M6227O5233J9077R464
6443B67196l1662m5174q018L9976J4874n286M7535j4281k583L550l8328O8771
$$ plain form
6431 296570 279356 204602 190505 276932 236909 204252 222879 254511 303192 305794 329712 259674
6419 259674 293410 318726 317486 328561 294300 247618 234801 252263 244897 220692 274989 220293
6407 220293 133384 192159 211209 226903 234339 278943 287482 228625 274546 297170 252888 162411
6395 162411 157812 254282 256947 296466 293948 225357 255980 276719 342822 357170 302360 296872
6383 296872 272170 312548 273325 258268 277540 225882 237943 301074 286211 295210 319996 281008
6371 281008 282522 256798 244270 346494 317191 274453 236142 294311 347891 326774 372470 422829
6359 422829 358538 296027 344199 316630 309089 351274 333224 310709 367138 329568 273647 314531
6347 314531 363329 332007 299043 268482 276850 321987 318324 319294 338874 337557 316990 334462 358121
$$ packed form
6431B96570j7214p4754j4097Q6427m0023l2657J8627L1632M8681K602K3918p0038
6419B59674L3736K5316j240J1075l4261m6682j2817J7462p366k4205N4297n4696
6407B20293q6909N8775J9050J5694P436M4604Q539n8857M5921K2624m4282r0477
6395A62411m599R6470K665L9519k518o8591L0623K0739O6103J4348n4810n488
6383B96872k4702M0378l9223j5057J9272n1658J2061O3131j4863Q999K4786l8988
6371B81008J514k5724j2528J02224k9303m2738l8311N8169N3580k1117M5696N0359
6359D22829o4291o2511M8172k7569p541M2185j8050k2515N6429l7570n5921M0884
6347C14531M8798l1322l2964l0561Q368M5137l663R70J9580j317k0567J7472K3659
$$ plain form
6334 358121 315590 301807 274261 259244 273250 274243 255613 311261 297399 276664 353672 338345
6322 338345 246383 276543 370832 363913 402555 416920 340423 367721 342162 334183 332335 345884
6310 345884 368456 397864 328012 285015 352410 378120 383363 350926 331174 348093 398878 388743
6298 388743 365937 392718 425463 382643 316095 331653 338594 324877 313322 316991 338162 356713
6286 356713 360728 348587 368525 367429 324937 320324 299558 363595 424894 422890 416161 366154 338051
6273 338051 399515 409710 382736 370420 384928 344591 341804 356565 318944 334138 362937 378520
6261 378520 360566 395541 368261 454540 432883 379283 330162 397816 447771 472767 488061 494436
6249 494436 484813 403933 393672 385993 392021 407581 415220 396422 427163 421032 426372 360349 370123
$$ packed form
6334C58121m2531j3783k7546j5017J4006R93j8630N5648j3862k0735P7008j5327
6322C38345r1962L0160R4289o919L8642J4365p6497K7298k5559p979j848J3549
6310C45884K2572K9408o9852m2997O7395K5710N243l2437j9752J6919N0785j0135
6298C88743k2806K6781L2745m2820o6548J5558O941j3717j1555L669K1171J8551
6286C56713M015j2141J9938j096m2492m613k0766O4037O1299k004o729n0007k8103
6273C38051O1464J0195k6974j2316J4508m0337k787J4761l7621J5194K8799J5583
6261C78520j7954L4975k7280Q6279k1657n3600m9121O7654M9955K4996J5294O375
6249D94436r623q0880j0261p679O028J5560P639j8798L0741o131N340o6023R774
$$ plain form
6236 370123 449900 450506 480414 492540 482424 473922 467405 481172 475511 437514 448462 434880 418855
6223 418855 473500 439793 468224 531283 516872 528475 550465 533108 469192 467658 512575 487232
6211 487232 411459 413455 456868 524582 502856 485475 513826 510610 462596 427488 461553 512856
6199 512856 502760 494804 502839 537493 518318 486197 524465 585959 583560 509767 508712 524523
6187 524523 470134 472135 468941 468083 520283 575863 603174 586103 597382 581162 555200 543575
6175 543575 489950 484994 519101 556273 560338 537717 505832 529574 576504 586344 619643 610733
6163 610733 551538 598168 578519 587246 601659 593292 624524 627602 578687 595158 634836 534793
6151 534793 550804 564733 591031 607351 574288 622773 620284 658265 690228 625381 614736 625503
$$ packed form
6236C70123P9777O06K9908J2126j0116q502o517J3767n661l7997J0948j3582j6025
6223D18855N4645l3707K8431O3059j4411J1603K1990j7357o3916j534M4917k5343
6211D87232p5773J996M3413O7714k1726j7381K8351l216m8014l5108L4065N1303
6199E12856j0096p956Q035L4654j9175l2121L8268O1494k399p3793j055J5811
6187E24523n4389K001l194q58N2200N5580K7311j7071J1279j6220k5962j1625
6175E43575n3625m956L4107L7172M065k2621l1885K3742M6930R840L3299q910
6163F10733n9195M6630j9649Q727J4413q367L1232L078m8915J6471L9678j00043
6151E34793J6011J3929K6298J6320l3063M8485k489L7981L1963o4847j0645J0767
$$ plain form
6139 625503 647802 624458 607845 628362 592663 645160 651017 672529 698955 677018 714698 675588
6127 675588 691179 687538 700648 645054 663683 689872 695240 677849 660913 656093 693388 732655
6115 732655 760170 718496 776936 701021 711670 762817 726426 666945 689848 707717 724412 756569
6103 756569 768751 751520 750487 804465 814615 800160 750192 759480 783157 840067 858522 807469
6091 807469 735709 770930 728262 752355 741360 707464 690133 670660 692102 664201 658626 722848
6079 722848 769569 796353 824885 802887 758028 825736 833348 789212 770853 773217 779341 782555
6067 782555 841407 830748 814842 790996 785960 820170 810241 838694 834214 840296 871354 842939
6055 842939 836105 822849 830434 874805 882316 912805 919429 908271 911442 913633 931385 906101 844362
$$ packed form
6139F25503K2299k3344j6613K0517l5699N2497N857K1512K6426k1937L7680l9110
6127F75588J5591l641J3110n5594J8629K6189N368j7391j6936m820L7295L9267
6115G32655K7515m1674N8440p5915J0649N1147l6391n9481K2903J7869J6695L2157
6103G56569J2182j7231j033N3978J0150j4455m9968R288K3677N6910J8455n1053
6091H07469p1760L5221m2668K4093j0995l3896j7331j9473K1442k7901n575O4222
6079G22848M6721K6784K8532k1998m4859O7708P612m4136j8359K364O124L214
6067G82555N8852j0659j5906k3846n036L4210r929K8453m480O082L1058k8415
6055H42939o834j3256P585M4371P511L0489O624j1158L171K191J7752k5284o1739
$$ plain form
6042 844362 883938 973473 987371 983472 982321 909826 901243 879705 887178 894738 897654 922482 898080
6029 898080 864389 885770 947240 970515 931231 925354 975642 987486 1008415 977798 955729 990683
6017 990683 1030739 997380 973503 943460 940044 1016218 1063281 1056752 995070 920026 946456 992875
6005 992875 1079993 1061948 1042481 1081934 1025114 1087504 1052633 996338 1034435 1032185 1024597 1064238
5993 1064238 1061435 1069006 1039605 1066709 1035857 1005582 1029368 1105193 1129376 1158018 1101917 1056563
5981 1056563 1051010 1082874 1142338 1131485 1048528 1092106 1111261 1131654 1195698 1196673 1168037 1073032
5969 1073032 1147025 1153787 1226884 1181093 1159515 1195198 1249860 1252381 1201957 1230332 1268126 1268015
5957 1268015 1270107 1275173 1242057 1239814 1237625 1232212 1184625 1189837 1203562 1304171 1358210 1271141
$$ packed form
6042H44362L9576Q9535J3898l899j151p2495q583k1538P473P560K916K4828k4402
6029H98080l3691K1381O1470K3275l9284n877N0288J1844K0929l0617k2069L4954
6017I90683M0056l3359k3877l0043l416P6174M7063o529o1682p5044K6430M6419
6005I92875Q7118j8045j9467L9453n6820O2390l4871n6295L8097k250p588L9641
5993A064238k803P571k9401K7104l0852l0275K3786P5825K4183K8642n6101m5354
5981A056563n553L1864N9464j0853q2957M3578J9155K0393O4044R75k8636r5005
5969A073032P3993O762P3097m5791k1578L5683N4662K521n0424K8375L7794j11
5957A268015K092N066l3116k243k189n413m7587N212J3725J00609N4039q7069
$$ plain form
5945 1271141 1298539 1356984 1333119 1367030 1340758 1419159 1408882 1406640 1384314 1354271 1330348 1317292
5933 1317292 1329997 1328405 1333828 1373876 1460409 1521242 1470850 1435783 1494892 1483684 1490093 1491081
5921 1491081 1505523 1458006 1481286 1474092 1526433 1550838 1564943 1560586 1638179 1619337 1587283 1619467
5909 1619467 1559857 1497001 1581595 1563359 1582449 1627639 1680882 1688248 1717218 1713111 1668652 1621747
5897 1621747 1680643 1684624 1705755 1777462 1804797 1801590 1830367 1790356 1752459 1773322 1800531 1817799
5885 1817799 1844234 1850432 1835145 1821981 1845140 1894473 1860387 1909490 1898269 1890018 1893574 1881852
5873 1881852 1939798 1900526 1984753 1990919 1973159 2040684 1988050 2078839 2119313 2084612 2010026 2025157
5861 2025157 2070249 2141535 2194326 2209984 2205068 2263869 2268468 2266228 2291783 2276184 2242211 2244716
$$ packed form
5945A271141K7398N8445k3865L3911k6272P8401j0277k242k2326l0043k3923j3056
5933A317292J2705j592N423M0048Q6533O0833n0392l5067N9109j1208O409R88
5921A491081J4442m7517K3280p194N2341K4405J4105m357P7593j8842l2054L2184
5909A619467n9610o2856Q4594j8236J9090M5190N3243P366K8970m107m4459m6905
5897A621747N8896L981K1131P1707K7335l207K8777m0011l7897K0863K7209J7268
5885A817799K6435O198j5287j3164K3159M9333l4086M9103j1221q251L556j1722
5873A881852N7946l9272Q4227O166j7760O7525n2634R0789M0474l4701p4586J5131
5861B025157M5092P1286N2791J5658m916N8801M599k240K5555j5599l3973K505
$$ plain form
5849 2244716 2212527 2199752 2178592 2182736 2182998 2292295 2354019 2388835 2454848 2390174 2350439 2342732
5837 2342732 2320174 2351308 2429325 2447893 2437621 2463396 2417697 2378173 2481028 2562747 2595762
5826 2595762 2639846 2594799 2597391 2580942 2528822 2583653 2592744 2614287 2634804 2617554 2619632 2664114
5814 2664114 2689787 2747550 2750635 2703651 2759507 2749618 2772869 2815072 2920966 2932498 2912173 2854235
5802 2854235 2930435 3006908 3016964 2971890 2928659 2975302 3027415 3067757 3104386 3038660 3034284 3096580
5790 3096580 3159590 3120630 3100117 3124931 3130184 3166237 3214312 3334964 3289797 3257192 3322518
5779 3322518 3355127 3356368 3421508 3377281 3381031 3371346 3431767 3509358 3448407 3457673 3437845 3528598
5767 3528598 3607043 3596063 3548587 3553120 3604790 3636437 3606098 3641703 3701778 3716682 3703389 3673660
$$ packed form
5849B244716l2189j2775k1160M144K62J09297O1724L4816O6013o4674l9735p707
5837B342732k2558L1134P8017J8568j0272K5775m5699l9524J02855Q1719L3015
5826B595762M4084m5047K592j6449n2120N4831R091K1543K0517j7250K078M4482
5814B664114K5673N7763L085m6984N5856r889K3251M2203J05894J1532k0325n7938
5802B854235P6200P6473J0056m5074m3231M6643N2113M0342L6629o5726m376O2296
5790C096580O3010l8960k0513K4814N253L6053M8075J20652m5167l2605O5326
5779C322518L2609J241O5140m4227L750r685O0421P7591o0951R266j9828R0753
5767C528598P8445j0980m7476M533N1670L1647l0339L5605O0075J4904j3293k9729
$$ plain form
5755 3673660 3800406 3852286 3887266 3912198 4006670 3996447 4007086 4029424 4092704 4112252 4100338
5744 4100338 4074163 4146947 4132292 4191909 4228863 4223673 4272814 4291122 4337590 4343361 4383679 4449701
5732 4449701 4459245 4446673 4487143 4551138 4621341 4548827 4534704 4650254 4698976 4749476 4801450
5721 4801450 4767754 4810743 4869839 4902164 4930502 5010206 5051832 5110371 5159420 5170460 5134143
5710 5134143 5184648 5171122 5186562 5307280 5344978 5341998 5389407 5413994 5442740 5502793 5556749
5699 5556749 5601305 5641720 5694946 5722785 5822202 5869172 5886386 5902274 5867338 5882860 6027695
5688 6027695 6111132 6137696 6208943 6246300 6228183 6252085 6264813 6286130 6395257 6470626 6544383
5677 6544383 6619351 6691172 6724304 6799269 6918931 6959936 7022481 7039161 7059876 7072835 7127676
$$ packed form
5755C673660J26746N1880L4980K4932R4472j0223J0639K2338O3280J9548j1914
5744D100338k6175P2784j4655N9617L6954n190M9141J8308M6468N771M0318O6022
5732D449701R544j2572M0470O3995P0203p2514j4123J15550M8722N0500N1974
5721D801450l3696M2989N9096L2325K8338P9704M1626N8539M9049J1040l6317
5710E134143N0505j3526J5440J20718L7698k980M7409K4587K8746O0053N3956
5699E556749M4556M0415N3226K7839R9417M6970J7214J5888l4936J5522J44835
5688F027695Q3437K6564P1247L7357j8117K3902J2728K1317J09127P5369P3757
5677F544383P4968P1821L3132P4965J19662M1005O2545J6680K0715J2959N4841
$$ plain form
5666 7127676 7200351 7251669 7358067 7425670 7448362 7515840 7555392 7688304 7733989 7769209 7888974
5655 7888974 7929529 7961055 8080278 8083709 8160377 8274055 8364825 8442480 8506478 8627235 8681322
5644 8681322 8722887 8752647 8855575 8978388 9022555 9108632 9240579 9223809 9237038 9293462 9420913
5633 9420913 9552229 9552462 9665709 9791237 9890087 9994060 10034905 10117580 10246648 10389366 10496688
5622 10496688 10584305 10622630 10738179 10905020 11056849 11139950 11249483 11374294 11446456 11601187
5612 11601187 11754434 11934742 12106982 12217705 12376373 12495006 12634067 12729880 12874442 13063408
5602 13063408 13194443 13347914 13488765 13685402 13884318 14017354 14202208 14318039 14495358
5593 14495358 14656570 14868999 15049725 15193859 15350291 15595944 15811940 15987041 16163341
$$ packed form
5666G127676P2675N1318J06398O7603K2692O7478L9552J32912M5685L5220J19765
5655G888974M0555L1526J19223L431P6668J13678R0770P7655O3998J20757N4087
5644H681322M1565K9760J02928J22813M4167Q6077J31947j6770J3229N6424J27451
5633I420913J31316K33J13247J25528R8850J03973M0845Q2675J29068J42718J07322
5622A0496688Q7617L8325J15549J66841J51829Q3101J09533J24811P2162J54731
5612A1601187J53247J80308J72240J10723J58668J18633J39061R5813J44562J88966
5602A3063408J31035J53471J40851J96637J98916J33036J84854J15831J77319
5593A4495358J61212K12429J80726J44134J56432K45653K15996J75101J76300
$$ plain form
5584 16163341 16325669 16527293 16721736 16895549 17174313 17433710 17630380 17910070 18153759
5575 18153759 18390742 18655469 18946570 19219787 19502276 19800780 20147408 20440583 20713687
5566 20713687 20978254 21349094 21707397 22026215 22413660 22773454 23173287 23546987 23920087
5557 23920087 24305969 24742427 25164097 25621453 26086309 26548637 27048312 27527525 28023898
5548 28023898 28531421 29017838 29533325 30145272 30748329 31351507 31933944 32588031 33288979
5539 33288979 33985828 34721262 35554397 36343333 37122790 37977821 38851207 39716393 40640154
5530 40640154 41674170 42684803 43706849 44820471 45994065 47188300 48520657 49733131
5522 49733131 50981873 52363783 53886818 55440614 56982651 58545779 60219868 61997433
$$ packed form
5584A6163341J62328K01624J94443J73813K78764K59397J96670K79690K43689
5575A8153759K36983K64727K91101K73217K82489K98504L46628K93175K73104
5566B0713687K64567L70840L58303L18818L87445L59794L99833L73700L73100
5557B3920087L85882M36458M21670M57356M64856M62328M99675M79213M96373
5548B8023898N07523M86417N15487O11947O03057O03178N82437O54087P00948
5539C3288979O96849P35434Q33135P88936P79457Q55031Q73386Q65186R23761
5530D0640154J034016J010633J022046J113622J173594J194235J332357J212474
5522D9733131J248742J381910J523035J553796J542037J563128J674089J777565
$$ plain form
5514 61997433 63783611 65668126 67655087 69764236 71906219 74133530 76446825 78859754
5506 78859754 81345920 83998614 86759509 89601390 92598971 95770570 99024260 102451334
5498 102451334 106036795 109817318 113808603 117949593 122236190 126876583 131713736 136796831
5490 136796831 142069021 147622631 153460697 159503561 165851748 172484110 179277514 186395610
5482 186395610 193719799 201238120 208972022 216844404 224853927 232905817 240894535 248796829
5474 248796829 256518981 263949061 270953691 277398851 283150749 288176047 292276488 295389706
5466 295389706 297493900 298362978 298056192 296648158 294060437 290285357 285538524 279877785
5458 279877785 273583959 266597336 259087734 251230582 243101224 234897629 226601615 218287583
$$ packed form
5514F1997433J786178J884515J986961K109149K141983K227311K313295K412929
5506G8859754K486166K652694K760895K841881K997581L171599L253690L427074
5498A02451334L585461L780523L991285M140990M286597M640393M837153N083095
5490A36796831N272190N553610N838066O042864O348187O632362O793404P118096
5482A86395610P324189P518321P733902P872382Q009523Q051890P988718P902294
5474B48796829P722152P430080P004630O445160N751898N025298M100441L113218
5466B95389706K104194Q69078l06786j408034k587721l775080m746833n660739
5458B79877785o293826o986623p509602p857152q129358q203595q296014q314032
$$ plain form
5450 218287583 210132832 202087055 194261568 186612625 179172734 172020280 165176088 158537101
5442 158537101 152160909 146173517 140413144 134826166 129520599 124538412 119741541 115165236
5434 115165236 110861913 106762678 102863069 99204709 95669490 92251400 88966777 85943725
5426 85943725 83043059 80212985 77556829 75016095 72635021 70301928 68101679 65981993
5418 65981993 63902306 61989014 60195917 58417749 56604616 54978920 53406600 51839764
5410 51839764 50399249 49044913 47720985 46464277 45196155 43929967 42797723 41720027
5402 41720027 40652661 39614394 38609831 37671929 36802664 35883492 35057728 34219332 33449602
5393 33449602 32694728 31985265 31331479 30644148 29967679 29359062 28726737 28077392 27502542
$$ packed form
5450B18287583q154751q045777p825487p648943p439891p152454o844192o638987
5442A58537101o376192n987392n760373n586978n305567m982187m796871m576305
5434A15165236m303323m099235l899609l658360l535219l418090l284623l023052
5426H5943725k900666k830074k656156k540734k381074k333093k200249k119686
5418F5981993k079687j913292j793097j778168j813133j625696j572320j566836
5410E1839764j440515j354336j323928j256708j268122j266188j132244j077696
5402D1720027j067366j038267j004563r37902q69265r19172q25764q38396p69730
5393C3449602p54874p09463o53786o87331o76469o08617o32325o49345n74850
$$ plain form
5384 27502542 26905140 26325674 25909197 25426323 24880156 24380263 23906548 23511278 23058349
5375 23058349 22621477 22213837 21832901 21441073 21032597 20682066 20408402 20096265 19820788
5366 19820788 19505830 19120666 18782877 18402030 18203055 17975075 17784018 17557852 17268936
5357 17268936 16973494 16722896 16420208 16191354 15988591 15832370 15628051 15432273 15266915
5348 15266915 15060639 14860045 14740991 14633648 14407531 14245237 14079086 13930567 13802012
5339 13802012 13697179 13562557 13380013 13310282 13191806 13144107 13020428 12874604 12860483 12681722
5329 12681722 12585037 12494754 12417377 12395643 12373483 12339861 12363508 12249210 12170283 12131507 12143407
5318 12143407 12113087 12121043 12042286 12042871 12090793 12067716 12040831 12049161 12075138 12025976 11934400 11988964
$$ packed form
5384B7502542n97402n79466m16477m82874n46167m99893m73715l95270m52929
5375B3058349m36872m07640l80936l91828m08476l50531k73664l12137k75477
5366A9820788l14958l85164l37789l80847j98975k27980j91057k26166k88916
5357A7268936k95442k50598l02688k28854k02763j56221k04319j95778j65358
5348A5266915k06276k00594j19054j07343k26117j62294j66151j48519j28555
5339A3802012j04833j34622j82544o9731j18476m7699j23679j45824j4121j78761
5329A2681722r6685r0283p7377k1734k2160l3622K3647j14298p8927l8776J1900
5318A2143407l0320P956p8757N85M7922k3077k6885Q330K5977m9162r1576N4564
$$ plain form
5306 11988964 12035153 11970851 11945352 11921394 11840122 11798310 11750099 11656659 11583622 11465518 11356338
5295 11356338 11276813 11126277 10913194 10800899 10678228 10480987 10335136 10197207 9995036 9780213
5285 9780213 9634897 9457239 9241895 9078051 8916643 8687009 8480484 8346755 8209537 8063260
5275 8063260 7927723 7781849 7687872 7529950 7394909 7243557 7043001 6934918 6790472 6650259
5265 6650259 6557825 6527194 6441645 6320985 6199259 6111145 6048581 5945902 5883711 5790031 5709754
5254 5709754 5618812 5501327 5404395 5336569 5268878 5172840 5100462 5015261 4963851 4912877 4880010
5243 4880010 4765133 4717629 4658101 4623875 4588905 4503941 4398344 4351092 4304906 4317239 4260547
5232 4260547 4218558 4180134 4142519 4102398 4009330 4006872 3906782 3845621 3856889 3824165 3712504
$$ packed form
5306A1988964M6189o4302k5499k3958q1272m1812m8211r3440p3037j18104j09180
5295A1356338p9525j50536k13083j12295j22671j97241j45851j37929k02171k14823
5285I780213j45316j77658k15344j63844j61408k29634k06525j33729j37218j46277
5275H063260j35537j45874r3977j57922j35041j51352k00556j08083j44446j40213
5265F650259r2434l0631q5549j20660j21726q8114o2564j02679o2191r3680q0277
5254E709754r0942j17485r6932o7826o7691r6038p2378q5201n1410n0974l2867
5243D880010j14877m7504n9528l4226l4970q4964j05597m7252m6186J2333n6692
5232D260547m1989l8424l7615m0121r3068k458j00090o1161J1268l2724j11661
$$ plain form
5221 3712504 3684921 3717025 3632577 3603247 3584122 3515720 3457987 3403461 3437092 3409772 3328949
5210 3328949 3286912 3276271 3252986 3252949 3178684 3140977 3146242 3080425 3110249 3081045 3068046 3010730
5198 3010730 2946990 2926279 2924102 2909045 2903455 2862673 2831449 2870855 2839886 2729113 2709971 2716261
5186 2716261 2680122 2661093 2513985 2504358 2525448 2490388 2497898 2536611 2526080 2517649 2497729 2434166
5174 2434166 2374178 2428257 2459624 2445593 2403447 2361956 2344043 2318470 2231343 2208166 2249513
5163 2249513 2226947 2133972 2122335 2134489 2070361 2109676 2146239 2162950 2165681 2087349 2038614 2123383
5151 2123383 2080590 2036276 1995923 1967461 1953026 1967143 1989212 1983304 1935753 1910938 1945340 1922003
5139 1922003 1825562 1867565 1926176 1834903 1812473 1835127 1911467 1851839 1821305 1777732 1759357
$$ packed form
5221C712504k7583L2104q4448k9330j9125o8402n7733n4526L3631k7320q0823
5210C328949m2037j0641k3285l7p4265l7707N265o5817K9824k9204j2999n7316
5198C010730o3740k0711k177j5057n590m0782l1224L9406l0969j10773j9142O290
5186B716261l6139j9029j47108r627K1090l5060P510L8713j0531q431j9920o3563
5174B434166n9988N4079L1367j4031m2146m1491j7913k5573q7127k3177M1347
5163B249513k2566r2975j1637J2154o4128L9315L6563J6711K731p8332m8735Q4769
5151B123383m2793m4314m0353k8462j4435J4117K2069n908m7551k4815L4402k3337
5139A922003r6441M2003N8611r1273k2430K2654P6340n9628l0534m3573j8375
$$ plain form
5128 1759357 1765287 1745989 1776039 1702261 1714377 1780958 1664087 1613785 1608854 1610832 1666711 1666621
5116 1666621 1619034 1600543 1582052 1618189 1613732 1554276 1598978 1586341 1578228 1463495 1534604 1592234
5104 1592234 1511789 1429454 1376889 1450328 1513065 1463017 1489844 1486621 1418660 1404663 1344365 1315062
5092 1315062 1300328 1352944 1357235 1362666 1369549 1358426 1324380 1276782 1254501 1260130 1228641 1264691
5080 1264691 1293416 1311456 1268971 1282470 1292052 1279104 1320428 1308593 1300707 1311071 1286586 1258655
5068 1258655 1292225 1200022 1143859 1139245 1081119 1085331 1197259 1259002 1264999 1232187 1210714 1224324
5056 1224324 1204213 1125505 1174715 1208542 1256247 1197569 1209887 1180949 1147729 1210366 1169718
5045 1169718 1119876 1125147 1117559 1101239 1069020 1058447 1072326 1041436 999860 1007319 1068494 1070134
$$ packed form
5128A759357N930j9298L0050p3778J2116O6581j16871n0302m931J978N5879r0
5116A666621m7587j8491j8491L6137m457n9456M4702j2637q113j14733P1109N7630
5104A592234q0445q2335n2565P3439O2737n0048K6827l223o7961j3997o0298k9303
5092A315062j4734N2616M291N431O883j1123l4046m7598k2281N629l1489L6050
5080A264691K8725J8040m2485J3499R582j2948M1324j1835p886J0364k4485k7931
5068A258655L3570r2203n6163m614n8126M212J11928O1743N997l2812k1473J3610
5056A224324k0111p8708M9210L3827M7705n8678J2318k8938l3220O2637m0648
5045A169718m9842N271p588j6320l2219j0573J3879l0890m1576P459O1175J640
$$ plain form
5033 1070134 1052014 1057856 1038487 1065466 1073989 1007872 1012932 991780 1043248 1032213 1034548 1032382
5021 1032382 1035036 1010845 998089 947758 963995 985149 957150 983852 994971 970283 995809 987764
5009 987764 1009047 1034539 988708 972548 976285 991783 986447 960773 920032 944565 953657 954508 936136
4996 936136 936091 926518 903325 905998 941621 991722 960433 967895 875047 914833 972037 896029 928430
4983 928430 965454 889422 871367 894650 891435 898772 868475 891192 983806 966813 884421 890010
4971 890010 921117 906819 930659 995840 957192 902659 958622 969005 912380 865529 806915 838253
4959 838253 851867 912538 920703 983071 982780 922071 966025 942150 987591 967192 831152 773988
4947 773988 794220 792752 847329 861484 887491 820384 816757 839791 839923 793751 840081 794712
$$ packed form
5033A070134j8120N842j9369K6979Q523o6117N060k1152N1468j1035K335k166
5021A032382K654k4191j2756n0331J6237K1154k7999K6702J1119k4688K5526q045
5009I87764K1283K5492m5831j6160L737J5498n336k5674m0741K4533R092Q51j8372
4996I36136m5r573k3193K673L5623N0101l1289P462r2848L9786N7204p6008L2401
4983I28430L7024p6032j8055K3283l215P337l0297K2717R2614j6993q2392N589
4971H90010L1107j4298K3840O5181l8648n4533N5963J0383n6625m6851n8614L1338
4959H38253J3614O0671Q165O2368k91o0709M3954k3875M5441k0399j36040n7164
4947G73988K0232j468N4577J4155K6007o7107l627K3034J32m6172M6330m5369
$$ plain form
4935 794712 768312 808814 774063 779979 784614 841718 782380 799273 828000 824028 854231 846376
4923 846376 806014 777681 777456 833017 848339 836508 767600 718561 793808 847809 801877 845032
4911 845032 870382 893691 843654 849248 809950 802314 740337 808784 869455 835321 850051 891515
4899 891515 813283 794519 777913 793440 752181 800891 797298 861652 892939 802370 858302 805916
4887 805916 791759 782845 873927 855254 784215 772114 797642 776218 787583 807021 730454 726428
4875 726428 751637 716805 701351 742280 780962 808671 769662 778297 736713 711916 728132 751840
4863 751840 803297 770208 753848 772843 844378 789946 770790 758189 770823 725845 677141 718580
4851 718580 786506 709738 697243 651276 684626 719592 722718 691380 791479 764963 760653 778079
$$ packed form
4935G94712k6400M0502l4751N916M635N7104n9338J6893K8727l972L0203p855
4923H46376m0362k8333k25N5561J5322j1831o8908m9039P5247N4001m5932M3155
4911H45032K5350K3309n0037N594l9298p636o1977O8447O0671l4134J4730M1464
4899H91515p8232j8764j6606J5527m1259M8710l593O4354L1287r0569N5932n2386
4887H05916j4157q914R1082j8673p1039j2101K5528k1424J1365J9438p6567m026
4875G26428K5209l4832j5454M0929L8682K7709l9009Q635m1584k4797J6216K3708
4863G51840N1457l3089j6360J8995P1535n4432j9156j2601J2634m4978m8704M1439
4851G18580O7926p6768j2495m5967L3350L4966L126l1338J00099k6516m310J7426
$$ plain form
4839 778079 712736 673160 656285 759873 793659 739722 713182 723563 682237 675196 678718 726452
4827 726452 720761 682920 703352 729543 751707 702565 677429 687676 718161 682569 668685 749097
4815 749097 749461 726629 722340 720777 731037 790235 790972 782110 745928 778475 728469 727082 772004
4802 772004 789248 770915 741711 734539 716794 695832 746072 753299 725926 753286 760007 736127
4790 736127 739334 730253 728564 779234 760579 710316 701534 747538 781182 742278 781564 827914
4778 827914 868749 859822 782653 793228 827265 782736 778968 782607 810759 826460 757743 749697
4766 749697 797397 808767 808517 810996 838086 798684 822182 850294 852304 888945 876488 874468 871654
4753 871654 903753 943460 880200 823119 852443 856270 825895 840927 926796 961588 969896 896098
$$ packed form
4839G78079o5343l9576j6875J03588L3786n3937k6540J0381m1326p041L522M7734
4827G26452n691l7841K0432K6191K2164m9142k5136J0247L0485l5592j3884Q0412
4815G49097L64k2832m289j563J0260N9198P37q862l6182L2547n0006j387M4922
4802G72004J7244j8333k9204p172j7745k0962N0240P227k7373K7360O721k3880
4790G36127L207r081j689N0670j8655n0263q782M6004L3644l8904L9286M6350
4778H27914M0835q927p7169J0575L4037m4529l768L639K8152J5701o8717q046
4766G49697M7700J1370k50K479K7090l9402K3498K8112K010L6641j2457k020k814
4753H71654L2099L9707o3260n7081K9324L827l0375J5032Q5869L4792Q308p3798
$$ plain form
4741 896098 933428 961065 950358 907667 940533 903453 886118 990662 1045068 1058447 1041417
4730 1041417 1058613 1093309 1059634 1083164 1090021 1033343 1051284 1091964 1096381 1085443 1074904 1129806
4718 1129806 1076643 1045944 1107559 1073033 1101900 1202457 1201686 1208786 1228557 1205646 1231166 1298808
4706 1298808 1317219 1249349 1276700 1350878 1356296 1362604 1342418 1292969 1319350 1324629 1268670 1320304
4694 1320304 1369903 1438632 1437620 1404408 1449552 1452267 1472336 1519596 1611142 1584635 1548610 1506578
4682 1506578 1541516 1574293 1624163 1640318 1661997 1659696 1684458 1708549 1770048 1821362 1775714 1771902
4670 1771902 1830903 1861154 1907185 1902060 1946301 1998639 2115703 2185503 2157444 2160303 2245200 2325304
4658 2325304 2387565 2451733 2459254 2510939 2542146 2554794 2616717 2657243 2739216 2786740 2855779 2901302
$$ packed form
4741H96098L7330K7637j0707m2691L2866l7080j7335J04544N4406J3379j7030
4730A041417J7196L4696l3675K3530O857n6678J7941M0680M417j0938j0539N4902
4718A129806n3163l0699O1615l4526K8867J00557p71P100J9771k2911K5520O7642
4706A298808J8411o7870K7351P4178N418O308k0186m9449K6381N279n5959N1634
4694A320304M9599O8729j012l3212M5144K715K0069M7260R1546k6507l6025m2032
4682A506578L4938L2777M9870J6155K1679k301K4762K4091O1499N1314m5648l812
4670A771902N9001L0251M6031n125M4241N2338J17064O9800k8059K859Q4897Q0104
4658B325304O2261O4168P521N1685L1207J2648O1923M0526Q1973M7524O9039M5523
$$ plain form
4646 2901302 2975325 3022756 3111799 3188949 3222725 3317366 3359488 3510353 3622414 3705843 3778764
4635 3778764 3893639 3996922 4172407 4351953 4429296 4519061 4708870 4779749 4950240 5086540
4625 5086540 5273197 5438243 5681768 5893252 6042033 6264986 6461283 6659164 6884576 7138866
4615 7138866 7393429 7659715 7916199 8238619 8511446 8848486 9126590 9393721 9677744 10088791
4605 10088791 10469825 10881075 11269598 11606857 12032110 12310679 12664097 13091231 13478086
4596 13478086 13803730 14214839 14500224 14822665 15139447 15374273 15632542 15943450 16135139
4587 16135139 16370646 16505771 16521011 16637558 16740000 16796548 16714131 16639399 16579074 16487681
4577 16487681 16399673 16251597 16023680 15811096 15572729 15361213 15032342 14678441 14312529 13964715
$$ packed form
4646B901302P4023M7431Q9043P7150L3776R4641M2122J50865J12061Q3429P2921
4635C778764J14875J03283J75485J79546P7343Q9765J89809P0879J70491J36300
4625E086540J86657J65046K43525K11484J48781K22953J96297J97881K25412K54290
4615G138866K54563K66286K56484L22420K72827L37040K78104K67131K84023M11047
4605A0088791L81034M11250L88523L37259M25253K78569L53418M27134L86855
4596A3478086L25644M11109K85385L22441L16782K34826K58269L10908J91689
4587A6135139K35507J35125J5240J16547J02442N6548q2417p4732o0325r1393
4577A6487681q8008j48076k27917k12584k38367k11516l28871l53901l65912l47814
$$ plain form
4567 13964715 13610943 13260958 12830098 12494356 12105848 11737031 11367859 10946543 10571576
4558 10571576 10182131 9764378 9400967 9129697 8801608 8481806 8184230 7824718 7557723
4549 7557723 7272608 7047515 6846659 6538292 6282058 6080088 5836340 5634442 5534787 5324431
4539 5324431 5174024 5025968 4822434 4605506 4493817 4365282 4268345 4123799 4018891 3943219
4529 3943219 3803739 3693680 3550600 3425173 3399977 3317548 3240767 3189003 3078057 2964822
4519 2964822 2873099 2759449 2754658 2655535 2575492 2561676 2465169 2376722 2342382 2287169 2226907
4508 2226907 2196227 2135059 2094278 2085101 1988793 1982411 1977546 1882078 1815307 1770364 1755699 1749732
4496 1749732 1745713 1694170 1672759 1620731 1549364 1533985 1556593 1497336 1444211 1422781 1422274 1411250
$$ packed form
4567A3964715l53772l49985m30860l35742l88508l68817l69172m21316l74967
4558A0571576l89445m17753l63411k71270l28089l19802k97576l59512k66995
4549G557723k85115k25093k00856l08367k56234k01970k43748k01898r9655k10356
4539E324431j50407j48056k03534k16928j11689j28535r6937j44546j04908p5672
4529C943219j39480j10059j43080j25427k5196q2429p6781n1764j10946j13235
4519B964822r1723j13650m791r9123q0043j3816r6507q8447l4340n5213o0262
4508B226907l0680o1168m0781r177r6308o382m865r5468o6771m4943j4665n967
4496A749732m019n1543k1411n2028p1367j5379K2608n9257n3125k1430n07j1024
$$ plain form
4484 1411250 1408502 1314286 1357294 1379645 1344964 1320121 1264907 1195147 1180979 1152217 1144345 1124896
4472 1124896 1127073 1120142 1118567 1082685 1088815 1045310 985205 944390 991288 1015878 1007265 1063295
4460 1063295 952470 883410 926962 950546 899092 818815 870866 900070 837912 839297 847800 803430
4448 803430 836840 824090 811269 855794 783243 747657 727823 738472 780808 780255 747584 711034
4436 711034 666180 634919 642798 698583 637736 680477 665247 658602 659925 653995 695092 627082
4424 627082 624902 622332 624152 624961 592778 615264 545631 493898 499767 530505 540446 594103 603754
4411 603754 583531 512606 482364 544895 620588 599649 584842 587757 526874 488625 453516 422086
4399 422086 462475 488257 458133 444721 412491 447690 413203 389152 413821 459576 465848 422044
$$ packed form
4484A411250k748r4216M3008K2351l4681k4843n5214o9760j4168k8762p872j9449
4472A124896K177o931j575l5882O130m3505o0105m0815M6898K4590q613N6030
4460A063295j10825o9060M3552K3584n1454q0277N2051K9204o2158J385Q503m4370
4448H03430L3410j2750j2821M4525p2551l5586j9834J0649M2336n53l2671l6550
4436G11034m4854l1261P879N5785o0847M2741j5230o645J323n930M1097o8010
4424F27082k180k570J820Q09l2183K2486o9633n1733N869L0738R941N3657R651
4411F03754k0223p0925l0242O2531P5693k0939j4807K915o0883l8249l5109l1430
4399D22086M0389K5782l0124j3412l2230L5199l4487k4051K4669M5755O272m3804
$$ plain form
4387 422044 409599 488870 512019 479641 382938 405702 402885 356641 354907 389270 398760 367464
4375 367464 336883 350224 362522 397795 415690 371632 311030 333919 384089 332379 432786
4364 432786 413275 412842 361484 353311 359364 363161 391844 372567 385913 356289 352482 359577 357957
4351 357957 376591 349791 386027 364204 337949 373989 366810 353277 252175 295402 329496 319119
4339 319119 288660 277415 284539 306043 318889 268566 269118 223989 266673 270866 252683 274123
4327 274123 231536 260307 282737 236348 225695 199626 161465 226723 230240 218161 330748 346715
4315 346715 318657 303138 307844 328307 339320 322958 277725 304116 266200 267188 254687 221813
4303 221813 196719 183484 196965 181753 150638 170034 153771 167597 189861 207761 313515
$$ packed form
4387D22044j2445P9271K3149l2378r6703K2764k817m6244j734L4363R490l1296
4375C67464l0581J3341J2298L5273J7895m4058o0602K2889N0170n1710J00407
4364D32786j9511m33n1358q173O053L797K8683j9277J3346k9624l807P095j620
4351C57957J8634k6800L6236k1823k6255L6040p179j3533j01102M3227L4094j0377
4339C19119l0459j1245P124K1504J2846n0323N52m5129M2684M193j8183K1440
4327B74123m2587K8771K2430m6389j0653k6069l8161O5258L517j2079J12587J5967
4315C46715k8058j5519M706K0463J1013j6362m5233K6391l7916R88j2501l2874
4303B21813k5094j3235J3481j5212l1115J9396j6263J3826K2264J7900J05754
$$ plain form
4292 313515 299641 278098 339177 290913 264846 254811 258866 296761 271639 272906 327478 330440
4280 330440 270785 246183 295683 314008 246164 248370 245139 213838 242952 310399 288596 227714
4268 227714 213188 300752 275944 275120 314482 251951 218182 223957 239603 202442 192957 228707
4256 228707 281815 271412 208982 185892 251978 213312 213458 193229 196789 191361 134969 180933
4244 180933 169173 248610 242714 257117 224266 155929 164715 174611 177765 179673 105472 167889 163303
4231 163303 152983 198253 171726 190417 172300 225974 264599 223223 220548 208996 208501 209562
4219 209562 183734 183400 213279 190653 177193 136659 141755 170647 128067 152493 143130 171484
4207 171484 143784 113908 148189 167209 211217 140233 120949 162755 94093 137836 131660 155129
$$ packed form
4292C13515j3874k1543O1079m8264k6067j0035M055L7895k5122J267N4572K962
4280C30440n9655k4602M9500J8325o7844K206l231l1301K9114O7447k1803o0882
4268B27714j4526Q7564k4808q24L9362o2531l3769N775J5646l7161r485L5750
4256B28707N3108j0403o2430k3090O6086l8666J46k0229L560n428n6392M5964
4244A80933j1760P9437n896J4403l2851o8337Q786R896L154J908p4201O2417m586
4231A63303j0320M5270k6527J8691j8117N3674L8625m1376k675j1552m95J061
4219B09562k5828l34K9879k2626j3460m0534N096K8892m2580K4426r363K8354
4207A71484k7700k9876L4281J9020M4008p0984j9284M1806o8662M3743o176K3469
$$ plain form
4195 155129 161216 94992 35534 156667 186481 186523 124348 144602 154050 125085 150087 182098
4183 182098 176652 172248 214188 144150 57083 58798 115697 156614 146243 120395 64415 16436
4171 16436 84578 94874 141497 194885 143178 82039 83641 130174 127509 200315 124390 74228
4159 74228 85054 81681 92589 92679 97615 97989 137087 218201 174379 159429 117298 67515 117008
4146 117008 138126 122616 104364 99896 102417 156514 82942 130320 52195 52488 96627 95479 68533
4133 68533 91142 133696 77508 -1884 52801 98862 113268 79906 78906 78708 62102 95846
4121 95846 103999 104447 121461 98441 128162 91901 139836 147028 125411 128251 76126 79815 65400
4108 65400 64067 91011 79970 132575 175942 146571 86379 49591 23225 14334 42274 77291
$$ packed form
4195A55129O087o6224n9458J21133K9814M2o2175K0254R448k8965K5002L2011
4183A82098n446m404M1940p0038q7067J715N6899M0917j0371k5848n5980m7979
4171A6436O8142J0296M6623N3388n1707o1139J602M6533k665P2806p5925n0162
4159G4228J0826l373J0908R0M936L74L9098Q1114m3822j4950m2131m9783M9493
4146A17008K1118j5510j8252m468K521N4097p3572M7378p8125K93M4139j148k6946
4133F8533K2609M2554n6188p9392N4685M6061J4406l3362j000j98j6606L3744
4121I5846Q153M48J7014k3020K9721l6261M7935P192k1617K840n2125L689j4415
4108F5400j333K6944j1041N2605M3367k9371o0192l6788k6366q891K7940L5017
$$ plain form
4096 77291 70735 71214 110469 142217 78563 52113 49786 46094 106391 102729 29791 86267 92819
4083 92819 64890 146361 166682 128598 22391 81667 141676 143961 134362 87292 115663 139524
4071 139524 99471 82613 73114 140405 176669 114752 77671 90853 51954 110846 67838 74394
4059 74394 58157 56440 75860 123038 113432 134615 136164 80103 59910 51384 38330 62122 71839
4046 71839 70565 37923 72070 79995 77630 126413 187777 141327 105162 48185 42887 130853 119754
4033 119754 90941 8553 61044 108803 137999 114266 121896 70229 74610 78035 103512 119263
4021 119263 111069 52967 45142 10559 69265 108402 128741 168784 156292 113062 114648 34492
4009 34492 75110 150692 98649 114966 79506 120928 127188 94476 75502 114910 86859 124513
$$ packed form
4096G7291o556M79L9255L1748o3654k6450k327l692O0297l662p2938N6476O552
4083I2819k7929Q1471K0321l8084j06207N9276O0009K285r599m7070K8371K3861
4071A39524m0053j6858r499O7291L6264o1917l7081J3182l8899N8892m3008O556
4059G4394j6237j717J9420M7178r606K1183J549n6061k0193q526j3054K3792R717
4046G1839j274l2642L4147P925k365M8783O1364m6450l6165n6977n298Q7966j1099
4033A19754k8813q2388N2491M7759K9196k3733P630n1667M381L425K5477J5751
4021A19263q194n8102p825l4583N8706L9137K0339M0043j2492m3230J586q0156
4009C4492M0618P5582n2043J6317l5460M1422O260l2712j8974L9408k8051L7654
$$ plain form
3997 124513 72251 14882 6413 57347 73005 52187 44315 95883 57473 15239 -25844 -63393
3985 -63393 -76747 -28276 -2529 -40745 5060 24779 18918 47834 50245 58991 48271 9768
3973 9768 4131 33825 49836 77688 79451 34547 30872 27038 105443 132465 85762 55325 -776
3960 -776 10652 13225 30368 74935 47930 51701 -16714 16135 63112 508 -32255 57615 24410
3947 24410 47821 102280 80389 54183 37694 64307 30515 1826 55215 22012 71989 108972
3935 108972 33539 -10351 37574 99378 96397 67081 69466 37920 23157 38997 26462 30772
3923 30772 17883 29489 104841 32233 23772 90325 91519 129169 45245 -53089 -18718 19388
3911 19388 74728 75444 43765 55101 49329 89721 121816 121724 75332 59266 31419 27423 141715
$$ packed form
3997A24513n2262n7369q469N0934J5658k0818p872N1568l8410m2234m1083l7549
3985f3393j3354M8471K5747l8216M5805J9719n861K8916K411Q746j0720l8503
3973I768n637K9694J6011K7852J763m4904l675l834P8405K7022m6703l0437n6101
3960g76J1428K573J7143M4567k7005L771o8415L2849M6977o2604l2763Q9870l3205
3947B4410K3411N4459k1891k6206j6489K6613l3792k8689N3389l3203M9977L6983
3935A08972p5433m3890M7925O1804k981k9316K385l1546j4763J5840j2535M310
3923C0772j2889J1606P5352p2608q461O6553J194L7650q3924r8334L4371L8106
3911A9388N5340P16l1679J1336n772M0392L2095r2m6392j6066k7847l996J14292
$$ plain form
3898 141715 148353 83246 44359 -21584 -24806 -10601 1914 28172 25665 67733 120989 61554
3886 61554 35444 61954 74799 36469 -7313 -40899 25111 -9823 8738 104836 94433 67476
3874 67476 66157 54529 44168 25855 23476 55387 96805 112948 94070 26663 4458 -30562
3862 -30562 -45269 -15516 3550 40118 47847 -935 -15660 -21486 5749 -19813 -7814 -35615
3850 -35615 -85420 -39603 36041 103567 49108 6554 47319 77468 17073 -7303 -12194 60900
3838 60900 44637 28254 54531 39777 74198 85952 24574 60566 39390 46453 60085 45000
3826 45000 65136 32596 77718 86815 13019 -11883 -18135 -1283 58829 62456 28620 53952
3814 53952 88282 72734 85329 48079 -33630 -13922 11016 -13644 -46866 19240 45716 37590
$$ packed form
3898A41715O638o5107l8887o5943l222J4205J2515K6258k507M2068N3256n9435
3886F1554k6110K6510J2845l8330m3782l3586O6010l4934J8561R6098j0403k6957
3874F7476j319j1628j0361j8313k379L1911M1418J6143j8878o7407k2205l5020
3862c0562j4707K9753J9066L6568P729m8782j4725n826K7235k5562J1999k7801
3850c5615m9805M5817P5644O7526n4459m2554M0765L0149o0395k4376m891P3094
3838F0900j6263j6383K6277j4754L4421J1754o1378L5992k1176P063J3632j5085
3826D5000K0136l2540M5122R097p3796k4902o252J6852O0112L627l3836K5332
3814E3952L4330j5548J2595l7250q1709J9708K4938k4660l3222O6106K6476q126
$$ plain form
3802 37590 58711 74412 64147 60148 80604 63914 43765 22232 36816 22836 -32248 -31682
3790 -31682 20664 -48982 -5794 26737 34055 48146 36606 49324 56491 76554 37869 -950
3778 -950 5038 8514 13495 -2329 -54894 35192 116452 69551 84362 72825 83608 35029 -21262
3765 -21262 -29519 -16031 34477 11835 -18943 -14564 -27060 -43214 -30459 3878 43101 43764 110368
3752 110368 44178 -353 -3581 56607 1890 -26661 -6481 -2032 24467 14435 45224 8219
3740 8219 82108 88861 86270 36662 14104 39973 52145 43746 24392 61148 56365 37203 -14023
3727 -14023 22872 31705 6191 85688 124656 99226 114685 131664 98572 87799 107763 118295
3715 118295 103205 51388 35969 -16790 9326 47151 87190 59817 25615 52316 72389 102009
$$ packed form
3802C7590K1121J5701j0265l999K0456j6690k0149k1533J4584j3980n5084N66
3790c1682N2346o9646M3188L2531P318J4091j1540J2718P167K0063l8685l8819
3778i50N988L476M981j5824n2565R0086Q1260m6901J4811j1537J0783m8579n6291
3765b1262q257J3488N0508k2642l0778M379j2496j6154J2755L4337L9223O63O6604
3752A10368o6190m4531l228O0188n4717k8551K0180M449K6499j0032L0789l7005
3740H219P3889O753k591m9608k2558K5869J2172q399j9354L6756m783j9162n1226
3727a4023L6895Q833k5514P9497L8968k5430J5459J6979l3092j0773J9964J0532
3715A18295j5090n1817j5419n2759K6116L7825M0039k7373l4202K6701K0073K9620
$$ plain form
3703 102009 94108 41750 40000 80026 30295 -53582 -60314 2488 -1346 20663 199 1850 -3390
3690 -3390 46333 102561 64801 58937 59877 82961 47574 -3591 10389 14632 68184 37882 69835
3677 69835 75641 35133 31120 12563 -20369 -29429 -57859 -36852 -41183 5125 19730 20833 -467
3664 -467 2809 74450 57265 23726 3718 21246 46641 36257 28942 12634 8411 59928 30010
3651 30010 49166 57229 105648 84377 41668 12547 4452 9273 27876 71897 64379 76702 20153
3638 20153 -6028 14794 45109 90331 53929 30879 -26703 -15711 27789 -23769 -40443 21240
3626 21240 -49123 -28351 21825 22400 42830 99327 100857 56165 64465 96750 69480 56223 59374
3613 59374 12053 45568 28986 39005 31926 24935 80301 112250 103208 46181 77784 49814
$$ packed form
3703A02009p901n2358j750M0026m9731q3877o732O2802l834K2009k0464J651n240
3690c390M9723N6228l7760n864R40K3084l5387n1165J3980M243N3552l0302L1953
3677F9835N806m0508m013j8557l2932r060k8430K1007m331M6308J4605J103k1300
3664d67L276P1641j7185l3539k0008J7528K5395j0384p315j6308m223N1517k9918
3651C0010J9156Q063M8419k1271m2709k9121q095M821J8603M4021p518J2323n6549
3638B0153k6181K0822L0315M5222l6402k3050n7582J0992M3500n1558j6674O1683
3626B1240p0363K0772N0176N75K0430N6497J530m4692Q300L2285k7270j3257L151
3613E9374m7321L3515j6582J0019p079o991N5366L1949r042n7027L1603k7970
$$ plain form
3601 49814 10528 8637 5300 18252 12019 3338 -15769 -14086 18030 58072 93828 72013 115550
3588 115550 79317 -19374 -12789 -31944 13586 2394 15822 53551 60789 -42117 -48511 36773
3576 36773 20817 3446 35981 23123 -15247 -50589 44282 52232 50501 100265 52400 25622
3564 25622 60866 82219 89141 29511 -1249 44317 -4831 -20341 -35715 56454 44872 9741
3552 9741 11185 -6893 25551 118107 105504 35258 42108 42064 18212 -25178 28850 27029 2531
3539 2531 6156 30648 40508 84527 35565 29327 90515 98333 87041 18929 34445 54010 32432
3526 32432 175 38417 80762 3752 2591 2012 -24651 34163 85587 89432 108318 65219 35017
3513 35017 56455 3340 12893 75925 59101 53868 66291 -15541 6334 43777 42048 31743
$$ packed form
3601D9814l9286j891l337J2952o233q681j9107J683L2116M0042L5756k1815M3537
3588A15550l6233r8691O585j9155M5530j1192J3428L7729P238j02906o394Q5284
3576C6773j5956j7371L2535j2858l8370l5342R4871P950j731M9764m7865k6778
3564B5622L5244K1353O922n9630l0760M5566m9148j5510j5374R2169j1582l5131
3552I741J444j8078L2444R2556j2603p0246O850m4k3852m3390N4028j821k4498
3539B531L625K4492R860M4019m8962o238O1188P818j1292o8112J5516J9565k1578
3526C2432l2257L8242M2345p7010j161n79k6663N8814N1424L845J8886m3099l0202
3513C5017K1438n3115R553O3032j6824n233J2423q1832K1875L7443j729j0305
$$ plain form
3501 31743 52539 91146 23198 29674 89076 120078 99413 70426 41417 62491 122843 129461
3489 129461 99896 42158 65903 60680 123643 117986 93044 95133 35618 39875 35095 26747 47972
3476 47972 65031 57969 11573 23533 70308 50904 73089 117243 127653 121650 103594 42602
3464 42602 102623 92403 9189 90019 87511 106566 104256 124936 161159 165229 110608 119145 171270
3451 171270 141605 94089 90925 108717 108947 83436 108540 143694 117165 91576 37988 29697
3439 29697 105502 151183 130304 121231 134992 167310 137950 108826 80232 71165 30257 84495
3427 84495 84899 122114 89895 37921 48608 166420 172765 193198 124422 146169 240160 198212
3415 198212 168790 167707 187403 160734 153144 126862 193652 183737 174130 211952 273675 278470 282420
$$ packed form
3501C1743K0796L8607o7948O476N9402L1002k0665k8987k9009K1074O0352O618
3489A29461k9565n7738K3745n223O2963n657k4942K089n9515M257m780q348K1225
3476D7972J7059p062m6396J1960M6775j9404K2185M4154J0410o003j8056o0992
3464D2602O0021j0220q3214Q0830k508J9055k310K0680L6223M070n4621Q537N2125
3451A71270k9665m7516l164J7792K30k5511K5104L5154k6529k5589n3588q291
3439B9697P5805M5681k0879r073J3761L2318k9360k9124k8594r067m0908N4238
3427H4495M04L7215l2219n1974J0687J17812O345K0433o8776K1747R3991m1948
3415A98212k9422j083J9696k6669p590k6282O6790r915r607L7822O1723M795L950
$$ plain form
3402 282420 255220 199717 246715 236128 242819 273829 290274 244388 224017 247630 245899 266861
3390 266861 253595 220065 204062 243290 234216 161402 190415 239150 174299 192495 181821 220129
3378 220129 238855 226108 213374 189100 155556 140173 121295 156676 216171 178666 98213 134675
3366 134675 148513 124545 97019 141809 179371 184833 225687 216053 131634 130447 156132 137059
3354 137059 116751 142946 209674 245214 203188 140649 110306 172618 202574 139213 172881 164871
3342 164871 135003 101198 100378 85838 85622 100212 104771 123911 110335 85009 78825 105056 61384
3329 61384 70183 35929 64772 95390 44683 6422 22099 58154 11788 67548 112445 95159
3317 95159 98457 77531 36958 113130 112196 93676 35746 17876 15367 24268 34836 31872 82202
$$ packed form
3402B82420k7200n5503M6998j0587O691L1010J6445m5886k0371K3613j731K0962
3390B66861j3266l3530j6003L9228r074p2814K9013M8735o4851J8196j0674L8308
3378B20129J8726j2747j2734k4274l3544j5383j8878L5381N9495l7505q0453L6462
3366A34675J3838k3968k7526M4790L7562N462M0854r634q4419j187K5685j9073
3354A37059k0308K6195O6728L5540m2026o2539l0343O2312K9956o3361L3668q010
3342A64871k9868l3805q20j4540k16J4590M559J9140j3576k5326o184K6231m3672
3329F1384Q799l4254K8843L0618n0707l8261J5677L6055m6366N5760M4897j7286
3317I5159L298k0926m0573P6172r34j8520n7930j7870k509Q901J0568k964N0330
$$ plain form
3304 82202 53818 69982 74216 76323 55925 32410 52026 34488 20863 90645 76240 43272
3292 43272 56150 79561 35517 57514 93595 79946 59652 30571 -8007 38306 39253 -3799
3280 -3799 33640 44340 35798 -11522 15284 38928 82141 72193 103348 59239 50821 79998 77875
3267 77875 27411 84136 65429 41389 56183 -1055 -16265 61388 37410 -5190 4319 62470
3255 62470 83863 71074 45362 26755 9236 79348 44796 23192 37760 36130 40228 16061
3243 16061 31828 8173 60463 63800 81632 38746 -30667 -70264 -56886 -26057 34961 -22633
3231 -22633 -2087 50289 57563 1814 -39564 -45664 -38838 19132 -24162 -12967 -673 23126
3219 23126 20703 -41526 -22799 -835 -58624 -375 3172 -61471 -58431 -65916 -6093 -18960 -63230
$$ packed form
3304H2202k8384J6164M234K107k0398k3515J9616j7538j3625O9782j4405l2968
3292D3272J2878K3411m4044K1997L6081j3649k0294k9081l8578M6313R47m3052
3280c799L7439J0700q542m7320K6806K3644M3213r948L1155m4109q418K9177k123
3267G7875n0464N6725j8707k4040J4794n7238j5210P7653k3978m2600R509N8151
3255F2470K1393j2789k5712j8607j7519P0112l4552k1604J4568j630M098k4167
3243A6061J5767k3655N2290L337J7832m2886o9413l9597J3378L0829O1018n7594
3231b2633K0546N2376P274n5749m1378o100O826N7970m3294J1195J2294K3799
3219B3126k423o2229J8727K1964n7789N8249L547o4643L040p485N9823j2867m4270
$$ plain form
3206 -63230 -8723 27152 8499 34489 -8338 25366 66872 27094 -42265 -57360 -9611 33461
3194 33461 52824 82532 4823 18240 -40752 -96268 -6770 52003 68060 62753 470 -66077
3182 -66077 -49311 -30925 -38381 7928 36181 -1757 38002 -7828 26505 34043 30153 28130 35232
3169 35232 -6034 11805 19053 33333 8226 28662 18677 -23830 -46429 -108340 -38469 -10757
3157 -10757 14230 30456 -14333 -55514 5804 -89782 -45802 4507 59092 -17905 -46701 27138
3145 27138 -12467 19722 55499 34176 16724 41656 19868 -33632 27865 -311 9617 -12869
3133 -12869 -7876 7393 59285 52825 -962 51793 56203 62782 70456 73818 18652 -1014 8970
3120 8970 -1167 517 41913 28213 -59626 -36310 32780 36302 25938 -1203 26511 28593 40346
$$ packed form
3206f3230N4507L5875j8653K5990m2827L3704M1506l9778o9359j5095M7749M3072
3194C3461J9363K9708p7709J3417n8992n5516Q9498N8773J6057n307o2283o6547
3182f6077J6766J8386p456M6309K8253l7938L9759m5830L4333P538l890k023P102
3169C5232m1266J7839P248J4280k5107K0436r985m2507k2599o1911O9871K7712
3157a0757K4987J6226m4789m1181O1318r5586M3980N0309N4585p6997k8796P3839
3145B7138l9605L2189L5777k1323j7452K4932k1788n3500O1497k8176R928k2486
3133a2869M993J5269N1892o460n3787N2755M410O579P674L362n5166j9666R984
3120H970j0137J684M1396j3700q7839K3316O9090L522j0364k7141K7714K082J1753
$$ plain form
3107 40346 -4255 -9604 -22848 -37528 -15094 97486 44785 21174 29581 41762 14913 -5644
3095 -5644 40374 -7675 -18324 -68997 -76089 -36298 25648 12777 -63758 -5822 3780 -43700
3083 -43700 -33198 -16607 -19704 -31875 -14137 22923 49321 16007 -28292 -58811 -12819 11390
3071 11390 -18073 32590 -2960 23770 5322 -8239 -6845 12093 25359 3287 -8242 34493
3059 34493 39899 45773 81304 61563 41304 11894 20932 25857 47711 47726 65804 78740 14314
3046 14314 -7458 26800 64962 103384 114245 91655 4602 -45744 45113 31637 23402 35912
3034 35912 91556 111390 63352 33132 32465 36840 14978 33454 26904 51232 27295 13669 15710
3021 15710 -12120 -9229 17749 12859 1912 -16947 29500 38162 30197 -1177 -41806 -11066 -47798
$$ packed form
3107D0346m4601n349j3244j4680K2434J12580n2701k3611Q407J2181k6849k0557
3095e644M6018m8049j0649n0673p092L9791O1946j2871p6535N7936R602m7480
3083d3700J0502J6591l097j2171J7738L7060K6398l3314m4299l0519M5992K4209
3071A1390k9463N0663l5550K6730j8448j3561J394J8938J3266k2072j1529M2735
3059C4493N406N874L5531j9741k0259k9410R038M925K1854J5J8078J2936o4426
3046A4314k1772L4258L8162L8422J0861k2590q7053n0346R0857j3476q235J2510
3034C5912N5644J9834m8038l0220o67M375k1862J8476o550K4328k3937j3626K041
3021A5710k7830K891K6978m890j0947j8859M6447Q662p965l1374m0629L0740l6732
$$ plain form
3008 -47798 23720 69129 -13152 10950 72762 90645 49512 24690 61802 62346 31658 13383
2996 13383 4625 -52546 -58109 -31986 -45163 -18425 -7406 34232 9130 25365 8623 24657
2984 24657 -6846 -82079 -6566 19570 44261 51212 33922 75949 74394 47791 36646 34118
2972 34118 42149 29218 1919 -75671 -104995 -26309 -36311 -9268 -930 29770 22444 11740
2960 11740 6868 -38016 -80980 -65116 -39834 -42509 -25482 -20612 -6942 22825 -7670 -35143
2948 -35143 -32432 -80108 -65916 -10213 8831 -5022 -30731 691 5087 12001 -13306 13570
2936 13570 52189 68001 38616 18075 -32091 -33654 1892 -52014 -40551 -19867 7473 -53724
2924 -53724 -75083 -69219 -33520 -3255 18765 63904 78243 77008 89606 12162 -35303 -90663
$$ packed form
3008d7798P1518M5409q2281K4102O1812J7883m1133k4822L7112N44l0688j8275
2996A3383q758n7171n563K6123j3177K6738J1019M1638k5102J6235j6742J6034
2984B4657l1503p5233P5513K6136K4691O951j7290M2027j555k6603j1145k528
2972C4118Q031j2931k7299p7590k9324P8686j0002K7043Q338L0700p326j0704
2960A1740m872m4884m2964J5864K5282k675J7027M870J3670K9767l0495k7473
2948c5143K711m7676J4192N5703J9044j3853k5709L1422M396O914k5307K6876
2936A3570L8619J5812k9385k0541n0166j563L5546n3906J1463K0684K7340o1197
2924e3724k1359N864L5699L0265K2020M5139J4339j235J2598p7444m7465n5360
$$ plain form
2912 -90663 -127347 -71392 -52550 -47470 -42131 -49269 168 66422 24326 -61429 -27147 -5221
2900 -5221 -19687 21215 20011 7390 -37760 -65917 -34465 -41174 -19014 -5590 -5365 -31914 12015
2887 12015 65739 49813 -63342 -21569 94806 32849 -67678 -71099 6162 -40491 -69575
2876 -69575 -76847 -88113 -83570 -22051 -3379 10257 17290 -53022 -46419 -34023 -61811 -39397 -71538
2863 -71538 -35418 -11300 -24830 -33985 -14429 -8035 -63454 -16804 -10594 -9215 8950 41131 9070
2850 9070 -24434 11083 -24518 18658 -8090 -45687 42257 53903 -19924 -72612 -36901 35717
2838 35717 20427 -65451 -144438 -80425 -1646 -6836 3614 27533 58973 85511 80750 -20125
2826 -20125 -38837 -19844 -6242 -11142 48600 -1839 24984 33827 1855 11314 -23036 -45487
$$ packed form
2912i0663l6684N5955J8842N080N339p138M9437O6254m2096q5755L4282K1926
2900e221j4466M0902j204j2621m5150k8157L1452o709K2160J3424K25k6549M3929
2887A2015N3724j5926j13155M1773J16375o1957j00527l421P7261m6653k9084
2876f9575p272j1266M543O1519J8672J3636P033p0312O603J2396k7788K2414l2141
2863g1538L6120K4118j3530r155J9556O394n5419M6650O210J379J8165L2181l2061
2850I070l3504L5517l5601M3176k6748l7597Q7944J1646p3827n2688L5711P2618
2838C5717j5290q5878p8987O4013P8779n190J0450K3919L1440K6538m761j00875
2826b0125j8712J8993J3602m900N9742n0439K6823Q843l1972R459l4350k2451
$$ plain form
2814 -45487 -30615 -66766 -97283 -73163 -30225 -31807 -51607 -120776 -48524 -6342 -14068 -10614
2802 -10614 -53108 -61291 -71417 -8146 -31858 14777 48299 -81351 -97464 7677 4925 -50281
2790 -50281 -116093 -123993 -93529 -52600 -19996 3254 21094 3658 -37141 -75845 -38748 -7873
2778 -7873 25355 44176 46215 49995 23243 27478 -6374 -1790 12973 -12600 -16268 -33803 -29659
2765 -29659 -16263 -16579 16554 6809 9683 -5832 3436 26756 19608 38746 -17054 -29519 -47976
2752 -47976 -22957 73188 38471 -57550 -67611 -33003 5508 -2794 -47951 -36789 -75997 -72254
2740 -72254 -38378 -307 -17758 21421 1200 -30607 -37354 -20602 -47934 -84254 -105986 -90485
2728 -90485 -102474 -86046 -103346 -82055 -86446 -64954 -24023 -5556 -58432 -22067 -18396 -41363
$$ packed form
2814d5487J4872l6151l0517K4120M2938j582j9800o9169P2252M2182p726L454
2802a0614m2494q183j0126O3271k3712M6635L3522j29650j6113J05141k752n5206
2790e0281o5812p900L0464M0929L2604K3250J7840j7436m0799l8704L7097L0875
2778g873L3228J8821K039L780k6752M235l3852M584J4763k5573l668j7535M144
2765b9659J3396l16L3133r745K874j5515R268K3320p148J9138n5800j2465j8457
2752d7976K5019R6145l4717r6021j0061L4608L8511q302m5157J1162l9208L743
2740g2254L3876L8071j7451L9179k0221l1807o747J6752k7332l6320k1732J5501
2728i0485j1989J6428j7300K1291m391K1492M0931J8467n2876L6365L671k2967
$$ plain form
2716 -41363 -26860 -32030 -34093 -37079 19814 4413 -45370 -53372 1640 36741 3891 -20410 -19119
2703 -19119 -16103 -22157 16393 18625 -19609 -50784 -46904 -19909 -46612 -34719 -31318 -43830 -26438
2690 -26438 -11051 5277 -34110 -52655 27184 9742 -46479 3557 20015 -28598 -18550 -83349
2678 -83349 -33943 -65474 -37351 -22327 26287 82737 12912 30582 40855 -38489 -53427 -72751
2666 -72751 -42418 -39300 -83290 -60080 -23687 -7912 8509 -49789 -44942 -31576 -37783 -18083
2654 -18083 -38829 -99091 -76935 -52111 -65115 -84117 -53488 -7625 12071 30340 -28334 -60356
2642 -60356 -78035 -48134 -46907 -36948 -22802 -35113 -66058 -71240 -97020 -104482 -40797 -31631 36592
2629 36592 27132 12766 -6745 41616 50015 57304 33849 -3024 76847 -4869 22063 88828
$$ packed form
2716d1363J4503n170k063k986N6893j5401m9783q002N5012L5101l2850k4301J291
2703a9119L016o054L8550K232l8234l1175L880K6995k6703J1893L401j2512J7392
2690b6438J5387J6328l9387j8545P9839j7442n6221N0036J6458m8613J0048o4799
2678h3349M9406l1531K8123J5024M8614N6450o9825J7670J0273p9344j4938j9324
2666g2751L0333L118m3990K3210L6393J5775J6421n8298M847J3366o207J9700
2654a8083k0746o0262K2156K4824j3004j9002L0629M5863J9696J8269n8674l2022
2642f0356j7679K9901J227R959J4146j2311l0945n182k5780p462O3685R166O8223
2629C6592r460j4366j9511M8361Q399P289k3455l6873P9871q1716K6932O6765
$$ plain form
2617 88828 50768 26776 -10979 -33799 -4543 -13244 -45657 -99523 -91765 -23470 -40842 -7320
2605 -7320 12228 -11984 -12523 -12138 6168 -26010 -19561 -22127 -81700 -59501 -95196 -155187 -116796
2592 -116796 -60135 -22831 -61021 -50243 49503 75517 -7490 -84164 -136501 -68727 828 -14756
2580 -14756 -13427 -111992 -122238 -93718 -62343 -8027 -44201 -6971 -7829 -10388 -23714 -40029 -67291
2567 -67291 -66506 7976 22785 4744 -89622 -45094 28283 -3348 5219 885 2335 -6606 -25645
2554 -25645 -2659 16469 2167 -5551 -42063 2806 -18520 -26118 30087 -21594 -18005 12191
2542 12191 -4507 -35287 -128097 -80843 -38039 -52315 -120770 -86746 -38015 -33274 -35645 -54356
2530 -54356 -36626 -864 -45539 46482 64590 -78911 -36877 -28913 -43863 -91026 -27599 -46885
$$ packed form
2617H8828l8060k3992l7755k2820K9256q701l2413n3866P758O8295j7372L3522
2605g320J9548k4212n39L85J8306l2178O449k566n9573K2199l5695n9991L8391
2592a16796N6661L7304l8190J0778R9746K6014q3007p6674n2337O7774O9555j5584
2580a4756J329r8565j0246K8520L1375N4316l6174L7230q58k559j3326j6315k7262
2567f7291P85P4482J4809j8041r4366M4528P3377l1631Q567m334J450q941j9039
2554b5645K2986J9128j4302p718l6512M4869k1326p598N6205n1681L589L0196
2542A2191j6698l0780r2810M7254M2804j4276o8455L4024M8731M741k371j8711
2530e4356J7730L5762m4675R2021J8108j43501M2034P964j4950m7163O3427j9286
$$ plain form
2518 -46885 -56274 -46086 -39215 -56138 -28753 -15442 -50388 -43118 -57444 -82896 -64231 -55902 -66841
2505 -66841 -47398 -21701 20799 -5905 13858 5091 24193 25893 68882 18749 54171 87957
2493 87957 42873 -30436 23945 55266 -27372 -27743 -4238 41689 89480 41801 12126 -57523
2481 -57523 -58762 -54713 -83340 -23369 -12034 -40600 -71086 -48661 -58921 -15505 51382 46440
2469 46440 1783 7234 8052 1046 -25711 -57880 -77354 -51949 -43009 -96061 -90358 -50047 -3662
2456 -3662 -26470 -79642 -46402 -33496 6213 -20160 -27823 -40351 34447 37502 48819 11220
2444 11220 16754 -52243 -99327 -93766 -80902 -82617 -74188 -18581 42763 50426 78662 41489 -23687
2431 -23687 -1577 -60298 -82616 -51378 -11750 -44420 -67251 -46519 -19342 -58020 -90391 -112511
$$ packed form
2518d6885r389J0188O871j6923K7385J3311l4946P270j4326k5452J8665Q329j0939
2505f6841J9443K5697M2500k6704J9763q767J9102J700M2989n0133L5422L3786
2493H7957m5084p3309N4381L1321q2638l71K3505M5927M7791m7679k9675o9649
2481e7523j239M049k8627N9971J1335k8566l0486K2425j0260M3416O6887m942
2469D6440m4657N451Q18p006k6757l2169j9474K5405Q940n3052N703M0311M6385
2456c662k2808n3172L3240J2906L9709k6373p663j2528P4798L055J1317l7599
2444A1220N534o8997m7084N561J2864j715Q429N5607O1344P663K8236l7173o5176
2431b3687K2110n8721k2318L1238L9628l2670k2831K0732K7177l8678l2371k2120
$$ plain form
2419 -112511 -113043 -30877 25335 14606 -17963 -48575 -51572 -55817 -40711 -39158 -41905 -30548 -23360
2406 -23360 -24676 18942 -49418 -19008 7614 -80199 -99744 -92644 -73748 -26035 -61873 -28464
2394 -28464 15039 -22550 -705 23600 -8858 -31958 -23911 -45420 -50785 -34415 -26593 16109
2382 16109 2255 -19695 -28574 -29257 16309 -7543 -84288 -59312 -30361 -55873 -106744 -118427
2370 -118427 -133700 -137236 -100883 -80826 -91847 -41553 40745 -30004 -42168 18221 35794 30571
2358 30571 33245 -26376 -18267 30401 26461 19817 -23233 -81247 -67823 13576 -43259 -67168 -70079
2345 -70079 -37367 57412 -43217 -39555 -61288 -51672 -59981 -96748 -65075 -17036 -65894 -15676
2333 -15676 -41166 -55074 -52193 -75546 -79064 -54520 -53352 -48339 -31511 -24542 -54480 -7235 44884
$$ packed form
2419a12511n32Q2166N6212j0729l2569l0612k997m245J5106J553k747J1357P188
2406b3360j316M3618o8360L0410K6622q7813j9545P100J8896M7713l5838L3409
2394b8464M3503l7589K1845K4305l2458k3100Q047k1509n365J6370P822M2702
2382A6109j3854k1950q879o83M5566k3852p6745K4976K8951k5512n0871j1683
2370a18427j5273l536L6353K0057j1021N0294Q2298p0749j2164O0389J7573n223
2358C0571K674n9621Q109M8668l940o644m3050n8014J3424Q1399n6835k3909k911
2345g0079L2712R4779j00629L662k1733R616q309l6767L1673M8039m8858N0218
2333a5676k5490j3908K881k3353l518K4544J168N013J6828O969k9938M7245N2119
$$ plain form
2320 44884 55894 14077 -53290 6677 -2026 -46148 -89699 -26348 -59043 7558 32609 -41563
2308 -41563 -17038 3409 -1118 -17526 -71529 -69290 -45986 -4675 -32632 -70563 -8740 6577
2296 6577 -10729 2014 -63993 -49005 -64083 -66228 -75753 -66144 -65457 -22691 -37606 7571 -2596
2283 -2596 -45238 -21802 11121 -29536 -66621 -68201 -46514 -76119 -93577 -55345 -30356 -62370
2271 -62370 -61658 -29669 41944 90607 -3342 -44527 -14295 -17810 -33550 3393 -42298 -45180 -40086
2258 -40086 -98385 -150068 -47827 -6906 -25834 -31342 -59231 -38750 -107495 -91942 -101675 -148876
2246 -148876 -109059 -26360 -51334 -25868 -60787 -80828 -64624 -85463 -28032 -41034 -81386 -130488
2234 -130488 -110460 -82894 -72308 -30695 -40657 -96757 -59396 -42232 -63011 -99588 -94011 -58313
$$ packed form
2320D4884J1010m1817o7367N9967q703m4122m3551O3351l2695O6601K5051p4172
2308d1563K4525K0447m527j6408n4003K239K3304M1311k7957l7931O1823J5317
2296F577j7306J2743o6007J4988j5078k145r525R609O87M2766j4915M5177j0167
2283b596m2642K3436L2923m0657l7085j580K1687k9605j7458L8232K4989l2014
2271f2370P12L1989P1613M8663r3949m1185L0232l515j5740L6943m5691k882N094
2258d0086n8299n1683J02241M0921j8928n508k7889K0481o8745J5553r733m7201
2246a48876L9817Q2699k4974K5466l4919k0041J6204k0839N7431j3002m0352m9102
2234a30488K0028K7566J0586M1613r962n6100L7361J7164k0779l6577N577L5698
$$ plain form
2222 -58313 -38021 -35570 -71394 -100271 75594 36607 22988 -21763 -29804 9810 -59380 -101047
2210 -101047 -6561 63281 78406 58051 -10760 -72166 -7272 -21347 -21422 29785 64752 40688
2198 40688 25043 30778 -53118 -60202 -17233 -86046 -99586 -117703 -83422 -40903 -52839 -44548
2186 -44548 -73481 -95617 -74471 -131407 -108612 -51549 -52327 19073 -8521 2255 -81982 -62590
2174 -62590 -82312 -57919 -43419 -85233 -54349 -2957 -32396 -48334 -65533 37446 45608 40346
2162 40346 4222 -55612 -73798 2344 11766 -79781 -79935 -32197 6777 -58539 -63437 -81098 -48467
2149 -48467 -6108 12699 34103 46431 21882 -39866 -72567 -17460 -52622 -64725 -36113 -19182
2137 -19182 -66620 -53523 -37113 -19690 -37298 -58687 -43876 -24180 -20339 -36704 -13204 -19323
$$ packed form
2222e8313K0292K451l5824k8877J75865l8987j3619m4751q041L9614o9190m1667
2210a01047R4486O9842J5125k0355o8811o1406O4894j4075p5N1207L4967k4064
2198D0688j5645N735q3896p084M2969o8813j3540j8117L4281M2519j1936Q291
2186d4548k8933k2136K1146n6936K2795N7063p78P1400k7594J0776q4237J9392
2174f2590j9722K4393J4500m1814L0884N1392k9439j5938j7199J02979Q162n262
2162D0346l6124n9834j8186P6142R422r1547j54M7738L8974o5316m898j7661L2631
2149d8467M2359J8807K1404J2328k4549o1748l2701N5107l5162j2103K8612J6931
2137a9182m7438J3097J6410J7423j7608k1389J4811J9696L841j6365K3500o119
$$ plain form
2125 -19323 -5576 -2794 -81230 -47907 33346 14569 1909 -28812 -70975 -75109 -28342 -22588
2113 -22588 3227 -14259 -56598 -10170 -27306 -112604 -46815 -39445 7498 28273 41606 6071
2101 6071 -23850 12060 9248 -34053 -57499 -21163 -80867 -92119 -59171 -65281 -49310 -13442
2089 -13442 16418 -23690 -61641 -39581 -9036 36456 69381 38296 -9878 -15895 3712 24850
2077 24850 10328 -28183 -41162 -58558 -27079 11386 -55 -49746 11197 -5627 -12472 -12263
$$ packed form
2125a9323J3747K782p8436L3323Q1253j8777j2660l0721m2163m134M6767N754
2113b2588K5815j7486m2339M6428j7136q5298O5789P370M6943K0775J3333l5535
2101F071k9921L5910k812m3301k3446L6336n9704j1252L2948o110J5971L5868
2089a3442K9860m0108l7951K2060L0545M5492L2925l1085m8174o017J9607K1138
2077B4850j4522l8511j2979j7396L1479L8465j1441m9691O0943j6824o845K09
$$ [...]
##END NTUPLES=NMR SPECTRUM
##END=
