##TITLE=1H_TG-2379
 200.13MHz, DMSO,
 8 sc
 
 28.1.2025
##JCAMPDX= 6.0         $$ Bruker NMR JCAMP-DX V2.0
##DATA TYPE= NMR SPECTRUM
##DATA CLASS= NTUPLES
##ORIGIN= UXNMR, Bruker Analytische Messtechnik GmbH
##OWNER= pz
$$ XWIN-NMR		Version 3.5
$$ Tue Jan 28 14:04:19 2025 Russian Standard Time (UT+4h)  she@DPX200
##.OBSERVE FREQUENCY= 200.1313
##.OBSERVE NUCLEUS= ^1H
##.ACQUISITION MODE= SIMULTANEOUS
##.ACQUISITION SCHEME= undefined
##.AVERAGES= 8
##.DIGITISER RES= 18
##SPECTROMETER/DATA SYSTEM= spect
##.PULSE SEQUENCE= zg30
##.SOLVENT NAME= DMSO
##.SHIFT REFERENCE= (INTERNAL, DMSO, 0, 15.4769)
##AUDIT TRAIL= $$ (NUMBER, WHEN, WHO, WHERE, WHAT)
$$ ##TITLE= Audit trail, XWIN-NMR		Version 3.5
$$ ##JCAMPDX= 5.01
$$ ##ORIGIN= Bruker BioSpin GmbH
$$ ##OWNER= she
$$ F:/spectra/data/she/nmr/H-C/1/pdata/1/auditp.txt
$$ ##AUDIT TRAIL=  $$ (NUMBER, WHEN, WHO, WHERE, WHAT)
(   1,<2025-01-28 14:03:08.78 +0400>,<she>,<DPX200>,
      <created by zg, POWCHK disabled, PULCHK disabled
       configuration hash MD5:
       00 E9 B6 7A A2 85 ED C7 34 08 36 98 17 FE 4E 26
       data hash MD5: 16K
       B9 76 32 58 24 36 04 F9 BA BA 1A B4 87 C8 3B DF>)
(   2,<2025-01-28 14:03:10.96 +0400>,<she>,<DPX200>,
      <Start of raw data processing
       efp BC_mod = 2 LB = 0.25 FT_mod = 6 PKNL = 1 PHC0 = 251.3811 PHC1 = 9.992229 SI = 16K 
       data hash MD5: 16K
       A1 21 E6 56 56 6D 6C 13 7B F0 6B 57 C2 2F C0 8C>)
(   3,<2025-01-28 14:03:40.17 +0400>,<she>,<DPX200>,
      <pk PHC0 = -21.26851 PHC1 = 31.39999 
       data hash MD5: 16K
       76 E9 CD E5 14 3C A7 67 BA CE 79 82 46 C7 BF 8D>)
(   4,<2025-01-28 14:03:45.56 +0400>,<she>,<DPX200>,
      <abs ABSG = 5 
       data hash MD5: 16K
       21 F7 3F 36 42 2A 00 28 F7 E7 BC DC 76 1E C7 27>)
$$ ##END=
$$ 
$$ hash MD5
$$ 54 00 F6 D5 72 B0 F9 E3 C7 44 AC 5B D9 D9 C3 72
##$RELAX= 
##$RELAX= 
##$RELAX= 
##$RELAX= 
##$RELAX= 
##$RELAX= 
$$ Bruker specific parameters
$$ --------------------------
##$DU= <F:/spectra>
##$EXPNO= 1
##$NAME= <H-C>
##$PROCNO= 1
##$TYPE= <nmr>
##$USER= <she>
##$AMP= (0..31)
100 100 100 100 100 100 100 100 100 100 100 100 100 100 100 100 100 100 
100 100 100 100 100 100 100 100 100 100 100 100 100 100 
##$AQSEQ= 0
##$AQ_mod= 1
##$AUNM= <au_zg>
##$AUTOPOS= <>
##$BF1= 200.13
##$BF2= 200.13
##$BF3= 200.13
##$BF4= 200.13
##$BF5= 200.13
##$BF6= 200.13
##$BF7= 200.13
##$BF8= 200.13
##$BYTORDA= 1
##$CFDGTYP= 0
##$CFRGTYP= 5
##$CHEMSTR= <none>
##$CNST= (0..31)
1 1 145 1 1 1 1 1 1 1 1 1 1 1 1 1 1 1 1 1 1 1 1 1 1 1 1 1 1 1 1 1 
##$CPDPRG= <>
##$CPDPRG1= <>
##$CPDPRG2= <>
##$CPDPRG3= <>
##$CPDPRG4= <mlev>
##$CPDPRG5= <mlev>
##$CPDPRG6= <mlev>
##$CPDPRG7= <mlev>
##$CPDPRG8= <mlev>
##$CPDPRGB= <>
##$CPDPRGT= <>
##$D= (0..31)
0 0.7 0 0 0 0 0 0 0 0 0 0.03 0 0 0 0 0 0 0 0 0 0 0 0 0 0 0 0 0 0 0 0 
##$DATE= 1738058588
##$DBL= (0..7)
120 120 120 120 120 120 120 120 
##$DBP= (0..7)
150 150 150 150 150 150 150 150 
##$DBP07= 0
##$DBPNAM0= <>
##$DBPNAM1= <>
##$DBPNAM2= <>
##$DBPNAM3= <>
##$DBPNAM4= <>
$$ [...]
##$SUBNAM3= <"">
##$SUBNAM4= <"">
##$SUBNAM5= <"">
##$SUBNAM6= <"">
##$SUBNAM7= <"">
##$SUBNAM8= <"">
##$SUBNAM9= <"">
##$SW= 18.0517328524113
##$SWIBOX= (0..15)
0 0 2 0 0 0 0 0 0 0 0 0 0 0 0 0 
##$SW_h= 3612.71676300578
##$TD= 16384
##$TD0= 1
##$TE= 0
##$TE2= 300
##$TE3= 300
##$TEG= 300
##$TL= (0..7)
0 120 120 120 120 120 120 120 
##$TP= (0..7)
150 150 150 150 150 150 150 150 
##$TP07= 0
##$TPNAME0= <>
##$TPNAME1= <>
##$TPNAME2= <>
##$TPNAME3= <>
##$TPNAME4= <>
##$TPNAME5= <>
##$TPNAME6= <>
##$TPNAME7= <>
##$TPOAL= (0..7)
0.5 0.5 0.5 0.5 0.5 0.5 0.5 0.5 
##$TPOFFS= (0..7)
0 0 0 0 0 0 0 0 
##$TUNHIN= 0
##$TUNHOUT= 0
##$TUNXOUT= 0
##$USERA1= <user>
##$USERA2= <user>
##$USERA3= <user>
##$USERA4= <user>
##$USERA5= <user>
##$V9= 5
##$VALIST= <valist>
##$VCLIST= <CCCCCCCCCCCCCCC>
##$VD= 0
##$VDLIST= <DDDDDDDDDDDDDDD>
##$VPLIST= <PPPPPPPPPPPPPPP>
##$VTLIST= <TTTTTTTTTTTTTTT>
##$WBST= 1024
##$WBSW= 4
##$XGAIN= (0..3)
0 0 0 0 
##$XL= 0
##$YL= 0
##$YMAX_a= 307394
##$YMIN_a= -308369
##$ZGOPTNS= <>
##$ZL1= 120
##$ZL2= 120
##$ZL3= 120
##$ZL4= 120
##$ABSF1= 15.47694
##$ABSF2= -2.574909
##$ABSG= 5
##$ABSL= 3
##$ALPHA= 0
##$AQORDER= 0
##$ASSFAC= 0
##$ASSFACI= 0
##$ASSFACX= 0
##$ASSWID= 0
##$AUNMP= <proc_1d>
##$AZFE= 0.1
##$AZFW= 0.1
##$BCFW= 0
##$BC_mod= 2
##$BYTORDP= 0
##$COROFFS= 0
##$CY= -3
##$DATMOD= 1
##$DC= 0
##$DFILT= <>
##$DTYPP= 0
##$F1P= 0
##$F2P= 0
##$FCOR= 1
##$FTSIZE= 16384
##$FT_mod= 6
##$GAMMA= 0
##$GB= 0
##$INTBC= 1
##$INTSCL= 3.241238e-09
##$ISEN= 128
##$LB= 0.25
##$LEV0= 0
##$LPBIN= 0
##$MAXI= 10000
##$MC2= 0
##$MEAN= 0
##$ME_mod= 0
##$MI= 1.114404
##$NCOEF= 0
##$NC_proc= -6
##$NLEV= 6
##$NOISF1= 3.799351
##$NOISF2= 2.8
##$NSP= 0
##$NTH_PI= 0
##$NZP= 0
##$OFFSET= 15.47694
##$PC= 1
##$PHC0= 230.1126
##$PHC1= 41.39222
##$PH_mod= 1
##$PKNL= yes
##$PPARMOD= 0
##$PSCAL= 0
##$PSIGN= 0
##$REVERSE= no
##$SF= 200.130008957281
##$SI= 16384
##$SIGF1= 3
##$SIGF2= 2
##$SINO= 0.751879
##$SIOLD= 32768
##$SREGLST= <19F.Aceton>
##$SSB= 0
##$STSI= 16384
##$STSR= 0
##$SW_p= 3612.71676300578
##$SYMM= 0
##$S_DEV= 0
##$TDeff= 16384
##$TDoff= 0
##$TI= <>
##$TILT= no
##$TM1= 0
##$TM2= 0
##$TOPLEV= 0
##$USERP1= <user>
##$USERP2= <user>
##$USERP3= <user>
##$USERP4= <user>
##$USERP5= <user>
##$WDW= 1
##$XDIM= 16384
##$YMAX_p= 433321888
##$YMIN_p= -559770
$$ End of Bruker specific parameters
$$ ---------------------------------
##NTUPLES= NMR SPECTRUM
##VAR_NAME=  FREQUENCY,     SPECTRUM/REAL,   SPECTRUM/IMAG
##SYMBOL=    X,             R,               I
##VAR_TYPE=  INDEPENDENT,   DEPENDENT,       DEPENDENT
##VAR_FORM=  AFFN,          ASDF,            ASDF
##VAR_DIM=   16384,         16384,           16384
##UNITS=     HZ,            ARBITRARY UNITS, ARBITRARY UNITS
##FACTOR=    0.220516191357247, 1,           1
##FIRST=     3097.40017185732, 0,            0
##LAST=      -515.316591148465, 0,           0
##MIN=       -515.316591148465, -559770,     0
##MAX=       3097.40017185732, 433321888,    0
$$ Real data points
##PAGE= N=1
##DATA TABLE= (X++(R..R)), XYDATA
$$ [...]
$$ plain form
8924 3807067 3857488 3830131 3739789 3820343 3917326 3971979 3973408 3934111 3951401 3937367 3979756 3949743
8912 3949743 3977002 4022695 4006902 4038676 4124643 4081780 4294322 4435519 4436870 4458658 4434110
8901 4434110 4479417 4747588 4722250 4776343 4769023 4759088 4810568 4764466 4958871 5148226 5173463
8890 5173463 5174948 5373336 5479575 5381528 5383293 5527631 5635430 5895686 5938895 6102866 6161449
8879 6161449 6046595 6240913 6384915 6553857 6770932 6859703 6893841 7051150 7174578 7245322
8869 7245322 7449209 7609744 7873120 7974881 7960900 8083874 8237889 8402115 8456836 8637512
8859 8637512 8862984 9047319 9224906 9314722 9450578 9732782 9882645 10092952 10205353 10458396
8849 10458396 10747970 10919769 11061601 11168845 11297377 11511394 11733644 11838817 11997602
$$ packed form
8924C807067N0421k7357r0342Q0554R6983N4653J429l9297J7290j4034M2389l0013
8912C949743K7259M5693j5793L1774Q5967m2863K12542J41197J351K1788k4548
8901D434110M5307K68171k5338N4093p320r935N1480m6102J94405J89355K5237
8890E173463J485J98388J06239r8047J765J44338J07799K60256M3209J63971N8583
8879F161449j14854J94318J44002J68942K17075Q8771L4138J57309J23428P0744
8869G245322K03887J60535K63376J01761j3981J22974J54015J64226N4721J80676
8859H637512K25472J84335J77587Q9816J35856K82204J49863K10307J12401K53043
8849A0458396K89574J71799J41832J07244J28532K14017K22250J05173J58785
$$ plain form
8840 11997602 12227548 12395213 12635764 12840318 13145380 13354674 13496860 13714263 13868294
8831 13868294 14043213 14209233 14339577 14595975 14765189 14972312 15174190 15335465 15535273
8822 15535273 15681288 15851268 15976179 16219295 16403339 16427252 16416052 16656308 16848574 16880237
8812 16880237 17017480 17029385 17148144 17326387 17296647 17356195 17602554 17674166 17580358 17614546
8802 17614546 17603085 17585623 17594081 17694455 17854237 18031980 18083320 17981874 18017759 18026085 17983273
8791 17983273 18089553 18210101 18271642 18272509 18226114 18285677 18224576 18345584 18290093 18278918 18297468
8780 18297468 18189745 18228522 18048823 17980097 17970673 17909408 17582999 17472827 17466429 17334364 17034481
8769 17034481 16938648 16742172 16381174 16154052 15982954 15791364 15596799 15355270 15093897 14850705
$$ packed form
8840A1997602K29946J67665K40551K04554L05062K09294J42186K17403J54031
8831A3868294J74919J66020J30344K56398J69214K07123K01878J61275J99808
8822A5535273J46015J69980J24911K43116J84044K3913j1200K40256J92266L1663
8812A6880237J37243J1905J18759J78243k9740N9548K46359P1612r3808L4188
8802A7614546j1461j7462Q458J00374J59782J77743N1340j01446L5885Q326m2812
8791A7983273J06280J20548O1541Q67m6395N9563o1101J21008n5491j1175J8550
8780A8297468j07723L8777j79699o8726r424o1265l26409j10172o398j32065k99883
8769A7034481r5833j96476l60998k27122j71098j91590j94565k41529k61373k43192
$$ plain form
8759 14850705 14659358 14447525 14097685 13978184 13668700 13374421 13088643 12971135 12815861
8750 12815861 12543803 12336796 12160542 11928363 11746327 11699615 11477424 11312010 11150810 10931653
8740 10931653 10790492 10601188 10381998 10193706 10078711 9851995 9670893 9553168 9393501
8731 9393501 9258596 9181567 9062417 8785880 8605376 8542434 8419820 8368461 8223646 8051723
8721 8051723 7906646 7637615 7406444 7408226 7306722 7197397 7055961 6965901 6913669 6847385
8711 6847385 6782613 6544833 6402016 6318160 6431472 6272027 6146097 6042855 5952416 5868002
8701 5868002 5728554 5696898 5754825 5617142 5504281 5507660 5574228 5539466 5367084 5311683 5227155
8690 5227155 5016248 4934240 4839937 4837320 4818779 4792145 4693761 4646521 4576172 4501213 4470317
$$ packed form
8759A4850705j91347k11833l49840j19501l09484k94279k85778j17508j55274
8750A2815861k72058k07007j76254k32179j82036m6712k22191j65414j61200k19157
8740A0931653j41161j89304k19190j88292j14995k26716j81102j17725j59667
8731I393501j34905p7029j19150k76537j80504o2942j22614n1359j44815j71923
8721H051723j45077k69031k31171J782j01504j09325j41436r0060n2232o6284
8711F847385o4772k37780j42817q3856J13312j59445j25930j03242r0439q4414
8701E868002j39448l1656N7927j37683j12861L379O6568l4762j72382n5401q4528
8690E227155k10907q2008r4303k617j8541k6634r8384m7240p0349p4959l0896
$$ plain form
8679 4470317 4419240 4198717 4105629 4169201 4064067 3945728 3877052 3847813 3860905 3877992 3767887
8668 3767887 3732274 3660014 3615744 3497871 3500443 3556475 3454901 3303829 3214193 3231110 3226536
8657 3226536 3210586 3234614 3345815 3242012 3256727 3106244 3170009 3104331 2970933 3030477 3020464
8646 3020464 2976824 2870640 2840477 2895160 2897834 2863401 3016212 2852157 2976981 2914012 2967623
8635 2967623 3017638 3034458 2967804 2958189 3020058 3044612 3173644 3119744 3020122 3037502 2869977
8624 2869977 2901120 2998034 3028151 2969570 2971112 3008729 3174778 3249848 3300713 3288311 3300368
8613 3300368 3298116 3369381 3550489 3654514 3887199 4092299 4182349 4326408 4517000 4535024
8603 4535024 4452083 4354507 4280003 4226144 4198391 4016112 3969424 3948240 3905758 3849760 3623240
$$ packed form
8679D470317n1077k20523r3088O3572j05134j18339o8676k9239J3092J7087j10105
8668C767887l5613p2260m4270j17873K572N6032j01574j51072q9636J6917m574
8657C226536j5950K4028J11201j03803J4715j50483O3765o5678j33398N9544j0013
8646C020464m3640j06184l0163N4683K674l4433J52811j64055J24824o2969N3611
8635B967623N0015J6820o6654r615O1869K4554J29032n3900r9622J7380j67525
8624B869977L1143R6914L0117n8581J542L7617J66049P5070N0865j2402J2057
8613C300368k252P1265J81108J04025K32685K05100R0050J44059J90592J8024
8603D535024q2941r7576p4504n3859k7753j82279m6688k1184m2482n5998k26520
$$ plain form
8592 3623240 3451730 3381978 3314307 3271038 3206870 3128526 2997506 3025956 2787910 2701064 2747976
8581 2747976 2707230 2773361 2710518 2601544 2602740 2670268 2717335 2847497 2810829 2755601 2789037
8570 2789037 2815336 2857311 2864699 2776879 2700873 2644974 2603368 2641023 2572301 2469041 2460016 2521802
8558 2521802 2537339 2448706 2326061 2251795 2274364 2284628 2296871 2260925 2187563 2203233 2111578
8547 2111578 2032389 1983318 1951176 1913340 1972009 1993845 1962233 1875796 1892483 1944939 1904630
8536 1904630 1901241 1929691 1837451 1862638 1896732 1747098 1775582 1654554 1665932 1914529 1870222
8525 1870222 1843460 1777723 1769330 1843019 1893068 1778353 1808334 1806795 1789729 1796619 1681254 1692560
8513 1692560 1837036 1755629 1757431 1783623 1869367 1945930 1838135 1775971 1779631 1841545 1926312
$$ packed form
8592C623240j71510o9752o7671m3269o4168p8344j31020K8450k38046q6846M6912
8581B747976m0746O6131o2843j08974J196O7528M7067J30162l6668n5228L3436
8570B789037K6299M1975P388q7820p6006n5899m1606L7655o8722j03260r025O1786
8558B521802J5537q8633j22645p4266K2569J0264J2243l5946p3362J5670r1655
8547B111578p9189m9071l2142l7836N8669K1836l1612q6437J6687N2456m0309
8536A904630l389K8450r2240K5187L4094j49634K8484j21028J1378K48597m4307
8525A870222k6762o5737q393P3689N0049j14715K9981j539j7066O890j15365J1306
8513A692560J44476q1407J802K6192Q5744P6563j07795o2164L660O1914Q4767
$$ plain form
8502 1926312 1939478 1947564 1904454 1884675 1936573 1836277 1858589 1894239 1878656 1886734 1973063 2038764
8490 2038764 1983121 1912421 2006995 1966957 1938695 1988804 1948909 1895035 1874770 1914671 2106581
8479 2106581 2004337 2030086 2006013 1939117 1995337 2053423 2056199 2037351 2085703 2029428 2060623
8468 2060623 1930848 1896814 1881819 1824041 1871550 1913289 1945546 1975814 1929554 1954232 1937984
8457 1937984 1959445 2032312 1911620 1965782 1980314 1863621 1854450 1914656 1900597 1922980 1828339
8446 1828339 1889449 1863111 1949505 1970838 1911756 1989093 1878451 2017683 1950862 1972063 2071246
8435 2071246 1971514 2018467 2001857 2016951 1975425 2001666 1966223 2086037 2046032 2051960 1993063
8424 1993063 1991272 2045571 1908435 1979344 1930679 1930877 2014597 1968829 2059919 2017849 2001450 2095495
$$ packed form
8502A926312J3166Q086m3110j9779N1898j00296K2312L5650j5583Q078Q6329O5701
8490B038764n5643p0700R4574m0038k8262N0109l9895n3874k0265L9901J91910
8479B106581j02244K5749k4073o6896N6220N8086K776j8848M8352n6275L1195
8468B060623j29775l4034j4995n7778M7509M1739L2257L0268m6260K4678j6248
8457A937984K1461P2867j20692N4162J4532j16693r171O0206j4059K2383r4641
8446A828339O1110k6338Q6394K1333n9082P7337j10642J39232o6821K1201R9183
8435B071246r9732M6953j6610J5094m1526K6241l5443J19814m0005N928n8897
8424A993063j791N4299j37136P0909m8665J98Q3720m5768R1090m2070j6399R4045
$$ plain form
8412 2095495 2173386 2134252 2009237 1970068 1975869 2035327 1980130 2053935 1937974 1935616 1932861 1989412
8400 1989412 2010911 2106881 2108821 2107412 2010121 1974113 2045266 2161873 2155035 2088518 2044983 2181911
8388 2181911 2181311 2056495 2180732 2255362 2091726 2017884 2050982 2045220 2095141 2077364 2159036
8377 2159036 2096569 2116779 2046274 2067319 2051152 2027388 2137271 2239795 2138188 2140799 2116003
8366 2116003 2211410 2218179 2221254 2184728 2190488 2190857 2200463 2314056 2209639 2163211 2165528 2150655
8354 2150655 2137766 2163362 2144394 2076691 2107609 2136831 2025353 2166471 2200436 2257982 2149753
8343 2149753 2114084 2068021 2026325 2114939 2013791 2029255 2108904 2200836 2193822 2135024 2295422
8332 2295422 2159508 2194320 2287333 2238997 2250269 2382079 2343498 2232443 2312027 2265938 2272507
$$ packed form
8412B095495P7891l9134j25015l9169N801N9458n5197P3805j15961k358k755N6551
8400A989412K1499R5970J940j409r7291l6008P1153J16607o838o6517m3535J36928
8388B181911o00j24816J24237P4630j63636p3842L3098n762M9921j7777Q1672
8377B159036o2467K0210p0505K1045j6167k3764J09883J02524j01607K611k4796
8366B116003R5407O769L075l6526N760L69R606J13593j04417m6428K317j4873
8354B150655j2889K5596j8968o7703L0918K9222j11478J41118L3965N7546j08229
8343B149753l5669m6063m1696Q8614j01148J5464P9649R1932p014n8798J60398
8332B295422j35914L4812R3013m8336J1272J31810l8581j11055P9584m6089O569
$$ plain form
8321 2272507 2329092 2130384 2193317 2173939 2129808 2151457 2135232 2130238 2040519 2023279 2086955
8310 2086955 2168172 2180932 2135803 2092256 2121747 2057687 2093271 1993193 2045686 2073228 2107782
8299 2107782 2191840 2211236 2060368 2040859 1963277 1813795 1954623 1993511 1928688 2015797 1906169
8288 1906169 1842532 1943841 2080091 2009057 2024341 2062377 2064824 2070507 2073378 1807956 1648696
8277 1648696 1787588 1864480 1902280 1958673 1962666 1820712 1893678 1969716 1884765 1872396 1885770
8266 1885770 1933010 1936093 1866380 1763735 1923483 1914886 1885319 2045553 2028663 1994404 1846995
8255 1846995 1732508 1634379 1562144 1564002 1663926 1823829 1915728 1847775 1849088 1856719 1873558 1818641
8243 1818641 1814897 1772646 1854016 1781885 1831917 1778498 1625204 1593309 1640684 1714042 1838553
$$ packed form
8321B272507N6585j98708O2933j9378m4131K1649j6225m994q9719j7240O3676
8310B086955Q1217J2760m5129m3547K9491o4060L5584j00078N2493K7542L4554
8299B107782Q4058J9396j50868j9509p7582j49482J40828L8888o4823Q7109j09628
8288A906169o3637J01309J36250p1034J5284L8036K447N683K871k65422j59260
8277A648696J38892P6892L7800N6393L993j41954P2966P6038q4951j2369J3374
8266A885770M7240L083o9713j02645J59748q597k9567J60234j6890l4259j47409
8255A846995j14487r8129p2235J858R9924J59903R1899o7953J313P631J6839n4917
8243A818641l744m2251Q1370p2131N0032n3419j53294l1895M7375P3358J24511
$$ plain form
8232 1838553 1848100 1756706 1767635 1749473 1800316 1841891 1755463 1802440 1707715 1596022 1719422
8221 1719422 1719557 1668907 1695301 1790778 1701498 1582426 1715156 1755473 1656323 1548969 1508710
8210 1508710 1536162 1422623 1355827 1333249 1403009 1327867 1394822 1450209 1480742 1576575 1559422
8199 1559422 1504124 1529902 1507003 1519844 1364948 1384422 1360959 1818216 2010835 1700397 1592784
8188 1592784 1514912 1541209 1556912 1619282 1637639 1659869 1603518 1509575 1403045 1268647 1298840
8177 1298840 1468364 1389842 1323751 1275458 1327654 1221830 1175195 1193971 1251906 1218004 1314223
8166 1314223 1365840 1250768 1295829 1358685 1317385 1404134 1342356 1344968 1317065 1320324 1326969 1244224
8154 1244224 1248907 1096071 1234478 1292659 1252347 1261190 1108266 1112103 1277614 1233360 1141560
$$ packed form
8232A838553R547r1394J0929j8162N0843M1575q6428M6977r4725j11693J23400
8221A719422J35n0650K6394R5477q9280j19072J32730M0317r9150j07354m0259
8210A508710K7452j13539o6796k2578O9760p5142O6955N5387L0533R5833j7153
8199A559422n5298K5778k2899J2841j54896J9474k3463M57257J92619l10438j07613
8188A592784p7872K6297J5703O2370J8357K2230n6351r3943j06530j34398L0193
8177A298840J69524p8522o6091m8293N2196j05824m6635J8776N7935l3902R6219
8166A314223N1617j15072M5061O2856m1300Q6749o1778K612k7903L259O645q2745
8154A244224M683j52836J38407N8181m0312Q843j52924L837J65511m4254r1800
$$ plain form
8143 1141560 1165523 1081376 1054208 1081508 1070626 1038369 1078044 1137568 1051043 1039864 1106689
8132 1106689 1084198 1132960 1182789 1163365 1145605 1052447 1039310 1056366 948358 896321 1005236
8121 1005236 1014155 1023530 1053547 1008754 1037186 1108975 1069010 957213 1010152 1057751 1106388 1237422
8109 1237422 1094067 992316 968905 1006192 979959 1063459 1055056 1019341 915245 949394 1024450
8098 1024450 917962 911993 858816 893386 856003 675287 745515 804121 808255 914287 892667
8087 892667 855079 754710 758196 769800 961723 1003569 817033 726306 756332 737821 804208
8076 804208 743752 785159 751283 673948 648376 686497 784822 674099 647252 705162 690199
8065 690199 690319 712370 758229 732000 616650 729604 785045 766041 774700 822467 646953 604981
$$ packed form
8143A141560K3963q4147k7168K7300j0882l2257L9675N9524q6525j1179O6825
8132A106689k2491M8762M9829j9424j7760r3158j3137J7056j08008n2037J08915
8121A005236Q919R375L0017m4793K8432P1789l9965j11797N2939M7599M8637J31034
8109A237422j43355j01751k3411L7287k6233Q3500q403l5715j04096L4149P5056
8098A024450j06488n969n3177L4570l7383j80716P0228N8606M134J06032k1620
8087H92667l7588j00369L486J1604J91923M1846j86536r0727L0026j8511O6387
8076H04208o0456M1407l3876p7335k5572L8121R8325j10723k6847N7910j4963
8065F90199J20K2051M5859k6229j15350J12954N5441j9004Q659M7767j75514m1972
$$ plain form
8053 604981 691880 841825 831167 849820 769574 536815 487191 449767 586587 640079 577180
8042 577180 588376 624867 675950 718349 738330 627733 629512 575859 566651 571944 548644 667810
8030 667810 777815 759058 677737 616850 550891 555834 576497 568189 582152 408676 490064 584849
8018 584849 535252 572982 567145 543442 550044 643880 543677 655477 579268 394120 503050
8007 503050 588021 671752 668675 601279 470881 471478 498027 350848 452579 507141 540917 571808
7995 571808 563498 440837 406700 336093 337422 541186 521027 391383 374951 490709 567287
7984 567287 499097 542040 493403 484281 562691 444441 344904 393989 458269 521883 481663 486726
7972 486726 512596 542749 460539 361653 398747 407946 287558 320069 562864 603055 535075
$$ packed form
8053F04981Q6899J49945j0658J8653q0246k32759m9624l7424J36820N3492o2899
8042E77180J1196L6491N1083M2399J9981j10597J779n3653r208N293k3300J19166
8030F67810J10005j8757q1321o0887o5959M943K0663q308J3963j73476Q1388R4785
8018E84849m9597L7730n837k3703O602R3836j00203J11800p6209j85148J08930
8007E03050Q4971Q3731l077o7396j30398N97K6549j47179J01731N4562L3776L0891
7995E71808q310j22661l4137p0607J329K03764k0159j29644j6432J15758P6578
7984E67287o8190M2943m8637r122P8410j18250r9537M9085O4280O3614m0220N063
7972D86726K5870L0153q2210r8886L7094R199j20388L2511K42795M0191o7980
$$ plain form
7961 535075 457531 435806 392384 436639 387552 344707 355959 261284 271730 289334 418914
7950 418914 446692 486278 433029 468178 460187 404592 463084 502819 509698 401990 307441 382429
7938 382429 390396 406631 526508 531163 350562 322518 273004 204462 396073 356907 290387
7927 290387 228330 402674 425339 392902 290006 262171 270502 382801 320428 428349 446936
7916 446936 469423 385862 359482 439135 364260 354183 395544 370566 334455 322744 328865 394496
7904 394496 499795 473858 273104 283145 273125 422488 454486 404578 379658 474570 445960
7893 445960 268187 245474 264487 357545 374024 394096 356043 393475 512749 404114 371728
7882 371728 337540 378155 380691 322078 313855 465453 374668 289586 368505 398189 428945 347578
$$ packed form
7961E35075p7544k1725m3422M4255m9087m2845J1252r4675J0446J7604J29580
7950D18914K7778L9586n3249L5149p991n5595N8492L9735O879j07708r4549P4988
7938C82429P967J6235J19877M655j80601k8044m9514o8542J91611l9166o6520
7927B90387o2057J74344K2665l2437j02896k7835Q331J12299o2373J07921J8587
7916D46936K2487q3561k6380P9653p4875j0077M1361k4978l6111j1711O121O5631
7904C94496J05299k5937k00754J0041j0020J49363L1998m9908k4920R4912k8610
7893D45960j77773k2713J9013R3058J6479K0072l8053L7432J19274j08635l2386
7882C71728l4188M0615K536n8613q223J51598r0785q5082P8919K9684L0756q1367
$$ plain form
7870 347578 328154 403944 462751 411253 460050 472536 369516 423306 448968 497352 685290
7859 685290 564147 478655 379496 391982 358487 216295 235485 309032 335306 320513 222425
7848 222425 225837 281068 229711 259714 314268 370687 245429 273636 180003 256413 169137 170749
7836 170749 146320 200515 354739 158093 215910 216310 185580 267326 247105 346181 371727 368093
7824 368093 409954 335872 215059 297504 248163 221198 214030 247734 365494 317204 305955
7813 305955 336099 183148 159632 255490 141700 169503 102045 100141 48544 182660 136146
7802 136146 98342 -314374 -270118 293738 168328 233872 160425 99123 172330 175444 289382
7791 289382 462247 255607 268934 277063 260233 239636 221929 178302 102828 206901 209373
$$ packed form
7870C47578j9424P5790N8807n1498M8797J2486j03020N3790K5662M8384J87938
7859F85290j21143q5492r9159J2486l3495j42192J9190P3547K6274j4793r8088
7848B22425L412N5231n1357L0003N4554N6419j25258K8207r3633P6410q7276J612
7836A70749k4429N4195J54224j96646N7817M00l0730Q1746k0221R9076K5546l634
7824C68093M1861p4082j20813Q2445m9341k6965p168L3704J17760m8290j1249
7813C05955L0144j52951k3516R5858j13790K7803o7458j904n1597J34116m6514
7802A36146l7804m12716M4256N63856j25410O5544p3447o1302P3207L114J13938
7791B89382J72865k06640J3327Q129j6830k0597j7707m3627p5474J04073K472
$$ plain form
7780 209373 238676 201030 262477 94726 25862 74186 154224 256533 212731 134517 271175
7769 271175 230204 220990 292131 160559 227713 287885 295371 201008 73282 147140 221044 265014
7757 265014 105493 47729 161357 130546 111595 69652 88965 132302 98787 185942 102828
7746 102828 87402 214448 254268 193742 305285 126352 -9383 70791 -27272 -44061 31442
7735 31442 53669 -62257 -57187 -71199 32637 -53135 13223 57441 11459 9519 151027 111525
7723 111525 66495 83604 -17998 67027 11420 969 20041 -5685 19797 -11920 28692
7712 28692 101354 29949 47336 133385 182167 197470 264018 97911 112807 165790 197061 242492
7700 242492 215271 171231 148979 273868 190458 178286 82104 28878 289604 263902 268861
$$ packed form
7780B09373K9303l7646O1447j67751o8864M8324Q0038J02309m3802p8214J36658
7769B71175m0971r214P1141j31572O7154O0172P486r4363j27726P3858P3904M3970
7757B65014j59521n7764J13628l0811j8951m1943J9313M3337l3515Q7155q3114
7746A02828j5426J27046L9820o0526J11543j78933j35735Q0174r8063j6789P5503
7735C1442K2227j15926N070j4012J03836q5772O6358M4218m5982j940J41508l9502
7723A11525m5030J7109j01602Q5025n5607j0451J9072k5726K5482l1717M0612
7712B8692P2662p1405J7387Q6049M8782J5303O6548j66107J4896N2983L1271M5431
7700B42492k7221m4040k2252J24889q3410j2172r6182n3226K60726k5702M959
$$ plain form
7689 268861 282478 302139 397732 473519 456597 553518 588790 425954 429971 417677 446521 352410
7677 352410 244474 260287 209389 239938 158411 101706 213647 172794 192060 79875 -27531
7666 -27531 166524 230491 289160 210504 127641 130427 189650 143718 107200 144386 130834 211805
7654 211805 340921 281837 142530 277043 284560 202863 154349 198582 229462 359713 428745
7643 428745 426169 420589 392678 290077 202908 224848 171156 135963 100906 107104 109509 40154
7631 40154 151378 118338 48168 39081 96008 -7050 108946 9053 -45368 -39473 30153 -110467
7619 -110467 -30114 8425 -16963 -56658 -139140 -63626 -23526 -72844 -137551 -64057 -17924 -60785
7607 -60785 -156929 -161012 -67566 -29520 -17670 38716 -125519 -84256 -168838 -167046 -174481 -132071
$$ packed form
7689B68861J3617J9661R5593P5787j6922R6921L5272j62836M017j2294K8844r4111
7677C52410j07936J5813n0898L0549q1527n6705J11941m0853J9266j12185j07406
7666b7531J94055O3967N8669p8656q2863K786N9223m5932l6518L7186j3552Q0971
7654B11805J29116n9084j39307J34513P517q1697m8514M4233L0880J30251O9032
7643D28745k576n580k7911j02601q7169K1940n3692l5193l5057O198K405o9355
7631D0154J11224l3040p0170r087N6927j03058J15996r9893n4421N895O9626j40620
7619a10467Q0353L8539k5388l9695q2482P5514M0100m9318o4707P3494M6133m2861
7607f0785r6144m083R3446L8046J1850N6386j64235M1263q4582J792p435M2410
$$ plain form
7595 -132071 -192008 -89659 21490 60154 10714 -106380 -101766 -59604 -173646 -122067 -36170
7584 -36170 -102467 -75774 -62771 -27599 1949 -98116 -108040 46814 70044 -29998 -155394
7573 -155394 -402648 -281111 -105894 -106007 -71560 -64098 -30998 -145350 -156348 -211582 -163079
7562 -163079 -15825 -58195 21933 -2749 87475 -8871 7298 -3858 -32660 -60044 -106735
7551 -106735 -3674 -107306 -145161 -194951 -205840 -143414 -151630 -116595 -143690 -106834 -78258
7540 -78258 -29355 31456 78605 48969 58233 157 40044 141266 225248 225460 39065 53934
7528 53934 154382 180794 130174 45803 70030 74204 -98080 -14742 24412 -32613 -27379 -6939
7516 -6939 -109274 -31365 -130002 -226692 -140932 -225645 -144111 -174248 -275053 -138064 -103588
$$ packed form
7595a32071n9937J02349J11149L8664m9440j17094M614M2162j14042N1579Q5897
7584c6170o6297K6693J3003L5172K9548j00065r924J54854K3230j00042j25396
7573a55394k47254J21537J75217j13L4447P462L3100j14352j0998n5234M8503
7562a63079J47254m2370Q0128k4682R0224r6346J6169j1156k8802k7384m6691
7551a06735J03061j03632l7855m9790j0889O2426q216L5035k7095L6856K8576
7540g8258M8903O0811M7149k9636R264n8076L9887J01222Q3982K12j86395J4869
7528E3934J00448K6412n0620q4371K4227M174j72284Q3338L9154n7025N234K0440
7516f939j02335P7909r8637r6690Q5760q4713Q1534l0137j00805J36989L4476
$$ plain form
7505 -103588 -33470 -138762 -158008 -156033 -211623 -261529 -267404 -279228 -217865 -190809 -220989 -172866
7493 -172866 -74055 -49228 -77497 -129693 -159354 -105407 -125027 -116148 -49990 -119851 -149018 -93646
7481 -93646 -180283 -96335 -194186 -317436 -302605 -280750 -280124 -224282 -128778 -151018 -123516 -49650
7469 -49650 -83560 -66175 -86138 -332765 -311308 -244119 -213848 -262284 -291305 -35790 -107747
7458 -107747 -199946 -250106 -174847 -67967 -105783 -116505 -80755 -156228 -130516 -124124 -64543 -98065
7446 -98065 -194292 -212455 -163911 -51983 -306601 -303116 -285362 -289748 -120214 7247 -102953
7435 -102953 -325088 -298355 -169148 -249123 -275762 -251638 -292735 -239457 -206174 -184499 -239636
7424 -239636 -328797 -258207 -102339 -209285 -301690 -168449 -145172 -40540 -56592 -93740 -183075
$$ packed form
7505a03588P0118j05292j9246J975n5590m9906n875j1824O1363K7056l0180M8123
7493a72866R8811K4827k8269n2196k9661N3947j9620Q879O6158o9861k9167N5372
7481i3646q6637Q3948r7851j23250J4831K1855O26N5842R5504k2240K7502P3866
7469d9650l3910J7385j9963k46627K1457O7189L0271m8436k9021K55515p1957
7458a07747r2199n0160P5259J06880l7816j0722L5750p5473K5712O392N9581l3522
7446i8065r6227j8163M8544J11928k54618L485J7754m386J69534J27461j10200
7435a02953k22135K6733J29207p9975k6639K4124m1097N3278L3283K1675n5137
7424b39636q9161P0590J55868j06946r2405J33241K3277J04632j6052l7148q9335
$$ plain form
7413 -183075 -226840 -223150 -206731 -162278 -228609 -300625 -275367 -266162 -222147 -266153 -154432 -132224
7401 -132224 -7623 33647 -56675 -48555 -73809 -157129 -268887 -141573 -226861 -235840 -219095
7390 -219095 -115446 3718 8715 -60979 -99176 -151278 -133921 -212544 -213366 -148894 -142484 -125171
7378 -125171 -193127 -234715 -200868 -178089 -258043 -305771 -334610 -291285 -234955 -286129 -274937 -389499
7366 -389499 -385692 -406342 -273019 -106830 -56740 -110463 -200134 -127982 -267006 -298580 -243970
7355 -243970 -153011 -194575 -264271 -192604 -147970 -137212 -61040 -168564 -442422 -329269 -199830
7344 -199830 -296565 -229597 -383097 -338804 -314576 -403973 -321230 -185107 -103325 -107695 -50349
7333 -50349 -142325 -242797 -219110 -94354 -276801 -323082 -221078 -157756 -212525 -68991 -84632
$$ packed form
7413a83075m3765L690J6419M4453o6331p2016K5258R205M4015m4006J11721K2208
7401a32224J24601M1270r0322Q120k5254q3320j11758J27314q5288q979J6745
7390b19095J03649J19164M997o9694l8197n2102J7357p8623q22O4472O410J7313
7378a25171o7956m1588L3847K2779p9954m7728k8839M3325N6330n1174J1192j14562
7366c89499L807k0650J33323J66189N0090n3723q9671P2152j39024l1574N4610
7355b43970R0959m1564o9696P1667M4634J0758P6172j07524k73858J13153J29439
7344a99830r6735O6968j53500M4293K4228q9397Q2743J36123Q1782m370N7346
7333e0349r1976j00472K3687J24756j82447m6281J02004O3322n4769J43534j5641
$$ plain form
7322 -84632 -67518 -107298 -228666 -80859 -77544 -90759 -210887 -316736 -249143 -276004 -175869
7311 -175869 1308 6254 -86957 -152497 -235902 -203656 -250594 -253314 -128939 -186859 -72451
7300 -72451 -10963 -138729 -210904 -152670 -93516 -160279 -180297 -70110 -69983 -201319 -258404 -312285
7288 -312285 -242447 -120411 -184454 -235481 -203243 -155704 -129301 -195404 -169380 -31948 -154567
7277 -154567 -285307 -265381 -318698 -270370 -177502 -298201 -193384 -188590 -198638 -154681 -168915
7266 -168915 -273866 -227173 -180003 -263681 -157000 -11782 -126105 -310550 -309515 -236205 -302998
7255 -302998 -338885 -423768 -448961 -350527 -138058 -15632 -120960 -39075 -107316 -217605 -213697
7244 -213697 -231966 -209094 -110596 -126892 -187855 -202203 -264215 -254211 -173532 -106967 -161512 -242825
$$ packed form
7322h4632J7114l9780j21368J47807L315j3215j20128j05849O7593k6861J00135
7311a75869J77177M946r3211o5540q3405L2246m6938k720J24375n7920J14408
7300g2451O1488j27766p2175N8234N9154o6763k0018J10187J27j31336n7085n3881
7288c12285O9838J22036o4043n1027L2238M7539K6403o6103K6024J37432j22619
7277a54567j30740J9926n3317M8328R2868j20699J04817M794j0048M3957j4234
7266a68915j04951M6693M7170q3678J06681J45218j14323j84445J035P3310o6793
7255c02998l5887q4883k5193R8434K12469J22426j05328Q1885o8241j10289L908
7244b13697j8269K2872R8498j6296o0963j4348o2012J0004Q0679O6565n4545q1313
$$ plain form
7232 -242825 -141770 -143901 -194272 -240157 -310156 -207055 -230903 -278058 -286856 -237467 -156701 -102447
7220 -102447 -231710 -194137 -209856 -278148 -196707 -222573 -241120 -184530 -115423 -235759 -275298
7209 -275298 -278430 -251384 -136482 -138000 -292064 -328852 -358538 -258762 -204518 -285483 -211206 -215768
7197 -215768 -303962 -228112 -120363 -188796 -164969 -175694 -218764 -186625 -254465 -202414 -157786
7186 -157786 -308566 -226221 -260172 -181500 -335081 -393713 -312041 -281915 -206596 -268478 -121853
7175 -121853 -230671 -176425 -235748 -304933 -206021 -260706 -346911 -277324 -274823 -294933 -274796 -369203
7163 -369203 -373880 -143701 -165395 -268667 -215748 -115245 -165576 -163885 -195525 -213435 -265197
7152 -265197 -294682 -217487 -201747 -160056 -179438 -81132 -83620 -210103 -260588 -270150 -168878 -196156
$$ packed form
7232b42825J01055k131n0371m5885o9999J03101k3848m7155q798M9389Q0766N4254
7220a02447j29263L7573j5719o8292Q1441k5866j8547N6590O9107j20336l9539
7209b75298l132K7046J14902j518j54064l6788k9686R9776N4244q0965P4277m562
7197b15768q8194P5850J07749o8433K3827j0725m3070L2139o7840N2051M4628
7186a57786j50780Q2345l3951P8672j53581n8632Q1672L0126P5319o1882J46625
7175a21853j08818N4246n9323o9185R8912n4685q6205O9587K501k0110K0137r4407
7163c69203m677K30179k1694j03272N2919J00503n0331J691l1640j7910n1762
7152b65197k9485P7195J5740M1691j9382R8306k488j26483n0485r562J01272k7278
$$ plain form
7140 -196156 -218638 -138944 -195956 -279264 -388142 -347355 -300661 -341716 -241697 -245160 -174834
7129 -174834 -208904 -306685 -154570 -219456 -242516 -188555 -211120 -155491 -235058 -239513 -281495 -437444
7117 -437444 -394601 -269179 -242359 -244772 -267121 -175770 -126371 -181838 -208171 -186728 -190642 -385897
7105 -385897 -395978 -305174 -280171 -268671 -270909 -258447 -260033 -265279 -227645 -276175 -252287 -322061
7093 -322061 -278935 -225307 -156913 -242082 -219513 -252370 -223433 -126364 -170186 -189670 -79117
7082 -79117 -90790 -199809 -207982 -238504 -234603 -238891 -97667 -112906 -265761 -130802 -156694 -326263
7070 -326263 -385980 -319699 -303003 -359507 -304334 -302556 -233562 -200041 -130395 -288072 -269375 -84208
7058 -84208 -54674 -137543 -166628 -234671 -238302 -259163 -257439 -261589 -357056 -316005 -211237 -129591
$$ packed form
7140a96156k2482P9694n7012q3308j08878M0787M6694m1055J00019l463P0326
7129a74834l4070r7781J52115o4886k3060N3961k2565N5629p9567m455m1982j55949
7117d37444M2843J25422K6820k413k2349R1351M9399n5467k6333K1443l914j95255
7105c85897j0081R0804K5003J1500k238J2462j586n246L7634m8530K3888o9774
7093c22061M3126N3628O8394q5169K2569l2857K8937R7069m3822j9484J10553
7082g9117j1673j09019q173l0522L901m288J41224j5239j52855J34959k5892j69569
7070c26263n9717O6281J6696n6504N5173J778O8994L3521O9646j57677J8697J85167
7058h4208K9534q2869k9085o8043l631k0861J724m150r5467M1051J04768Q1646
$$ plain form
7046 -129591 -224029 -325586 -317421 -290419 -255765 -303937 -178159 -108960 -183617 -248430 -249547 -308058
7034 -308058 -302172 -288928 -296001 -374991 -330475 -331281 -290612 -207525 -238180 -268275 -204147 -58041
7022 -58041 -178104 -120806 -101931 -170199 -186351 -181336 -245977 -188481 -102388 -95278 -62448 -97098
7010 -97098 -166894 -216811 -219486 -352608 -336140 -303210 -283841 -304199 -156914 -209053 -339459
6999 -339459 -417064 -559770 -435096 -380555 -247502 -159314 -257763 -229077 -202117 -248194 -272090
6988 -272090 -397579 -316995 -265660 -307143 -281025 -216646 -305759 -388400 -294815 -253337 -165131
6977 -165131 -252861 -296180 -176632 -176362 -33134 -91899 -212766 -338748 -272945 -231581 -342378
6966 -342378 -404443 -255612 -222389 -163808 -207316 -192626 -125759 -153267 -187666 -263041 -368886
$$ packed form
7046a29591r4438j01557Q165K7002L4654m8172J25778O9199p4657o4813j117n8511
7034c08058N886J3244p073p8990M4516q06M0669Q3087l0655l0095O4128J46106
7022e8041j20063N7298J8875o8268j6152N015o4641N7496Q6093P110L2830l4650
7010i7098o9796m9917k675j33122J6468L2930J9369k0358J47285n2139j30406
6999c39459p7605j42706J24674N4541J33053Q8188r8449K8686K6960m6077k3896
6988b72090j25489Q0584N1335m1483K6118O4379q9113q2641R3585M1478Q8206
6977a65131q7730m3319J19548K70J43228n8765j20867j25982O5803M1364j10797
6966c42378o2065J48831L3223N8581m3508J4690O6867k7508l4399p5375j05845
$$ plain form
6955 -368886 -322458 -254773 -280008 -141994 -72836 -108530 -233411 -124009 -205957 -192106 -194685
6944 -194685 -276394 -192613 -195771 -277276 -292546 -237877 -276544 -307975 -295573 -258130 -218908 -197030
6932 -197030 -324483 -254552 -73394 -225175 -276432 -260575 -374602 -140295 -116680 -115182 4314
6921 4314 -107309 -161794 -243943 -319001 -228054 -177011 -141332 -185107 -232230 -162865 -175263 -242360
6909 -242360 -161160 -111823 -279664 -267606 -303137 -369809 -266841 -212463 -142579 -171974 -205677
6898 -205677 -358986 -353217 -248523 -282499 -183084 -245678 -108366 -80145 -116478 -174894 -137549
6887 -137549 -232446 -148997 -236564 -225919 -159358 -170714 -74328 -150918 -125906 -114530 -253350
6876 -253350 -293813 -174183 -158931 -174305 -296802 -302169 -322994 -318572 -328150 -282725 -239909 -285659
$$ packed form
6955c68886M6428O7685k5235J38014O9158l5694j24881J09402q1948J3851k579
6944a94685q1709Q3781l158q1505j5270N4669l8667l1431J2402L7443L9222K1878
6932a97030j27453O9931J81158j51781n1257J5857j14027K34307K3615J498J19496
6921D314j11623n4485q2149p5058R0947N1043L5679m3775m7123O9365j2398o7097
6909b42360Q1200M9337j67841J2058l5531o6672J02968N4378O9884k9395l3703
6898b05677j53309N769J04694l3976R9415o2594J37312K8221l6333n8416L7345
6887a37549r4897Q3449q7567J0645O6561j1356R6386p6590K5012J1376j38820
6876b53350m0463J19630J5252j5374j22497n367k0825M422r578M5425M2816m5750
$$ plain form
6864 -285659 -344721 -333743 -237476 -247449 -239690 -294077 -333387 -321384 -180318 -86447 -122609 -116101
6852 -116101 -17850 -163386 -164678 -179241 -257289 -232033 -228221 -248679 -262098 -293919 -256278 -133876
6840 -133876 -244111 -264022 -310299 -229847 -137095 -197094 -200784 -190038 -206067 -281382 -272629 -274425
6828 -274425 -221710 -239275 -250250 -315283 -307078 -234320 -237793 -238097 -214953 -194675 -225031 -218869 -185176
6815 -185176 -223016 -294465 -126477 -110514 -233763 -218901 -162283 -361197 -255764 -248130 -295274
6804 -295274 -204285 -309781 -275596 -255301 -117378 -928 -128843 -235824 -253179 -187355 -167557
6793 -167557 -106885 -175446 -257684 -286983 -267242 -307577 -154757 -75551 -112202 -10540 -11546
6782 -11546 -148210 -191037 -184481 -279758 -229169 -206101 -249584 -381087 -422973 -488574 -457104 -346773
$$ packed form
6864b85659n9062J0978R6267r973P759n4387l9310J2003J41066R3871l6162O508
6852a16101R8251j45536j292j4563p8048K5256L812k0458j3419l1821L7641J22402
6840a33876j10235j9911m6277Q0452R2752n9999l690J0746j6029p5315Q753j796
6828b74425N2715j7565j0975o5033Q205P2758l473l04K3144K0278l0356O162L3693
6815a85176l7840p1449J67988J5963j23249J4862N6618j98914J05433P634m7144
6804b95274R0989j05496L4185K0295J37923J16450j27915j06981j7355O5824J9798
6793a67557O0672o8561q2238k9299J9741m0335J52820P9206l6651J01662j006
6782a1546j36664m2827O556r5277N0589K3068m3483j31503m1886o5601L1470J10331
$$ plain form
6770 -346773 -348138 -414037 -279025 -250632 -365592 -217844 -206695 -316692 -260078 -271575 -237628
6759 -237628 -132399 -191912 -86375 -61818 -104807 -80953 -82212 -201874 -240258 -270494 -277427
6748 -277427 -277611 -148146 -249197 -327010 -291376 -257092 -311006 -209851 -109896 -31281 -186268
6737 -186268 -259224 -172620 -303838 -251032 -133528 -125293 -169764 -96908 -90836 -145655 -107871 -209885
6725 -209885 -258172 -249833 -321478 -212197 -196962 -175721 -227825 -259907 -227245 -131660 -84670 -83643
6713 -83643 -56061 -77549 -132334 -369401 -480584 -232983 -126636 -193228 -295114 -132444 -50776
6702 -50776 -124458 -199979 -168399 -116645 -139724 -153825 -92172 29665 17786 -85857 -23292
6691 -23292 -8647 -49277 13297 -84904 -233831 -218499 -132922 -83891 -140236 -219966 -183674 -192577
$$ packed form
6770c46773j365o5899J35012K8393j14960J47748J1149j09997N6614j1497L3947
6759b37628J05229n9513J05537K4557m2989K3854j259j19662l8384l0236o933
6748b77427j84J29465j01051p7813L5634L4284n3914J01155R9955P8615j54987
6737a86268p2956Q6604j31218N2806J17504Q235m4471P2856O072n4819L7784j02014
6725b09885m8287Q339p1645J09281J5235K1241n2104l2082L2662R5585M6990J027
6713h3643K7582k1488n4785k37067j11183K47601J06347o6592j01886J62670Q1668
6702e0776p3682p5521L1580N1754k3079j4101O1653J21837j1879j03643O2565
6691b3292J4645m0630O2574r8201j48927J5332Q5577M9031n6345p9730L6292q903
$$ plain form
6679 -192577 -185039 -113801 -193457 -288680 -212697 -55085 -78385 -200895 -248693 -213602 -205430 -113728
6667 -113728 -76667 4099 -111965 -119844 -131231 -222149 -191383 -160543 -135731 -170991 -270944 -153227
6655 -153227 -102633 -202956 -291386 -282207 -309259 -251120 -198375 -280917 -219556 -158185 -304414
6644 -304414 -176133 -172774 -155374 -207549 -245075 -152526 -128079 -8362 12827 -36885 -118639
6633 -118639 -239675 -316118 -296532 -290464 -255268 -178470 -32440 -202316 -258154 -363369 -252926
6622 -252926 -245677 -210312 -147012 -222523 -130996 -130872 -184250 -202647 -264266 -316737 -200997 -84619
6610 -84619 -23626 -48303 -135564 -160209 -170391 -151239 -227761 -179211 -100272 -116742 -119049 -71167
6598 -71167 -143709 -223901 -273041 -152862 -130270 -195783 -221606 -269991 -237166 -271710 -260957 -208624
$$ packed form
6679a92577P538P1238p9656r5223P5983J57612k3300j22510m7798L5091Q172R1702
6667a13728L7061Q0766j16064p879j1387r0918L0766L0840K4812l5260r9953J17717
6655a53227N0594j00323q8430R179k7052N8139N2745q2542O1361O1371j46229
6644c04414J28281L359J7400n2175l7526R2549K4447J19717K1189m9712q1754
6633a18639j21036p6443J9586O068L5196P6798J46030j69876n5838j05215J10443
6622b52926P249L5365O3300p5511R1527J24n3378j8397o1619n2471J15740J16378
6610h4619O0993k4677q7261k4645j0182J9152p6522M8550P8939j6470k307M7882
6598g1167p2542q0192m9140J20179K2592o5513k5823m8385L2825l4544J0753N2333
$$ plain form
6586 -208624 -287539 -362341 -123832 -52406 -155830 -119502 -230880 -218568 -237962 -238869 -210167
6575 -210167 -125018 -223470 -280318 -226438 -165224 -156664 -180045 -138361 -124818 -116601 -227452 -221101
6563 -221101 -135733 -91386 -126173 -239029 -206752 -344893 -311854 -245259 -152557 -136133 -79369
6552 -79369 -155816 -247196 -248395 -252435 -231812 -302772 -226710 -141683 -58371 -84845 45507 49948
6540 49948 -81535 -236482 -283843 -161565 -232047 -255296 -220188 -278941 -325268 -363136 -234515
6529 -234515 -203072 -204973 -128301 -105804 -111728 -127212 -71146 -9001 -38953 -31349 -106106 -27959
6517 -27959 -54080 -176256 -191355 -111645 -124119 -149812 -121682 -116657 -202888 -283607 -144001 -173256
6505 -173256 -122979 -147649 -115300 5770 -24968 -66426 -200076 -91137 -138731 -49355 -33359
$$ packed form
6586b08624p8915p4802K38509P1426j03424L6328j11378J2312j9394r07K8702
6575b10167Q5149r8452n6848N3880O1214Q560k3381M1684J3543Q217j10851O351
6563b21101Q5368M4347l4787j12856L2277j38141L3039O6595R2702J6424N6764
6552g9369p6447r1380j199m040K0623p0960P6062Q5027Q3312k6474J30352M441
6540D9948j31483j54947m7361J22278p0482k3249L5108n8753m6327l7868J28621
6529b34515L1443j901P6672K2497n924j5484N6066O2145k9952P604p4757P8147
6517b7959k6121j22176j5099P9710j2474k5693K8130N025q6231q0719J39606k9255
6505a73256N0277k4670L2349J21070l0738m1458j33650J08939m7594Q9376J5996
$$ plain form
6494 -33359 -46830 -41346 -83993 -253541 -137843 24365 93092 26546 -177444 -221976 -217455
6483 -217455 -269292 -195654 -43961 -27072 -179133 -148516 -142802 -115548 -59167 -61937 -114375 -145172
6471 -145172 -153694 -173752 -112185 -184188 -261517 -188510 -101738 -17315 10109 -45101 -156658 -197382
6459 -197382 -81545 -77417 -20779 -68535 -60119 -32151 -68814 -127329 -5276 -31043 -55423 11439
6447 11439 -9196 -16693 -15140 -23310 4710 -176033 -209249 -162867 -26916 80994 -17578 -177275
6435 -177275 -161026 -135000 -151596 -28038 -63371 -100677 -170535 -90713 -12937 -57365 -52807 -55107
6423 -55107 -19091 -75205 6426 54693 13101 -110477 -59314 12787 -50055 -35872 33308 -2744
6411 -2744 130559 68681 -102123 -28286 -29922 7662 -66852 -167674 -81893 -63525 -37239 50358
$$ packed form
6494c3359j3471N484m2647j69548J15698J62208O8727o6546k03990m4532M521
6483b17455n1837P3638J51693J6889j52061L0617N714K7254N6381k770n2438l0797
6471a45172q522k0058O1567p2003p7329P3007Q6772Q4423K7424n5210j11557m0724
6459a97382J15837M128N6638m7756Q416K7968l6663n8515J22053k5767k4380O6862
6447A1439k0635p497J553q170K8020j80743l3216M6382J35951J07910r8572j59697
6435a77275J6249K6026j6596J23558l5333l7306o9858P9822P7776m4428M558k300
6423e5107L6016n6114Q1631M8267m1592j23578N1163P2101o2842J4183O9180l6052
6411b744J33303o1878j70804P3837j636L7584p4514j00822Q5781J8368K6286Q7597
$$ plain form
6399 50358 139820 128379 -2025 -135353 -22726 -20333 -11428 28868 -53539 -101030 -148988 -30895
6387 -30895 -74417 77476 168052 227388 195778 171978 -18350 -138644 -23064 -59795 -91135
6376 -91135 -83493 -101678 -117495 -42741 -48325 -134879 -85321 3063 11072 93628 23036 154572
6364 154572 193433 161358 66586 -13518 -71640 -15520 72394 51089 -20657 8975 174061
6353 174061 95774 174357 175798 193693 136490 138655 77594 -10825 -34482 14208 105496 156518
6341 156518 139118 138189 36975 95110 119299 32788 125226 337469 387891 318431 241407 202039
6329 202039 238155 159491 248150 193851 46136 118365 180912 277268 214161 73521 190220
6318 190220 163227 118982 95588 138401 159844 196409 244730 178072 118385 129257 234803
$$ packed form
6399E0358Q9462j1441j30404j33328J12627K393Q905M0296q2407m7491m7958J18093
6387c0895m3522J51893R0576N9336l1610k3800j90328j20294J15580l6731l1340
6376i1135P642j8185j5817P4754n584q6554M9558Q8384Q009Q2556p0592J31536
6364A54572L8861l2075r4772q0104n8122N6120Q7914k1305p1746K9632J65086
6353A74061p8287P8583J441J7895n7203K165o1061q8419k3657M8690R1288N1022
6341A56518j7400r29j01214N8135K4189q6511R2438K12243N0422o9460p7024l9368
6329B02039L6116p8664Q8659n4299j47715P2229O2547R6356o3107j40640J16699
6318A90220k6993m4245k3394M2813K1443L6565M8321o6658n9687J0872J05546
$$ plain form
6307 234803 274060 304868 251788 147498 90161 176874 202956 222031 174979 231165 309269
6296 309269 192563 146526 196561 216413 224948 209362 193059 217592 219230 199020 143445 224137
6284 224137 251504 236622 226794 281771 329512 319469 403265 391850 291663 221643 255804 267125
6272 267125 303344 408227 385098 219916 275841 292464 190256 222225 313252 265801 276728
6261 276728 307604 252418 256830 162590 285100 348913 337580 355476 468327 483013 369250
6250 369250 376154 328565 225050 244732 173509 277324 322880 317205 378211 428996 535353
6239 535353 487016 337534 379508 350536 332288 365721 518540 493832 439772 273664 376263
6228 376263 393772 484756 386197 178050 227832 403482 448461 219403 333440 441184 400342
$$ packed form
6307B34803L9257L0808n3080j04290n7337Q6713K6082J9075m7052N6186P8104
6296C09269j16706m6037N0035J9852Q535j5586j6303K4533J638k0210n5575Q0692
6284B24137K7367j4882r828N4977M7741j0043Q3796j1415j00187p0020L4161J1321
6272B67125L6219J04883k3129j65182N5925J6623j02208L1969R1027m7451J0927
6261B76728L0876n5186M412r4240J22510O3813j1333J7896J12851J4686j13763
6250C69250O904m7589j03515J9682p1223J03815M5556n675O1006N0785J06357
6239E35353m8337j49482M1974k8972j8248L3433J52819k4708n4060j66108J02599
6228C76263J7509R0984r8559k08147M9782J75650M4979k29058J14037J07744m0842
$$ plain form
6217 400342 457264 450654 477955 480564 454978 474261 395326 485297 474067 545230 689996 610271
6205 610271 544073 547416 502000 542911 532393 535727 522998 634641 537654 483705 447684 571237
6193 571237 628860 632285 681657 672471 512020 484073 533009 665547 558557 550847 597293 611347
6181 611347 501463 541073 637972 545925 579533 663255 669985 649625 663416 681582 685726 824955
6169 824955 807655 859571 853423 799651 812749 712789 705205 743593 754751 678735 735604 849209
6157 849209 800133 604181 689753 763251 602689 620292 725194 919304 904784 755603 709461
6146 709461 799202 867615 866700 808594 746290 754893 701129 831458 862366 902206 858801 878832
6134 878832 863138 938717 898184 911594 1002172 1048023 1005790 936486 1030522 906217 871217
$$ packed form
6217D00342N6922o610K7301K609k5586J9283p8935Q9971j1230P1163J44766p9725
6205F10271o6198L343m5416M0911j0518L334j2729J11643r6987n3949l6021J23553
6193E71237N7623L425M9372r186j60451k7947M8936J32538j06990p710M6446J4054
6181F11347j09884L9610R6899r2047L3608Q3722O730k0360J3791J8166M144J39229
6169H24955j7300N1916o148n3772J3098r9960p584L8388J1158p6016N6869J13605
6157H49209m9076j95952Q5572P3498j60562J7603J04902J94110j4520j49181m6142
6146G09461Q9741O8413r15n8106o2304Q603n3764J30329L0908L9840m3405K0031
6134H78832j5694P5579m0533J3410R0578M5851m2233o9304R4036j24305l5000
$$ plain form
6123 871217 951223 904041 972860 865408 877914 943500 987679 1007138 996876 1022834 983460
6112 983460 949674 1000424 1089313 1040170 936088 893978 863507 864239 912202 945724 894083 948501
6100 948501 963182 939813 1052071 1088663 983650 1104349 1217728 1104427 1037725 1000746 1037150
6089 1037150 1011450 923887 975088 1064372 908911 902980 1099517 1077455 1095423 1175882 1068431
6078 1068431 1032159 1196302 1182660 1144403 1255314 1278487 1115052 1148008 1247771 1191133 1135142
6067 1135142 1125326 1168701 1201646 1244419 1248922 1244330 1270375 1228140 1228380 1193273 1171724 1212633
6055 1212633 1198768 1196140 1248559 1207748 1309445 1319512 1176526 1209360 1236797 1130854 1155233
6044 1155233 1246037 1263593 1286080 1237225 1229157 1234024 1398141 1459205 1305203 1323257 1257689
$$ packed form
6123H71217Q0006m7182O8819j07452J2506O5586M4179J9459j0262K5958l9374
6112I83460l3786N0750Q8889m9143j04082m2110l0471P32M7963L3522n1641N4418
6100I48501J4681k3369J12258L6592j05013J20699J13379j13301o6702l6979L6404
6089A037150k5700q7563N1201Q9284j55461n931J96537k2062J7968Q0459j07451
6078A068431l6272J64143j3642l8257J10911K3173j63435L2956R9763n6638n5991
6067A135142r816M3375L2945M2773M503m592K6045m2235K40l5107k1549M0909
6055A212633j3865k628N2419m0811J01697J0067j42986L2834K7437j05943K4379
6044A155233R0804J7556K2487m8855q068M867J64117O1064j54002J8054o5568
$$ plain form
6033 1257689 1345953 1318506 1254964 1302732 1317501 1414466 1521039 1448776 1499828 1607066 1511764
6022 1511764 1490835 1618659 1584861 1453645 1563487 1686306 1651404 1502477 1593245 1483345
6012 1483345 1346923 1313433 1391542 1559512 1644167 1538014 1543699 1490265 1393997 1418864 1567393
6001 1567393 1655675 1648585 1683420 1763539 1747669 1754389 1828895 1836344 1805353 1846738 1734437 1733076
5989 1733076 1804352 1703533 1685514 1834798 1782257 1818417 1845390 1729210 1801922 1886782 1955803
5978 1955803 2003091 1906749 1902533 1928408 1901249 1833471 2029147 2080489 2130801 2066761 1996074
5967 1996074 2085583 2258218 2280455 2220946 2290816 2406138 2366421 2316872 2392950 2460149 2503220
5956 2503220 2433772 2484419 2563324 2631910 2666829 2595783 2499800 2583394 2604400 2683650 2698469
$$ packed form
6033A257689Q8264k7447o3542M7768J4769R6965J06573p2263N1052J07238r5302
6022A511764k0929J27824l3798j31216J09842J22819l4902j48927R0768j09900
6012A483345j36422l3490P8109J67970Q4655j06153N685n3434r6268K4867J48529
6001A567393Q8282p090L4835Q0119j5870O720P4506P449l0991M1385j12301j361
5989A733076P1276j00819j8019J49284n2541L6160K6973j16180P2712Q4860O9021
5978A955803M7288r6342m216K5875k7159o7778J95676N1342N0312o4040p0687
5967A996074Q9509J72635K2237n9509O9870J15322l9717m9549P6078O7199M3071
5956B503220o9448N0647P8905O8586L4919p1046r5983Q3594K1006P9250J4819
$$ plain form
5945 2698469 2698752 2624829 2690454 2783044 2905516 2895838 2852909 2919700 2954912 2942026 2965708 3010217
5933 3010217 3070002 3170867 3195720 3036288 3131790 3223514 3335181 3313075 3368709 3339901 3377150
5922 3377150 3415743 3444750 3686012 3751702 3721415 3783636 3914882 4026516 4163540 4088392 4096730
5911 4096730 4028994 4081721 4151670 4137603 4139931 4230927 4304478 4392620 4414101 4292305 4357966
5900 4357966 4562886 4618681 4487391 4550742 4672525 4743630 4754847 4923091 4993960 4988237 5026064
5889 5026064 5012433 4999738 5096397 5147791 5378753 5490361 5528148 5548527 5552967 5664943 5794053
5878 5794053 5870151 6099464 6202903 6167236 6366605 6549335 6627445 6696378 6965528 7279476
5868 7279476 7383111 7494018 7677202 7898875 8130096 8229427 8402680 8533416 8721213 8937556
$$ packed form
5945B698469K83p3923O5625R2590J22472r678m2929O6791L5212j2886K3682M4509
5933C010217N9785J00865K4853j59432R5502R1724J11667k2106N5634k8808L7249
5922C377150L8593K9007K41262O5690l0287O2221J31246J11634J37024p5148Q338
5911D096730o7736N2727O9949j4067K328R0996P3551Q8142K1481j21796O5661
5900D357966K04920N5795j31290O3351J21783P1105J1217J68244P0869n723L7827
5889E026064j3631j2695R6659N1394K30962J11608L7787K0379M440J11976J29110
5878E794053P6098K29313J03439l5667J99369J82730P8110O8933K69150L13948
5868G279476J03635J10907J83184K21673K31221R9331J73253J30736J87797K16343
$$ plain form
5858 8937556 9062301 9315363 9636673 9861860 10213379 10412604 10508695 10805897 11090444 11510068
5848 11510068 11878131 12285133 12558865 12731778 13114375 13628339 14071677 14480004 14973450
5839 14973450 15457905 15935419 16393750 16913604 17396666 18008412 18511089 19167085 19791227
5830 19791227 20616105 21366909 22123662 22890476 23707209 24693264 25438145 26405698 27454617
5821 27454617 28637324 29882815 31093644 32455114 33746810 35198777 36707335 38370065
5813 38370065 40082876 41956200 44080049 46453302 48943755 51668242 54630965 57780202
5805 57780202 61091457 64436347 67743985 71044435 74028102 76551527 78434555 79842371
5797 79842371 81075201 82339833 83923938 85765236 87566635 89704666 92175189 94913235
$$ packed form
5858H937556J24745K53062L21310K25187L51519J99225R6091K97202K84547M19624
5848A1510068L68063M07002K73732J72913L82597N13964M43338M08327M93446
5839A4973450M84455M77514M58331N19854M83062O11746N02677O55996O24142
5830A9791227Q24878P50804P56753P66814Q16733R86055P44881R67553J048919
5821B7454617J182707J245491J210829J361470J291696J451967J508558J662730
5813C8370065J712811J873324K123849K373253K490453K724487K962723L149237
5805E7780202L311255L344890L307638L300450K983667K523425J883028J407816
5797G9842371J232830J264632J584105J841298J801399K138031K470523K738046
$$ plain form
5789 94913235 97731600 100763537 104135301 107828015 111871997 115940349 120495799 125478403
5781 125478403 130595642 136115534 141378047 145815551 148775366 149264199 147624607 144867273
5773 144867273 142188996 139958879 138204514 137263004 136941118 137155868 137881227 138974262 140691310
5764 140691310 142737021 145277052 148295663 151870376 155708423 159905994 164199154 168659913
5756 168659913 173128171 178030519 183615935 189793921 196657898 204528466 213199719 222775598
5748 222775598 233120409 243842751 254570433 264891864 274399286 283048139 291636046
5741 291636046 301407635 313231969 327957576 346060138 367546881 390922602 412721705
5734 412721705 428190595 433321888 428891973 419512535 409793258 401687447 396019388 392437805
$$ packed form
5789I4913235K818365L031937L371764L692714M043982M068352M555450M982604
5781A25478403N117239N519892N262513M437504K959815M88833j639592k757334
5773A44867273k678277k230117j754365r41510l21886K14750P25359J093035J717048
5764A40691310K045711K540031L018611L574713L838047M197571M293160M460759
5756A68659913M468258M902348N585416O177986O863977P870568Q671253R575879
5748B22775598J0344811J0722342J0727682J0321431R507422Q648853Q587907
5741B91636046R771589J1824334J4725607J8102562K1486743K3375721K1799103
5734D12721705J5468890N131293m429915r379438r719277q105811n668059l581583
$$ plain form
5726 392437805 389904773 388070068 387228949 387276234 386454704 381652411 370433798 354628100
5718 354628100 337722890 322232848 309103240 298470378 289703857 281685058 273562993
5711 273562993 264831039 255665184 246893437 239555408 233833086 229608828 226621339 223669794
5703 223669794 219863425 215438788 211347914 208212516 206132811 205357414 205489540 206394806
5695 206394806 207950888 210129147 211795808 211288356 207341973 201770556 196328667 191883319
5687 191883319 188483497 186072284 184875071 184758719 185576028 186547620 186973137 187052989 187206462
5678 187206462 187802477 188891482 190007681 190804773 191428641 192053370 192976157 194357887 196278884
5669 196278884 198675820 201822298 205528359 209905104 215317309 221932499 230024295 239473777
$$ packed form
5726C92437805k533032j834705q41119M7285q21530m802293j1218613j5805698
5718C54628100j6905210j5490042j3129608j0632862q766521q018799q122065
5711B73562993q731954r165855q771747p338029n722322m224258k987489k951545
5703B23669794l806369m424637m090874l135398k079705p75397J32126R05266
5695B06394806J556082K178259J666661n07452l946383n571417n441889m445348
5687A91883319l399822k411213j197213j16352Q17309R71592M25517P9852J53473
5678A87206462N96015J089005J116199P97092O23868O24729R22787J381730J920997
5669A96278884K396936L146478L706061M376745N412205O615190Q091796R449482
$$ plain form
5661 239473777 249934884 260165249 268430556 272770492 271314397 263832662 251696344 236554789
5653 236554789 220477201 205456535 191878562 179876925 169154013 159657602 151161916
5646 151161916 143547655 136633153 130268435 124394587 119006959 113871119 109064721 104606335
5638 104606335 100481315 96474161 92648905 88880106 85326987 82153723 78982410 76086050
5630 76086050 73213485 70745200 68578149 66261179 64019029 61925640 59704394 57678479
5622 57678479 55842800 54215801 52525977 50965672 49445356 48037984 46621346 45277465
5614 45277465 43965254 42842515 41592689 40522347 39451397 38339440 37305579 36231870
5606 36231870 35091965 34098849 33073935 32107548 31221993 30255057 29241580 28183923 27256339
$$ packed form
5661B39473777J0461107J0230365Q265307M339936j456095p481735j2136318j5141555
5653B36554789j6077588j5020666j3577973j2001637j0722912r496411q495686
5646A51161916p614261o914502o364718n873848n387628n135840m806398m458386
5638A04606335m125020m007154l825256l768799l553119l173264l171313k896360
5630G6086050k872565k468285k167051k316970k242150k093389k221246k025915
5622E7678479j835679j626999j689824j560305j520316j407372j416638j343881
5614D5277465j312211j122739j249826j070342j070950j111957j033861j073709
5606C6231870j139905r93116j024914r66387q85555r66936j013477j057657r27584
$$ plain form
5597 27256339 26439895 25656903 24868323 23950401 23180517 22455251 21636750 20976301 20505927
5588 20505927 19902566 19244798 18683509 18238045 17638548 17324541 17011881 16603500 16211830
5579 16211830 15718767 15184408 14889328 14579741 14212408 14032473 13690469 13292850 12929367
5570 12929367 12739313 12405227 12080369 11785572 11474294 11191914 10948608 10807073 10588056
5561 10588056 10329458 10095113 9831549 9709632 9553702 9349307 9099985 8984523 8698612
5552 8698612 8503031 8323646 8192048 7967634 7868620 7849295 7615623 7437046 7241635 7212639
5542 7212639 7291799 7078514 6861465 6792304 6687910 6623539 6566777 6268561 6226653 6139712 6058750
5531 6058750 6091827 6015759 5892154 5820047 5605426 5424843 5331604 5286787 5238020 5100692 5067919
$$ packed form
5597B7256339q16444p82992p88580r17922p69884p25266q18501o60449m70374
5588B0505927o03361o57768n61289m45464n99497l14007l12660m08381l91670
5579A6211830m93063n34359k95080l09587l67333j79935l42004l97619l63483
5570A2929367j90054l34086l24858k94797l11278k82380k43306j41535k19017
5561A0588056k58598k34345k63564j21917j55930k04395k49322j15462k85911
5552H698612j95581j79385j31598k24414r9014j9325k33672j78577j95411k8996
5542G212639P9160k13285k17049o9161j04394o4371n6762k98216m1908q6941q0962
5531F058750L3077p6068j23605p2107k14621j80583r3239m4817m8767j37328l2773
$$ plain form
5520 5067919 4923690 4738729 4810598 4715349 4550523 4582881 4591694 4462824 4377669 4394743 4308174
5509 4308174 4221855 4196559 4086089 4015413 4094766 3999293 3810325 3658963 3612856 3681677 3652822
5498 3652822 3604840 3507769 3375409 3434516 3375659 3223996 3185378 3292539 3259913 3170081 3193563
5487 3193563 3039549 3043407 3035129 2895428 2811403 2768459 2811559 2683333 2692728 2704206 2601944
5476 2601944 2827450 2827000 2662688 2414018 2455150 2584053 2519888 2424210 2411050 2400055 2361581
5465 2361581 2441782 2432059 2334166 2296135 2323706 2210212 2119908 2179575 2159327 2250922 2229586
5454 2229586 2282444 2404617 2253059 2177653 2147631 2030056 2077148 2177377 2030545 1956907
5444 1956907 1911389 2032192 2081072 2032078 1966942 2007514 1850205 1824971 1774703 1845024 1887276
$$ packed form
5520E067919j44229j84961P1869r5249j64826L2358Q813j28870q5155J7074q6569
5509D308174q6319k5296j10470p0676P9353r5473j88968j51362m6107O8821k8855
5498C652822m7982r7071j32360N9107n8857j51663l8618J07161l2626q9832K3482
5487C193563j54014L858q278j39701q4025m2944M3100j28226R395J1478j02262
5476B601944K25506m50j64312k48670M1132J28903o4165r5678j3160j0995l8474
5465B361581Q0201r723r7893l8031K7571j13494r0304N9667k0248R1595k1336
5454B229586N2858J22173j51558p5406l0022j17575M7092J00229j46832p3638
5444A956907m5518J20803M8880m8994o5136M0572j57309k5234n0268P0321M2252
$$ plain form
5433 1887276 1854742 1743164 1888517 1893468 1697098 1705928 1664794 1610296 1644844 1672132 1610556
5422 1610556 1699323 1795811 1738001 1548197 1580232 1713197 1585324 1573045 1511033 1542289 1613266
5411 1613266 1488932 1546487 1505396 1489810 1461907 1533218 1634210 1552041 1483536 1494304 1434504
5400 1434504 1364076 1330207 1380308 1426232 1327033 1321167 1391211 1375182 1310107 1296320 1378377 1348105
5388 1348105 1429290 1418669 1223454 1156272 1161184 1135733 1047787 994659 1144068 1236010 1132096
5377 1132096 1109399 1058530 1030814 1003276 1065001 1123548 1060342 989120 947904 985533 977303 1022366
5365 1022366 983537 971844 954997 950479 1005686 1009003 1003055 1029096 872222 821267 915020 884716
5353 884716 886237 905916 874127 1056595 998124 867194 962012 909352 879676 872449 868085 787455
$$ packed form
5433A887276l2534j11578J45353M951j96370Q830m1134n4498L4548K7288o1576
5422A610556Q8767R6488n7810j89804L2035J32965j27873j2279o2012L1256P0977
5411A613266j24334N7555m1091j5586k7903P1311J00992q2169o8505J0768n9800
5400A434504p0428l3869N0101M5924r9199n866P0044j6029o5075j3787Q2057l0272
5388A348105Q1185j0621j95215o7182M912k5451q7946n3128J49409R1942j03914
5377A132096k2697n0869k7716k7538O1725N8547o3206p1222m1216L7629q230M5063
5365A022366l8829j1693j6847m518N5207L317n948K6041j56874n0955R3753l0304
5353H84716J521J9679l1789J82468n8471j30930R4818n2660k9676p227m364q0630
$$ plain form
5341 787455 770648 703440 879569 794250 800097 764636 827284 863417 820313 899417 884732 806467
5329 806467 718476 674044 723110 800959 761455 794324 838639 745018 789850 795436 787875 841166
5317 841166 750043 850325 872655 780285 736461 725256 682662 632057 707122 639014 534019
5306 534019 556475 531427 676842 733341 658339 606668 603306 595722 673864 696381 728750 551160
5294 551160 550651 603796 646826 600251 481511 554820 705650 694663 574410 625482 535560
5283 535560 503379 497881 482194 609631 553953 595650 565488 554044 523675 514379 401281 510818
5271 510818 607014 603247 503471 510241 561785 529389 487319 546111 488969 450148 471817 467757
5259 467757 474967 520373 605960 546608 595386 485639 455163 410479 313668 429878 582488
$$ packed form
5341G87455j6807o7208J76129q5319N847l5461O2648L6133m3104P9104j4685p8265
5329H06467q7991m4432M9066P7849l9504L2869M4315r3621M4832N586p561N3291
5317H41166r1123J00282K2330r2370m3824j1205m2594n0605P5065o8108j04995
5306E34019K2456k5048J45415N6499p5002n1671l362p584P8142K2517L2369j77590
5294E51160n09N3145M3030m6575j18740P3309J50830j0987j20253N1072q9922
5283E35560l2181n498j5687J27437n5678M1697l0162j1444l0369r296j13098J09537
5271E10818R6196l767r9776O770N1544l2396m2070N8792n7142l8821K1669m060
5259D67757P210M5406Q5587n9352M8778j09747l0476m4684r6811J16210J52610
$$ plain form
5248 582488 470637 415299 505648 552425 474966 542366 413165 202107 270880 382372 442192
5237 442192 456596 490702 376855 461619 409195 399861 525686 350434 302722 534777 399259
5226 399259 293707 437002 429717 504903 501101 483408 297465 331946 522243 546571 421531
5215 421531 398293 373416 197555 293238 366296 320297 384179 454381 406521 284148 330713
5204 330713 272560 204519 137709 319265 387873 334159 307863 278305 253350 267396 338771
5193 338771 340992 263733 331371 459276 443987 391664 425899 295159 247777 275370 241817
5182 241817 371559 475074 324842 285937 207213 215342 238173 296819 180809 53460 67757
5171 67757 220605 336792 310368 308686 370913 400718 404818 298340 220108 354871 301356
$$ packed form
5248E82488j11851n5338R0349M6777p7459O7400j29201k11058O8773J11492N9820
5237D42192J4404L4106j13847Q4764n2424r334J25825j75252m7712K32055j35518
5226C99259j05552J43295p285P5186l802j7693j85943L4481J90297K4328j25040
5215D21531k3238k4877j75861R5683P3058m5999O3882P0202m7860j22373M6565
5204C30713n8153o8041o6810J81556O8608n3714k6296k9558k4955J4046P1375
5193C38771K221p7259O7638J27905j5289n2323L4235j30740m7382K7593l3553
5182B41817J29742J03515j50232l8905p8724Q129K2831N8646j16010j27349J4297
5171F7757J52848J16187k6424j682O2227K9805M100j06478p8232J34763n3515
$$ plain form
5160 301356 203397 172138 191236 171602 232487 202278 228094 186716 176600 156329 225011 285087
5148 285087 254995 216425 110265 152725 139349 140852 214846 196720 232850 178255 137655 85292
5136 85292 95569 67500 151656 325410 254999 63437 -48791 615 155436 238002 152158
5125 152158 174524 122534 50523 76439 134488 135429 203090 252628 172837 135307 254619 274802
5113 274802 183391 168283 196541 161370 200431 136897 88052 88010 112133 253603 307622 233032
5101 233032 280971 275855 232380 272903 241033 248164 179764 183184 164355 217524 273028 251812
5089 251812 126160 115245 84438 31766 112518 54630 103017 143090 145337 125570 -13381
5078 -13381 81348 217659 203870 -3113 -35751 -101377 -40335 18264 147404 121436 74926
$$ packed form
5160C01356r7959l1259J9098j9634O0885l0209K5816m1378j0116k0271O8682O0076
5148B85087l0092l8570j06160M2460j3376J503P3994j8126L6130n4595m0600n2363
5136H5292J0277k8069Q4156J73754p0411j91562j12228M9406J54821Q2566q5844
5125A52158K2366n1990p2011K5916N8049R41O7661M9538p9791l7530J19312K0183
5113B74802r1411j5108K8258l5171L9061o3534m8845m2K4123J41470N4019p4590
5101B33032M7939n116m3475M0523l1870P131o8400L420j8829N3169N5504k1216
5089B51812j25652j0915l0807n2672Q0752n7888M8387M0073K247j9767j38951
5078a3381R4729J36311j3789k06983l2638o5626O1042N8599J29140k5968m6510
$$ plain form
5067 74926 78147 147072 138516 194872 152535 218169 171037 138339 74925 118701 51349 129037
5055 129037 264256 317361 184459 79350 119233 153217 193301 71927 91827 -14041 44448
5044 44448 33580 24815 90608 131046 136275 67313 -17890 98269 147397 54026 29192 69074
5032 69074 125295 139295 163670 167703 176978 38308 19034 137841 191370 216177 137140 230815
5020 230815 144996 46402 67747 228896 115249 214190 175695 14635 -38612 106738 53120
5009 53120 -24991 63308 76752 149205 219171 166292 28806 -24215 93102 144890 126955
4998 126955 43112 54378 144093 121020 80953 28108 -86556 51011 48746 -83347 116697
4987 116697 99834 33386 -41079 -8961 61301 -20359 27061 91642 157468 115620 71853 41302
$$ packed form
5067G4926L221O8925q556N6356m2337O5634m7132l2698o3414M3776o7352P7688
5055A29037J35219N3105j32902j05109L9883L3984M0084j21374J9900j05868N8489
5044D4448j0868q765O5793M0438N229o8962q5203J16159M9128r3371k4834L9882
5032F9074N6221J4000K4375M033R275j38670j9274J18807N3529K4807p9037R3675
5020B30815q5819r8594K1345J61149j13647R8941l8495j61060n3247J45350n3618
5009E3120p8111Q8299J3444P2453O9966n2879j37486n3021J17317N1788j7935
4998A26955q3843J1266Q9715k3073m0067n2845j14664J37567k265j32093K00044
4987A16697j6863o6448p4465L2118P0262q1660M7420O4581O5826m1848m3767l0551
$$ plain form
4975 41302 23790 -35728 -35181 50903 120555 19278 2788 45939 92833 111000 186354 232053
4963 232053 91382 103056 57176 52982 114295 252236 241315 95244 28171 29631 84936
4952 84936 59193 -6663 96516 69118 -8655 -26247 7662 95388 17173 155115 234701
4941 234701 99905 133451 180653 265853 140361 32060 38177 55779 106421 211641 351156
4930 351156 341243 271771 125830 165534 224120 85914 88444 95024 87808 74716 113085 275503
4918 275503 301153 361114 90725 225027 216177 142590 210029 250717 228891 183526 327770
4907 327770 298696 302554 426902 467832 388881 423835 349369 325139 436468 465642 412786
4896 412786 496923 498642 401057 369896 457518 490156 384088 156318 233893 361307 410143
$$ packed form
4975D1302j7512n9518N47Q6084O9652j01277j6490M3151M6894J8167P5354M5699
4963B32053j40671J1674m5880m194O1313J37941j0921j46071o7073J460N5305
4952H4936k5743o5856J03179k7398p7773j7592L3909Q7726p8215J37942P9586
4941B34701j34796L3546M7202Q5200j25492j08301O117J7602N0642J05220J39515
4930C51156r913o9472j45941L9704N8586j38206K530O580p216j3092L8369J62418
4918B75503K5650N9961k70389J34302q850p3587O7439M0688k1826m5365J44244
4907C27770k9074L858J24348M0930p8951L4954p4466k4230J11329K9174n2856
4896D12786Q4137J719r7585l1161Q7622L2638j06068k27770P7575J27414M8836
$$ plain form
4885 410143 413633 385810 249721 188086 241745 337590 257805 165911 193115 159829 21925
4874 21925 148615 232581 216604 244520 299406 240801 314747 232248 91838 96103 216837
4863 216837 262627 216855 81879 75523 43138 -37718 32126 706 23701 -65192 78462
4852 78462 169405 91856 97471 184588 109339 120720 84814 -113802 106831 98646 20179 -52
4840 -52 115062 124681 55567 46337 23722 50615 94109 98903 156444 120262 178411 278974 243468
4827 243468 77393 10868 -2676 77568 137652 119029 89783 -49158 -33987 -19607 26462
4816 26462 -74121 -82938 -123282 -72537 -32470 71619 84088 77309 11804 54719 21533 -45764
4804 -45764 -65857 -40472 62657 -8890 -21811 12908 150183 136260 27560 152450 58844
$$ packed form
4885D10143L490k7823j36089o1635N3659R5845p9785r1894K7204l3286j37904
4874B1925J26690Q3966j5977K7916N4886n8605P3946q2499j40410M265J20734
4863B16837M5790m5772j34976o356l2385q0856O9844l1420K2995q8893J43654
4852G8462R0943p7549N615Q7117p5249J1381l5906j98616K20633q185p8467k0231
4840e2J15114R619o9114r230k2615K6893M3494M794N7541l6182N8149J00563l5506
4827B43468j66075o6525j3544Q0244O0084j8623k9246j38941J5171J4380M6069
4816B6462j00583q817m0344N0745M0067J04089J2469o779o5505M2915l3186o7297
4804d5764k0093K5385J03129p1547j2921L4719J37275j3923j08700J24890r3606
$$ plain form
4793 58844 12048 19313 75198 83501 160339 227826 187068 167077 225114 126703 135430 148843
4781 148843 82251 90839 94293 178468 172148 72768 202019 172909 163705 148027 173879 133014
4769 133014 165569 196130 208452 260675 282062 195634 184508 223139 127159 146269 228526 179790
4757 179790 -9289 71120 153398 219929 179470 259068 320643 221301 290270 302471 265584
4746 265584 304561 293427 245421 266262 177573 118584 138135 231592 259332 330848 315378 89702
4734 89702 110495 26047 54000 208983 273794 190386 169501 135848 197351 325909 200370
4723 200370 171198 246608 208348 153832 155597 240373 253812 272797 178963 319233 512997
4712 512997 419214 292937 210974 224076 235985 326431 459380 344184 269590 247393 328614
$$ packed form
4793E8844m6796P265N5885Q303P6838O7487m0758j9991N8037r8411Q727J3413
4781A48843o6592Q588L454Q4175o320r9380J29251k9110r204j5678K5852m0865
4769A33014L2555L0561J2322N2223K1387q6428j1126L8631r5980J9110Q2257m8736
4757A79790j89079Q0409Q2278O6531m0459P9598O1575r9342O8969J2201l6887
4746B65584L8977j1134m8006K0841q8689n8989J9551R3457K7740P1516j5470k25676
4734H9702K0793q4448K7953J54983O4811q3408k0885l3653O1503J28558j25539
4723B00370k9172P5410l8260n4516J765Q4776J3439J8985r3834J40270J93764
4712E12997r3783j26277q1963J3102J1909R0446J32949j15196p4594k2197Q1221
$$ plain form
4701 328614 277830 324754 297090 313466 401401 436145 393592 304730 405453 409580 448073 364302
4689 364302 421889 476189 406482 386029 316424 302262 422336 361000 316488 426784 408533
4678 408533 502563 673956 459581 466213 509746 583994 704187 791221 780395 758481 639048
4667 639048 572175 772529 743110 890905 976106 998691 1028136 975908 841593 916332 1134110
4656 1134110 1136152 1203558 1295494 1188346 1328065 1407427 1442388 1407455 1524743 1635908 1732661
4645 1732661 1826389 1861907 1944347 2094709 2174210 2291684 2421613 2528526 2545442 2779538
4635 2779538 2909693 3067805 3447561 3646025 3867419 3968340 4267788 4734740 5270110 5608741
4625 5608741 5795924 6146472 6625441 7171564 7799983 8506037 9179497 9872413 10577729 11325988
$$ packed form
4701C28614n0784M6924k7664J6376Q7935L4744m2553q8862J00723M127L8493q3771
4689C64302N7587N4300o9707k0453o9605j4162J20074o1336m4512J10296j8251
4678D08533R4030J71393k14375O632M3533P4248J20193Q7034j0826k1914j19433
4667F39048o6873K00354k9419J47795Q5201K2585K9445n2228j34315P4739K17778
4656A134110K042O7406R1936j07148J39719P9362L4961l4933J17288J11165R6753
4645A732661R3728L5518Q2440J50362P9501J17474J29929J06913J6916K34096
4635B779538J30155J58112L79756J98464K21394J00921K99448M66952N35370L38631
4625E608741J87183L50548M78969N46123O28419P06054O73460O92916P05316P48259
$$ plain form
4615 11325988 12235189 13105966 14236438 15446735 16820983 18255080 19878639 21712218
4607 21712218 23667795 25937889 28399436 31027537 33764799 36474757 38917287 41307229
4599 41307229 43700633 46324499 49318074 52708798 55962812 58683190 60946919 62739299
4591 62739299 64197327 65519261 67126644 69060679 71052192 72511051 72903195 72432723
4583 72432723 71323680 69460967 67687296 66118942 64916697 63592447 61784362 59428892
4575 59428892 56613689 53386003 50179635 47140190 44372865 41879404 39428413 36991242
4567 36991242 34243335 31554451 28986430 26361602 24056891 21906325 20136918 18508657
4559 18508657 16994696 15774848 14764068 13852465 12915457 12041147 11246694 10647700 10095655
$$ packed form
4615A1325988R09201Q70777J130472J210297J374248J434097J623559J833579
4607B1712218J955577K270094K461547K628101K737262K709958K442530K389942
4599D1307229K393404K623866K993575L390724L254014K720378K263729J792380
4591F2739299J458028J321934J607383J934035J991513J458859L92144m70472
4583G2432723j109043j862713j773671j568354j202245j324250j808085k355470
4575E9428892k815203l227686l206368l039445k767325k493461k450991k437171
4567C6991242k747907k688884k568021k624828k304711k150566j769407j628261
4559A8508657j513961j219848j010780r11603r37008q74310p94453n98994n52045
$$ plain form
4550 10095655 9602467 9135585 8740343 8295071 7823125 7508827 7287803 6974818 6675607
4541 6675607 6317261 6039940 5825292 5693727 5400581 5223703 4983913 4832170 4768797 4588472
4531 4588472 4493420 4279796 4056334 3884566 3814161 3766345 3599686 3409296 3300628 3329426
4521 3329426 3365428 3315629 3204976 3173809 2989137 2821570 2712896 2527225 2498730 2540453
4511 2540453 2520792 2485229 2403373 2414023 2376026 2175906 2168667 2129605 1992629 2004265 1935228
4500 1935228 1872148 1862501 1860896 1713500 1653284 1784017 1844276 1889722 1804443 1670628 1502638
4489 1502638 1585720 1488554 1555152 1544758 1537127 1539668 1453146 1512581 1327892 1313286 1356733 1425834
4477 1425834 1504682 1443247 1319793 1282342 1291403 1239374 1259248 1327462 1190063 1043504 1041677
$$ packed form
4550A0095655m93188m66882l95242m45272m71946l14298k21024l12985k99211
4541F675607l58346k77321k14648j31565k93146j76878k39790j51743o3373j80325
4531D588472r5052k13624k23462j71768p0405m7816j66659j90390j08668K8798
4521C329426L6002m9799j10653l1167j84672j67567j08674j85671k8495M1723
4511B540453j9661l5563q1856J0650l7997k00120p239l9062j36976J1636o9037
4500A935228o3080r647j605j47396o0216J30733O0259M5446q5279j33815j67990
4489A502638Q3082r7166O6598j0394p631K541q6522N9435j84689j4606M3447O9101
4477A425834P8848o1435j23454l7451R061n2029J9874O8214j37399j46559j827
$$ plain form
4466 1041677 977076 1027973 1169741 1095746 1071131 1009577 979628 1005858 878167 728386 791317
4455 791317 820055 662315 853781 944270 968657 820814 775881 743408 769863 751435 737183
4444 737183 657903 555217 733999 780862 734540 714923 703561 647749 706189 587617 661250
4433 661250 607900 590041 470527 458527 644190 677438 571506 533153 490662 423579 404439
4422 404439 541227 577227 541622 436364 505294 671674 566478 522126 636325 579773 529806
4411 529806 493586 410767 530813 484851 505880 486004 331848 358419 374637 422432 356597
4400 356597 250480 305010 404593 526937 569758 472781 436497 400448 314569 296573 258882
4389 258882 305562 327463 345706 453310 360519 311561 465266 410360 335097 351933 474547
$$ packed form
4466A041677o4601N0897J41768p3995k4615o1554k9949K6230j27691j49781O2931
4455G91317K8738j57740J91466R0489K4387j47843m4933l2473K6455j8428j4252
4444G37183p9280j02686J78782M6863m6322j9617j1362n5812N8440j18572P3633
4433F61250n3350j7859j19514j2000J85663L3248j05932l8353m2491o7083j9140
4422D04439J36788L6000l5605j05258O8930J66380j05196m4352J14199n6552m9967
4411E29806l6220q2819J20046m5962K1029j9876j54156K6571J6218M7795o5835
4400C56597j06117N4530R9583J22344M2821r6977l6284l6049q5879j7996l7691
4389B58882M6680K1901J8243J07604r2791m8958J53705n4906p5263J6836J22614
$$ plain form
4378 474547 428156 396758 442010 527761 425602 359564 455424 390773 295665 436261 524413
4367 524413 465715 356733 377623 357591 259223 283855 326753 384893 355856 243720 194940
4356 194940 179837 176484 273442 335626 216025 181910 222850 299595 333509 332031 276151 242640
4344 242640 325299 303217 346235 317575 311609 225012 259577 378840 227033 149190 168317
4333 168317 173317 129971 236809 304354 201734 217601 201460 147767 184083 212500 184185
4322 184185 73036 67953 58217 118397 203103 311878 341533 337838 421025 281941 164487
4311 164487 168945 291270 264882 275255 229831 234047 206241 207361 236092 188819 246341 229194
4299 229194 240267 360570 484718 406476 339686 364436 416990 471124 540391 501510 591483
$$ packed form
4378D74547m6391l1398M5252Q5751j02159o6038R5860o4651r5108J40596Q8152
4367E24413n8698j08982K0890k0032r8368K4632M2898N8140k9037j12136m8780
4356A94940j5103l353R6958O2184j19601l4115M0940P6745L3914j478n5880l3511
4344B42640Q2659k2082M3018k8660n966q6597L4565J19263j51807p7843J9127
4333A68317N000m3346J06838O7545j02620J5867j6141n3693L6316K8417k8315
4322A84185j11149n083r736O0180Q4706J08775K9655l695Q3187j39084j17454
4311A64487M458J22325k6388J0373m5424M216k7806J120K8731m7273N7522j7147
4299B29194J1073J20303J24148p8242o6790K4750N2554N4134O9267l8881Q9973
$$ plain form
4288 591483 553084 554798 531351 538669 652520 602246 532657 526677 529801 505232 481892 523682
4276 523682 585311 720618 715370 562380 618265 669897 720580 598445 547955 521059 496684
4265 496684 402074 371354 431300 466162 404488 342273 451591 393438 245196 202456 370914
4254 370914 539756 478872 455702 349344 258595 317594 302672 333429 414571 269081 161661
4243 161661 231717 260874 208958 173419 122852 126440 39063 53328 242325 283850 201920 39528
4231 39528 39995 154242 152111 116782 80551 185406 112574 59337 33194 -8006 122580 103781
4219 103781 98231 197900 189617 162356 269053 148172 110678 159157 106294 80602 129125 53798
4207 53798 58556 -6015 -29805 -4264 49075 140421 94570 56815 69517 119589 79385 78620
$$ packed form
4288E91483l8399J714k3447P318J13851n0274o9589n980L124k4569k3340M1790
4276E23682O1629J35307n248j52990N5885N1632N0683j22135n0490k6896k4375
4265D96684r4610l0720N9946L4862o1674o2215J09318n8153j48242m2740J68458
4254C70914J68842o0884k3170j06358r0749N8999j4922L0757Q1142j45490j07420
4243A61661P0056K9157n1916l5539n0567L588q7377J4265J88997M1525q1930j62392
4231C9528M67J14247k131l5329l6231J04855p2832n3237k6143m1200J30586j8799
4219A03781n550R9669q283k7261J06697j20881l7494M8479n2863k5692M8523p5327
4207E3798M758o4571k3790K5541N3339R1346m5851l7755J2702N0072m0204p65
$$ plain form
4195 78620 188813 173937 98776 92243 159402 183057 91584 168962 107324 83624 148807 179522
4183 179522 105971 219664 205894 248848 313184 249403 182533 284470 249856 294178 204788
4172 204788 102968 197399 194240 73719 96623 230550 80911 175015 218546 236215 164218
4161 164218 83145 27665 150420 145388 231068 221603 123312 43191 142600 170797 104467 207077
4149 207077 222621 236892 -46733 -10419 28102 -38655 27919 -75126 464 45203 56897
4138 56897 17468 21717 35487 -8109 -33913 49284 109579 -4947 -51965 35818 143570 168964
4126 168964 136557 116517 33735 172957 156089 67969 -36334 -115528 -56277 -40942 35532
4115 35532 130658 16518 129072 135233 71725 125294 25081 5146 54715 53001 125555 130268
$$ packed form
4195G8620J10193j4876p5161o533O7159K3655r1473P7378o1638k3700O5183L0715
4183A79522p3551J13693j3770M2954O4336o3781o6870J01937l4614M4322q9390
4172B04788j01820R4431l159j20521K2904J33927j49639R4104M3531J7669p1997
4161A64218q1073n5480J22755n032Q5680r465r8291q0121R9409K8197o6330J02610
4149B07077J5544J4271k83625L6314L8521o6757O6574j03045P5590M4739J1694
4138E6897l9429M249J3770m3596k5804Q3197O0295j14526m7018Q7783J07752K5394
4126A68964l2407k0040q2782J39222j6868q8120j04303p9194N9251J5335P6474
4115C5532R5126j14140J12554O161o3508N3569j00213j9935M9569j714P2554M713
$$ plain form
4103 130268 45144 35575 -14404 5627 19578 -56662 -45236 59307 67431 29004 10124 80337
4091 80337 36407 35306 -27972 -21898 -57500 -16128 12683 73594 36223 -42741 -29982 105663
4079 105663 47336 95661 140152 84000 23702 52556 87190 87264 23400 -992 -23527 -207727
4067 -207727 -265901 -166139 -227520 -165823 -52868 18894 123248 8112 14681 154265 77781
4056 77781 6243 78110 -5640 11810 215733 288995 174206 109915 -12792 30888 30018 -42507
4044 -42507 -174087 -107915 34179 130183 129935 118301 115297 140456 62698 -48577 -23087 -48000
4032 -48000 31515 -51923 -30993 432 -23312 122605 68468 56365 30258 -910 99538
4021 99538 132409 40429 -10673 -31985 -46657 70244 7333 39374 14068 -104767 -9422
$$ packed form
4103A30268q5124r569m9979K0031J3951p6240J1426J04543Q124l8427j8880P0213
4091H0337m3930j101o3278O074l5602M1372K8811O0911l7371p8964J2759J35645
4079A05663n8327M8325M4491n6152o0298K8854L4634P4o3864k4392k2535j84200
4067b07727n8174R9762o1381O1697J12955P1762J04354j15136O569J39584p6484
4056G7781p1538P1867q3750J7450K03923P3262j14789o4291j22707M3680q70p2525
4044d2507j31580O6172J42094R6004k48j1634l004K5159p7758j11275K5490k4913
4032d8000P9515q3438K0930L1425k3744J45917n4137j2103k6107l1168J00448
4021I9538L2871r1980n1102k1312j4672J16901o2911L2041k5306j18835R5345
$$ plain form
4010 -9422 1517 185729 127515 19814 43725 -16465 -59278 35378 -17845 -83000 -63311 12090
3998 12090 -68911 -112298 -10008 4302 30895 130457 156523 78070 -58304 -70422 -58203
3987 -58203 -86634 -48349 -95338 52348 105423 139327 88336 -10884 -26629 -129758 -209205
3976 -209205 -35307 -16430 63898 -23063 -118913 -47281 -2633 70926 83596 -24681 -23090
3965 -23090 -17875 21177 21335 -48247 -82416 -37296 12195 32237 155362 76951 -83138 -50773
3953 -50773 -30994 136548 8856 -74902 100877 -9120 21860 53483 -19308 32639 70348
3942 70348 -11707 51315 -19292 -64693 17123 8597 37079 101233 -284 -33578 29741 100974
3930 100974 109777 -55884 -64751 88839 -38671 23424 90480 -65604 -50086 -39107 -10634
$$ packed form
4010i422J0939J84212n8214j07701K3911o0190m2813R4656n3223o5155J9689P5401
3998A2090q1001m3387J02290J4310K6593R9562K6066p8453j36374j2118J2219
3987e8203k8431L8285m6989J47686N3075L3904n0991r9220j5745j03129p9447
3976b09205J73898J8877Q0328q6961r5850P1632M4648P3559J2670j08277J591
3965b3090N215L9052J58o9582l4169M5120M9491K0042J23125p8411j60089L2365
3953e0773J9779J67542j27692q3758J75779j09997L0980L1623p2791N1947L7709
3942G0348q2055O3022p0607m5401Q1816q526K8482O4154j01517l3294O3319P1233
3930A00974Q803j65661q867J53590j27510O2095O7056j56084J5518J0979K8473
$$ plain form
3919 -10634 58593 81368 115937 127199 142307 -22562 -47843 -58152 -123548 -40528 -66479 65778
3907 65778 182753 49900 92595 174552 171776 237833 147350 -6209 137298 250532 149460
3896 149460 146601 72827 95178 57792 28611 -21242 -13985 -3642 -1569 96843 86082 159720
3884 159720 19864 -73294 -57550 12252 43622 -52506 -8538 -26073 78469 182490 82244
3873 82244 -4040 -60646 -7857 -39940 -185751 -207267 -49546 -88598 -46503 -43446 -71635 111770
3861 111770 137467 69621 87133 53223 69969 -25513 8377 -39864 -159339 -102552 -79861
3850 -79861 -32594 -117238 -141471 -80074 61566 146253 228847 195272 162068 46094 3792
3839 3792 76502 53246 506 71955 115887 26476 7862 74731 67437 42979 64172 18599
$$ packed form
3919a0634O9227K2775L4569J1262J5108j64869k5281j0309o5396Q3020k5951J32257
3907F5778J16975j32853M2695Q1957k776O6057r0483j53559J43507J13234j01072
3896A49460k859p3774K2351l7386k9181m9853P257J0343K073R8412j0761P3638
3884A59720j39856r3158J5744O9802L1370r6128M3968j7535J04542J04021j00246
3873H2244q6284n6606N2789l2083j45811k1516J57721l9052M2095L057k8189J83405
3861A11770K5697o7846J7512l3910J6746r5482L3890m8241j19475N6787K2691
3850g9861M7267q4644k4233O1397J41640Q4687Q2594l3575l3204j15974m2302
3839C792P2710k3256n2740P1449M3932q9411j8614O6869p294k4458K1193m5573
$$ plain form
3827 18599 -91853 18130 9442 -40034 -27875 -48554 70718 28187 -109946 -69706 44033
3816 44033 122024 -97016 -88155 -6240 74097 7598 -122284 -65440 -57240 -94675 -64034 62343
3804 62343 -37906 -44888 36649 23121 -15711 -73472 -29763 -13998 -47341 -76791 -31769 111610
3792 111610 26378 72880 149380 77490 -3990 42820 38047 37710 -8099 -37720 20443 18743
3780 18743 24792 44443 115154 113077 36071 -18496 115095 29436 -36679 116668 102652 1770
3768 1770 -73635 -3808 88341 88356 -84873 -44613 -124695 11128 11819 14097 23149 -6420 -12814
3755 -12814 -43270 -121228 -172748 4493 82390 132328 108811 98121 27089 25215 -28425 19197
3743 19197 53503 169321 255200 239540 139505 119365 151841 166621 111435 -801 89749
$$ packed form
3827A8599j10452J09983q688m9476J2159k0679J19272m2531j38133M0240J13739
3816D4033P7991k19040Q861Q1915Q0337o6499j29882N6844Q200l7435L0641J26377
3804F2343j00249o982Q1537j3528l8832n7761M3709J5765l3343k9450M5022J43379
3792A11610q5232M6502P6500p1890q1480M6810m773l37m5809k9621N8163j700
3780A8743O049J9651P0711k077p7006n4567J33591q5659o6115J53347j4016j00882
3768A770p5405O9827R2149J5j73229M0260q0082J35823O91K278R052k9569o394
3755a2814l0456p7958n1520J77241P7897M9938k3517j0690p1032j874n3640M7622
3743A9197L4306J15818Q5879j5660j00035k0140L2476J4780n5186j12236R0550
$$ plain form
3732 89749 106258 74294 108518 8475 -52168 -100559 -111095 12271 -6219 -82394 -35881
3721 -35881 -34336 -102847 -101354 -169677 -172232 9746 -9027 -54402 -89297 27421 -92494 -129684
3709 -129684 -20309 -15251 29601 57612 84626 169388 168128 53235 30729 48520 63281 37926
3697 37926 -1956 -51460 28952 -34205 -28984 -93392 -91700 -164875 3457 -60424 -34957 -54586
3685 -54586 -97222 -11549 55644 43152 -126344 -99027 -48245 82505 157276 45639 90940
3674 90940 224215 76994 122094 30740 65477 71345 136664 122347 2994 -17191 -152141
3663 -152141 -52854 -35766 11405 -84689 -72979 -9673 -147732 -94934 -18877 -73554 -140632
3652 -140632 -187467 -19102 462 57939 101584 -120125 -62098 151972 230287 2261 -73515
$$ packed form
3732H9749J6509l1964L4224j00043o0643m8391j0536J23366j8490p6175M6513
3721c5881J545o8511J493o8323k555J81978j8773m5375l4895J16718j19915l7190
3709a29684J09375N058M4852K8011K7014Q4762j260j14893k2506J7791J4761k5355
3697C7926l9882m9504Q0412o3157N221o4408J692p3175J68332o3881K5467j9629
3685e4586m2636Q5673O7193j2492j69496K7317N0782J30750P4771j11637M5301
3674I0940J33275j47221M5100r1354L4737N868O5319j4317j19353k0185j34950
3663a52141R9287J7088M7171r6094J1710O3306j38059N2798P6057n4677o7078
3652a40632m6835J68365J9564N7477M3645k21709N8027K14070P8315k28026p5776
$$ plain form
3641 -73515 -102729 1903 -73874 -73615 -4156 75321 104477 -8565 -98044 -59671 16137 37990
3629 37990 52722 23943 -26733 -88200 -38447 -122894 -239947 -95741 -65680 -111609 -118478 -117595
3617 -117595 -22749 36590 -6630 -84729 -45998 -71312 -114533 10840 46586 -58456 64355
3606 64355 9305 31635 -8670 81085 229916 164204 111353 42433 59887 -76792 -37975
3595 -37975 -57469 35201 39436 143866 100724 49548 86801 46755 79164 163643 57941 -13639
3583 -13639 68081 82135 117339 -66732 6307 33481 36969 69003 5228 128379 139201 13414
3571 13414 88675 131780 32095 -22160 -3592 105316 149504 -3864 -76279 -66885 -55709 88318
3559 88318 156290 -24447 -105940 -93992 -137308 -64835 -28495 -90585 -158846 -66586 -47848 26785
$$ packed form
3641g3515k9214J04632p5777K59O9459P9477K9156j13042q9479L8373P5808K1853
3629C7990J4732k8779n0676o1467M9753q4447j17053J44206L0061m5929o869Q83
3617a17595R4846N9339m3220p8099L8731k5314m3221J25373L5746j05042J22811
3606F4355n5050K2330m0305Q9755J48831o5712n2851o8920J7454j36679L8817
3595c7975j9494R2670M235J04430m3142n1176L7253m0046L2409Q4479j05702p1580
3583a3639Q1720J4054L5204j84071P3039K7174L488L2034o3775J23151J0822j25787
3571A3414P5261M3105r9685n4255J8568J08908M4188j53368p2415R394J1176J44027
3559H8318O7972j80737q1493J1948m3316P2473L6340o2090o8261R2260J8738P4633
$$ plain form
3547 26785 -19533 -77824 -33696 -63463 -15186 31338 18075 9794 -15896 16776 14489 -54331
3535 -54331 111423 126726 18150 -18955 36893 -27491 -61 81513 94218 -120133 -16755
3524 -16755 11393 -61466 -45655 3552 -119696 -287798 -300504 -126777 -93676 -17982 -34352
3513 -34352 -76091 -124147 -117386 -156751 -193026 -73164 -34916 -60662 -5748 129932 29794
3502 29794 125828 197546 166512 57606 61169 123119 113885 49649 -34746 29748 -65069 -19440
3490 -19440 38613 40090 98033 60295 44739 42600 -5472 -70951 -169356 -77921 -107044 -73622
3478 -73622 64132 48138 62136 33886 5837 -54430 13313 -17008 -28460 49973 22754 5587
3466 5587 -66096 -46748 20542 -27810 129762 144624 116246 12937 -76156 -43451 52880 16550
$$ packed form
3547B6785m6318n8291M4128k9767M8277M6524j3263q281k5690L2672k287o8820
3535e4331J65754J5303j08576l7105N5848o4384K7430Q1574J2705k14351J03378
3524a6755K8148p2859J5811M9207j23248j68102j2706J73727L3101P5694j6370
3513c4352m1739m8056O761l9365l6275J19862L8248k5746N4914J35680j00138
3502B9794R6034P1718l1034j08906L563O1950r234o4236q4395O4494r4817M5629
3490a9440N8053J477N7943l7738j5556k139m8072o5479r8405R1435k9123L3422
3478g3622J37754j5994J3998k8250k8049o0267O7743l0321j1452P8433k7219j7167
3466E587p1683J9348O7290m8352J57572J4862k8378j03309q9093L2705R6331l6330
$$ plain form
3454 16550 146103 87152 156831 25151 57258 38672 -16941 -55051 -127321 5375 145962
3443 145962 97959 11722 152328 189887 130968 63437 -13079 -12084 60012 128854 117840 108884
3431 108884 139717 134207 148937 77193 36402 79485 -19977 -55267 128164 244954 168647
3420 168647 17687 14754 34946 120454 67341 -3786 -8755 87190 30144 -35062 -38178 -14138
3408 -14138 94697 152579 193531 225736 149865 152767 166487 103081 57431 198369 254839 55279
3396 55279 95594 59351 50321 112223 201036 140583 29673 -34451 43266 82726 30199 -35527
3384 -35527 -14949 -37203 5430 148675 195131 195683 174037 106361 32817 -47445 30833 165764
3372 165764 -9316 60752 66200 143882 88848 71081 41969 129961 189623 70720 31683
$$ packed form
3454A6550J29553n8951O9679j31680L2107j8586n5613l8110p2270J32696J40587
3443A45962m8003q6237J40606L7559n8919o7531p6516R95P2096O8842j1014q956
3431A08884L0833n510J4730p1744m0791M3083r9462l5290J83431J16790p6307
3420A68647j50960k933K0192Q5508n3113p1127m969R5945n7046o5206l116K4040
3408a4138J08835N7882M0952L2205p5871K902J3720o3406m5650J40938N6470j99560
3396E5279M0315l6243r030O1902Q8813o0453j10910o4124P7717L9460n2527o5726
3384c5527K0578k2254M2633J43245M6456N52k1646o7676p3544q0262P8278J34931
3372A65764j75080P0068N448P7682n5034j7767k9112Q7992N9662j18903l9037
$$ plain form
3361 31683 36675 65528 48169 32325 -16124 12673 34566 96899 96421 118751 177186 239669
3349 239669 274040 263636 339314 260186 181775 296751 288317 209562 261139 162805 148322 279645
3337 279645 375627 168056 85773 114566 45562 -36333 -3704 -53971 4967 74543 81205 17694
3325 17694 74274 29465 -50343 -127143 -46943 121231 84947 30465 81962 178801 150819 130932
3313 130932 77627 52963 86248 65440 29477 63238 70208 62942 -44118 -104595 14411 88931
3301 88931 75572 1984 117387 165871 54113 43577 -41456 57761 77783 109943 23235
3290 23235 -41349 37629 7826 1884 -19582 -107569 -58750 5038 139455 134326 161749 60004
3278 60004 -22228 1432 12024 -109753 -84084 -94388 -19229 59115 -91249 -113716 -62443
$$ packed form
3361C1683M992K8853j7359j5844m8449K8797K1893O2333m78K2330N8435O2483
3349B39669L4371j0404P5678p9128p8411J14976q434p8755N1577r8334j4483J31323
3337B79645R5982k07571q2283K8793o9004q1895L2629n0267N8938O9576O662o3511
3325A7694N6580m4809p9808p6800Q0200J68174l6284n4482N1497R6839k7982j9887
3313A30932n3305k4664L3285k0808l5963L3761O970p266j07060o0477J19006P4520
3301H8931j3359p3588J15403M8484j11758j0536q5033R9217K0022L2160q6708
3290B3235o4584P8978k9803n942k1466q7987M8819O3788J34417n129K7423j01745
3278F0004q2232K3660J0592j21777K5669j0304P5159P8344j50364k2467N1273
$$ plain form
3267 -62443 34223 156753 247156 198166 64119 85157 12108 50361 24737 6927 28381
3256 28381 -35657 -9202 2965 -5905 104503 76225 -25088 709 68750 59910 -18624 -27103
3244 -27103 -27318 164421 199617 45706 67761 151885 30884 -12172 -17143 46937 49037 101913
3232 101913 40443 17192 -52022 -54034 53272 -14582 37660 25167 -7197 18318 30678 -24276
3220 -24276 -3827 124823 92836 16346 -7207 -34977 23948 61815 22767 7460 -58430 -86901
3208 -86901 -183605 -94804 -38879 117760 -67104 -151919 -200203 -204417 -51490 32593 -55373
3197 -55373 -90213 -42184 -88464 -45141 -85353 57377 5348 -23937 34520 86389 -17043
3186 -17043 -2303 23231 7805 -27536 -62591 -1551 81236 53022 41009 -106068 -89090 -6662
$$ packed form
3267f2443R6666J22530R0403m8990j34047K1038p3049L8253k5624j7810K1454
3256B8381o4038K6455J2167q870J10408k8278j01313K5797O8041q840p8534q479
3244b7103k15J91739L5196j53911K2055Q4124j21001m3056m971O4080K100N2876
3232A01913o1470k3251o9214k012J07306o7854N2242j2493l2364K5515J2360n4954
3220b4276K0449J28650l1987p6490k3553k7770N8925L7867l9048j5307o5890k8471
3208h6901r6704Q8801N5925J56639j84864q4815m8284m214J52927Q4083q7966
3197e5373l4840M8029m6280M3323m0212J42730n2029k9285N8457N1869j03432
3186a7043J4740K5534j5426l5341l5055O1040Q2787k8214j2013j47077J6978Q2428
$$ plain form
3174 -6662 -23081 -42233 -18382 21029 61822 92221 11049 40481 65381 92213 -23660 -147390
3162 -147390 71494 3424 66639 117053 61803 -21257 -123788 23834 80279 -28548 17957
3151 17957 27100 -40040 -148217 -50441 -87693 -132333 -169040 -229760 -183081 -84518 -56293 -34668
3139 -34668 61930 9418 -60237 8676 31300 -6742 10292 4786 305077 167840 71171 68653
3127 68653 -125510 -52358 89556 -4208 99705 91769 217276 212404 143932 74621 97955
3116 97955 -30186 -28762 81289 141230 198642 91030 118343 190278 87641 80040 71977 46995
3104 46995 22752 -8834 177187 69076 110713 11630 -35054 130573 19510 -36677 18766
3093 18766 -19158 -91966 -35414 -9089 39730 -18774 -60337 37859 83315 70000 84492 102720
$$ packed form
3174f662j6419j9152K3851L9411M0793L0399q1172K9432K4900K6832j15873j23730
3162a47390K18884o8070O3215N0414n5250q3060j02531J47622N6445j08827M6505
3151A7957R143o7140j08177R7776l7252m4640l6707o0720M6679R8563K8225K1625
3139c4668R6598n2512o9655O8913K2624l8042J7034n506L00291j37237r6669k518
3127F8653j94163P3152J41914r3764J03913p936J25507m872o8472o9311K3334
3116I7955j28141J424J10051N9941N7412j07612K7313P1935j02637p601q063k4982
3104D6995k4243l1586J86021j08111M1637r9083m6684J65627j11063n6187N5443
3093A8766l7924p2808N6552K6325M8819n8504m1563R8196M5456j3315J4492J8228
$$ plain form
3081 102720 159411 189053 38420 22519 80752 28539 32617 -96045 -14429 -29098 -41417
3070 -41417 -71450 -93855 -26261 -100669 -92672 -185461 -130069 -98016 -138766 -16260 -14948 1719
3058 1719 -21353 52041 28242 -9496 -16616 -47118 14062 -25600 -116280 41854 59087 -36533
3046 -36533 79343 154538 114390 12995 20592 -26100 -90768 -24033 75810 -12836 13234 -33515
3034 -33515 52709 61533 60061 -20855 -65378 -76256 -161228 -164226 -50040 -126493 -72291 -134248
3022 -134248 -179927 -16485 31802 -18588 -72500 39184 6996 -209775 -107923 7242 -18115
3011 -18115 31129 46999 4240 14148 -34223 28087 112183 138482 107002 25134 26548 7099
2999 7099 -169365 -157031 -114319 -149744 -29437 31999 -22355 -63693 -17839 89477 62573
$$ packed form
3081A02720N6691K9642j50633j5901N8233n2213M078j28662Q1616j4669j2319
3070d1417l0033k2405O7594p4408P997r2789N5392L2053m0750J22506J312J6667
3058A719k3072P3394k3799l7738p120l0502O1180l9662r0680J58134J7233r5620
3046c6533J15876P5195m0148j01395P597m6692o4668O6735R9843q8646K6070m6749
3034c3515Q6224Q824j472q0916m4523j0878q4972k998J14186p6453N4202o1957
3022a34248m5679J63442M8287n0390n3912J11684l2188k16771J01852J15165k5357
3011a8115M9244J5870m2759R908m8371O2310Q4096K6299l1480q1868J414j9449
2999G099j76464J2334M2712l5425J20307O1436n4354m1338M5854J07316k6904
$$ plain form
2988 62573 -45489 -96886 -50696 -49680 -83034 -8369 25437 -79535 -159954 -8441 1687
2977 1687 23790 29591 260410 275412 18163 -57519 -37204 21857 18284 -75546 2348 -47772
2965 -47772 -18024 66535 25840 104131 105698 -78498 -42381 88231 56910 72086 34973 -81624
2953 -81624 -122687 -46803 -38299 -11919 -95446 -89636 -108275 -89776 -73842 -109158 -57255 -59487
2941 -59487 4656 1796 -109669 -177293 -183999 -105118 -52915 -19992 -49130 -116431 -186485 -70551
2929 -70551 15507 -80194 -115464 -44106 26363 -126050 -176469 -14100 -39597 -111054 -143109
2918 -143109 -127471 -159176 -116402 26648 -61952 -101358 29289 45858 -59037 -172676 -133307
2907 -133307 -136649 -182767 -23408 -39203 -5815 -24359 -26109 97542 52209 129412 112668 27508
$$ packed form
2988F2573j08062n1397M6190J016l3354P4665L3806j04972q0419J51513J0128
2977A687K2103N801K30819J5002k57249p5682K0315N9061l573r3830P7894n0120
2965d7772K9748Q4559m0695P8291J567j84196L6117J30612l1321J5176l7113j16597
2953h1624m1063P5884Q504K6380q3527N810j8639J8499J5934l5316N1903k232
2941e9487O4143k860j11465o7624o706P8881N2203L2923k9138o7301p0054J15934
2929g0551Q6058r5701l5270P1358P0469j52413n0419J62369k5497p1457l2055
2918a43109J5638l1705M2774J43050q8600l9406J30647J6569j04895j13639L9369
2907a33307l342m6118J59359j5795L3388j8544j750J23651m5333P7203j6744q5160
$$ plain form
2895 27508 -15188 -109420 23885 -19214 -2222 -78594 -116083 -113704 -144931 -138608 -60002 -59985 -47463
2882 -47463 -131601 -15894 9521 -37935 111333 116219 -23102 -113403 -146586 -189323 -158007
2871 -158007 -97524 -28333 -27894 -116505 -94156 -66911 -158411 -64308 55200 13493 -80616 -180703
2859 -180703 -159830 -89489 -51676 -34868 59711 30665 105997 119430 107906 72149 671 -1600
2847 -1600 -46275 -27467 -49160 33256 107408 101016 86081 65807 -20080 -112659 -18542 71168
2835 71168 -64934 40989 44485 -24694 47895 87741 12014 -13850 58790 95599 -53911
2824 -53911 -38824 30864 -3916 -23869 -87757 -148193 -106938 -82393 -84711 22696 3122 -16562
2812 -16562 -90143 -101522 -93059 -94543 -58579 -61288 -113437 -95292 -130801 -83231 17998 -59642
$$ packed form
2895B7508m2696r4232J33305m3099J6992p6372l7489K379l1227O323P8606J7J2522
2882d7463q4138J15707K5415m7456J49268M886j39321r0301l3183m2737L1316
2871a58007O0483O9191M39q8611K2349K7245r1500R4103J19508m1707r4109j00087
2859a80703K0873P0341L7813J6808R4579k9046P5332J3433j1524l5757p1478k271
2847a600m4675J8808k1693Q2416P4152o392j4935k0274q5887r2579R4117Q9710
2835G1168j36102J05923L496o9179P2589L9846p5727k5864P2640L6809j49510
2824e3911J5087O9688l4780j9953o3888o0436M1255K4545k318J07407j9574j9684
2812a6562p3581j1379Q463j484L5964k709n2149J8145l5509M7570J01229p7640
$$ plain form
2800 -59642 -55662 -102767 -87642 -194116 -141411 -183490 -58922 -120574 -59503 -438 -17887 -16903
2788 -16903 -18043 -130644 -107057 -74245 -116737 -82750 -105745 -90156 -90316 -110054 -89351 -91237
2776 -91237 -118301 -29139 -18016 -95123 -103451 -21823 -29496 -118997 -80049 84650 71824 -7126
2764 -7126 53772 34404 -30042 -144087 -11784 32558 4820 -29347 -13930 20687 30919 21820
2752 21820 119050 95290 68929 119944 34913 -117651 -219890 -96459 -136108 -24581 9413
2741 9413 -213233 -201685 -94390 -118753 -65456 41474 27573 -107318 -82646 -114910 -80845
2730 -80845 -79865 -2324 93113 174296 -27168 -128892 -106591 29466 -53077 -109251 -155985 -78466
2718 -78466 -30073 -67739 -21490 102873 78860 -68257 -1145 124866 117262 97797 80933
$$ packed form
2800e9642L980m7105J5125j06474N2705m2079J24568o1652O1071N9065j7449R84
2788a6903j140j12601K3587L2812m2492L3987k2995J5589j60j9738K0703j886
2776i1237k7064Q9162J1123p7107q328Q1628p673q9501L8948J64699j2826p8950
2764g126O0898j9368o4446j14045J32303M4342k7738l4167J5417L4617J0232r099
2752B1820R7230k3760k6361N1015q5031j52564j02239J23431l9649J11527L3994
2741I413k22646J1548J07295k4363N3297J06930j3901j34891K4672l2264L4065
2730h0845R80P7541R5437Q1183k01464j01724K2301J36057q2543n6174m6734P7519
2718g8466M8393l7666M6249J24363k4013j47117O7112J26011p604j9465j6864
$$ plain form
2707 80933 -11603 9469 73207 67311 41746 46757 22166 45783 28144 -38814 97711 194447
2695 194447 5588 -99263 -3864 11359 120097 -38091 -38243 16018 45040 -26899 84348
2684 84348 -31844 -106111 -177914 -197718 -22521 -91287 -93880 -179331 -193095 -44279 -56220
2673 -56220 -119648 121962 37678 -77932 -99277 -24882 -52710 -135386 -102143 -82889 -75015 -7286
2661 -7286 21870 43570 43444 -83659 -39918 -42871 -23041 8777 -82132 -55669 -32969 110397
2649 110397 121656 34587 -110227 -14964 -9964 -86699 -66352 27662 -52086 -146955 -122117 32206
2637 32206 -45288 -111436 -31835 -136696 -133394 -61432 31526 44603 86425 -140565 -286032
2626 -286032 -194506 -153298 33215 -53428 -47040 -6592 84567 171626 92026 39086 18608 -104175
$$ packed form
2707H0933r2536K1072O3738n896k5565N011k4591K3617j7639o6958J36525R6736
2695A94447j88859j04851R5399J5223J08738j58188j52N4261K9022p1939J11247
2684H4348j16192p4267p1803j9804J75197o8766k593q5451j3764J48816j1941
2673e6220o3428K41610q4284j15610k1345P4395k7828q2676L3243J9254P874O7729
2661g286K9156K1700j26j27103M3741k953J9830L1818r0909K6463K2700J43366
2649A10397J1259q7069j44814R5263N000p6735K0347R4014p9748r4869K4838J54323
2637C2206p7494o6148P9601j04861L302P1962R2958J3077M1822k26990j45467
2626b86032R1526M1208J86513q6643O388M0448R1159Q7059p9600n2940k0478j22783
$$ plain form
2614 -104175 -32179 -74434 -109076 4002 -1508 -49491 -38463 -62070 -10490 24816 -27978 -83863
2602 -83863 -195023 -53811 -131512 -125393 -819 -24273 -26201 -48745 -127471 -192720 -125477 -43642
2590 -43642 -13062 31025 -55799 -53283 25489 937 -148 -2569 -174416 -99113 -72957 -79710
2578 -79710 48207 42739 65539 -69671 -1659 102757 38011 -11908 99892 59093 77465
2567 77465 27750 -4704 81346 -36655 21037 119137 8920 67757 41013 -83368 -124128
2556 -124128 -113422 -892 -96920 -192705 -111596 -116050 -146260 -141629 -171335 -31438 -2180 -94114
2544 -94114 -75474 60568 139 79489 89656 1853 -48185 1507 -105590 -91231 50798
$$ packed form
2614a04175P1996m2255l4642J13078n510m7983J1028k3607N1580L5306n2794n5885
2602h3863j11160J41212p7701O119J24574k3454j928k2544p8726o5249O7243Q1835
2590d3642L0580M4087q6824K516P8772k4552j085k421j71847P5303K6156o753
2578g9710J27917n468K2800j35210O8012J04416o4746m9919J11800m0799J8372
2567G7465m9715l2454Q6050j18001N7692R8100j10217N8837k6744j24381m0760
2556a24128J0706J12530r6028r5785Q1109m454l0210M631k9706J39897K9258r1934
2544i4114J8640J36042o0429P9350J0167q7803n0038M9692j07097J4359J42029
$$ [...]
##END NTUPLES=NMR SPECTRUM
##END=
