##TITLE=1H_TG-2379-A
 200.13MHz, CDCl3+DMSO,
 8 sc
 
 29.1.2025
##JCAMPDX= 6.0         $$ Bruker NMR JCAMP-DX V2.0
##DATA TYPE= NMR SPECTRUM
##DATA CLASS= NTUPLES
##ORIGIN= UXNMR, Bruker Analytische Messtechnik GmbH
##OWNER= pz
$$ XWIN-NMR		Version 3.5
$$ Wed Jan 29 14:15:29 2025 Russian Standard Time (UT+4h)  she@DPX200
##.OBSERVE FREQUENCY= 200.1313
##.OBSERVE NUCLEUS= ^1H
##.ACQUISITION MODE= SIMULTANEOUS
##.ACQUISITION SCHEME= undefined
##.AVERAGES= 8
##.DIGITISER RES= 18
##SPECTROMETER/DATA SYSTEM= spect
##.PULSE SEQUENCE= zg30
##.SOLVENT NAME= DMSO
##.SHIFT REFERENCE= (INTERNAL, DMSO, 0, 15.7304)
##AUDIT TRAIL= $$ (NUMBER, WHEN, WHO, WHERE, WHAT)
$$ ##TITLE= Audit trail, XWIN-NMR		Version 3.5
$$ ##JCAMPDX= 5.01
$$ ##ORIGIN= Bruker BioSpin GmbH
$$ ##OWNER= she
$$ F:/spectra/data/she/nmr/H-C/1/pdata/1/auditp.txt
$$ ##AUDIT TRAIL=  $$ (NUMBER, WHEN, WHO, WHERE, WHAT)
(   1,<2025-01-29 14:14:13.90 +0400>,<she>,<DPX200>,
      <created by zg, POWCHK disabled, PULCHK disabled
       configuration hash MD5:
       00 E9 B6 7A A2 85 ED C7 34 08 36 98 17 FE 4E 26
       data hash MD5: 16K
       18 12 F9 5D 8A CE 4C E1 4A 33 92 B7 FF D5 AA 5B>)
(   2,<2025-01-29 14:14:16.03 +0400>,<she>,<DPX200>,
      <Start of raw data processing
       efp BC_mod = 2 LB = 0.25 FT_mod = 6 PKNL = 1 PHC0 = 254.9229 PHC1 = 6.392229 SI = 16K 
       data hash MD5: 16K
       3F 16 F7 6D F4 1E FE 25 18 C8 F0 E7 24 94 B0 38>)
(   3,<2025-01-29 14:14:37.73 +0400>,<she>,<DPX200>,
      <pk PHC0 = -21.95549 PHC1 = 28.2 
       data hash MD5: 16K
       EC 6A 5C 62 76 5B 92 72 45 DB 1A 98 9A A1 DF 88>)
(   4,<2025-01-29 14:14:41.68 +0400>,<she>,<DPX200>,
      <abs ABSG = 5 
       data hash MD5: 16K
       03 F1 E2 1F F5 D2 04 79 D6 AD 31 2E 8F 6A 8C 44>)
$$ ##END=
$$ 
$$ hash MD5
$$ 2D 9D FA 9F 27 DB 1A C8 68 4D 50 BE 2C 5B 86 58
##$RELAX= 
##$RELAX= 
##$RELAX= 
##$RELAX= 
##$RELAX= 
##$RELAX= 
$$ Bruker specific parameters
$$ --------------------------
##$DU= <F:/spectra>
##$EXPNO= 1
##$NAME= <H-C>
##$PROCNO= 1
##$TYPE= <nmr>
##$USER= <she>
##$AMP= (0..31)
100 100 100 100 100 100 100 100 100 100 100 100 100 100 100 100 100 100 
100 100 100 100 100 100 100 100 100 100 100 100 100 100 
##$AQSEQ= 0
##$AQ_mod= 1
##$AUNM= <au_zg>
##$AUTOPOS= <>
##$BF1= 200.13
##$BF2= 200.13
##$BF3= 200.13
##$BF4= 200.13
##$BF5= 200.13
##$BF6= 200.13
##$BF7= 200.13
##$BF8= 200.13
##$BYTORDA= 1
##$CFDGTYP= 0
##$CFRGTYP= 5
##$CHEMSTR= <none>
##$CNST= (0..31)
1 1 145 1 1 1 1 1 1 1 1 1 1 1 1 1 1 1 1 1 1 1 1 1 1 1 1 1 1 1 1 1 
##$CPDPRG= <>
##$CPDPRG1= <>
##$CPDPRG2= <>
##$CPDPRG3= <>
##$CPDPRG4= <mlev>
##$CPDPRG5= <mlev>
##$CPDPRG6= <mlev>
##$CPDPRG7= <mlev>
##$CPDPRG8= <mlev>
##$CPDPRGB= <>
##$CPDPRGT= <>
##$D= (0..31)
0 0.7 0 0 0 0 0 0 0 0 0 0.03 0 0 0 0 0 0 0 0 0 0 0 0 0 0 0 0 0 0 0 0 
##$DATE= 1738145653
##$DBL= (0..7)
120 120 120 120 120 120 120 120 
##$DBP= (0..7)
150 150 150 150 150 150 150 150 
##$DBP07= 0
##$DBPNAM0= <>
##$DBPNAM1= <>
##$DBPNAM2= <>
##$DBPNAM3= <>
##$DBPNAM4= <>
$$ [...]
##$SUBNAM3= <"">
##$SUBNAM4= <"">
##$SUBNAM5= <"">
##$SUBNAM6= <"">
##$SUBNAM7= <"">
##$SUBNAM8= <"">
##$SUBNAM9= <"">
##$SW= 18.0517328524113
##$SWIBOX= (0..15)
0 0 2 0 0 0 0 0 0 0 0 0 0 0 0 0 
##$SW_h= 3612.71676300578
##$TD= 16384
##$TD0= 1
##$TE= 0
##$TE2= 300
##$TE3= 300
##$TEG= 300
##$TL= (0..7)
0 120 120 120 120 120 120 120 
##$TP= (0..7)
150 150 150 150 150 150 150 150 
##$TP07= 0
##$TPNAME0= <>
##$TPNAME1= <>
##$TPNAME2= <>
##$TPNAME3= <>
##$TPNAME4= <>
##$TPNAME5= <>
##$TPNAME6= <>
##$TPNAME7= <>
##$TPOAL= (0..7)
0.5 0.5 0.5 0.5 0.5 0.5 0.5 0.5 
##$TPOFFS= (0..7)
0 0 0 0 0 0 0 0 
##$TUNHIN= 0
##$TUNHOUT= 0
##$TUNXOUT= 0
##$USERA1= <user>
##$USERA2= <user>
##$USERA3= <user>
##$USERA4= <user>
##$USERA5= <user>
##$V9= 5
##$VALIST= <valist>
##$VCLIST= <CCCCCCCCCCCCCCC>
##$VD= 0
##$VDLIST= <DDDDDDDDDDDDDDD>
##$VPLIST= <PPPPPPPPPPPPPPP>
##$VTLIST= <TTTTTTTTTTTTTTT>
##$WBST= 1024
##$WBSW= 4
##$XGAIN= (0..3)
0 0 0 0 
##$XL= 0
##$YL= 0
##$YMAX_a= 53447
##$YMIN_a= -70386
##$ZGOPTNS= <>
##$ZL1= 120
##$ZL2= 120
##$ZL3= 120
##$ZL4= 120
##$ABSF1= 15.48907
##$ABSF2= -2.562779
##$ABSG= 5
##$ABSL= 3
##$ALPHA= 0
##$AQORDER= 0
##$ASSFAC= 0
##$ASSFACI= 0
##$ASSFACX= 0
##$ASSWID= 0
##$AUNMP= <proc_1d>
##$AZFE= 0.1
##$AZFW= 0.1
##$BCFW= 0
##$BC_mod= 2
##$BYTORDP= 0
##$COROFFS= 0
##$CY= -3
##$DATMOD= 1
##$DC= 0
##$DFILT= <>
##$DTYPP= 0
##$F1P= 0
##$F2P= 0
##$FCOR= 1
##$FTSIZE= 16384
##$FT_mod= 6
##$GAMMA= 0
##$GB= 0
##$INTBC= 1
##$INTSCL= 3.241238e-09
##$ISEN= 128
##$LB= 0.25
##$LEV0= 0
##$LPBIN= 0
##$MAXI= 10000
##$MC2= 0
##$MEAN= 0
##$ME_mod= 0
##$MI= 1.114404
##$NCOEF= 0
##$NC_proc= -10
##$NLEV= 6
##$NOISF1= 3.799351
##$NOISF2= 2.8
##$NSP= 0
##$NTH_PI= 0
##$NZP= 0
##$OFFSET= 15.73037
##$PC= 1
##$PHC0= 232.9674
##$PHC1= 34.59223
##$PH_mod= 1
##$PKNL= yes
##$PPARMOD= 0
##$PSCAL= 0
##$PSIGN= 0
##$REVERSE= no
##$SF= 200.129958241109
##$SI= 16384
##$SIGF1= 3
##$SIGF2= 2
##$SINO= 0.751879
##$SIOLD= 32768
##$SREGLST= <19F.Aceton>
##$SSB= 0
##$STSI= 16384
##$STSR= 0
##$SW_p= 3612.71676300578
##$SYMM= 0
##$S_DEV= 0
##$TDeff= 16384
##$TDoff= 0
##$TI= <>
##$TILT= no
##$TM1= 0
##$TM2= 0
##$TOPLEV= 0
##$USERP1= <user>
##$USERP2= <user>
##$USERP3= <user>
##$USERP4= <user>
##$USERP5= <user>
##$WDW= 1
##$XDIM= 16384
##$YMAX_p= 396942947
##$YMIN_p= -6002450
$$ End of Bruker specific parameters
$$ ---------------------------------
##NTUPLES= NMR SPECTRUM
##VAR_NAME=  FREQUENCY,     SPECTRUM/REAL,   SPECTRUM/IMAG
##SYMBOL=    X,             R,               I
##VAR_TYPE=  INDEPENDENT,   DEPENDENT,       DEPENDENT
##VAR_FORM=  AFFN,          ASDF,            ASDF
##VAR_DIM=   16384,         16384,           16384
##UNITS=     HZ,            ARBITRARY UNITS, ARBITRARY UNITS
##FACTOR=    0.220516191357247, 1,           1
##FIRST=     3148.11820473525, 0,            0
##LAST=      -464.598558270527, 0,           0
##MIN=       -464.598558270527, -6002450,    0
##MAX=       3148.11820473525, 396942947,    0
$$ Real data points
##PAGE= N=1
##DATA TABLE= (X++(R..R)), XYDATA
$$ [...]
7881B171627O7067Q15710L31332k00687l56139p35807n02644O68996J627461k92850
7871C594066j292636J773975J98341j79292l15674j033213J019824M68951k359198
7862A875144n78242j553971R45773K692590j230656r71929K493349J012643j887235
7853B797466j505208R43791J157621M94006k80583j913306q5280J828040n40747
7844B895800j759217m72090j48824K22395R81979l58758M16003n05456L83652
7835A655484n88144N35693Q31179o44933j114314l36415Q80152J310453O45718
7826C174873j917429j278337J593971J510403J572269q40292j774598k98827k175
7817A739858m98927J02912J028408r45228o46303O95799j194485J251503n19996
$$ y = [2171627, 2238694, 3054404, 3385736, 3185049, 2828910, 2093103, 1590459, 2259455, 3886916, 3594066, 2301430, 4075405, 4273746, 4094454, 3778780, 2745567, 3765391, 4234342, 1875144, 1296902, -257069, 688704, 3381294, 2150638, 1178709, 3672058, 4684701, 2797466, 1292258, 2236049, 3393670, 3887676, 3607093, 1693787, 1608507, 3436547, 2895800, 1136583, 664493, 515669, 738064, 1720043, 1361285, 1777288, 1271832, 1655484, 1067340, 1603033, 2434212, 1789279, 674965, 338550, 1218702, 2529155, 3174873, 1257444, -20893, 1573078, 3083481, 4655750, 3815458, 2040860, 1742033, 1739858, 1240931, 1343843, 2372251, 1427023, 780720, 1476519, 282034, 1533537, 1013541]
7808A013541P43872k17136n38563J568273N52240j637818J111165q55203M92171
7799B232542l16644p81674K80760k78843m88679P26399J786693l29406r57575
7790A873573n04767J181460j865586l92271n2660N07757o9782p63910k30282J152283
7780H35815J376313J57788j86615q12867k45278O40614n40455m52244q67491J483567
7770A389147m60531j091445j44900j038094J129040J552592J91641k120J997077
7761C522407k417627K55883J265100n83142k91290r8239j42204N47424m9525j550864
7751D57923M21393O18432L468447j210055r15809m81134J178683j852760p6686
7742A608434J445195q92809Q59184M98533j165750J255520L13749m64475j150871
$$ y = [1013541, 1757413, 1540277, 1001714, 2569987, 3122227, 1484409, 2595574, 1740371, 2232542, 1915898, 1134224, 1414984, 1136141, 647462, 1373861, 3160554, 2831148, 1873573, 1368806, 2550266, 684680, 292409, 239749, 747506, 677724, -86186, -316468, 835815, 2212128, 2369916, 2183301, 1370434, 1125156, 1765770, 1225315, 773071, -94420, 1389147, 928616, -162829, -307729, -1345823, -216783, 1335809, 1527450, 1525330, 3522407, 1104780, 1360663, 2625763, 2042621, 1751331, 1653092, 1510888, 2058312, 2008787, 457923, 879316, 1497748, 4966195, 3756140, 2840331, 2359197, 3537880, 1685120, 1608434, 3053629, 2160820, 3020004, 3518537, 2352787, 3608307, 3922056, 3457581, 2306710]
7733B306710J512207J418866k104367J86012j60778j202193p38236O22992m52037
7724A389176p71432k12791P35611J215214K337354j78012j442173q66636j73354
7715B032957K13057q80457k730063J377877Q30754Q68315J082027j321012p54660
7706G18795O35171k19020K75439J980004k780896P29136J36266l34918M70694
7697A610671J455241k71432j002302L07950k7262Q22461K77002N03840o84416
7688B991753k39932r22760l356634l57034J855625l75906p62525L129793Q62314
7679B824694Q26576J209309r68451l62269j784943O22249R42686j526470j990233
7670b06852J248645m19456J148982J322757k265683m70991O29543j230977J613934
$$ y = [2306710, 3818917, 5237783, 3133416, 3319428, 3158650, 1956457, 1218221, 1841213, 1389176, 617744, 404953, 1140564, 2355778, 4693132, 4515120, 3072947, 2206311, 2032957, 2246014, 1365557, -1364506, 13371, 844125, 1712440, 2794467, 1473455, 718795, 1353966, 1134946, 1410385, 3390389, 609493, 1338629, 1474895, 1139977, 1610671, 3065912, 2794480, 1792178, 2100128, 2072866, 2895327, 3172329, 3676169, 2991753, 2751821, 1829061, -1527573, -1884607, -28982, -404888, -1167413, 1962380, 2824694, 3651270, 4860579, 3892128, 3529859, 1744916, 2367165, 3309851, 1783381, -206852, 1041793, 622337, 1771319, 3094076, 828393, 357402, 986945, -244032, 1369902]
7661A369902M84581J146179j663670q95061L85973K93352M79989j12486N72663
7652B061422k81698l07613j157706P00897k142266K604148J4414P6362l84460
7643A183500k618868K211343r74020p49339J807549j527113p72680K134697j146183
7634d51114P49778L105375o07767j806682M98605O95168k409772N12037Q83182
7625A168810j513525m76474K641415p10097n30881J327949J68284j32223j828979
7616A14279o52280p80260J075446L17872j13556O50423j480752r65240L66392
7607a467676j44004J025819j200083j093234K211603Q79167k16958j049028p56325
7598a810719J920824j776575j327548P91469j101422R6604O83599L57979J655362
$$ y = [1369902, 1854483, 3000662, 1336992, 441931, 827904, 1121256, 1601245, 1488759, 2061422, 1779724, 1472111, 314405, 1015302, -1126964, 1477184, 1491598, 1567960, 1183500, -1435368, 775975, -198045, -947384, 860165, -666948, -1439628, 695069, -451114, 298664, 3404039, 2796272, 989590, 1488195, 2183363, -226409, 285628, 1168810, -344715, -821189, 1820226, 1110129, 579248, 1907197, 2075481, 1943258, 114279, -538001, -1318261, -242815, 75057, -38499, 611924, -868828, -1834068, -1467676, -1611680, -585861, -1785944, -2879178, -667575, 211592, -5366, -1054394, -1810719, 110105, -1666470, -2994018, -2202549, -3303971, -3207367, -2523768, -2165789, -510427]
7589e10427j572278R96855j15543j008547O19374R25529p12548l51887J093669
7580f35803j990743n20962k91444j23837R82135L85918j174724K318343K499512
7571A448395l56692J14713j101695n69072j52749J583433J148299L75127k195357
7562B94402j040290L07097j709331J425772K306254J386930j964880k99128k497132
7553a790306K91497Q29659L86816k23897k41572J38760J465908J247774k092982
7544A1657m44999j24141J370914q41962p65986m91694J060209j261672Q49413
7535f38261J315559j04039j201207j22045k05455K70522Q5380j965570L9681O28927
7525a896508P55234j73300q87276k00507J622414J373907o88909Q23304l0399
$$ y = [-510427, -2082705, -1085850, -1201393, -2209940, -1590566, -665037, -1377585, -1729472, -635803, -2626546, -3147508, -3438952, -3562789, -2580654, -2194736, -3369460, -1051117, 1448395, 1091703, 1206416, 104721, -464351, -617100, 966333, 2114632, 2489759, 294402, -745888, -438791, -2148122, -722350, 1583904, 2970834, 1005954, 706826, -1790306, -1498809, -669150, -282334, -506231, -747803, -609043, 856865, 2104639, 11657, -433342, -557483, 813431, -28531, -794517, -1286211, -226002, -1487674, -638261, 677298, 573259, -627948, -749993, -955448, -684926, -599546, -2565116, -2525435, -1896508, -1141274, -1314574, -2201850, -2402357, -779943, 593964, -94945, 728359, 697960]
7516F97960o11412j520806k035394j405742J376748L13265k817069J375966R39395
7507c687089L19581Q7813K39095J476711K33950k48380k21343p79506J52978L3210
7497b392980O21069K178917P59926m18210L63583r85728M96717j563807R46811
7488F298K393419k337988r30321J012785k59578j639411M64918M67144j755182
7479b577916k56794K101153j96231q91502R91653r76078N46619j636301K715107
7470a80290R36708k252051J062261J49821J32465N65016j186087q382r12663N61200
7460a132002J368993q84713M85185J231256N1358r80681K5418K014708j419771
7451G59751j110327P58571o58878Q15763j0293m80594q03962p04798K20154j891414
$$ y = [697960, 86548, -1434258, -3469652, -4875394, -3498646, -3185381, -6002450, -4626484, -3687089, -3367508, -3279695, -3040600, -1563889, -1329939, -1578319, -1799662, -2579168, -2426190, -2392980, -1771911, 407006, 1166932, 748722, 1112305, 126577, 623294, -940513, 6298, 2399717, 61729, -868592, 144193, -115385, -1754796, -1289878, -822734, -2577916, -2834710, -733557, -929788, -1821290, -829637, -1805715, -1259096, -2895397, -180290, 756418, -1495633, -433372, -283551, -151086, 413930, -772157, -780539, -1693202, -1132002, 236991, -647722, -162537, 1068719, 1120077, 139396, 164814, 2179522, 759751, -350576, 407995, -250883, 564880, 554587, 73993, -729969, -1434767, -1214613, -3106027]
7441c106027J90543J795393M6624K020247N2846j425252J9970J738262k685532
7432a352926m65307P99668m76083J604995n94431k065290Q27143J134608j518491
7423b106114K327079J158925o5526k438694j519282J401162l46306K436251P06208
7414A553703j271294k0502r16114l3181Q87325M87837n49702J45152r48407m28832
7404a094015L00169k66221J334673R94410P70732k714567j295712K95513O69076
7395a005942M1541M74231j713769N14008l95054K0250j52375p32633J556530M44569
7385i48644m59904j892875n74362K966347J641431l41536j86806q31740j150100
7376a778189k70802L67274j9580k68181k62158K460074j077686M42173M51477
$$ y = [-3106027, -2915484, -1120091, -1073467, 946780, 999626, -425626, -405656, 1332606, -1352926, -1818233, -1018565, -1494648, 110347, -484084, -2549374, -1722231, -587623, -2106114, 220965, 1379890, 1314364, -1124330, -2643612, -1242450, -1588756, 847495, 1553703, 282409, 261907, -654207, -687388, 199937, 687774, 138072, 283224, -665183, -1094015, -793846, -1060067, 274606, 1269016, 2039748, -674819, -1970531, -1675018, -1005942, -964401, -490170, -2203939, -1689931, -2084985, -2064735, -2217110, -2949743, -1393213, -948644, -1408548, -3301423, -3875785, -909438, 731993, 390457, 203651, -628089, -1778189, -2048991, -1681717, -1701297, -1969478, -2231636, 228438, -849248, -407075, 44402]
7367D4402k798632P24386j315276J327684R25175o15276n8135N84285Q43448j770665
7357b108604k48344l66365j555830M33114J084499k87922J50570J883700k38654
7348a253836j961439J333161k39462J388167P63648p6431J468577j632478r98949
7339a209042J912232j548837k449812K98005K867503j666544j397010J204020
7331a989485K71924N09150l41932M59598M5590J235601k16908q4726j827152J457557
7321d80783r72878p61665N68938L63219K299429p39357j319814P01641j133105
7312a474375k536333m68873J110197k65274j30319J340848L74164o76205K35334
7303b490836Q11235J604502n32858r00605R46956j865387Q03329L29970R91532
$$ y = [44402, -2754230, -2029844, -3345120, -2017436, -1092261, -1707537, -1765672, -1181387, -337939, -2108604, -2356948, -2723313, -4279143, -3846029, -2761530, -3049452, -2898882, -1015182, -1253836, -3215275, -1882114, -2121576, -733409, 30239, -46192, 1422385, -210093, -1209042, 703190, -845647, -3295459, -2997454, -129951, -1796495, -3193505, -1989485, -1717561, -1208411, -1550343, -1090745, -1045155, 190446, -26462, -111188, -1938340, -480783, -1453661, -2215326, -1646388, -1283169, 1016260, 276903, -1042911, -341270, -1474375, -4010708, -4479581, -3369384, -3634658, -3764977, -2424129, -2049965, -2726170, -2490836, -1679601, -75099, -607957, -1508562, -561606, -2426993, -1623664, -1293694, -302162]
7294c02162n80498m15145k27424n30117j191030J255551P05760K09088K82525
7285g93452q97669K62463Q39058k89245P7562R87094M03670M444P87435k78408
7275A102952q55312r07778N30821k413238J97918K024228n79580k090453M77863
7266b512579K36961J138647L77292K99872P32765j413351p39862J541380m83540
7257h22415j221313J345798k218660M92565O5301L09254J51307M20200p77748
7248b255711J236865p79449J48050J731502j591495j080673Q34992k59657O62728
7239a352848J87875p07078M92809J82656m88622N27406J602290M49812j68628
7230G25672m72370j193514Q29072J29034k475294o42730K792849k93072j363524
$$ y = [-302162, -882660, -1297805, -1525229, -2055346, -3246376, -1990825, -1285065, -1075977, -793452, -1691121, -1428658, -589600, -878845, -801283, 185811, 589481, 593925, 1381360, 1102952, 247640, -660138, -129317, -2542555, -2344637, -320409, -899989, -2990442, -2512579, -2275618, -1136971, -759679, -459807, 272958, -1140393, -1880255, -338875, -822415, -2043728, -697930, -2916590, -2424025, -2358724, -2049470, -1898163, -1477963, -2255711, -1018846, -1798295, -1650245, 81257, -1510238, -2590911, -1755919, -2015576, -1352848, -1164973, -1872051, -1379242, -1196586, -1685208, -1157802, 444488, 894300, 725672, 253302, -940212, -111140, 17894, -2457400, -3100130, -307281, -600353, -1963877]
7221a963877l2995j850666J927314O46099k411930K406336j049858J032380J431545
7212A34348m09084K22446J15757j325797m64650J223015n2320L61681j172075
7203a366679r38284j499892j62909R34147K06086J229235k50009M69848K65993
7194a112464P47061l55976j881897O64329p2618Q34676n12564K065507j549437
7185a173383m97390K191496p20420j883590M35963j49537j311032J797993m17129
7176a727029j301200J93634M22493K64452k96571L34491J797658M09803l54039
7167b56308j7082o57388L92314r33063j365629J372159k96051j696230J351513
7158b105765L27527o05321Q93921J445031l11051q48991r70018m7954J299748
$$ y = [-1963877, -1996872, -3847538, -1920224, -1274125, -3686055, -1279719, -2329577, -1297197, 134348, -274736, -52290, 63467, -1262330, -1726980, -503965, -556285, -194604, -1366679, -2304963, -3804855, -3967764, -3033617, -2827531, -1598296, -1848305, -1378457, -1112464, -365403, -721379, -2603276, -1938947, -2011565, -1176889, -1689453, 376054, -1173383, -1670773, 520723, -199697, -2083287, -1647324, -1796861, -3107893, -1309900, -1727029, -3028229, -2834595, -2412102, -2147650, -2444221, -2109730, -312072, 97731, -256308, -273390, -930778, -538464, -1471527, -2837156, -1464997, -1761048, -3457278, -2105765, -1778238, -2383559, -1489638, -44607, -355658, -1204649, -2174667, -2222621, -922873]
7149i22873J382288j219662o99559J317636M42738j376526j371989J8311J732891
7140f96745j9035j260094j207877P15441j77336J156540j061945r59848P95957
7131b714942j399384L53042M25942O35730K31229n5784K605736k010426j098950
7122c027807K356707O6017j690557j375005J924054j189462k86127n35689K138845
7113a619024j121089m94875j69673J657369R77821l35057o72540o27148K168318
7104b35898o45849j819454q7647j40629L19188n3959L51555J263525m75004p88597
7094b312769L6856L70357M59353j731318L45947J058519k94671j553m91719n48939
7084c109937J646875P10734j074714n24839K534538K68982k872060n9011K511884
$$ y = [-922873, 459415, -760247, -1459806, -142170, 300568, -1075958, -2447947, -2429636, -696745, -715780, -1975874, -3183751, -2468310, -2645646, -1489106, -2551051, -3510899, -2714942, -4114326, -3761284, -3335342, -2699612, -2468383, -2524167, 81569, -1928857, -3027807, -671100, -605083, -2295640, -3670645, -1746591, -2936053, -3222180, -3757869, -1619024, -2740113, -3234988, -3404661, -1747292, -769471, -1104528, -1777068, -2404216, -235898, -881747, -2701201, -2788848, -2929477, -2610289, -2664248, -2312693, -1049168, -1524172, -2312769, -2275913, -1905556, -1446203, -3177521, -2831574, -1773055, -2067726, -2069279, -2560998, -3109937, -1463062, -752328, -1827042, -2351881, 182657, 451639, -2420421, -2479432, 32452]
7075C2452o23955J091798N02692k22729j983182j258116J025408j85385P44711
7066h76306j444495J370503k13808J7375j014148l49256J063723M31100j016472
7057b031784j063492J56290K879027J029560k337517o47522K916894J90573J49087
7048A241116M93709k414596j482874l30286m37514J269985J233520L90291j282211
7039a318860m9214p44890m78489n95447R08174J08819N20538J437690K6014m24997
7029f10662J07165J626256j382109k51157j603058k975959J908078K477271j047190
7020a751365P5081j929804l62881J489867R24128j382947r79578K173452P67237
7011i76810K64628j89120J942082k105879k99119J661035n98681Q06986k450957
$$ y = [32452, -591503, 500295, 1002987, 780258, -1202924, -2461040, -1435632, -1621017, -876306, -2320801, -950298, -1164106, -1146731, -2160879, -2510135, -1446412, -1015312, -2031784, -3095276, -2938986, -59959, 969601, -1367916, -2015438, 901456, 1092029, 1241116, 1734825, -679771, -2162645, -2492931, -2930445, -1660460, -426940, -36649, -1318860, -1368074, -2112964, -2591453, -3186900, -2278726, -2169907, -1649369, -211679, -185665, -610662, -503497, 1122759, -259350, -510507, -2113565, -5089524, -3181446, -704175, -1751365, -1676284, -3606088, -3968969, -2479102, -1554974, -2937921, -3917499, -1744047, -976810, -712182, -901302, 1040780, -1065099, -1364218, 296817, -301864, 505122, -1945835]
7002a945835o31058M19177P72560j078769K88950N87678P65367n95391k42081
6993a659402K142851p78377l332j692230K67541J417038j224483P1160l37627
6984a796861P75425l68263l13513L25106J274036P8018j768015p22539j26875
6975b643481R71841q00436j230892J219172L229630l030481j369099K675398l50863
6966a329211q16544L25475j624350K44089O59820R54140R99921l45328O57281
6957b74707o50512L0678m32322P05542N53579K25784J818115j033766k393606
6948a451215k179102J828848Q58205j651985R6064R03176J223029j108967n63216
6939b045163j32694j087406J449033Q26995J619818K00636k042731Q36638m85445
$$ y = [-1945835, -2576893, -2157716, -1385156, -2463925, -2174975, -1587297, -821930, -1417321, -1659402, 483449, -294928, -298260, -1990490, -1722949, -305911, -1530394, -1459234, -1796861, -1021436, -1389699, -1703212, -1378106, -104070, -26052, -1794067, -2516606, -2643481, -1671640, -2472076, -3702968, -2483796, 745834, -2284647, -3653746, -978348, -1329211, -2145755, -1820280, -3444630, -3200541, -2540721, -1586581, -586660, -931988, -274707, -925219, -894541, -1326863, -621321, -67742, 158042, 1976157, 942391, -1451215, -3630317, -1801469, -943264, -2595249, -2499185, -1596009, -372980, -1481947, -2045163, -2177857, -3265263, -1816230, -989235, 630583, 831219, -1211512, -374874, -860319]
6930h60319L12876J236872j51409R8071j10799K21013j270146m860n29006l1321
6920a089028j302468K128311r8133k59415k286467l19160K314056J83326K394879
6911A665901k1985O22346k38342j88700j373248L7088j163455K26681j156761
6902a590475q75154J874666J341908q73134l9338j035475j571199p31106J164345
6893b334962p20764q5549l56231N51415J33426Q00264p56867J61995M68705J711221
6883d27347k046828j06078O78614O54120K041554k683341j376874O41987J215109
6874a409084J88927m07280n61601P92365J183415r91319P55678k48582J0064L16675
6864c70742k189296q51753J710419M3577K106215n36595k061915o86165K137393
$$ y = [-860319, -547443, 689429, 538020, 636091, 525292, 746305, -523841, -528701, -1057707, -1089028, -2391496, -263185, -361318, -620733, -2907200, -3226360, -912304, -728978, 1665901, 1643916, 2266262, 2027920, 1839220, 465972, 503060, -660395, -433714, -1590475, -2465629, -590963, 750945, -122189, -161527, -1197002, -2768201, -3499307, -2334962, -3055726, -3141275, -3497506, -2946091, -2812665, -2012401, -2769268, -2607273, -2138568, -427347, -2474175, -2580253, -1901639, -1247519, 794035, -1889306, -3266180, -2624193, -1409084, -1220157, -1627437, -2189038, -1396673, -213258, -1204577, -448899, -697481, -687417, -370742, -2560038, -3411791, -1701372, -1657795, 448420, -88175, -2150090, -2836255, -698862]
6855f98862L38669j953182K325754j185576L895488j113439k719291n34092J160052
6846d84479p86190k51516J98982J160469N26862k26313m90159j302886Q25235
6837h29995k16064k52522L26626l43236j04052K69491J056855O17347j481315
6828i56865J171147j221706j636503K466155Q34523j129505j2109j552319n51116
6819b588298m26382J574451P83919k060229K142100k64697J518761j741401q54911
6810a916687q6858J657809P38781k297044j062429j0595K032958J238543k56291
6801C8187J812117k383554k614526L343079O39867j317846q47438l44928O09767
6792a065275j694950P51333J087033o36804j617455r14112M41660J926670P46190
$$ y = [-698862, -360193, -2313375, 12379, -1173197, 2722291, 1608852, -1110439, -1644531, -484479, -1270669, -1522185, -1323203, -162734, 364128, 137815, -352344, -1655230, -829995, -1046059, -1298581, -971955, -1315191, -1419243, -1149752, -92897, 524450, -956865, 214282, -1007424, -2643927, -177772, 656751, -472754, -484863, -2037182, -2588298, -3014680, -1440229, -656310, -2716539, -574439, -839136, 679625, -1061776, -1916687, -2003545, -345736, 393045, -1903999, -2966428, -2977023, -944065, 294478, 38187, 1850304, -533250, -3147776, 195303, 835170, -482676, -1330114, -1675042, -1065275, -2760225, -2008892, -921859, -1558663, -3176118, -4090230, -3648570, -1721900, -975710]
6783i75710m11526n83706J834369J129164j995091m23514l72451J222349l90683
6774i66799j036652R47172k52902J237646J112446o02395j089361o60219J919889
6765F08825o88630l353865O31680J895777N06838Q47163j970940R92473J74214
6756c56465j358008j60031K44041L51449l29350j436843K364599M24829j4675
6747b70454o82410J369439r80613k526748M788496j577292j687338J181450j007041
6738a392511J445469j676584n86793J207850J520356M48038j518888L39996o48626
6729h61693k15136M78784j621286j686695J698963K377653r90337o94778L53175
6720a161350J08300j846865J025504P33461m06417j651231J435740K219321j745692
$$ y = [-975710, -1387236, -1970942, -136573, 992591, -1002500, -1426014, -1798465, -576116, -966799, -2003451, -1056279, -1309181, -71535, 1040911, 438516, -650845, -1311064, 608825, -79805, -3433670, -2801990, -906213, -399375, 447788, -1523152, -530679, -356465, -1714473, -1874504, -1630463, -1279014, -1608364, -3045207, -680608, -255779, -270454, -952864, 416575, -564038, -3090786, 1697710, 120418, -1566920, -385470, -1392511, 52958, -1623626, -2210419, -1002569, 517787, 965825, -553063, -213067, -861693, -1076829, -598045, -2219331, -3906026, -2207063, 170590, -819747, -1514525, -1161350, -1053050, -2899915, -1874411, -1140950, -1547367, -3198598, -1762858, 456463, -1289229]
6711a289229k39131O57926m18503J469705j044304k098553P67321Q02341J034219
6702c58208N349O47387m74753K02551k65622Q6878P70640N04796k470185j025060
6692b376227J520442q58822R58175j84345J098800J022194j295950L21919K73146
6683D79332M83204p02331q56322j528513o10932K223277J001135K86214j365796
6674e90732r50198J11359l82675l71568K2277J44629j281674N18075n0172m96364
6664c327043J555006k1971q20161o75825l85868J612063J120371N88713r81525
6655a336240j491809R71723o0899R61047J14373p33570J155826l26492r57127
6646a703168j606712K56512O60099L37235J233947m13253k854896K61638J215639
$$ y = [-1289229, -1528360, -870434, -1288937, 180768, -863536, -2962089, -2194768, -1392427, -358208, -352859, 294528, -180225, 22326, -243296, -156418, 614222, 1119018, -1351167, -2376227, -855785, -1714607, -756432, -940777, 158023, 1180217, -115733, 206186, 479332, 962536, 260205, -596117, -2124630, -2735562, -512285, 488850, 775064, -590732, -1540930, -1429571, -1812246, -2183814, -2161537, -2016908, -3298582, -2780507, -2830679, -3327043, -1772037, -1794008, -2614169, -3289994, -3675862, -2063799, -943428, -354715, -1336240, -2828049, -1856326, -1917225, -956178, -841805, -1575375, -419549, -746041, -1703168, -3309880, -3053368, -2393269, -2056034, -822087, -1235340, -4090236, -3828598, -2612959]
6637b612959J558847N95959r31998J171805J73383J784283l652324j434117K75073
6628c072048J605359J129727R29551k43395j205041J944929p2665k483666M35425
6619a031824J249041j253064J338293r59303j691282o79051L269000J084519p85834
6610E40495o2494r10748r69884Q04883O19778j244k347343J105288p18186K649649
6600G10194k94121K2429J953825k505113j000484m28438K89403O48284l0375j349981
6590a984377l53994P96423r88249K816302J538182j500602l12396J643796L65816
6581B020901j176568r04414K78455n77375O0164R72904j711906M47873J94021
6572c95945K140727q0343r27482j058268m02482J452431j494081j566811J515711
$$ y = [-2612959, -1054112, -458153, -1390151, -218346, -44963, 1739320, -1913004, -3347121, -3072048, -1466689, -336962, 592589, 349194, -855847, 1089082, 1016417, -1467249, -1031824, 217217, -1035847, 302446, -656857, -2348139, -3027190, 241810, 1326329, 540495, 478001, -432747, -1402631, -597748, 22030, 20786, -2326557, -1221269, -1939455, 710194, 416073, 438502, 2392327, -112786, -1113270, -1541708, -1252305, -604021, -634396, -1984377, -2338371, -1541948, -2530197, 286105, 1824287, 323685, 11289, 1655085, 2020901, 844333, -60081, 218374, -359001, -298837, 674067, -1037839, -589966, -395945, 1744782, 1664439, 736957, -321311, -723793, 728638, -765443, -2332254, -816543]
6563h16543p64006J296396R21595j073551J023225K51688M89169R9945k728768
6554a300850k467016J481285O96465J546186L67639p35859L53200P6891L97601
6545D15542r7356m53291j27110q87992k889566J900197L76436J730826J362570
6536A330256n27488m37790N91208r76284m13143l81073K30489L74417m22915R51261
6526C18938j878355p91381J63290m27214K789548r39563k130606J594587n21166
6517a821922n34190m56108J427891J189085Q12893j336154j93930n51295k47048
6508a710778K688853K42834k32405j505987m48517K096920j67309k251011k82802
6499a570202J341807J70012j20410j226850j462133J006740p19103J20982R27246
$$ y = [-816543, -1580549, -284153, 637442, -436109, 587116, 838804, 1327973, 1427918, -1300850, -3767866, -2286581, -1590116, -43930, 323709, -412150, -58950, 17941, 415542, 318186, -135105, -262215, -1150207, -4039773, -2139576, -1763140, -32314, 1330256, 802768, 364978, 956186, -20098, -433241, -814314, -583825, -209408, -632323, 318938, -1559417, -2350798, -2187508, -2614722, 174826, -764737, -2895343, -1300756, -1821922, -2356112, -2812220, -1384329, -195244, 617649, -718505, -912435, -1463730, -1710778, 978075, 1220909, 988504, -517483, -966000, 1130920, 963611, -1287400, -1570202, -228395, -58383, -178793, -1405643, -2867776, -1861036, -2580139, -2459157, -1531911]
6490a531911J162682L40692o71765k790714M74761K081282J153649o47480P15366
6481B86562J574293j182549j308809j133600O03471K581186o34097j306318L07762
6472b12099j403646L29803j011024l31489Q74659J115391M01908P47130k85327
6463B25306l648501J334654J306788p14388k389645K298917J382487j685426P40548
6454a149260k74638M46934J911256r43748k89346L90048j628470n29083K058585
6445g722Q20665L49387l53612j137013O65618o60743Q38806o34764j15308j284402
6435a519088Q85368P08669K71180J134522l11015q09934j28452j040548K125387
6426A316089L6337M50415m35080M48950J2219r92241j196366p44806J995799M51711
$$ y = [-1531911, -369229, -28537, -700302, -3491016, -3016255, -934973, 218676, -428804, 286562, 1860855, 678306, -630503, -1764103, -1160632, 1420554, 786457, -519861, -212099, -1615745, -1285942, -2296966, -2628455, -1753796, -638405, -236497, 510633, 225306, -3423195, -2088541, -781753, -1496141, -3885786, -1586869, -204382, -1889808, -1149260, -1423898, -976964, 934292, -9456, -298802, 91246, -1537224, -2066307, -7722, 812943, 1162330, 808718, -328295, 337323, -323420, 515386, -119378, -234686, -1519088, -633720, 74949, 346129, 1480651, 1169636, 359702, 231250, -809298, 1316089, 1352426, 1802841, 1367761, 1816711, 1828930, 836689, -359677, -1104483, 891316, 1343027]
6416A343027j740795K002937L49964N03410p49721o26128r133p70344J059712
6407A362929L91080m14880k190073k40232k66738J119696J578729k14321k108707
6398i82517J274136J06411j579365J690720J896256p63841j573394j702072k70045
6389a903711J615524r14532J691566N4913p34974j029244J630076L57678k062286
6380a294990m36352O90318m76098R51582r9535j269634J564152K29190J545461
6371A404094n1330j044876l001893o88020Q96908P80569J786533J435485k639965
6362a122495R78926J014938O13541j875617M31208K935331J042266q3747j468561
6353B465790l068458j065571m85224J484773l48415M76876J717181j302200l70454
$$ y = [1343027, -397768, 1605169, 1955133, 2458543, 1708822, 1082694, 1073561, 303217, 1362929, 1754009, 1339129, -850944, -1091176, -1357914, -238218, 1340511, 1126190, -982517, 291619, 398030, -1181335, 509385, 2405641, 1641800, 68406, -1633666, -1903711, -288187, -1202719, 488847, 543760, -191214, -1220458, 409618, 767296, -1294990, -1731342, -1041024, -1517122, -565540, -665075, -1934709, -370557, -141367, 1404094, 1352764, 307888, -2694005, -3382025, -2485117, -1704548, 81985, 1517470, -1122495, -143569, 871369, 1484910, -390707, 40501, 2975832, 4018098, 3934351, 2465790, -602668, -1668239, -2153463, -668690, -1017105, -540229, 1176952, -125248, -495702]
6344d95702J074164N01053k707244L316718j31502j13352M26235k028119l22878
6335d80627n48310l37849J335440J907139k027805L49697j97066O22629j402162
6326g78914O32627N55135j604289l26713j76834J150876q10342R58698J078225
6317F78469J6396j96896k45607j465904J773545l424587J435470K177156L32773
6308A080815k475167j875279J268286P00650R23224j571782N88431K302979J003072
6299A945229l22845j084058O9749J204510k079591K83826r36188l37839r88635
6290b245842K2980K838700k903425J43720O04755O93726j273617k434761L856318
6281f97446J738419n99104p54558J177742k09835J319541j340816n88943K70081
$$ y = [-495702, 578462, 1079515, -1627729, 1688989, 1557487, 1444135, 1870370, -157749, -480627, -1028937, -1366786, -31346, 1875793, -152012, 197685, 619, 623248, -778914, -146287, 408848, -1195441, -1522154, -1698988, -548112, -1358454, -399756, 678469, 694865, 497969, 252362, -1213542, 560003, -2864584, -1429114, 748042, 1080815, -1394352, -3269631, -2001345, -1300695, -377471, -1949253, -1360822, 942157, 1945229, 1622384, 538326, 608075, 1812585, -267006, 16820, -919368, -1257207, -2245842, -2222862, 615838, -2287587, -2143867, -1539112, -845386, -2119003, -4553764, -697446, 1040973, 441869, -312689, 865053, 655218, 1974759, 633943, 45000, 315081]
6272C15081K880416k076156l83951j274645k51558J026918Q24185L69139p37361
6263F92068l18112N71371O11994k727073J139947q24192O92801Q95023J749072
6254B482899k081132p25981j209732m52958J542677J958765j346446j540525o74644
6245b047077J075238K489434R54237j582780l981036Q47513N62552M04027k97725
6236a575617J610573J257046p81190K207945j75249N71261J012391l095082r97085
6227C4993Q68700J819727j80672O60199m91611k19714k8402N16592N80212n92013
6217B968011N9489j868844N12819j431509J89618L19940j35110L96970J661460
6208B672844n36739n50356O62959j930611m69543K268934k23084J012417K0582
$$ y = [315081, 3195497, 1119341, 735390, -539255, -790813, 236105, 1060290, 1429429, 692068, 373956, 945327, 1557321, -1169752, -29805, -853997, -161196, 733827, 2482899, 401767, -324214, -1533946, -1986904, -444227, 1514538, 168092, -1372433, -2047077, -971839, 1517595, 2471832, 889052, -3091984, -2244471, -1681919, -1277892, -1575617, 34956, 1292002, 510812, 2718757, 2543508, 3114769, 4127160, 1032078, 34993, 903693, 2723420, 2542748, 3202947, 2711336, 2491622, 2463220, 2979812, 3560024, 2968011, 3027500, 1158656, 1671475, 239966, 429584, 749524, 614414, 1011384, 2672844, 2136105, 1585749, 2248708, 318097, -151446, 2117488, 1894404, 2906821, 2927403]
6199B927403j150227R50842j071600p15474J189427m60838j781065O04407n05312
6190a2437J146036j17910J695841n8681j241866k405223k6144K74911K897159
6181B151686O60255n87909k192653j118178L61361M61638M55935l6396J679168
6172A834907j598356J036846K10843m66753n889k67559j6260J147479n99489K16870
6162A492639J36232O93559Q46213m75467j861360J76556q12377O17118j380868
6153e67755j89768n77239L356127J086814k25729j277335J440898j097082q03026
6144A145905j077064j357583J840908r74426j82512j41852P36894J338366l70059
6135I58577O777R13956j489641J313552K175051j912247o87648J055917k88214
$$ y = [2927403, 1777176, 2728018, 1656418, 940944, 2130371, 1669533, -111532, 492875, -12437, 1133599, 1015689, 2711530, 2652849, 1410983, -994240, -1020384, -745473, 2151686, 2811941, 2224032, 31379, -1086799, -725438, -263800, 192135, 155739, 1834907, 236551, 1273397, 1484240, 1017487, 1011598, 744039, 727779, 1875258, 1275769, 1492639, 1628871, 2322430, 3168643, 2693176, 831816, 1008372, 195995, 813113, -567755, -757523, -1334762, 2021365, 3108179, 2882450, 1605115, 3046013, 1948931, 1145905, 68841, -1288742, 552166, -422260, -604772, -746624, -9730, 1328636, 958577, 965354, 1879310, 389669, 1703221, 3878272, 1966025, 1278377, 2334294, 2046080]
6126B046080P91274J95110o73345j464965k376084J450486k32929o93584J057305
6117I9348q37385J512048Q76893N40141O62812K600270l640911J02823Q50332
6108B766371j797752J115966J176318j78126k6509J1006Q63512p79937O07808
6099C758657L10193j845553l83966Q84675N25979R57177o15346j355313J174804
6090C411307L94081j720071R47829o29079P45813Q3057M89257l082335O40284
6081A280143K028910J351117p67064j028744p849q53795m70488J558031K51194
6072C341455N98000J186960l926127J050571m73431r27509N8060L86439o30543
6063F63875J521990o4070m76467N73518k03239J589320J502087N9048k368932
$$ y = [2046080, 2837354, 3032464, 2359119, 894154, -1481930, -31444, -264373, -957957, 99348, -738037, 774011, 1650904, 2191045, 2853857, 5454127, 1813216, 1916039, 2766371, 968619, 2084585, 3260903, 3082777, 3056268, 3067274, 3930786, 3150849, 3758657, 4068850, 2223297, 1839331, 2724006, 3249985, 4207162, 3591816, 2236503, 3411307, 3805388, 2085317, 3033146, 2404067, 3149880, 3232937, 3722194, 639859, 1280143, 3309053, 4660170, 3893106, 2864362, 2856513, 2002718, 1532230, 3090261, 3341455, 3939455, 5126415, 1200288, 2250859, 1777428, 849919, 907979, 1294418, 663875, 2185865, 2121795, 1645328, 2218846, 2015607, 3604927, 5107014, 5166062, 2797130]
6054B797130P43268Q24715j044649o09825n10098K41058k9050J109654K836042
6045F358245j693748l097862j296640M96329N42908O62805J885832q67924L5493
6036C025438j286547p56300J457898k97677k707278J596571J424437R24212P88799
6027D169553J62257j146546m29398p19460k8524K118125O98903m11014j155898
6018C257998j534361K329929J201313k108744j732617J402027j019520M83075
6010B279100J153528l68267J586415O69465r41026R4282K186950k198480p8551
6001D383416j07322M31668p3814j47256j198884p6229Q08234l66108J307612p40553
5991D220764M88752J50794j571409j608224J287456K309988J332589n01745j261295
$$ y = [2797130, 3540398, 4365113, 3320464, 2710639, 2200541, 2441599, 2412549, 3522203, 6358245, 4664497, 1566635, 269995, 766324, 1309232, 1972037, 3857869, 2989945, 3025438, 1738891, 982591, 2440489, 2142812, -564466, 1032105, 2456542, 3380754, 4169553, 4331810, 3185264, 2755866, 2036406, 2007882, 4126007, 4824910, 4413896, 3257998, 1723637, 4053566, 5254879, 3146135, 1413518, 2815545, 1796025, 2279100, 3432628, 3064361, 4650776, 5320241, 4379215, 4473497, 6660447, 4461967, 4383416, 4276094, 4707762, 4633948, 4486692, 3287808, 3211579, 4019813, 3653705, 4961317, 4220764, 4709516, 4860310, 3288901, 1680677, 2968133, 5278121, 6610710, 6108965, 4847670]
5982D847670j694167K041525j963017p07343P32019J99281n2610j079076O75843
5973C000125P59020O53389P97646M75476L39370q7940m32605J79007K90953j421342
5963D553099p72866J069412o07754J151719Q00412r40021q49021o23686R08978
5954D690272M48191J535617N88140j623607m38491r49879P52242j42859m48341
5945D411285m72837L416189N1424j526695q71119P9977j069691k31480J060603
5936D847656P44397J010666k517024j173352J144362R21257R80249l72820J92807
5927E778198J063276o7746k355590N9145J054158J560956m8900j038785o19079
5918E385633j940524J419374J549872J532253j703695o47174j100303Q7081J811266
$$ y = [4847670, 3153503, 5195028, 3232011, 2524668, 3256687, 3455968, 3403358, 2324282, 3000125, 3759145, 4412534, 5210180, 5685656, 6025026, 5937086, 5504481, 5683488, 5974441, 4553099, 3780233, 4849645, 4241891, 5393610, 6194022, 5254001, 4404980, 3781294, 4690272, 5138463, 6674080, 7262220, 5638613, 5200122, 4250243, 5002485, 4859626, 4411285, 3938448, 7354637, 7406061, 5879366, 5008247, 5088224, 4018533, 3787053, 4847656, 5592053, 6602719, 4085695, 2912343, 4056705, 4977962, 5958211, 5585391, 5778198, 6841474, 6773728, 4418138, 4477283, 5531441, 7092397, 7043497, 6004712, 5385633, 3445109, 4864483, 6414355, 7946608, 6242913, 5595739, 4495436, 4582517, 6393783]
5909F393783K085357k760647k26919J706499j211830q47838m94266m36971j164826
5900C042342N52965J764676J125818N60823J476161k847942j476426M0819K718748
5891F957984p22295J731670J804556l80366q77048q7215j976820l67608K067505
5882H150363r40912J025443l18947K50467j451456j737963K73147K876475j313946
5873F812671Q08675K128884r70324j758230j168634l16510j825975K22549J392763
5864E325869O01931O95487K560204j176857k435066J653647J271963l109791J648974
5855G036361P28706j576165J36559Q36683J293931r35950N56041O9584j611925
5846F533825j066020J500105K421369m83249j512591R39837k730615j75049R96973
$$ y = [6393783, 8479140, 5718493, 5491574, 7198073, 5986243, 5138405, 4644139, 4207168, 3042342, 3595307, 5359983, 6485801, 7046624, 8522785, 5674843, 4198417, 4239236, 6957984, 6235689, 7967359, 9771915, 9391549, 8514501, 8427286, 6450466, 6082858, 8150363, 7209451, 8234894, 7915947, 8166414, 6714958, 4976995, 5250142, 8126617, 6812671, 7621346, 9750230, 8779906, 7021676, 5853042, 5536532, 3710557, 3933106, 5325869, 5927800, 6623287, 9183491, 8006634, 5571568, 7225215, 8497178, 5387387, 7036361, 7765067, 6188902, 6325461, 7162144, 8456075, 7520125, 8076166, 8145750, 6533825, 5467805, 6967910, 9389279, 8906030, 7393439, 8333276, 5602661, 5427612, 6424585]
5837F424585Q97365J409561j803867p87752r3657j8212L17658K571810o03223
5828H314268j384905j166642N99360J00627K139890p06429J54717n19969p2084
5819G458833R1603j130268J513440r80452J15373M05052K297361m74626j460122
5810G836194j030999K19878r88414Q87525J002598l0844N0976J051209Q42217
5801I840340K56476p4162Q34958j478929n57739J546458N27812k74818o90918
5792I929478j593120N6470r60387n49497Q40002P77779K86875J360808P50762
5783A0899170k384003j252821J980286O32461P57284J852289n39994p58731q05166
5774A0380775J078786J780735q25430j409923L63568k242447K56453Q57459m39391
$$ y = [6424585, 7321950, 8731511, 6927644, 6139892, 6046235, 6028023, 6345681, 8917491, 8314268, 6929363, 5762721, 6362081, 6462708, 8602598, 7896169, 8050886, 7530917, 7458833, 7550436, 6420168, 7933608, 6953156, 7068529, 7473581, 9770942, 9296316, 7836194, 6805195, 7025073, 6036659, 6924184, 7926782, 7895938, 7946914, 8998123, 9840340, 10096816, 10022654, 10857612, 9378683, 8820944, 10367402, 10895214, 10620396, 9929478, 8336358, 8392828, 7432441, 6882944, 7722946, 8500725, 8787600, 10148408, 10899170, 8515167, 7262346, 9242632, 9875093, 10632377, 12484666, 11944672, 11185941, 10380775, 11459561, 13240296, 12414866, 11004943, 11368511, 9126064, 9382517, 10239976, 9800585]
5765I800585J694979Q53130p50558p71619K67054J683526N2601p54602r53566
5756A1121530J105683Q83302J024034o48019n89128l49647J10669K745942k88469
5747A5115897j442415l73698j595027r30095j566795J012017K663403J127465
5739A4010752q21680j098323Q2659j741292J564478j230951j306189J961621O71181
5730A2092256L140574J361309p32161k884670j106408J969789k631319J390601
5722A2599971J463891j895122K130473j65933J465035l13268l74762O81452m165536
5713A1426201J371746J11405m2639O39680O15798j551849J052838M09508L23982
5704A4356670P96741j266488j632925j244184K161139O82371J133772M53411m08922
$$ y = [9800585, 11495564, 12348694, 11598136, 10826517, 11093571, 12777097, 12829698, 12075096, 11121530, 12227213, 13110515, 14134549, 13486530, 12897402, 12547755, 12658424, 15404366, 15115897, 13673482, 13299784, 11704757, 10774662, 9207867, 10219884, 12883287, 14010752, 13189072, 12090749, 12173408, 10432116, 11996594, 10765643, 9459454, 11421075, 12092256, 15232830, 16594139, 15861978, 12977308, 11870900, 13840689, 11209370, 12599971, 14063862, 12168740, 14299213, 14133280, 15598315, 15285047, 14910285, 15591737, 11426201, 12797947, 12909352, 12866713, 13506393, 14122191, 12570342, 13623180, 14032688, 14356670, 15153411, 13886923, 12253998, 11009814, 13170953, 13853324, 14987096, 15440507, 15031585]
5695A5031585k282508j656947J955487M85271j100596J240310J212123m31395
5687A4453330Q76226Q74490O42197j363443L92213R81869j72811k57383p01653
5678A5725035J43378N37186n77723o94087P43591j622188J636632p80187k9058
5669A5082579K25191q09490J822492o39752j102601k60899j499272J98919j47614
5660A2869553J920193J712404j701288o05646J799324j326907m84282J780381
5652A5963732J883906q04947J212222J514646r20170k27015K29581K29904k94326
5643A8787533j309931n54449K943670r5765L19384P36416j579296N9268J738743
5634B1045573P19411k229625j384596M60312Q40662R05004R38458k753920r2884
$$ y = [15031585, 12749077, 11092130, 13047617, 13532888, 12432292, 13672602, 14884725, 14453330, 15329556, 16204046, 16846243, 15482800, 15875013, 16856882, 16684071, 16426688, 15725035, 15868413, 16405599, 15827876, 15133789, 15877380, 14255192, 15891824, 15111637, 15082579, 15307770, 14498280, 16320772, 15681020, 14578419, 14317520, 12818248, 13017167, 12869553, 14789746, 16502150, 14800862, 14195216, 15994540, 14667633, 14183351, 15963732, 17847638, 17042691, 18254913, 19769559, 18849389, 18622374, 18851955, 19081859, 18787533, 17477602, 16923153, 19866823, 19771058, 20090442, 20826858, 19247562, 19306830, 21045573, 21764984, 19535359, 18150763, 18611075, 19451737, 20356741, 21295199, 18541279, 18448395]
5625A8448395K729314o70898r36536j023044M5289M03866J762762j390968j024385
5616A8343795J731689j566361j348602Q07508K632856j432671k29841J581293
5608B0519666m39070J020695K406847j820603j877862K134975J293259m38641
5600B2799266K464705R2339k046981k065947M27728K842599k9407L55285j406145
5591B3433442N9531J085839J139714j386852L89780k14048K09007p40609j147587
5582B2828217O82584L49934k92720k80328R71642L266890M38008m5897m01872
5573B7516458j295374J035181p33645r93230M74819L8495R50073P88643J276477
5564B9057897n52382J35931m30775J777975p05810l01531m88878J652959K07328
$$ y = [18448395, 21177709, 20506811, 19570275, 18547231, 18592520, 18996386, 20759148, 19368180, 18343795, 20075484, 18509123, 17160521, 17968029, 20600885, 19168214, 18938373, 20519666, 20080596, 21101291, 23508138, 21687535, 19809673, 21944648, 23237907, 22799266, 25263971, 25356310, 23309329, 21243382, 21671110, 24513709, 24484302, 24839587, 23433442, 23492973, 24578812, 25718526, 24331674, 24721454, 24507406, 24716413, 23975804, 22828217, 23510801, 23860735, 23568015, 23287687, 24259329, 27526219, 27964227, 27918330, 27516458, 26221084, 27256265, 26522620, 25529390, 26004209, 26042704, 26992777, 27781420, 29057897, 28505515, 28641446, 28210671, 29988646, 29282836, 28981305, 28492427, 30145386, 30352714]
5555C0352714k328345P35394J598152j17952j390261Q41287J676979K91328j482097
5546C0177199J525460L519303j497804k06155o42000m25017L6967j076119L349509
5537C4761343p8262j99028K03463J18254M81889p68885n98894q60626J509598
5528C4568852J030078j160446J313691r66784j36140J461016J089918R69877j03122
5519C8066940N58997L79493r26824J84851J144929N93498J59714J841489o47430
5510D1355657L86809Q11210J639365J01568o83198N58440J619145M27162j046663
5501D5169495R9581j146923K364517J497662k248904L402243O73341J189221j580748
5492D9419485k22077K758103K35852J807253J360133l39972J721376O4940J93535
$$ y = [30352714, 28024369, 28759763, 30357915, 30239963, 28849702, 29690989, 31367968, 31659296, 30177199, 31702659, 35221962, 33724158, 33518003, 32876003, 32450986, 32487953, 31411834, 34761343, 34683081, 34484053, 34687516, 34805770, 35287659, 34518774, 33919880, 33059254, 34568852, 35598930, 34438484, 35752175, 34785391, 34649251, 36110267, 37200185, 38170062, 38066940, 38625937, 39005430, 38078606, 38263457, 39408386, 40001884, 40161598, 42003087, 41355657, 41742466, 42553676, 44193041, 44294609, 43611411, 44169851, 45788996, 46216158, 45169495, 45269076, 44122153, 46486670, 47984332, 45735428, 49137671, 49811012, 51000233, 49419485, 49197408, 51955511, 52191363, 53998616, 55358749, 55018777, 56740153, 56805093, 56998628]
5483E6998628P08137K668078J744296r33968P31435K483437K379393M82522J453634
5474F8715592J675579K642187K063149R26975J560103K969369L621243M085424
5466H8259621J905947J409785M498483M750418K286182l02036J78388K120986
5458A05107774q30426j142806k840236r49438l86267q01154J38260p2391J583019
5449I9806335J094638j12428L311529M435052M43558L848910K039755L032737
5441A17900086N092790L789557M075353O532560O876075N068892P777366P735129
5433A64847808O437305Q345886O890407N007024M257051k646017n363720q510128
5425A79265616q091316j0687766o685821l888913n056336n827253l047897o00789
$$ y = [56998628, 57706765, 60374843, 62119139, 61185171, 61916606, 64400043, 66779436, 67261958, 68715592, 70391171, 73033358, 75096507, 76023482, 77583585, 80552954, 84174197, 88259621, 90165568, 91575353, 96073836, 100824254, 103110436, 102808400, 102986788, 105107774, 104277348, 103134542, 100294306, 99344868, 98958601, 98157447, 98295707, 98223316, 99806335, 100900973, 100788545, 104100074, 108535126, 108978684, 112827594, 114867349, 117900086, 122992876, 126782433, 130857786, 137390346, 144266421, 149335313, 157112679, 164847808, 171285113, 179630999, 186521406, 191528430, 195785481, 193139464, 187775744, 179265616, 171174300, 160486534, 153800713, 149911800, 144855464, 139028211, 135980314, 135379525]
5417A35379525k109120j410435L361981J098078l8307J279806K641966L813764
5409A44017258K604410K701550N821617N237825N766650P692928O717955O419626
5401A86979819N074342O706591M098007K937632n94891k515317n518231j0199272
5393A86968680r858265q802844j0337921o776073n777632m866636k159732q7950
5385A38301627j604140m342177Q06071j029380M84825j416004m08670J145425
5377A31937577K439749K033184l50106K959674M346241J602016J630844L456456
5369A50055635N648673K193036l78315M7057j554094r67588n525286m21432k458518
5360A46639168l362246j102204p54293j162859M28306j616724j484507O15299
$$ y = [135379525, 133270405, 131859970, 135221951, 136320029, 136281722, 137561528, 140203494, 144017258, 146621668, 149323218, 155144835, 160382660, 166149310, 173842238, 180560193, 186979819, 192054161, 198760752, 202858759, 205796391, 205201500, 202686183, 197167952, 186968680, 177110415, 168307571, 157969650, 151193577, 145415945, 140549309, 138389577, 138301627, 136697487, 132355310, 133161381, 132132001, 132616826, 131200822, 130792152, 131937577, 134377326, 136410510, 136060404, 139020078, 143366319, 144968335, 146599179, 150055635, 155704308, 157897344, 157519029, 157566086, 156011992, 155044404, 149519118, 149097686, 146639168, 143276922, 142174718, 141420425, 140257566, 140685872, 139069148, 137584641, 138199940]
5352A38199940J698300J39347q30028J434278O94977O31261O9763J952525L450461
5343A47440824J521343M68345R17645J571147J090750O03455l03177K257489J476251
5334A57044072J018551J995945J400671N16083j35687K078441J179762J851980
5326A66949818L746356K081936L203771J010505j921580L763770J447055J766111
5318A82047742Q51958J878817K768995K962326K181784O50459M152803J127032
5310A98621916J123018K182331J658461J744948J071366J268059L320712M110938
5302B15101749K556215J825485L377191J868574M313771L321568M19950M185214
5294B36969717L991110J488988K499817M366655K789176R73313L474978J805767
$$ y = [138199940, 139898240, 140037587, 139207559, 140641837, 141336814, 141968075, 142037838, 143990363, 147440824, 148962167, 149430512, 150348157, 151919304, 153010054, 153613509, 153310332, 155567821, 157044072, 158062623, 160058568, 161459239, 161975322, 161839635, 163918076, 165097838, 166949818, 170696174, 172778110, 175981881, 176992386, 175070806, 178834576, 180281631, 182047742, 182899700, 184778517, 187547512, 190509838, 192691622, 193342081, 197494884, 198621916, 199744934, 201927265, 203585726, 205330674, 206402040, 207670099, 210990811, 215101749, 217657964, 219483449, 222860640, 224729214, 229042985, 232364553, 232784503, 236969717, 240960827, 242449815, 244949632, 249316287, 252105463, 253078776, 256553754, 258359521]
5286B58359521L444385K734463M13669L462044J917418J609973M985568J088894
5278B78015935J689874M118175K036603L390115L570157L160756J113932L641400
5270C00736947L581602K410561M312197L802076M34420R78324M621497M032944
5262C24910568L926158M309547O93761L024269L694077K907479L554764L865897
5254C50886520K035101K533821O85377L553844L253386N37880M23375J373183
5246C65282487J173503K468194O69807Q18666l81071K715872Q3J816338L436476
5237C78000355k73970K536353L96116Q51598L65907K849932p75698j258751L592876
5228C86284718K572612M53129K346727J953446O87978q80751q56787K977611J404264
$$ y = [258359521, 261803906, 264538369, 264952038, 268414082, 270331500, 271941473, 276927041, 278015935, 279705809, 283823984, 285860587, 289250702, 292820859, 295981615, 297095547, 300736947, 304318549, 306729110, 311041307, 314843383, 315277803, 316256127, 320877624, 324910568, 328836726, 333146273, 333840034, 336864303, 340558380, 343465859, 347020623, 350886520, 352921621, 355455442, 356140819, 359694663, 362948049, 363485929, 363909304, 365282487, 366455990, 368924184, 369593991, 370412657, 370031586, 372747458, 372747541, 374563879, 378000355, 377726385, 380262738, 380658854, 381510452, 381876359, 384726291, 383950593, 382691842, 386284718, 388857330, 389310459, 391657186, 393610632, 394298610, 393417859, 392561072, 395538683, 396942947]
5219C96942947j456176n05924k174170j317279l033068O97306j773971k810768
5211C84568897j319846l162140k809986k46744j080675k812481l879532j665421
5203C67592072j155560k124677M75672k304968k413968j963971j920429k942751
5195C53241420k464558l420995k875202j998663K77368k293124l026682k62760
5187C37176804k942575k444709l903784l022761k950206l528141m375793l435840
5179C10572995l517173m257346m469170j226674q39030k130279m526095n637105
5171B83970123l749533k403220k448403j19455n345295l400476p18596k828509
5163B62956636l392803j085730l131721o403178j032092l106803k142566p68513
$$ y = [396942947, 395486771, 394980847, 392806677, 391489398, 388456330, 389153636, 387379665, 384568897, 383249051, 380086911, 377276925, 377030181, 375949506, 373137025, 369257493, 367592072, 366436512, 364311835, 364787507, 362482539, 360068571, 358104600, 356184171, 353241420, 350776862, 347355867, 344480665, 342482002, 342759370, 340466246, 337439564, 337176804, 334234229, 331789520, 327885736, 324862975, 321912769, 318384628, 314008835, 310572995, 307055822, 302798476, 298329306, 297102632, 296263602, 294133323, 289607228, 283970123, 280220590, 277817370, 275368967, 275249512, 269904217, 266503741, 265785145, 262956636, 259563833, 258478103, 255346382, 248943204, 247911112, 244804309, 242661743, 241893230]
5155B41893230l585680m671059k528012j266424l703520l855928K35356l463746
5147B19054217m717352k280136l194754k144980k059919r47371k585684j792093
5139A99331928l115263l113340j116525l513836l355892k676333l016298n25899
5131A78898542l19076l569688l153220k077079j444941q01446n70931j926914
5123A65035247o52904j420710j975705o254512j606032q23732m204197j017799
5115A47079656q56769J86322o18732k689643p85648k711315k948710j051278N95730
5106A36199613l159145l185087j647035K55759k988810j01695l79273j522431
5098A23471896j224360k099518J60310j407676l298353n82592j273946k759123
$$ y = [241893230, 238307550, 233636491, 231108479, 229842055, 226138535, 222282607, 222517963, 219054217, 214336865, 212056729, 208861975, 206716995, 204657076, 203709705, 201124021, 199331928, 196216665, 193103325, 191986800, 188472964, 185117072, 182440739, 179424441, 178898542, 178579466, 175009778, 171856558, 169779479, 168334538, 167533092, 166962161, 165035247, 164382343, 162961633, 160985928, 154731416, 153125384, 152301652, 148097455, 147079656, 146222887, 146409209, 145790477, 143100834, 142315186, 139603871, 136655161, 135603883, 136199613, 133040468, 129855381, 128208346, 128464105, 125475295, 125373600, 124994327, 123471896, 122247536, 120148018, 120308328, 118900652, 115602299, 115019707, 113745761, 110986638]
5090A10986638n3638J016949k143364j533497m523583J386385O16466k631889
5082A03120467j544933j822910p97171k03480j017686k532784k256007j667649
5074I1277847L30743q97311p35458j771808p49786j412381p49835l786347J456736
5065H2962400q86766J53875l95050j421898q79200q43814j456427R60148l085509
5056G5107759r60282j85934j182182k22570j918095l03510j067055J089929p24722
5047F9633338j610010q17484n49174O11964j32117K61948p14326k616248k780069
5038F1287822n53316l672n98632J088698k876382k0481J735540j494594J77465
5029E8742448k58490j523051k318417P54645j047559Q23331k110552P02775l55395
$$ y = [110986638, 110933000, 111949949, 109806585, 108273088, 103749505, 105135890, 105752356, 103120467, 101575534, 99752624, 98955453, 98751973, 97734287, 95201503, 92945496, 91277847, 91608590, 90711279, 89975821, 88204013, 87454227, 86041846, 85292011, 81505664, 82962400, 82075634, 82229509, 81834459, 80412561, 79533361, 78689547, 77233120, 78193268, 75107759, 74147477, 73961543, 72779361, 72556791, 70638696, 70335186, 69268131, 70358060, 69633338, 68023328, 67205844, 66656670, 67268634, 67136517, 67398465, 66684139, 64067891, 61287822, 60734506, 60730834, 60132202, 61220900, 58344518, 58324037, 60059577, 58564983, 58742448, 58483958, 56960907, 54642490, 55397135, 54349576, 55172907, 53062355, 53765130, 53409735]
5020E3409735J32521j412712m50886P54121k634527Q33774L34652q46043j335888
5011D8784747M57916p03224j427147N23823J300337j853321j907784p72901L73641
5002D4776087q58197j060378K563914n15176r48226J105390J22301k07999j145704
4993D3832012j037991O11885j356978k329769r8906m92890k45723k284395M38421
4984C7035666J320970l49112j67903R07429p0595j812445j263274j020455M39858
4975C5020139j322136j069933O35066J874115q0658r44138k45559q90019l15925
4966C2660952j113433J705803J5899o10231j750650N57287K94227j181390m99562
4957C0078902N40922q19167L32690j551509J853916L37526k084562j435133l79891
$$ y = [53409735, 53542256, 52129544, 51678658, 52432779, 49798252, 50632026, 50966678, 50120635, 48784747, 49242663, 48539439, 47112292, 47636115, 48936452, 47083131, 45175347, 44402446, 44776087, 43917890, 42857512, 45421426, 44906250, 43958024, 45063414, 45185715, 44977716, 43832012, 42794021, 43405906, 42048928, 39719159, 39620253, 39127363, 38881640, 36597245, 37035666, 38356636, 38007524, 37839621, 38747050, 38676455, 36864010, 35600736, 34580281, 35020139, 33698003, 32628070, 33263136, 35137251, 35056593, 34112455, 33866896, 32976877, 32660952, 31547519, 33253322, 33269221, 32658990, 30908340, 31465627, 31759854, 30578464, 30078902, 30619824, 29800657, 30133347, 28581838, 30435754, 30773280, 28688718, 27253585, 26873694]
4948B6873694K16715P99319J024304l38082j447976n11582r76282k76198n36055
4939B4827857L553825M73908N82019l367582p52927r80070J38597P60072k45974
4930B4989725J275180M60051l316639N26199J775611k43750n79728l016659N49017
4921B2419007j396452K043314J162127J741451j421514j113241l23292n52907
4913B2558493l067929J142797j344741J005710K76712j116304M41584p7263R85077
4904B0804136J443965k664868K80192J103052j409514q25516J55749J578920N18155
4895B0984271o26612J390554N28727o20161L6091j975203R7671L61213j763845
4886A8412706K81596j787926O80800r20274J573992k216539j597475J739397r09508
$$ y = [26873694, 27090409, 27889728, 28914032, 28575950, 27127974, 26616392, 25640110, 25363912, 24827857, 28381682, 28855590, 29437609, 26070027, 25317100, 24337030, 24475627, 25235699, 24989725, 26264905, 26724956, 23408317, 23934516, 25710127, 25466377, 24886649, 21869990, 22419007, 21022555, 23065869, 24227996, 25969447, 24547933, 23434692, 23111400, 22558493, 19490564, 20633361, 19288620, 20294330, 20571042, 19454738, 19896322, 19819059, 20804136, 22248101, 19583233, 19863425, 20966477, 19556963, 18731447, 18887196, 20466116, 20984271, 20357659, 21748213, 22276940, 21656779, 21692870, 19717667, 19815338, 20176551, 18412706, 18694302, 16906376, 17587176, 16666902, 18240894, 16024355, 14426880, 16166277, 15256769]
4877A5256769K91273k29072k079931l35132Q97986j053993n37496N07281P48611
4868A3466296M50929K33646r19118K00767J376783R65490p2038p53957O58177
4859A5606975l64501o84282j059343J361427l94989j309367k47037j109903O81417
4850A2480397J038040o56748k053042J397369J013894Q13466o55390j390741r70507
4841A1016738K26713Q69815K8339J887765j125641j031015K05368j112051k57651
4832A0708380j706389J885574Q64313M51228p89921J498824J012253j594395J48588
4823A2478455k235637J499272K711348k572127J927415j766157k048538M25284
4815A0419315q51065J610285r39381j542714M68368k73188K519399M53045l43941
$$ y = [15256769, 15548042, 15318970, 13239039, 12903907, 13801893, 12747900, 12210404, 12717685, 13466296, 13917225, 14150871, 13231753, 13432520, 14809303, 15774793, 15702755, 14948798, 15606975, 15242474, 14558192, 13498849, 14860276, 14465287, 13155920, 12908883, 11798980, 12480397, 13518437, 12861689, 10808647, 12206016, 13219910, 14033376, 13377986, 11987245, 11016738, 11243451, 12113266, 12141605, 14029370, 12903729, 11872714, 12078082, 10966031, 10708380, 9001991, 10887565, 11751878, 12203106, 11413185, 12912009, 13924262, 12329867, 12478455, 10242818, 11742090, 14453438, 11881311, 13808726, 12042569, 9994031, 10419315, 9568250, 11178535, 10239154, 8696440, 9164808, 8891620, 11411019, 11864064, 11520123]
4806A1520123k358460K066129P95967k82955k311560k816403q7875J10714K079416
4797H715096N74600j260938r68222p60330R51346J452791k16967P35706m72437
4788H750645l14617k97697K62211j417095J961818L072530j302905j510110J58013
4779I362793J75328n1555j488855j369905J648471Q1785j762619Q45987N62633
4770H004063J618068l4886j153554j33043k207013L06368K717559K043427k85804
4761A0875185p59567k11469j422204Q5085j668733l014916J236231j257967j172076
4752B689569J314132J675607J202784P0991k225082q79633J201099Q59063L30234
4743F238764k749448r644R32297K015702l90051n46003K010530m17492n09626
$$ y = [11520123, 9161663, 11227792, 12023759, 11740804, 9429244, 6612841, 6524966, 6635680, 8715096, 9289696, 8028758, 7060536, 6300206, 7251552, 8704343, 8487376, 9223082, 8750645, 8436028, 8138331, 8400542, 6983447, 8945265, 12017795, 10714890, 9204780, 9362793, 9538121, 9486566, 7997711, 6627806, 8276277, 8358062, 6595443, 7441430, 8004063, 9622131, 9587245, 8433691, 8300648, 6093635, 6400003, 9117562, 11160989, 10875185, 10115618, 9904149, 8481945, 8567030, 6898297, 3883381, 5119612, 3861645, 2689569, 4003701, 5679308, 6882092, 6953083, 4728001, 3848368, 5049467, 5908530, 6238764, 3489316, 3479672, 4411969, 6427671, 6037620, 5491617, 7502147, 7084655, 6575029]
4734F575029j150479m02573K434959j253783l27268j119803P6038l32250J091734
4725E591604k39652q1716Q75191P49561J466034j452546l803302J838658K448062
4716G391894k53934j659616j430076K471021P84654j353414j117960J21678M09939
4707E364186N37737j898566K142491J390782j084126o33008n69718J282152n88757
4698E943173k229687J047490J789760M95560k82732j346975L12367j234607M38182
4689D932531j484657o90925J000701K52367J802499j038924L96373J121338j073169
4680E218134j89921j360323p60203K95210K444437O49165j799364j27101k298337
4671B071697P75716o32262J531744P79560k4865K90452O56393L91040k84421j96445
$$ y = [6575029, 5424550, 5021977, 7456936, 6203153, 5875885, 4756082, 4832120, 4499870, 5591604, 5351952, 5270236, 6145427, 6894988, 8361022, 6908476, 3105174, 4943832, 7391894, 7137960, 5478344, 4048268, 6519289, 7303943, 5950529, 4832569, 4954247, 5364186, 5901923, 4003357, 6145848, 7536630, 6452504, 5819496, 5249778, 6531930, 5943173, 3713486, 4760976, 6550736, 7046296, 6763564, 5416589, 5728956, 4494349, 4932531, 3447874, 2756949, 3757650, 4010017, 5812516, 4773592, 5169965, 6291303, 5218134, 5028213, 3667890, 2907687, 3202897, 5647334, 6296499, 4497135, 4370034, 2071697, 2847413, 2215151, 3746895, 4526455, 4501590, 4792042, 5448435, 5839475, 5555054, 5358609]
4661E358609N61789j528327o08856J549878M16776j103034M04286r08785j169746
4652B972590N80618n1305o0849m23347P59720j216804P51621M02380j445149P93815
4642C063290K065962j83696K65506R74168j651082k701909J867547N22667p35052
4633C487401m24381J5869j44544j849953L65805K183295J373218J066112q79513
4624E193309k158196J87698J11886j90422k197159J434780p5808Q23931j080083
4615B049936r67079J224500j93360L50786k374085Q96762J713410R73142j73899
4606C500113k61977j381597P48399K456548N00596k983035j37831J359261l4945
4597C765532P83226j224768j424288M14807J173790N12150l95931l13513J169952
$$ y = [5358609, 5920398, 4392071, 3783215, 5333093, 5749869, 4646835, 5051121, 4142336, 2972590, 3553208, 3501903, 3441054, 3017707, 3777427, 2560623, 3312244, 3714624, 2269475, 3063290, 5129252, 4945556, 5211062, 6185230, 4534148, 1832239, 3699786, 4222453, 3487401, 3063020, 3078889, 2934345, 1084392, 1450197, 3633492, 5006710, 6072822, 5193309, 3035113, 3222811, 3334697, 3144275, 947116, 2381896, 2306088, 3130019, 2049936, 1082857, 2307357, 2113997, 2464783, 90698, 987460, 2700870, 3674012, 3500113, 3238136, 1856539, 2604938, 5061486, 5562082, 2579047, 2441216, 3800477, 3765532, 4548758, 3323990, 1899702, 2314509, 3488299, 4000449, 3604518, 3291005, 4460957]
4588D460957j363722j713262J034585M03915r53669K006880J122433p8123J176571
4579F096565k478258j29191M46261n61348L68097P12651J93543j575829K203662
4570E276153J304455o89049n67966j068733O1426n34193l7615o10341Q86056Q94101
4560D914294k08368o62973n70348J219800l16800k414213J332426R79078K545728
4551F818624M52852k927515M29054j763968J373527K980305r0283j049467p58927
4542E464202J379383m28184k33009Q09960m14931j24039J0774M04510P10040k45882
4532G332824L02255M67103K789677J599290j391495j37513J213806J723018l416021
4523A0482944J329119J041680r9958R00287J707172J61579Q85028K961384K499709
$$ y = [4460957, 3097235, 1383973, 2418558, 2822473, 1868804, 3875684, 4998117, 4919994, 6096565, 3618307, 3489116, 3935377, 3374029, 3742126, 4454777, 4648320, 3072491, 5276153, 6580608, 5891559, 5323593, 4254860, 4316286, 3782093, 3744478, 3134137, 4020193, 4914294, 4705926, 4042953, 3472605, 4692405, 4375605, 1961392, 3293818, 4272896, 6818624, 7271476, 4343961, 4773015, 3009047, 4382574, 7362879, 7272596, 6223129, 5464202, 6843585, 6415401, 6182392, 6992352, 6577421, 6453382, 6464156, 6868666, 7578706, 7332824, 7635079, 8102182, 10891859, 12491149, 11099654, 10962141, 12175947, 13898965, 10482944, 11812063, 12853743, 12753785, 13654072, 15361244, 15522823, 16407851, 19369235, 21868944]
4514B1868944J32642n62176K50028N61754K221045P00143P39262M15971J699854
4505B8027467J463687r14845L84205L403791J682630J912448N064471M59998J853710
4496D3337562N513887J956231K003844K950306K396690N034282M483542L718709
4488G1395053M113217O982007P897876L504240N128482O824162N627134L742164
4480A15214335M911453P291816L711536M518762K384586K292680K283049J094129
4472A43702346L076499K013732J430650J538883K370104l985126m280985n753144
4464A40112959l790745m424177m334981n606132m027648o075298o170076o112009
4456I9571893o366486o524381m626448m860605m648308l380978n806226l331962
$$ y = [21868944, 22001586, 21439410, 21689438, 22251192, 24472237, 25172380, 25911642, 26327613, 28027467, 29491154, 28576309, 28960514, 32364305, 34046935, 35959383, 41023854, 41483852, 43337562, 48851449, 50807680, 52811524, 55761830, 58158520, 63192802, 67676344, 71395053, 75508270, 82490277, 90388153, 93892393, 99020875, 105845037, 111472171, 115214335, 120125788, 127417604, 131129140, 135647902, 138032488, 140325168, 142608217, 143702346, 146778845, 148792577, 150223227, 151762110, 154132214, 150147088, 145866103, 140112959, 136322214, 131898037, 127563056, 121956924, 117929276, 111853978, 105683902, 99571893, 93205407, 86681026, 82054578, 77193973, 72545665, 69164687, 63358461, 60026499]
4448F0026499o656107n547790o042689m162050k359168l421656k767757j673859
4440B7395423l181121M4714j301163k258387l124010k060420J32753j570617j783787
4431A2293385l69977K52517n64395q00734P83460J01821j160083M62546j036055
4422I962485l14864j078505J77050L33356j091582J191765j669708k525016Q51816
4413E836797j747781M64234Q25768M00761l98436O43881j836628j044219J069058
4404D213435j99600N44491q1744j420722j21579k601402J41419L890985l64752
4395D000531J84052r27326L9223n76098Q79211j301471l37527j002241K30643
4386A188997J909990M44974o40668j4818K78301k97005Q05610p53499K367798
$$ y = [60026499, 53370392, 47822602, 41779913, 37617863, 35258695, 31837039, 29069282, 27395423, 24214302, 24259016, 22957853, 20699466, 17575456, 15515036, 15647789, 14077172, 12293385, 11923408, 12175925, 11611530, 10810796, 11594256, 11696077, 10535994, 10998540, 9962485, 9647621, 8569116, 8746166, 9079522, 7987940, 9179705, 7509997, 4984981, 5836797, 4089016, 4553250, 5379018, 5779779, 5381343, 6025224, 4188596, 3144377, 4213435, 4013835, 4558326, 4476582, 3055860, 2934281, 332879, 474298, 4365283, 4000531, 4184583, 3257257, 3296480, 2720382, 3599593, 2298122, 1960595, 958354, 1188997, 3098987, 3543961, 2903293, 2888475, 3166776, 2869771, 3675381, 2921882, 5289680]
4377E289680q83953l280239p40447K21665J338825Q60737J37986J216093l33816
4368C826531p43301J139968q68434k412305L03547n08431j512026J130171n46208
4359a90488L99648J583666o03807N98313l72287q20028r50384M00413L009447
4350C054493o85857j105914n46311j023181j37279J219431j23995j460875Q51739
4341D2251J106678K23181J205517j59512m38474j48231N11942j813019K150931
4332B681264J29770l490633J343297N54829L5273p71632q34142K078106j314592
4323D11540k44284J466698L04264j67897j203184J031068j149745L23622n93178
4314A78904K7618J47704j784625o66052R65043j484889J196037J869024j08535
$$ y = [5289680, 4405727, 1125488, 385041, 606706, 1945531, 2806268, 2944254, 4160347, 3826531, 3083230, 4223198, 3354764, 942459, 1246006, 737575, -774451, 355720, -190488, 209160, 1792826, 1189019, 1787332, 1415045, 595017, -355367, 45046, 3054493, 2368636, 1262722, 716411, -306770, -444049, 775382, 651387, -809488, 42251, 1148929, 1372110, 2577627, 2418115, 1979641, 1831410, 2343352, 530333, 2681264, 2811034, -679599, 663698, 1218527, 1253800, 482168, -351974, 1726132, 411540, 167256, 1633954, 1938218, 1770321, 567137, 1598205, 448460, 772082, 178904, 206522, 354226, -1430399, -2096451, -1131408, -2616297, -1420260, 448764, 340229]
4305C40229O72270j194962K710037o71512k750840M32830M62947j169258N31880
4296f36379j415294O57119N01432Q53547k110272q23264K351317j327720R3708
4287a855806K886107j189807j040383J339947o1875j357227O13194n64786j830407
4278c061043P24983q07976N48040L64447K485555j649910j235285J242024R65173
4269d23992N81071P06873l13689j169444j178738J244769J90503M39449k49262
4260a72460J691192J469625j049767q47065M88442j605826j135956J639043L09415
4251G86643R4738k022206N524J697291j9432J50735M66923N03715j173321n81384
4241i0774j257869r00361J550866o98334K96932M27616q0267j183608k116518
$$ y = [340229, 1012499, -182463, 2527574, 1856062, -894778, -461948, 999, -1168259, -636379, -2051673, -1394554, -893122, -39575, -2149847, -2973111, -621794, -1949514, -1855806, 1030301, -159506, -1199889, 140058, 78183, -1279044, -665850, -1230636, -3061043, -2336060, -3144036, -2595996, -2231549, 254006, -1395904, -2631189, -1389165, -423992, 157079, 863952, 550263, -619181, -1797919, -553150, -362647, 76802, -172460, 1518732, 2988357, 1938590, 1091525, 1579967, -25859, -1161815, 477228, 786643, 881381, -1140825, -1135301, 561990, 542558, 693293, 1160216, 1663931, 490610, -90774, -1348643, -2249004, -698138, -1396472, -1099540, -671924, -752191, -1935799, -4052317]
4232d052317K793453J086970p86746j51175K74155R83448m46554K152035n4695
4223A798574l022856p84287Q27120J011493k20953p32617r65145P65102J572586
4214B49017q4914l37959J36332j080875L09356J26793L30379M35850o22263J829019
4204A290735l76849r24836M80580j274090P01705j332957J89912L35660j0017
4195i20157M8832J159146J081662k637990O08832L41710J016545j00607j030956
4186d32983K284453R01873k242274J48152O91901j511310j843018K3166J204458
4177g75582Q45662M51017k1449m03927J084128m42095M50616L11120n60950j293286
4167c54746m71119M75351J135445r08778K011767m75800O46691j734883n59184
$$ y = [-4052317, -1258864, -171894, -958640, -1109815, -835660, 147788, -298766, 1853269, 1798574, -1224282, -2008569, -1181449, -169956, -390909, -1123526, -2088671, -1323569, 249017, 164103, -173856, -37524, -1118399, -809043, -682250, -351871, 83979, -538284, 1290735, 913886, -10950, 469630, -804460, -102755, -1435712, -1245800, -910140, -920157, -871325, 287821, 1369483, -1268507, -659675, -317965, 698580, 597973, -432983, 1851470, 2753343, 511069, 659221, 1351122, -160188, -2003206, -1980040, -775582, 70080, 521097, 499648, 95721, 1179849, 737754, 1188370, 1499490, 938540, -354746, -825865, -350514, 784931, -123847, 1887920, 1412120, 2058811, 323928, -235256]
4158b35256L540030o45543j971617r43634N50220J157430J671723L7380k200782
4149I59951j601740L582343k932325R00880l58573m7898J457028j592703k39007
4140A27956O70390n31352O34175k85070M60511J045766l421p64258o32978J045361
4130A767080r88002K335398j6209m14398J87656J196448J098144J588326j768015
4121D986428p16248N42504J022906J278857J103361m1623j022756l82931J175830
4112G946328J869953j843584p79166K004141J78687N10694J267094L5595Q7801
4103A1277543J156320Q74804J989985J188495J297836J203304Q42860m99309J978194
4094B1310032L330458K999305L688940m42917N044232N018500N267600O611117
$$ y = [-235256, 3304774, 2659231, 687614, -256020, 294200, 1451630, 3123353, 3160733, 959951, -641789, 2940554, 8229, 909109, 550536, 502638, 1959666, 366963, 127956, 798346, 266994, 901169, 616099, 1076610, 2122376, 2118955, 1354697, 721719, 1767080, 779078, 3114476, 3098267, 2683869, 2871525, 4067973, 5166117, 6754443, 4986428, 4270180, 4812684, 5835590, 7114447, 8217808, 8176185, 7153429, 6770498, 7946328, 9816281, 7972697, 7193531, 9197672, 9376359, 9887053, 11154147, 11189742, 11277543, 12433863, 13308667, 15298652, 16487147, 17784983, 18988287, 19831147, 19331838, 21310032, 24640490, 27639795, 31328735, 30885818, 35930050, 40948550, 46216150, 52827267]
4086E2827267M700633P472385M355435K181768K073989l278881n310756r400997
4078E5620843j1651159q613779n853477n050515m779418j915216r40179k658311
4070A4158789m88109j380479k63502J21677j092158l528986j053858r01154P69241
4061F341461K07257k365123j399546O18154m91446r32901m51724R97289M66279
4052B989700M86422J201138l994659Q28975L35469m38844o35348Q92417P94656
4043B459926p24063J12223r80750J505919K24429m47641L94408K19632o55122
4034B108961j662214q20722o29156n04732J836064K334458j654504M40941J022612
4025B471708j170159K15080m08309j738968r51759N703j045176K087667J354847
$$ y = [52827267, 57527900, 65000285, 69355720, 71537488, 73611477, 70332596, 65021840, 55620843, 43969684, 35355905, 29502428, 24451913, 19672495, 17757279, 16817100, 14158789, 13670680, 12290201, 12026699, 12148376, 11056218, 7527232, 6473374, 5572220, 6341461, 6548718, 4183595, 2784049, 3402203, 2910757, 1977856, 1526132, 2523421, 2989700, 3476122, 4677260, 682601, 1511576, 1847045, 1408201, 772853, 1665270, 2459926, 1735863, 1848086, 867336, 2373255, 2597684, 2150043, 2544451, 2764083, 2108961, 446747, -373975, -1003131, -1507863, 328201, 2662659, 1008155, 1449096, 2471708, 1301549, 1516629, 1108320, -630648, -1582407, -1576704, -2621880, -534213, 820634]
4016H20634Q64121K71256l66280k365095K573591R3987j014756J00836l75681
4007F02613p20813k128305K034372Q21486p61706j440029j193867j140857J616461
3998b310645Q81807m3643O63587Q76360k84241n95125M58088K087082Q07276O16821
3988C157367o83178L34663q90354j211769j635040K84322j099164Q97125K119483
3979A273455j0460j635916P63514J734673o12305q65009j555827K365796o92367
3970G65554k410728J712629J630616o97541J506826k94227k018789Q30556p39638
3961B85258p93825j77579J489400R64441r52255r20449P64809k52402m81852j442764
3951a517218r73538k37357K339515K459874J3132q30346j599942o97392p32624
$$ y = [820634, 1684755, 1956011, 1589731, -775364, 1798227, 1892214, 877458, 978294, 602613, -118200, -2246505, -212133, 609353, -152353, -1592382, -2786249, -3927106, -2310645, -1428838, -1472481, -808894, 67466, -216775, -811900, -353812, 1733270, 2540546, 3157367, 2474189, 2808852, 1918498, 706729, -928311, -643989, -1743153, -846028, 1273455, 1262995, -372921, 390593, 2125266, 1512961, 647952, -907875, 1457921, 765554, -1645174, 67455, 1698071, 1000530, 2507356, 2213129, 194340, 1024896, 285258, -508567, -686146, 803254, 1767695, 815440, -105009, 659800, 407398, -74454, -1517218, -2490756, -2728113, -388598, 2071276, 2084408, 1254062, -345880, -1043272, -1775896]
3942a775896j841218J727002n4165m77420j2904r26264J424766J26435K34941
3933a574723q36046L381351j396062j061261J152503J344687l48146l127406l81497
3924b846600J261536j587947L53366q04779Q6682r15924L07295L02330J736640
3915b107401l22573m25951M29486l36445J540881l52934J642113P88457K17529
3906A073162q92804k9058n93093j931798J21874k88366J112361O52944Q18501
3897D3723p05046j384760R94824R50919J050873k272808j818903j07653J767367
3888a481464J410475L71240l5856j006660q67926J234984j027417K7537k41536
3879a616623r34958Q3053Q19999J468222l98989r81504q07340K945848j972760
$$ y = [-1775896, -3617114, -1890112, -1944277, -2421697, -2434601, -3360865, -1936099, -1809664, -1574723, -2410769, 970582, -425480, -1486741, -334238, 1010449, 662303, -2465103, -2846600, -1585064, -3173011, -2819645, -3624424, -3537742, -4453666, -4146371, -3844041, -2107401, -2429974, -2855925, -2426439, -2762884, -1222003, -1574937, 67176, 855633, 1073162, 180358, 151300, -441793, -2373591, -2251717, -2540083, -1427722, -774778, 43723, -661323, -2046083, -1051259, -100340, 950533, -1322275, -3141178, -3248831, -1481464, -70989, 300251, 264395, -742265, -1610191, -375207, -1402624, -1375087, -1616623, -2551581, -2468528, -1648529, -180307, -579296, -1560800, -2368140, 577708, -1395052]
3870a395052l136770J910685P6262M84573N7627p1066J229425J723206o61642
3861B17248K94890q40629q7689M11124q07963j021202R66750N70361M91876p90767
3851e96001j609540J562907j498744L078420m89815k521763J795182j95184l17727
3842g92265j97309p44823m48036Q42035p03059J495542n58609L65674o70240J408896
3832b194J585990j599732m70938P18713j309253k6930R88641o07658j297198m69506
3822b490065o74883j16589l24603J086515L75554M7324J009695k39213j75011
3813a501276k32418q5361P48354J76264J952387n67965j016240j572974R08070
3804a191159J855976q62432J300060O6554J419556k662480k021713K52586M47440
$$ y = [-1395052, -4531822, -2621137, -2544875, -2060302, -2002675, -2073741, -844316, 878890, 217248, 512138, -328491, -416180, -5056, -813019, -1834221, -867471, -297110, 194766, -596001, -2205541, -642634, -2141378, 937042, 447227, -2074536, -279354, -474538, -792265, -989574, -1734397, -2182433, -1340398, -2043457, -547915, -1106524, -740850, -1411090, -2194, 1583796, -15936, -486874, 231839, -1077414, -1104344, -115703, -723361, -2020559, -2490065, -3164948, -3281537, -3606140, -2519625, -2144071, -2096747, -1087052, -1326265, -1501276, -1733694, -1819055, -1070701, -894437, 1057950, 489985, -526255, -2099229, -1191159, 664817, -197615, 1102445, 1168999, 2588555, -73925, -2095638, -1843052, -1395612]
3795a395612M26812R55673j471513j529665J187787M78485j216995P28821J550202
3786b86005J242691k001155R88323k820536j054987j014762J563825J482586K457033
3777E57013q72103j369161K1414k37704l28206l33506J901781j180824m32836
3768b274132j75673J770658N50669o12722r24590l78649J447627N28490p78738
3759h47060j166502K072412N12678K49444j818335p06967K419603K44619j488931
3750e29039n92268J737619q82299j410545O48337R11839l6533L06511p72408m42824
3740a061610r86494o31010Q85016O44709k855512L09777K007452j01482n38342
3731b327496J803840P66325k088524K62212J123382Q65814k55610j707406j143596
$$ y = [-1395612, -968800, -13127, -1484640, -3014305, -1826518, -1348033, -2565028, -1836207, -286005, 956686, -1044469, -56146, -2876682, -3931669, -4946431, -3382606, -1900020, 557013, -315090, -1684251, -1662837, -1900541, -2228747, -2562253, -660472, -1841296, -2274132, -2449805, -679147, -128478, -741200, -1665790, -2044439, -596812, -68322, -847060, -2013562, 58850, 571528, 820972, -997363, -1704330, 715273, 959892, -529039, -1121307, 616312, -265987, -1676532, -1028195, -116356, -152889, 153622, -618786, -1061610, -2048104, -2679114, -1794098, -1149389, -4004901, -3695124, -1687672, -1789154, -2327496, -523656, 242669, -1845855, -1583643, -460261, 405553, 149943, -1557463, -2701059]
3722b701059n19383m1196J588741M02440j440107P68337L84946O428m24101J679463
3712b95491J98226o70843j54246N28927R1109J201281j76093r44460j810954K67399
3702a765145J276261J53377n39147J134013O68079q66192N10129r93776O30088
3693B07687J009761P6793K36563r45379O3985J226577o89449q33400j62764R62464
3683A152838L26988k6504R52905J276538K88769j436564J503936R03093K47041
3674E189040K58052R55721n38015J300502l32517K39951M036178K29923Q32269
3665A2171104P38906J195679N47234J441692M34409j914627o58296j401713j565523
3656A0988865k566480j210895P44984o4282l46046q69183j2910k079818n02254
$$ y = [-2701059, -3220442, -3261638, -1672897, -1270457, -2710564, -1942227, -1557281, -1550853, -1974954, -295491, -97265, -768108, -922354, -393427, -302318, 898963, 722870, -221590, -2032544, -1765145, -488884, -335507, -874654, 259359, 927438, 61246, 571375, -422401, 207687, 1217448, 1294241, 1530804, 585425, 649410, 1875987, 1186538, 353138, 190374, 1152838, 1479826, 1453322, 2406227, 3682765, 3971534, 2534970, 4038906, 4941999, 5189040, 5447092, 6402813, 5864798, 7165300, 6832783, 7072734, 11108912, 11338835, 12171104, 12910010, 14105689, 14652923, 16094615, 16529024, 14614397, 13956101, 12554388, 10988865, 8422385, 7211490, 7956474, 7892192, 7546146, 6676963, 6664053, 4584235, 4081981]
3647D081981M9377K056237J430498J339986J996871Q02119n81739j284953J880427
3638A1770804L25336J457413P97501K375552J649792K503080J305925J380834
3630B3566237L76405J741103K455302j666352k294106k666406k467888k450628
3622A6593667k067314l187581j367916k818409K713598j198360k326869K50404
3614F591220J367793L97060j849258K38108r5912J393633P28093q79634J39852
3605H030955R27065j396985m55142J975816J059773j537798j086641L971839J850319
3596A3339201l92341p38161j129853p13069N16510m94119k778257r00118j83465
3587F526328k315298J2353k022372j373354J089800l49039K282728j615358q26753
$$ y = [4081981, 4131358, 6187595, 7618093, 8958079, 10954950, 11757069, 11175330, 9890377, 11770804, 12096140, 13553553, 14351054, 16726606, 18376398, 20879478, 22185403, 23566237, 23942642, 25683745, 28139047, 26472695, 24178589, 21512183, 19044295, 16593667, 14526353, 11338772, 9970856, 7152447, 9866045, 8667685, 6340816, 6591220, 7959013, 8356073, 6506815, 6744923, 6649011, 8042644, 8770737, 7891103, 8030955, 8958020, 7561035, 7105893, 9081709, 10141482, 8603684, 7517043, 11488882, 13339201, 12946860, 12208699, 11078846, 10365777, 10882287, 10388168, 7609911, 6709793, 6526328, 4211030, 4223383, 2201011, 827657, 1917457, 1568418, 3851146, 2235788, 1409035]
3578A409035n85953R76482J325591j560253Q81049q66453K81976m40974o39985
3569G80515p33586j804509m79788J643753K303456J101462j303616J007224Q64029
3560C378940n04058j752761R7122M95014j254094P60482J98251j086372Q72981
3551A205505O46496k492123K007453K18387L26788M90114o03824m04258m09804
3542I84734k19731K760195j76382j97479P30908j116816q42416m78544P27289
3533B171758J138133n86944n17027k80878j96578l5923j026590N7101j18808K30878
3523H35122L56382n30621K11800q38164K70688J070412r71885Q57493J339213
3514B600440l77601j012285j025153k11583J333243L53114P81942R67799j98768
$$ y = [1409035, 823082, 1799564, 3125155, 1564902, 2445951, 1579498, 1861474, 1420500, 780515, 46929, -1757580, -2237368, -593615, 1709841, 2811303, 1507687, 2514911, 3378940, 2874882, 1122121, 1219243, 1714257, 460163, 1220645, 1418896, 332524, 1205505, 1852001, -640122, 1367331, 1585718, 1912506, 2402620, 1798796, 1394538, 984734, 765003, 3525198, 3348816, 3151337, 3882245, 2765429, 1923013, 1444469, 2171758, 3309891, 2722947, 2205920, 1925042, 1728464, 1692541, 665951, 723052, 604244, 835122, 1191504, 660883, 872683, 34519, 305207, 1375619, 403734, 1261227, 2600440, 2222839, 1210554, 185401, -26182, 1307061, 1660175, 2442117, 3409916, 3211148]
3505C211148R29687N20412j94221p2495j458889j239272J534613j79626m05779
3496B645578J539621o43244j462019p7019J334015r75874K529598p67962k87047
3487C835647r18924j268541Q3653n63800J613063J618511K80737q08394r79511
3478B892441L91780J551195M13802j882091r6720k79597m83783j843178J397174
3469B061023R69180k06495j045296j6945K093929P94549R72644k366090M90582
3460C747081J07093K5561o61648J60228j262500m3099Q08594K536421k82285j050638
3450D084808j118347L433112Q90077k025131K358777j218980j969076K76043L23608
3441E034891Q25302P13346q69202o86544Q64993P87329J457658j369553k57718
$$ y = [3211148, 4140835, 4661247, 4467026, 4394531, 2935642, 1696370, 3230983, 3051357, 2645578, 4185199, 3541955, 2079936, 2002917, 3336932, 2361058, 4890656, 4122694, 3835647, 2916723, 1648182, 1731835, 1168035, 2781098, 4399609, 4680346, 3871952, 2892441, 3284221, 4835416, 5249218, 3367127, 3270407, 2990810, 2507027, 663849, 2061023, 3030203, 2823708, 1778412, 1761467, 3855396, 4649945, 5622589, 3256499, 3747081, 3854174, 3879735, 3218087, 3378315, 2115815, 2072716, 2881310, 5417731, 5135446, 4084808, 2966461, 6399573, 7289650, 5264519, 7623296, 6404316, 4435240, 4711283, 5034891, 5860193, 6573539, 5704337, 5017793, 5882786, 6670115, 8127773, 6758220, 6500502]
3432F500502k608519J16320J587898L82004L77476j244097L54405m98560n83897
3423D383532J04957J582632J824027l30111k430494L43377J908710r94106j366121
3414E026403o5143N46909j710J692481O73758j265779P90549K143477k04263j122203
3404H214479J715022k064439o48089j228695m71280q35611K013902O71678j090901
3395F276066R15786o25671k84902O82895N98061m80710K096562M63812j907056
3386G734843J435835k104436K16387J569782j300336O13303n30967J125207k32446
3377H527172q20189k38077P6473k389436o17700J276301k36956j289359J121880
3368E410109Q93976m38141J014336P43684j022900j263165K096301J239163j810825
$$ y = [6500502, 3891983, 4008303, 5596201, 5978205, 6355681, 5111584, 5465989, 4967429, 4383532, 4488489, 6071121, 7895148, 7565037, 5134543, 5477920, 7386630, 6392524, 5026403, 4961260, 5508169, 5506459, 7198940, 7872698, 6606919, 7397468, 9540945, 9336682, 8214479, 9929501, 7865062, 7216973, 5988278, 5516998, 4681387, 6695289, 7366967, 6276066, 7191852, 6566181, 6281279, 6964174, 7562235, 7081525, 9178087, 9641899, 7734843, 9170678, 7066242, 7282629, 8852411, 7552075, 8165378, 7634411, 8759618, 8527172, 7706983, 7468906, 7545379, 5155943, 4538243, 5814544, 5577588, 4288229, 5410109, 6304085, 5865944, 6880280, 7623964, 6601064, 5337899, 7434200, 8673363, 6862538]
3359F862538L7618J361749j00121k556128O04534J576041L56616k685720M58098
3350E915225K818119k155163k212452J11799M34385N48991K524722r21613j682175
3341E381838j534233J103364J07832p25780K273198K250892j117863j354250k646504
3332C738494J224690m14275k74520J066094J078247j77608k57783K07333M79232
3323F669904J921710j105303K460792J620066k535971N40126j363198l49535K58214
3314H116805m01328j579215J772316q78134N68998K715286r87672j03214K058646
3305A1282488L70516m86021k98177j698317m69887j37604o62359K488054j15829
3296A0272864k800445O24440l50100o34144J219561J873417J771950J697860M76690
$$ y = [6862538, 6900156, 8261905, 8161784, 5605656, 6210190, 7786231, 8142847, 5457127, 5915225, 8733344, 6578181, 4365729, 4477528, 4911913, 5460904, 7985626, 7064013, 5381838, 3847605, 4950969, 5058801, 4333021, 6606219, 8857111, 7739248, 6384998, 3738494, 4963184, 4548909, 4274389, 5340483, 6418730, 6241122, 5983339, 6190672, 6669904, 8591614, 7486311, 9947103, 11567169, 9031198, 9571324, 8208126, 7858591, 8116805, 7715477, 6136262, 7908578, 7030444, 7599442, 10314728, 9327056, 9223842, 11282488, 11653004, 11166983, 10868806, 9170489, 8700602, 8562998, 7900639, 10388693, 10272864, 7472419, 8096859, 7746759, 7112615, 8332176, 10205593, 11977543, 13675403, 14152093]
3287A4152093j731427P97808J475646J225935k375015r75654j86990j9162K217723
3278A4580957K111353Q50097k80798K320194N77534R89349J97967J466253J13722
3269B2926628N15583k01720R17343J099657K333173R37215L622309L80127J311117
3260C3841432J436363L23279l92514K284516K492142L74033L361860L207941K550187
3251D9479239L947403K475162L191079K682611K300917J688684L724689J731059
3243G1220843K361635K593547K162994M630609M966286M427988N976451N797163
3235A04137516M383617O315170N865017R606036J0541883O821558Q190742L280161
3227A59141700L49265o38781o940788r942368r374265j0167789p366215o628086
$$ y = [14152093, 12420666, 13218474, 14694120, 15920055, 13545040, 12569386, 12382396, 12363234, 14580957, 16692310, 17542407, 17261609, 19581803, 20159337, 21148686, 21346653, 22812906, 22926628, 23442211, 23240491, 24157834, 25257491, 27590664, 28527879, 32150188, 32530315, 33841432, 35277795, 35601074, 35208560, 37493076, 39985218, 40359251, 43721111, 46929052, 49479239, 53426642, 55901804, 59092883, 61775494, 64076411, 65765095, 69489784, 71220843, 73582478, 76176025, 78339019, 82969628, 87935914, 92363902, 98340353, 104137516, 108521133, 114836303, 120701320, 130307356, 140849239, 147670797, 155861539, 159141700, 159490965, 158852184, 151911396, 141969028, 132594763, 122426974, 115060759, 108432673]
3219A08432673o024218k903388L07489k356527J668304J867185R18221L285958
3211A05195697K013727O142250N982964L488179N546921Q848724R746131J1065011
3203A58029604R524213J4896057J4514095J7727997J8373861J4323049Q519113
3196B55907989L863730j379698j1054945k0319741k1801121k1636866k1324527
3189A62254821j5585853j4883007j1372146o000763p780590m502024m323980l347371
3181I4459087l348418r67300l050246r36355l73163O76559J256517L265429K896859
3172I3878969L895769L118889L705975R185968O047478Q370804L188475K147434
3164A33539761J086350n297148o580733j1690682j0667585j0839549j1134710
$$ y = [108432673, 102408455, 99505067, 99812556, 97456029, 99124333, 100991518, 101909739, 105195697, 107209424, 113351674, 119334638, 122822817, 128369738, 137218462, 146964593, 158029604, 167553817, 182449874, 196963969, 214691966, 233065827, 247388876, 255907989, 259771719, 258392021, 247337076, 227017335, 205216214, 183579348, 162254821, 146668968, 131785961, 120413815, 114413052, 106632462, 102130438, 97806458, 94459087, 91110669, 90143369, 87093123, 86156768, 85783605, 86460164, 87716681, 90982110, 93878969, 97774738, 100893627, 104599602, 113785570, 119833048, 128203852, 131392327, 133539761, 134626111, 129328963, 122748230, 111057548, 100389963, 89550414, 78415704]
3157G8415704p509208q323219m723918q362213n642232l442540m049924j942434
3149C4420016j920757r83970j566078j046614l114470j975428o65482k317344
3141B0829873j058358j622652J318860j395573k671391K599775J171080k942494
3133A6229120j315986J633807j355660j470346j803215j902427L17606J723916
3125A2056815j095556j463445L48078L45819j556236N92329r07325j46862M74675
3116H648292L23573j990290R3407J795520k42493j791813Q28858m20046N77430
3107G822438k72637j822385j200867R92948Q80435m49063l14448J190850L67879
3098G195150j256585j797575N87693J400634k267939P91637j642134j45313j492125
$$ y = [78415704, 70906496, 62583277, 57859359, 49497146, 43854914, 40412374, 36362450, 34420016, 32499259, 31515289, 29949211, 28902597, 25788127, 23812699, 23147217, 20829873, 19771515, 18148863, 19467723, 18072150, 15400759, 18000534, 19171614, 16229120, 14913134, 16546941, 15191281, 13720935, 11917720, 10015293, 10332899, 12056815, 10961259, 9497814, 9845892, 10191711, 8635475, 9227804, 8320479, 8173617, 8648292, 8971865, 6981575, 7074982, 8870502, 8628009, 6836196, 7665054, 7245008, 7822438, 7549801, 5727416, 4526549, 5519497, 6399932, 5950869, 5636421, 6827271, 7195150, 5938565, 4140990, 4728683, 6129317, 3861378, 4653015, 3010881, 2865568, 1373443]
3089A373443N67150q66744Q7896J942356J76269J207210l61964j319114j136397
3080A670105m77507K007252J03612l94372J346809r64102j947762J86678J577851
3071C108564J262835l71413Q9340J444901q64028k307641Q0023j58067o14117
3062A670397J852043K027297k428932L76014n97011r89981j621475Q23571P92033
3053A903956J98177N21308k171746N18512n4244k497981J837367R8599J975006
3044B328954q37223O30175N46073p69085J771023r14789k797633p08283J698978
3035I48190o51179o04865n85653k22274J027315J808058j197074J01651L45700
3026I69869J032429L6599P70338j172766o07063K21133L93894k26877n36672p29060
$$ y = [1373443, 1940593, 1073849, 1161745, 3104101, 3280370, 4487580, 4125616, 2806502, 1670105, 1192598, 3199850, 3303462, 2909090, 4255899, 3291797, 1344035, 1530713, 3108564, 4371399, 3999986, 4089326, 5534227, 4670199, 2362558, 2442581, 2284514, 1670397, 3522440, 5549737, 3120805, 3496819, 2899808, 1909827, 288352, 1111923, 1903956, 2102133, 2623441, 451695, 970207, 915963, -1582018, 255349, 353948, 2328954, 1491731, 2121906, 2667979, 1898894, 3669917, 2755128, -42505, -750788, 948190, 297011, -307854, -893507, -1115781, -88466, 1719592, 522518, 624169, 969869, 2002298, 2038897, 2809235, 1636469, 1029406, 1250539, 1644433, 1417556, 880884, 151824]
3016A51824L99594K392915k019065K07482J171191m24628o39697n18784k215322
3007a494490P21065P21412j245150L428475O84261j540700J39124J131767q17722
2998A728042j96983O45646k351322K357864m16287p69814j182497Q49904Q56296
2989A520849j972405N46038j130236J894747k5557j483600j03449K8394l22097
2980a047316q74077Q35803m5842K05091p84767P54931l77329m08779J217530N76707
2970E1952q00939q25155P24425O26723L43789M28827p76270q36679J971305L62455
2960A270433M26061m35281R22302j016060O01400j398226J093275Q1861L36836
2951A882601r9570Q17043j161927n26739J678669J163790r08838j901880L15829
$$ y = [151824, 551418, 2944333, 925268, 1132750, 2303941, 1879313, 1239616, 720832, -1494490, -773425, -52013, -1297163, 2131312, 2815573, 1274873, 1413997, 2545764, 1728042, 1531059, 2176705, -174617, 2183247, 1766960, 997146, -185351, 664553, 1520849, -451556, 94482, -1035754, 858993, 833436, -650164, -753613, -725219, -1047316, -1921393, -1085590, -1131432, -926341, -1711108, -956177, -1333506, -1742285, -524755, 51952, -748987, -1574142, -849717, -222994, 120795, 549622, -226648, -1063327, 907978, 1270433, 1696494, 1261213, 2183515, 1167455, 1768855, 370629, 1463904, 1545765, 1882601, 1783031, 2600074, 1438147, 911408, 2590077, 3753867, 2845029, 943149, 1258978]
2942A258978m57225k97857Q63719J217806O31010l32620n36925l06364o62075
2933A378447M99726J77765m96652o94425J44294Q3947Q032P75363p3497N43494
2923B346494O25841K19662R16873l88850j159964M33850j07510q7775Q39842k3133
2913C615330j38326j346351r7805J199347P1678n39498k79819j46560J925774
2904D263770l30431j625771n33667J677299Q07235j772889j102128J154950R22096
2895C460464N99098M211j524875n30193L00302J069719j331505m60155m36512
2886A150554K73603K69321n57637J083934o4584J884806L1313j794382K97024
2877B573952j801337J258083J888390k279737j114940J863339J186942j5558p55272
$$ y = [1258978, 801753, 503896, 1367615, 2585421, 3216431, 2883811, 2346886, 2040522, 1378447, 1878173, 2055938, 1559286, 864861, 1009155, 1093102, 1101134, 1876497, 1803000, 2346494, 2972335, 3191997, 4108870, 3720020, 2560056, 2993906, 2886396, 2798621, 3638463, 3615330, 3477004, 2130653, 2032848, 3232195, 3303873, 2764375, 2484556, 2337996, 4263770, 3933339, 2307568, 1773901, 3451200, 4258435, 2485546, 1383418, 2538368, 3460464, 4059562, 4063773, 2538898, 2008705, 2309007, 3378726, 2047221, 1587066, 1150554, 1424157, 1693478, 1135841, 2219775, 2155191, 4039997, 4071310, 2276928, 2573952, 772615, 2030698, 3919088, 1639351, 524411, 2387750, 3574692, 3559134, 2803862]
2868B803862q12582Q11699j485906l76832J067212j131568K03986N04548p46359
2859H38060R55203K279172q14214k008988r18140N68409J162086j139388o98276
2850B23924r46844J800471j348046l84841J688842J206687p47798j532117k217078
2841b256800J437015R26833J811927L11909j227042N8649J53091J233304k753782
2832c04896J731777M99818j951544J484548P31909K41718J30964k232960j88172
2823A43162m60115j106327R26059M73267J015274j477314r56376J484113N80848
2814F22591n48122q7454l085012J270601J290461K26280J277512j671299j383805
2805b088247L14716m1219J809324P19011j335119J54065j97885J084568k70o69722
$$ y = [2803862, 1991280, 2802979, 1317073, 940241, 2007453, 875885, 1079871, 1584419, 838060, 1793263, 4072435, 3258221, 1249233, 331093, 899502, 2061588, 922200, 223924, -722920, 1077551, -270495, -655336, 1033506, 2240193, 1492395, -39722, -2256800, -819785, 107048, 1918975, 2230884, 1003842, 1062491, 1215582, 2448886, -304896, 1426881, 1926699, -24845, 1459703, 2191612, 2433330, 2564294, 331334, 143162, -316953, -1423280, -497221, -23954, 991320, -485994, -1442370, 41743, 622591, 74469, -12985, -3097997, -1827396, -536935, -310655, 966857, -704442, -2088247, -1773531, -1814750, -5426, 713585, -621534, -467469, -665354, 419214, 418944, -250778]
2795b50778J245n24619l88860j52771Q61357K44518J244763p49062m94167J391470
2785A183096n95463k72124j078297j296555K692804J698310j990330j081470p75696
2776a515725r80981j269188J371705r36407q1089K02685M64259l85907j58363
2767c289011J45050k73637J285368Q45138j092640m62626n88894O43324k15274
2758c003202j52481o31828J552656P79864l84801k891125K232285J475487k940023
2749c963168L47794K05956K224341r985K06938J488434p82316j750997L13394
2740a719609J504674N6846j007035n2868L48732K80704l99947J023159J46927
2731A81583p93287j135581p62912J62970J64170r40712M07318o8068M75816L58229
$$ y = [-250778, -249533, -774152, -1163012, -1315783, -454426, -209908, 1034855, 285793, -208374, 1183096, 587633, 315509, -762788, -2059343, 633461, 2331771, 341441, -740029, -1515725, -2496706, -3765894, -2394189, -3330596, -3411685, -3209000, -2744741, -3130648, -3289011, -3143961, -3417598, -2132230, -1287092, -2379732, -2842358, -3431252, -2787928, -3003202, -3155683, -3787511, -2234855, -1454991, -1839792, -4730917, -2498632, -1023145, -3963168, -3615374, -3409418, -1185077, -1195062, -988124, 500310, -282006, -2033003, -1719609, -214935, -158089, -1165124, -1217992, -869260, -588556, -988503, 34656, 181583, -611704, -1747285, -2510197, -2347227, -2183057, -3123769, -2716451, -2784519, -2308703, -1950474]
2721a950474L03206J396883M72947m25502l51168k18048k686787R36115q3949
2712b606777J104643J789579l69545k79074j754594n49044J044J226348L6055
2703a401365k100876K244680m91446K25538n20156Q5531P80131o20525L40765
2694a457723l71493n44843J871631K15908j284960J19788K99421O71068k740560
2685c221763j522107J008808K569349J648252j834197q56954j90814L31748r77564
2676c045242k33376J09730K049698l30434p25878Q33889M24377K176474j317600
2667e8362p87902j027866m91822R07713O15448j63864o5353Q27322k13649N42637
2657H4302j225407r87773J571699r9937J138356n39625k05280j449708J884392
$$ y = [-1950474, -1647268, -250385, 222562, -202940, -554108, -772156, -3458943, -2522828, -2606777, -1502134, 287445, -82100, -361174, -2115768, -2664812, -2663768, -1437420, -1401365, -3502241, -1257561, -1749007, -1523469, -2043625, -1958094, -1177963, -1798488, -1457723, -1829216, -2374059, -502428, -286520, -1571480, -1451692, -1152271, -481203, -3221763, -4743870, -3735062, -1165713, 482539, -1351658, -2208612, -2399426, -2067678, -3045242, -3278618, -3168888, -1119190, -1449624, -2175502, -1341613, -917236, 1259238, -58362, -846264, -1874130, -2365952, -1458239, -842791, -1006655, -1072008, -244686, -458335, 84302, -1141105, -2128878, -557179, -657116, 481240, -58385, -263665, -1713373, 171019]
2648A71019J581068j74323j977400J17861K1493K89311k226349j496832o25058
2639d319210J16928R43567O83099j53939J39143M89950Q55440j243252J605340
2630h82934N8474J430014r57736j145100L43812m26331k97361k060242J88579
2621c748825J274303J614686k00171l92387L74165j251157Q76307n25551j098595
2612c077225K271389N98855K79239o86920l59958r37638J294046p77834j078528
2603b474574L62384o2756r31212J823824k76126j024666j252812m30493O30148
2594c636283J335714P0332O11153j661981J36370k20386J748263K81553k256489
2585c591754J226527M56987J06990Q79764O33280k032064J004540J670959j051676
$$ y = [171019, 1752087, 1577764, -399636, -281775, -260282, 29029, -2197320, -3694152, -4319210, -4202282, -3258715, -2575616, -2729555, -2590412, -2100462, -1245022, -2488274, -882934, -824460, 605554, -352182, -1497282, -1153470, -1579801, -1877162, -3937404, -3748825, -2474522, -859836, -1060007, -1452394, -1078229, -2329386, -1453079, -1978630, -3077225, -805836, -206981, 72258, -614662, -974620, -1912258, -618212, -1396046, -2474574, -2112190, -2174946, -3106158, -1282334, -1558460, -2583126, -3835938, -4266431, -3636283, -2300569, -2230237, -1619084, -3281065, -3144695, -3365081, -1616818, -1335265, -3591754, -2365227, -1908240, -1801250, -921486, -288206, -2320270, -1315730, 355229, -696447]
2576f96447j663682J139463K434959r45940j770704l479218M18619K378275n52517
2567b737192o94585J579090j176534Q75224J856644Q95833j499226o55467J678399
$$ y = [-696447, -2360129, -1220666, 1214293, 268353, -1502351, -4981569, -4562950, -2184675, -2737192, -3431777, -1852687, -3029221, -2153997, -297353, 598480, -900746, -1556213, 122186]
$$ [...]
##END NTUPLES=NMR SPECTRUM
##END=
