##TITLE=1H_TG-2375
 CDCl3
 8 sc, 
 5.10.2023
##JCAMPDX= 6.0         $$ Bruker NMR JCAMP-DX V2.0
##DATA TYPE= NMR SPECTRUM
##DATA CLASS= NTUPLES
##ORIGIN= UXNMR, Bruker Analytische Messtechnik GmbH
##OWNER= root
$$ XWIN-NMR		Version 3.5
$$ Thu Oct  5 14:03:13 2023 Russian Standard Time (UT+4h)  she@DPX200
##.OBSERVE FREQUENCY= 200.13135
##.OBSERVE NUCLEUS= ^1H
##.ACQUISITION MODE= SIMULTANEOUS
##.ACQUISITION SCHEME= undefined
##.AVERAGES= 8
##.DIGITISER RES= 18
##SPECTROMETER/DATA SYSTEM= spect
##.PULSE SEQUENCE= zg30
##.SOLVENT NAME= D2O
##.SHIFT REFERENCE= (INTERNAL, D2O, 0, 15.7744)
##AUDIT TRAIL= $$ (NUMBER, WHEN, WHO, WHERE, WHAT)
$$ ##TITLE= Audit trail, XWIN-NMR		Version 3.5
$$ ##JCAMPDX= 5.01
$$ ##ORIGIN= Bruker BioSpin GmbH
$$ ##OWNER= she
$$ F:/spectra/data/she/nmr/H-F/1/pdata/1/auditp.txt
$$ ##AUDIT TRAIL=  $$ (NUMBER, WHEN, WHO, WHERE, WHAT)
(   1,<2023-10-05 14:02:11.84 +0400>,<she>,<DPX200>,
      <created by zg, POWCHK disabled, PULCHK disabled
       configuration hash MD5:
       00 E9 B6 7A A2 85 ED C7 34 08 36 98 17 FE 4E 26
       data hash MD5: 16K
       52 92 8F B0 B0 84 17 27 75 9C 60 8D D8 5A 23 A8>)
(   2,<2023-10-05 14:02:14.37 +0400>,<she>,<DPX200>,
      <Start of raw data processing
       efp BC_mod = 2 LB = 0.24 FT_mod = 6 PKNL = 1 PHC0 = -22071.02 PHC1 = 12.85271 SI = 16K 
       data hash MD5: 16K
       7F 94 28 BB 52 99 7C 48 5B 00 38 45 66 2F C4 17>)
(   3,<2023-10-05 14:02:30.53 +0400>,<she>,<DPX200>,
      <pk PHC0 = 0.4303697 PHC1 = -0.2000001 
       data hash MD5: 16K
       98 28 F7 96 4C E5 97 38 CB 74 DD B7 BF 35 72 C3>)
(   4,<2023-10-05 14:02:34.17 +0400>,<she>,<DPX200>,
      <abs ABSG = 5 
       data hash MD5: 16K
       4C AE BA A2 B1 AE 62 E1 CE 80 26 43 3A 73 36 45>)
$$ ##END=
$$ 
$$ hash MD5
$$ 05 CE 87 BF 17 4A 57 59 B6 F8 4C 68 8E 63 72 93
##$RELAX= 
##$RELAX= 
##$RELAX= 
##$RELAX= 
##$RELAX= 
##$RELAX= 
$$ Bruker specific parameters
$$ --------------------------
##$DU= <F:/spectra>
##$EXPNO= 1
##$NAME= <H-F>
##$PROCNO= 1
##$TYPE= <nmr>
##$USER= <she>
##$AMP= (0..31)
100 100 100 100 100 100 100 100 100 100 100 100 100 100 100 100 100 100 
100 100 100 100 100 100 100 100 100 100 100 100 100 100 
##$AQSEQ= 0
##$AQ_mod= 1
##$AUNM= <au_zg>
##$AUTOPOS= <>
##$BF1= 200.13
##$BF2= 200.13
##$BF3= 200.13
##$BF4= 200.13
##$BF5= 200.13
##$BF6= 200.13
##$BF7= 200.13
##$BF8= 200.13
##$BYTORDA= 1
##$CFDGTYP= 0
##$CFRGTYP= 5
##$CHEMSTR= <none>
##$CNST= (0..31)
1 1 145 1 1 1 1 1 1 1 1 1 1 1 1 1 1 1 1 1 1 1 1 1 1 1 1 1 1 1 1 1 
##$CPDPRG= <>
##$CPDPRG1= <>
##$CPDPRG2= <>
##$CPDPRG3= <>
##$CPDPRG4= <mlev>
##$CPDPRG5= <mlev>
##$CPDPRG6= <mlev>
##$CPDPRG7= <mlev>
##$CPDPRG8= <mlev>
##$CPDPRGB= <>
##$CPDPRGT= <>
##$D= (0..31)
0 1.2 0 0 0 0 0 0 0 0.06 0 0.03 0 0 0 0 0.0002 0 0 0 0 0 0 0 0 0 0 0 0 
0 0 0 
##$DATE= 1696500131
##$DBL= (0..7)
120 120 120 120 120 120 120 120 
##$DBP= (0..7)
150 150 150 150 150 150 150 150 
##$DBP07= 0
##$DBPNAM0= <>
##$DBPNAM1= <>
##$DBPNAM2= <>
##$DBPNAM3= <>
##$DBPNAM4= <>
$$ [...]
##$SUBNAM3= <"">
##$SUBNAM4= <"">
##$SUBNAM5= <"">
##$SUBNAM6= <"">
##$SUBNAM7= <"">
##$SUBNAM8= <"">
##$SUBNAM9= <"">
##$SW= 18.05172834244
##$SWIBOX= (0..15)
0 0 2 0 0 0 0 0 0 0 0 0 0 0 0 0 
##$SW_h= 3612.71676300578
##$TD= 16384
##$TD0= 1
##$TE= 0
##$TE2= 300
##$TE3= 300
##$TEG= 300
##$TL= (0..7)
0 120 120 120 120 120 120 120 
##$TP= (0..7)
150 150 150 150 150 150 150 150 
##$TP07= 0
##$TPNAME0= <>
##$TPNAME1= <>
##$TPNAME2= <>
##$TPNAME3= <>
##$TPNAME4= <>
##$TPNAME5= <>
##$TPNAME6= <>
##$TPNAME7= <>
##$TPOAL= (0..7)
0.5 0.5 0.5 0.5 0.5 0.5 0.5 0.5 
##$TPOFFS= (0..7)
0 0 0 0 0 0 0 0 
##$TUNHIN= 0
##$TUNHOUT= 0
##$TUNXOUT= 0
##$USERA1= <user>
##$USERA2= <user>
##$USERA3= <user>
##$USERA4= <user>
##$USERA5= <user>
##$V9= 5
##$VALIST= <valist>
##$VCLIST= <CCCCCCCCCCCCCCC>
##$VD= 0
##$VDLIST= <DDDDDDDDDDDDDDD>
##$VPLIST= <PPPPPPPPPPPPPPP>
##$VTLIST= <TTTTTTTTTTTTTTT>
##$WBST= 1024
##$WBSW= 4
##$XGAIN= (0..3)
0 0 0 0 
##$XL= 0
##$YL= 0
##$YMAX_a= 406799
##$YMIN_a= -612002
##$ZGOPTNS= <>
##$ZL1= 120
##$ZL2= 120
##$ZL3= 120
##$ZL4= 120
##$ABSF1= 15.73476
##$ABSF2= -2.317089
##$ABSG= 5
##$ABSL= 3
##$ALPHA= 0
##$AQORDER= 0
##$ASSFAC= 0
##$ASSFACI= 0
##$ASSFACX= 0
##$ASSWID= 0
##$AUNMP= <proc_1d>
##$AZFE= 0.1
##$AZFW= 0.1
##$BCFW= 0
##$BC_mod= 2
##$BYTORDP= 0
##$COROFFS= 0
##$CY= -3
##$DATMOD= 1
##$DC= 0
##$DFILT= <>
##$DTYPP= 0
##$F1P= 0
##$F2P= 0
##$FCOR= 1
##$FTSIZE= 16384
##$FT_mod= 6
##$GAMMA= 0
##$GB= 0
##$INTBC= 1
##$INTSCL= 3.70164e-10
##$ISEN= 128
##$LB= 0.24
##$LEV0= 0
##$LPBIN= 0
##$MAXI= 10000
##$MC2= 0
##$MEAN= 0
##$ME_mod= 0
##$MI= 1.114404
##$NCOEF= 0
##$NC_proc= -7
##$NLEV= 6
##$NOISF1= 3.799351
##$NOISF2= 2.8
##$NSP= 0
##$NTH_PI= 0
##$NZP= 0
##$OFFSET= 15.77444
##$PC= 1
##$PHC0= -22070.59
##$PHC1= 12.65271
##$PH_mod= 1
##$PKNL= yes
##$PPARMOD= 0
##$PSCAL= 0
##$PSIGN= 0
##$REVERSE= no
##$SF= 200.129999419963
##$SI= 16384
##$SIGF1= 3
##$SIGF2= 2
##$SINO= 5.538805
##$SIOLD= 16384
##$SREGLST= <1H.CDCl3>
##$SSB= 0
##$STSI= 16384
##$STSR= 0
##$SW_p= 3612.71676300578
##$SYMM= 0
##$S_DEV= 0
##$TDeff= 16384
##$TDoff= 0
##$TI= <>
##$TILT= no
##$TM1= 0
##$TM2= 0
##$TOPLEV= 0
##$USERP1= <user>
##$USERP2= <user>
##$USERP3= <user>
##$USERP4= <user>
##$USERP5= <user>
##$WDW= 1
##$XDIM= 16384
##$YMAX_p= 431370403
##$YMIN_p= -513117
$$ End of Bruker specific parameters
$$ ---------------------------------
##NTUPLES= NMR SPECTRUM
##VAR_NAME=  FREQUENCY,     SPECTRUM/REAL,   SPECTRUM/IMAG
##SYMBOL=    X,             R,               I
##VAR_TYPE=  INDEPENDENT,   DEPENDENT,       DEPENDENT
##VAR_FORM=  AFFN,          ASDF,            ASDF
##VAR_DIM=   16384,         16384,           16384
##UNITS=     HZ,            ARBITRARY UNITS, ARBITRARY UNITS
##FACTOR=    0.220516191357247, 1,           1
##FIRST=     3156.93863036707, 0,            0
##LAST=      -455.778132638708, 0,           0
##MIN=       -455.778132638708, -513117,     0
##MAX=       3156.93863036707, 431370403,    0
$$ Real data points
##PAGE= N=1
##DATA TABLE= (X++(R..R)), XYDATA
$$ [...]
5576F065432m1349J383J28946n140n3449L72415q9867J48757K27365L56500J59817
$$ 6065432 6024083 6025466 6154412 6149272 6095823 6468238 6378371 6527128 6754493 7110993 7270810
5565G270810J4823K09310J51809L22344L39545M42451L50670M06138O72494N54155
$$ 7270810 7285633 7494943 7646752 7969096 8308641 8751092 9101762 9507900 10180394 10734549
5555A0734549L76189L80382M33584N93618k78737o80630m22336J78150J64148
$$ 10734549 11110738 11491120 11924704 12518322 12239585 11558955 11136619 11314769 11478917
5546A1478917J00808K85080M98690M19540P44686N92332P11034P45105R14891
$$ 11478917 11579725 11864805 12363495 12783035 13527721 14120053 14831087 15576192 16491083
5537A6491083O42241O27924P15473M14784K90409l4826k28743m60337k05330m37333
$$ 16491083 17133324 17761248 18476721 18891505 19181914 19147088 18918345 18458008 18252678 17815345
5527A7815345m08012k45294k29132l3026k23967j63555K514l2594n36059p50429
$$ 17815345 17407333 17162039 16932907 16899881 16675914 16512359 16514873 16482279 15946220 15195791
5517A5195791n61995m79744j18862j43762j09748O2579R8063J82575q3004K70782
$$ 15195791 14633796 14154052 14035190 13891428 13781680 13844259 13942322 14124897 14041893 14312675
5507A4312675K28923K04311K329M8111L12015P14796N19724N68994Q69288R02553
$$ 14312675 14541598 14745909 14748238 14796349 15108364 15823160 16342884 16911878 17781166 18683719
5497A8683719O43654J045807J428065J393976J434552J130191J717573J388985
$$ 18683719 19327373 20373180 21801245 23195221 24629773 25759964 27477537 28866522
5489B8866522R46525O16109j62657m03684q40414j093321j221830j465780j306053
$$ 28866522 29813047 30429156 30266499 29862815 29022401 27929080 26707250 25241470 23935417
5480B3935417j147284j258994j147780r35583p17890p09792p15129n84305q76961
$$ 23935417 22788133 21529139 20381359 19445776 18727886 18018094 17302965 16718660 15841699
5471A5841699n11494l50150L602k15221j41739J80139J07458K16420L81951N35609
$$ 15841699 15330205 14980055 14983657 14768436 14626697 14806836 14914294 15130714 15512665 16048274
5461A6048274O21179P33253N94731k845q4388o53485p00121p47504k88690K62161
$$ 16048274 16669453 17402706 17997437 17994592 17910204 17256719 16556598 15809094 15520404 15782565
5451A5782565K08174K05937K05233K61554M12216M41745O38737M62435P38521
$$ 15782565 15990739 16196676 16401909 16663463 17075679 17517424 18156161 18618596 19357117
5442A9357117L85887J11926j86887p4857j39849o81056p06331n14375l92783l94899
$$ 19357117 19743004 19854930 19668043 19593186 19453337 18772281 18065950 17551575 17158792 16763893
5432A6763893j67710j11331J71783K47387K71073K23512l06168n75385q09859
$$ 16763893 16596183 16484852 16656635 16904022 17175095 17398607 17092439 16517054 15707195
5423A5707195j071012m46727l87753m21424l00496j76250K28025J22882L0524
$$ 15707195 14636183 14189456 13801703 13380279 13079783 12903533 13131558 13254440 13284964
5414A3284964R7310N3562J21226L00908L48204J30484J35678K75177K87707O6038
$$ 13284964 13382274 13435836 13557062 13857970 14206174 14336658 14472336 14747513 15035220 15101258
5404A5101258N6651l62584j78401m14572O792M9478j73805P6418L89936J67371
$$ 15101258 15157909 14795325 14616924 14202352 14209144 14258622 14084817 14161235 14551171 14718542
5394A4718542K34669m7304J34262j39973j45386K41842Q1662J24302K46428M35158
$$ 14718542 14953211 14905907 15040169 14900196 14754810 14996652 15078314 15202616 15449044 15884202
5384A5884202K59639L34212O00640N21169K50733N63987Q52884P21335O03910
$$ 15884202 16143841 16478053 17078693 17599862 17850595 18414582 19267466 19988801 20592711
5375B0592711P45573P38685N61829J15501m97654k79767p86723n56413m02030
$$ 20592711 21338284 22076969 22638798 22754299 22256645 21976878 21190155 20633742 20231712
5366B0231712l96137m29227j43973Q3535j11036K3410M29238K85401L06597O97957
$$ 20231712 19835575 19406348 19262375 19345910 19234874 19258284 19687522 19972923 20279520 20977477
5356B0977477N6355P56939P19731R90167R09988J281952J299225J304531J565977
$$ 20977477 21033832 21790771 22510502 23500669 24410657 25692609 26991834 28296365 29862342
5347B9862342J677193J747726J521670J633594J468826J466164J171898L89905
$$ 29862342 31539535 33287261 34808931 36442525 37911351 39377515 40549413 40939318
5339D0939318j04134p62869j229906j954294j812232j498726j443334j007465
$$ 40939318 40835184 40072315 38842409 36888115 35075883 33577157 32133823 31126358
5331C1126358q53086p38492l86993k20433J46542K62137K76010N76971Q49709
$$ 31126358 30273272 29534780 29147787 28927354 29073896 29336033 29612043 30189014 31038723
5322C1038723R41994J233417J519782J448128J564086J915127K102383K313632
$$ 31038723 31980717 33214134 34733916 36182044 37746130 39661257 41763640 44077272
5314D4077272K129211J988660K003339J260902P11755r9697o04519j133714j665152
$$ 44077272 46206483 48195143 50198482 51459384 52171139 52071442 51466923 50333209 48668057
5305D8668057j855573k311812k386089k162160k196876j549283j355134j141041
$$ 48668057 46812484 44500672 42114583 39952423 37755547 36206264 34851130 33710089
5297C3710089o72033n52891l58887r2693P4333K89835K36332L44195O37281R46887
$$ 33710089 33038056 32485165 32126278 32033585 32107918 32397753 32634085 32978280 33615561 34562448
5287C4562448R32725J217122J530799J535221J520430J364798J461729R72433
$$ 34562448 35495173 36712295 38243094 39778315 41298745 42663543 44125272 45097705
5279D5097705M30485j58451r19912j414630j611926j773520j683986j414016j220795
$$ 45097705 45528190 45369739 44449827 43035197 41423271 39649751 37965765 36551749 35330954
5270C5330954j012386q59914o37220o70997l67141k45083k57521n85804n39996
$$ 35330954 34318568 33458654 32821434 32150437 31783296 31538213 31280692 30694888 30154892
5261C0154892l67206m78206m23871k13079k35005j41349M8340N567N5238M73388
$$ 30154892 29787686 29309480 28885609 28672530 28437525 28296176 28344516 28350083 28405321 28878709
5251B8878709K86318K43492N56398L93007J29200l40024n18078o78293q67863
$$ 28878709 29165027 29408519 29964917 30357924 30487124 30147100 29629022 28950729 28082866
5242B8082866j031517q22882q62505o79043l58637k10561l43891j39282p1106
$$ 28082866 27051349 26228467 25365962 24686919 24328282 24117721 23773830 23634548 23563442
5233B3563442K21529K54885L02130O52293M21796N30866R24639M93756M68908
$$ 23563442 23784971 24039856 24341986 24994279 25416075 25946941 26871580 27365336 27834244
5224B7834244N25290k8121n14739m99944p75447l92545r35353q40573n40456m28024
$$ 27834244 28359534 28331413 27816674 27316730 26541283 26148738 25213385 24372812 23832356 23404332
5214B3404332j78260n96926p82588q14491n11015p83994o51217p33953o02236
$$ 23404332 23226072 22629146 21846558 21032067 20521052 19737058 19085841 18351888 17749652
5205A7749652k74928l58984l74054l29234l06723j35946j70613k18989j64433
$$ 17749652 17474724 17115740 16741686 16412452 16105729 15969783 15799170 15580181 15415748
5196A5415748J2340k19768P1439L5065J1580L57751K78059M16194L40035L92423
$$ 15415748 15428088 15208320 15279759 15314824 15326404 15684155 15962214 16378408 16718443 17110866
5186A7110866M86247J26841J61421j75260k92251m33607m40974o45457n76220
$$ 17110866 17597113 17723954 17885375 17710115 17417864 16984257 16543283 15897826 15321606
5177A5321606o59284m19517o35974n55638j17282m67671k92630k7984k53125p8878
$$ 15321606 14662322 14242805 13606831 13051193 12933911 12466240 12173610 12145626 11892501 11813623
5167A1813623o5461q0913j63923m65767n2763m07070l18993r1753R839J13511
$$ 11813623 11748162 11667249 11503326 11037559 10984796 10577726 10258733 10166980 10176819 10290330
5157A0290330j47942j03266J37903j38322K20694L02025J12083K81773M9297k19725
$$ 10290330 10142388 10039122 10177025 10038703 10259397 10561422 10673505 10955278 11004575 10784850
5147A0784850l60636j97203M9337l18010J43912M6793p7044Q1318Q102R9296j7972
$$ 10784850 10424214 10227011 10276348 9958338 10102250 10149043 10071999 10153317 10161419 10260715 10242743
5136A0242743o80r2655k9690p8967k9603l2968j91958j47695q8946j76403P2094
$$ 10242743 10242063 10149408 10119718 10040751 10011148 9978180 9786222 9638527 9549581 9373178 9445272
5125I445272K72733J3104L3743K56245Q2676N01388L75467K07865j98013N5741
$$ 9445272 9718005 9731109 9764852 10021097 10103773 10605161 10980628 11188493 10990480 11046221
5115A1046221m7986j15033n2239q0082k0440P5222J73326m2192m085k47361J11905
$$ 11046221 10998235 10883202 10830963 10750881 10730441 10805663 10978989 10936797 10932712 10685351 10797256
5104A0797256J83529r0539L0819o3946k11051J89389l9551j80053J24948L96347
$$ 10797256 10980785 10890246 10921065 10857119 10646068 10835457 10795906 10615853 10740801 11137148
5094A1137148j40393j9975p1285M69670K83989L26665j05911J12963N1954j12654
$$ 11137148 10996755 10976780 10905495 11375165 11659154 11985819 11879908 11992871 12044825 11932171
5084A1932171J23032J76941J56996J90782K26066N1101K33666n4322J24252K57705
$$ 11932171 12055203 12232144 12389140 12579922 12805988 12857089 13090755 13036433 13160685 13418390
5074A3418390K41246N2805j14812l7275K03142j92900l5822o8509j73910k32397
$$ 13418390 13659636 13712441 13597629 13560354 13763496 13570596 13534774 13466265 13292355 13059958
5064A3059958K0621N6122K30520o0416L14075j2830k6981K67842M24597K29137
$$ 13059958 13080579 13136701 13367221 13306805 13620880 13608050 13581069 13848911 14273508 14502645
5054A4502645N46638L94901L00382O07627M02726M58043K92703M71564M43984
$$ 14502645 15049283 15444184 15744566 16352193 16754919 17212962 17505665 17977229 18421213
5045A8421213O37204Q57359O68960M94375L23373j02405k90710l24423m46483
$$ 18421213 19058417 19915776 20584736 21079111 21402484 21300079 21009369 20684946 20238463
5036B0238463m06996r0539k82002J39531K71799Q1869K99683N77897M40413K49026
$$ 20238463 19831467 19740928 19458926 19598457 19870256 19952125 20251808 20829705 21270118 21519144
5026B1519144M46763K56682J66783N93704N92728Q47612Q56839Q79828J142950
$$ 21519144 21965907 22222589 22389372 22983076 23575804 24423416 25280255 26160083 27303033
5017B7303033J141877J562451J719149J881555J766804J809046J893486J914676
$$ 27303033 28444910 30007361 31726510 33608065 35374869 37183915 39077401 40992077
5009D0992077J262028R83403L47896n64962j190474j481746j093193o40342j92116
$$ 40992077 42254105 43237508 43585404 43020442 41829968 40348222 39255029 38614687 38422571
5000C8422571J54329M14802O82126R30880Q66211J114645J274534J082578O92735
$$ 38422571 38576900 38991702 39673828 40604708 41470919 42585564 43860098 44942676 45635411
4991D5635411L73357M43778M38048M57161M17762Q36407J613543J751219K384026
$$ 45635411 46008768 46452546 46890594 47347755 47765517 48601924 50215467 51966686 54350712
4982E4350712K745966K974585L002497K972958L162585K810170K211867Q23825
$$ 54350712 57096678 60071263 63073760 66046718 69209303 72019473 74231340 75055165
4974G5055165r27825k275482l394350l240859k449571j568340q36096K06056Q00054
$$ 75055165 74127340 71851858 68457508 65216649 62767078 61198738 60362642 60568698 61368752
4965F1368752J376733K227839K333020K717410K285241J574906P29340j098911
$$ 61368752 62745485 64973324 67306344 70023754 72308995 73883901 74613241 73514330
4957G3514330k395749k775000k907352k658282j446252o34623K85890Q81780J409188
$$ 73514330 71118581 68343581 65436229 62777947 61331695 60697072 60982962 61864742 63273930
4948F3273930J378251J317577J710574J730589J908591J227981m27411j796714
$$ 63273930 64652181 65969758 67680332 69410921 71319512 72547493 72120082 70323368
4940G0323368k934324l421718l141718k238149j442445q54586k16916N94265J388733
$$ 70323368 67389044 63967326 60825608 58587459 57145014 56290428 56073512 56667777 58056510
4931E8056510K061814J911157J964201J501337N43059o62062k634149l963260
$$ 58056510 60118324 62029481 63993682 65495019 66038078 65376016 62741867 58778607
4923E8778607m282421l811206l507675k624044k140822j483222j101692j028886
$$ 58778607 54496186 50684980 47177305 44553261 42412439 40929217 39827525 38798639
4915C8798639p91065n88561l93931m87766l32731l16960p22408j115089q97503
$$ 38798639 38007574 37419013 37025082 36537316 36204585 35887625 35165217 34050128 33152625
4906C3152625j246976q90190p34226n96438K5512R8118Q7804L89329N64781N16504
$$ 33152625 31905649 31015459 30281233 29684795 29710307 29808425 29896229 30285558 30850339 31366843
4896C1366843P63958R2422k33990q08734j254547j966014j963979j687544j535725
$$ 31366843 32130801 32223223 31989233 31180499 29925952 27959938 25995959 24308415 22772690
4887B2772690j383908r44851q70521q96291o26365p05391n67297n01637l30084
$$ 22772690 21388782 20443931 19573410 18677119 18050754 17345363 16778066 16276429 15946345
4878A5946345m68897m18237j76660j44375n6142l81338k07170M5589K07110J29483
$$ 15946345 15477448 15059211 14882551 14738176 14682034 14300696 14093526 14139115 14346225 14475708
4868A4475708J47465J66236K03886M64088L24866K59848L33944K86197R6348l62848
$$ 14475708 14623173 14789409 14993295 15457383 15782249 16042097 16376041 16662238 16758586 16395738
4858A6395738o74269n41892l86350l13506l64382k46597m36552j48726m4456k43256
$$ 16395738 15721469 15179577 14793227 14479721 14115339 13868742 13432190 13283464 13239008 12995752
4848A2995752l4964j81388L6973k178q0706n2051j39356j5321K032K6181K6092
$$ 12995752 12960788 12779400 12816373 12814195 12733489 12681438 12542082 12526761 12528793 12554974 12581066
4837A2581066j38834K42750L85694j8573K9733N4170R2216J47246J04401J28563
$$ 12581066 12442232 12684982 13070676 13052103 13081836 13136006 13228222 13375468 13479869 13608432
4827A3608432j54568o5238j74389j23882j7169j54922j22024j38242n1810r1999
$$ 13608432 13453864 13388626 13214237 13090355 13073186 12918264 12796240 12657998 12606188 12514189
4817A2514189j25805N1869l5558j77961p7174j21640j05687J64896m7372l2116
$$ 12514189 12388384 12440253 12404695 12226734 12149560 12027920 11922233 12087129 12039757 12007641
4807A2007641j49364n4177k0201j7536l6644j12578J5048j08835k26272N7172
$$ 12007641 11858277 11804100 11783899 11766363 11729719 11617141 11632189 11523354 11297082 11354254
4797A1354254o1392r9772l9024j13698R988K1919K57103k01149Q91k74178k59609
$$ 11354254 11292862 11193090 11154066 11040368 11050356 11072275 11329378 11128229 11129120 10854942 10595333
4786A0595333q8138M7873k34391j64995m4882l7744k51234O437k6213m43301o6918
$$ 10595333 10507195 10555068 10320677 10155682 10110800 10073056 9821822 9828259 9802046 9358745 9291827
4775I291827n9356m2391j79962j74175L8284k5381k30120j09754K6973Q754q4811
$$ 9291827 9232471 9190080 9010118 8835943 8874227 8848846 8618726 8508972 8535945 8544699 8459888
4764H459888k6469R862k14593O7699k32501n7745j59248r7512j14210j37188L2045
$$ 8459888 8433419 8443281 8228688 8296387 8063886 8006141 7846893 7749381 7635171 7497983 7530028
4753G530028m2557j17567j58112J19322O6537o0816j59703j09580j24545k85910
$$ 7530028 7487471 7369904 7211792 7331114 7397651 7336835 7177132 7067552 6943007 6657097
4743F657097J28384n8499K1823j36385j82480j3170l7185M6530j86483k31308
$$ 6657097 6785481 6726982 6748805 6612420 6429940 6416770 6379585 6426115 6239632 6008324
4733F008324J42810o0409j40380r7773j4108J56234k35191K27186k0237j31466
$$ 6008324 6151134 6090725 5950345 5852572 5838464 5994698 5759507 5986693 5966456 5834990
4723E834990q8870k71501j51238n6532j35380j66551J33406J07924j3765l4885
$$ 5834990 5746120 5474619 5323381 5266849 5131469 4964918 5098324 5206248 5192483 5157598
4713E157598j87244L9184j57152l3953O9701J42271q8245J47597j72253j66103
$$ 5157598 4970354 5009538 4852386 4818433 4888134 5030405 4942160 5089757 4917504 4751401
4703D751401L1864l7229j24344N8055O1012l66933q7607k5211P1288k41298j6175
$$ 4751401 4783265 4746036 4621692 4679747 4740759 4373826 4286219 4261008 4332296 4090998 4074823
4692D074823P9203j63683Q9291L5156p3567j32320K9336J7401J04182j30734N8910
$$ 4074823 4154026 3990343 4079634 4114790 4041223 3908903 3938239 3955640 4059822 3929088 3987998
4681C987998K31284M6446K4278Q5968J07562r6139k11148j45327J16142L675j60894
$$ 3987998 4219282 4265728 4290006 4375974 4483536 4387397 4176249 4030922 4147064 4150739 3989845
4670C989845o96p6793N9240o8483j39147K3831j43484K64785J41404k35289j54813
$$ 3989845 3989149 3912356 3971596 3903113 3763966 3787797 3644313 3909098 4050502 3815213 3660400
4659C660400J0490j0492r9604j01169j65831R7314J82719R0211l22653K113J88827
$$ 3660400 3670890 3660398 3560794 3459625 3293794 3391108 3573827 3664038 3341385 3343498 3532325
4648C532325n0091m5668M0772J9598p4268J78649j41924m3849J6712j09220l4331
$$ 3532325 3482234 3436566 3477338 3496936 3422668 3601317 3459393 3415544 3432256 3323036 3288705
4637C288705K4955O0854L7485J21459k34237j41956P9901J91219l4834J41851
$$ 3288705 3313660 3374514 3411999 3533458 3299221 3157265 3237166 3428385 3393551 3535402
4627C535402j92k3655j97355k5305O238j2487J77825k14945j33946l6336K24879
$$ 3535402 3535210 3511555 3314200 3288895 3295133 3282646 3460471 3245526 3111580 3075244 3300123
4616C300123n369k8880j4752m7096R8880O3772p9698n0259j86200O5185l4543
$$ 3300123 3294754 3265874 3251122 3204026 3302906 3366678 3286980 3236721 3050521 3115706 3081163
4605C081163K25232O7037q7955l12523K56463K12215N0440j25774l88759J70574
$$ 3081163 3306395 3373432 3285477 2972954 3229417 3441632 3492072 3366298 2977539 3148113
4595C148113r419J53814L5021J7802q8701k2828J68993J7052O2947K5645j14464
$$ 3148113 3138694 3292508 3327529 3345331 3256630 3233802 3402795 3419847 3482794 3508439 3393975
4584C393975J01082n8138q3432J36817n4538N2349J05264l38257J20233N0536
$$ 3393975 3495057 3436919 3353487 3490304 3435766 3488115 3593379 3255122 3375355 3425891
4574C425891k868R2024J62914K2247j48918N5763K16830J76804k30031p048O2491
$$ 3425891 3423023 3515047 3677961 3700208 3551290 3607053 3823883 4000687 3770656 3763608 3826099
4563C826099l8561j30581j91010m7992P4307K11531j12061p9995N8480J26854
$$ 3826099 3787538 3656957 3465947 3417955 3492262 3703793 3591732 3511737 3570217 3697071
4553C697071Q8952j89699J2165L2567O8461j40740J05054Q7804n0771k01250O0363
$$ 3697071 3786023 3596324 3608489 3641056 3709517 3568777 3673831 3761635 3710864 3509614 3569977
4542C569977K9980K83680o4541k4237K6981K5704p1788r3955k38570p3575K58627
$$ 3569977 3599957 3883637 3819096 3794859 3821840 3847544 3775756 3681801 3443231 3369656 3628283
4531C628283q9935k6357M7072J62220j56851r6212J07844j19489k0479J36512
$$ 3628283 3538348 3511991 3559063 3721283 3564432 3468220 3576064 3456575 3436096 3572608
4521C572608K7031j15230k7501J66098Q1584k94084R6755R0193M188j5827P7269
$$ 3572608 3599639 3484409 3456908 3623006 3704590 3410506 3507261 3597454 3601642 3585815 3663084
4510C663084J88008J37375M6644k64816j26130K8780K96935o2361k313o4579k6508
$$ 3663084 3851092 3988467 4035111 3770295 3644165 3672945 3969880 3907519 3905206 3840627 3814119
4499C814119N7936j43409P1498N2660j11477O9968N6503J99344j55591m8646J36264
$$ 3814119 3872055 3728646 3800144 3852804 3741327 3811295 3867798 4067142 3911551 3862905 3999169
4488C999169N8892P7804J9206j37593l8870q3022J82687L7167o0305k08071N1598
$$ 3999169 4058061 4135865 4155071 4017478 3978608 3895586 4078273 4115440 4055135 3847064 3898662
4477C898662J29534R0026O647j34385M0875j33503R7888K37912J21639J35511
$$ 3898662 4028196 4118222 4124869 3990484 4031359 3897856 3995744 4233656 4355295 4490806
4467D490806p2259q0835J3202r592K70343J20758j11917R4284J77854j82563k94043
$$ 4490806 4418547 4337712 4350914 4341322 4611665 4732423 4620506 4714790 4892644 4710081 4416038
4456D416038N8872n4404J2035j3155R5707J24512J03334n2666r078p1675K59829
$$ 4416038 4474910 4420506 4432541 4419386 4515093 4639605 4742939 4690273 4681195 4609520 4869349
4445D869349J37711j16649k09961j26071j7982n6461J43501k5916m3789K44166
$$ 4869349 5007060 4890411 4680450 4554379 4536397 4479936 4623437 4597521 4553732 4797898
4435D797898K71411l57920J4562O7423J45062K54012L8387j29296m0312J27855
$$ 4797898 5069309 4711389 4725951 4793374 4938436 5192448 5230835 5101539 5061227 5189082
4425E189082K5838l7584R6957m4090N9716j10674m4749Q1053K29001q3971N7625
$$ 5189082 5214920 5177336 5274293 5230203 5289919 5179245 5134496 5215549 5444550 5360579 5418204
4414E418204J74569N6895K1687K3695j02365L3950J09339J58218J22284l1188
$$ 5418204 5592773 5649668 5671355 5695050 5592685 5626635 5735974 5894192 6016476 5985288
4404E985288j6019J69154N2750J95193J40609R3315Q2210q8742n5237k46289r1771
$$ 5985288 5969269 6138423 6191173 6386366 6526975 6620290 6702500 6613758 6558521 6312232 6220461
4393F220461k27357k00529r0772k2170k9318k29441j18812l3253q2576O7277j14988
$$ 6220461 5993104 5792575 5701803 5679633 5650315 5420874 5302062 5268809 5186233 5253510 5138522
4382E138522J54190o6778p6380L6818K33287P8843m3849j46480o9935P3359j25664
$$ 5138522 5292712 5225934 5149554 5186372 5419659 5498502 5454653 5308173 5238238 5311597 5185933
4371E185933p5560K27061J81110k41853p2065K73341k8545k00760L2735J74729
$$ 5185933 5110373 5337434 5518544 5276691 5204626 5477967 5449422 5248662 5281397 5456126
4361E456126q543J34686J2482J84678p4120R2971P0277j52603q2984N9053r6787
$$ 5456126 5447583 5582269 5594751 5779429 5705309 5798280 5868557 5715954 5632970 5692023 5595236
4350E595236n108N9007L5233J74314P031J04711l157J7113L5058k1562m1315P7390
$$ 5595236 5590128 5649135 5684368 5858682 5865713 5970424 5967267 5984380 6019438 5997876 5956561 6033951
4338F033951m3655O4411J13848J17862j42274P8505J41825O0562R0040R2391Q66
$$ 6033951 5990296 6054707 6168555 6286417 6144143 6222648 6364473 6425035 6515075 6607466 6608332
4327F608332J05147L6021n9109j5738J66846O661N9435j74727K3742M9277p5458
$$ 6608332 6713479 6749500 6690391 6674653 6841499 6848160 6907595 6732868 6756610 6805887 6730429
4316F730429m3765o5212J56274R0246j68840Q9511K69068j7658j92497J53565
$$ 6730429 6686664 6621452 6777726 6867972 6699132 6788643 7057711 7040053 6847556 7001121
4306G001121J0373O4063K1454J22277k12153R3032J81201J35316j05588j62712
$$ 7001121 7011494 7075557 7097011 7219288 7007135 7100167 7281368 7416684 7311096 7148384
4296G148384j83144J68885L82838j03368M7277J38541P4089r627L6134M0329N9016
$$ 7148384 6965240 7134125 7516963 7413595 7460872 7599413 7673502 7663875 7700009 7740338 7799354
4285G799354J88898J61817J03687J37128n195K37780K33255L02495J67953K33356
$$ 7799354 7988252 8150069 8253756 8390884 8385689 8623469 8856724 9159219 9327172 9560528
4275I560528K9217K96810L61158R9045o4425k83681p3642j8460k45842j80670
$$ 9560528 9589745 9886555 10247713 10346758 10282333 9998652 9925010 9906550 9660708 9480038
4265I480038J58307j23492O3216J58008l13433L86684Q8753K35269j9877J49288
$$ 9480038 9638345 9514853 9578069 9736077 9422644 9809328 9898081 10133350 10113473 10262761
4255A0262761M9893J79131M0488M2131L87479l2978J81894J55126P9614K74575
$$ 10262761 10312654 10491785 10532273 10574404 10961883 10928905 11110799 11265925 11345539 11620114
4245A1620114K53125R5537J66551K01492N7753K59354k0250j7065K59037J34096
$$ 11620114 11873239 11968776 12135327 12336819 12394572 12653926 12633676 12616611 12875648 13009744
4235A3009744j16714M2727J51376K52118K43758L3275L21843M38322K53850L15468
$$ 13009744 12893030 12935757 13087133 13339251 13583009 13616284 13938127 14376449 14630299 14945767
4225A4945767K49802L05890K20371L84427N92135K74391K66302N93262N18659
$$ 14945767 15195569 15501459 15721830 16106257 16698392 16972783 17239085 17832347 18351006
4216A8351006P36202O08645N60124O91755J002678J353632J367235J666730K049242
$$ 18351006 19087208 19695853 20255977 20947732 21950410 23304042 24671277 26338007 28387249
4207B8387249K040477J619582J679198Q56233n6960k04585o73701j208919j520614
$$ 28387249 30427726 32047308 33726506 34582739 34525779 34321194 33647493 32438574 30917960
4198C0917960j629585r78396p78471m56217k88772n6095M6823k0579O6756M69249
$$ 30917960 29288375 28309979 27531508 27075291 26786519 26730424 26777247 26756668 26823424 27292673
4188B7292673K86303K31299N79010N76604N76023P74737K61118M19253P47834
$$ 27292673 27578976 27810275 28389285 28965889 29541912 30316649 30577767 30997020 31744854
4179C1744854R49045J038550R11533J156890J320577J249218J277164J322420
$$ 31744854 32693899 33732449 34643982 35800872 37121449 38370667 39647831 40970251
4171D0970251J477564J283437R22408Q64242J302208J201249O76404P64182J074458
$$ 40970251 42447815 43731252 44653660 45517902 46820110 48021359 48697763 49461945 50536403
4162E0536403J226912J330042J594149J986112J514742R37493J182012J453061
$$ 50536403 51763315 53093357 54687506 56673618 58188360 59125853 60307865 61760926
4154F1760926J780517J642775J582567J046202N55425M95089O11219J087423R52732
$$ 61760926 63541443 65184218 66766785 67812987 68368412 68863501 69474720 70562143 71514875
4145G1514875J373531J757877J567152K410094K551911K537800K882997L204275
$$ 71514875 72888406 74646283 76213435 78623529 81175440 83713240 86596237 89800512
4137H9800512L466483L591708L912333L878949M018413M485261M914503N768114
$$ 89800512 93266995 96858703 100771036 104649985 108668398 113153659 118068162 123836276
4129A23836276N928836O158809O237837O380945P629472R214254J1170625J3158435
$$ 123836276 129765112 135923921 142161758 148542703 156172175 165386429 176557054 189715489
4121A89715489J4446892J3258473R641885Q274129J1782739J8159371K4253906
$$ 189715489 204162381 217420854 227062739 235336868 247119607 265278978 289532884
4114B89532884K8536116L0306304K6809450J5451664l686103k3974648l8020717
$$ 289532884 318069000 348375304 375184754 390636418 386950315 362975667 324954950
4107C24954950m2830837l9328783l2141934k5624856k0720054j6602153j3278483
$$ 324954950 282124113 242795330 210653396 185028540 164308486 147706333 134427850
4100A34427850j0527593q722570p311730o140238n578216m937515m352045m180676
$$ 134427850 123900257 115177687 107865957 101725719 96147503 91209988 86857943 82677267
4092H2677267l895329l412512l124587k848049k414121k184911j820146j502979
$$ 82677267 78781938 75369426 72244839 69396790 66982669 64797758 62977612 61474633
4084F1474633j163763j271338j053911p54630r42849o48848m66755p69705m37918
$$ 61474633 60310870 59039532 57985621 57230991 56288142 55639294 55172539 54402834 53964916
4075E3964916m38294o32297j41205l78657l55962r8472n6728J57759J36773J92286
$$ 53964916 53526622 52894325 52753120 52374463 52018501 51920029 51863301 52021060 52157833 52350119
4065E2350119P819K97934M62500M17422M81772M46485J83429L58014N33978P46327
$$ 52350119 52357938 52655872 53118372 53535794 54017566 54464051 54647480 55005494 55539472 56285799
4055E6285799J080436Q05167J502261J905679K092135K334386K783154L439609
$$ 56285799 57366235 58171402 59673663 61579342 63671477 66005863 68789017 72228626
4047G2228626L688628M298475N546509P710227J0779604J3681054J4303057J5235813
$$ 72228626 75917254 80215729 85762238 93472465 104252069 117933123 132236180 147471993
4039A47471993K4026225J4316855j7769367l7648429l0367382j7017393j0760527
$$ 147471993 171498218 185815073 168045706 130397277 100029895 83012502 72251975
4032G2251975o991064n502209m256219l827811l200904k694705k163152k016144
$$ 72251975 65260911 59758702 55502483 51674672 48473768 45779063 43615911 41599767
4024D1599767j480971j261069j570517j279682j014952j240640r87381j020767
$$ 41599767 40118796 38857727 37287210 36007528 34992576 33751936 32764555 31743788
4016C1743788j123762j125311j007964q07035o16270q52010p17847n34568m57444
$$ 31743788 30620026 29494715 28486751 27679716 27063446 26211436 25493589 24959021 24501577
4007B4501577o59296o14109o27687n83806p13110m23869m89965l21275o21921
$$ 24501577 23842281 23228172 22600485 22016679 21303569 20879700 20389735 20068460 19446539
3998A9446539n11546l92059r0987l56832l73442j26588l78925k79954l80699n14321
$$ 19446539 18934993 18542934 18451947 18095115 17721673 17595085 17216160 16936206 16555507 16041186
3988A6041186m07498k14598n70372m65205j24510k96545k05484l20133k44028
$$ 16041186 15633688 15419090 14848718 14383513 14259003 13962458 13756974 13436841 13192813
3979A3192813k37185k45687j31078l31522j66279k74670q0730k2687l16916l89987
$$ 13192813 12955628 12709941 12578863 12247341 12081062 11806392 11725662 11702975 11386059 10996072
3969A0996072r1452r8967k21839k24237K8015O1939n62299m1610k4167Q4541n85080
$$ 10996072 10904620 10805653 10583814 10359577 10387592 10449531 9887232 9845622 9821455 9905996 9320916
3958I320916o2581K808k28888k7738Q1879P6652j70286J25601k70705j57853L9218
$$ 9320916 9258335 9261143 9032255 9004517 9086396 9163048 8992762 9118363 8847658 8689805 8729023
3947H729023N0538l79083o395o8210M9954J7555R8961J75346J16002j34845K2744
$$ 8729023 8779561 8400478 8394083 8325873 8375827 8393382 8492343 8667689 8783691 8648846 8671590
3936H671590j64288J42309k6876O0697K74565K69593L07596L99686M15821N64434
$$ 8671590 8507302 8649611 8622735 8683432 8957997 9227590 9535186 9934872 10350693 10915127
3926A0915127P32383Q43636P73134L35776p38195j563392j372503o34376l72573
$$ 10915127 11647510 12491146 13264280 13600056 12861861 11298469 9925966 9291590 8919017
3917H919017m34497j29804j16339j2027j46444l1205K7035j61373k99456j7469
$$ 8919017 8484520 8354716 8238377 8226350 8079906 8048701 8075736 7914363 7614907 7597438
3907G597438L6425j2825l9028m8979J65762j71337m4856J4586K14451r1484p4066
$$ 7597438 7633863 7621038 7582010 7533031 7698793 7527456 7482600 7497186 7711637 7620153 7546087
3896G546087M0365J9601L4911n8766J21428m6171j51638O6464N9646p3687P3720
$$ 7546087 7586452 7606053 7640964 7582198 7703626 7657455 7505817 7572281 7631927 7558240 7631960
3885G631960J79880q0846O2972J04020N523j00071l4794P9143J89872J66320k39274
$$ 7631960 7811840 7730994 7793966 7897986 7903509 7803438 7768644 7847787 8037659 8203979 7964705
3874G964705J06282M5712J98956j00943J41850k1827q2147K26862J9070j21076
$$ 7964705 8070987 8116699 8315655 8214712 8356562 8334735 8252588 8479450 8498520 8377444
3864H377444R8925K44213K4761K50004J12694J6804o1439L3729L8157J57771L55574
$$ 8377444 8476369 8720582 8745343 8995347 9108041 9124845 9063406 9097135 9135292 9293063 9648637
3853I648637J25754K45051K46808L4887j3966J53255K64220l9847O8164L03378
$$ 9648637 9774391 10019442 10266250 10301137 10287171 10440426 10704646 10664799 10732963 11036341
3843A1036341L27748J71119K05717L84061K8140K94395j5532K17122N42999K71865
$$ 11036341 11364089 11535208 11740925 12124986 12153126 12447521 12431989 12649111 13192110 13463975
3833A3463975K38791L11301L92928M03821J00257L69461L67249N47520O56869
$$ 13463975 13702766 14014067 14406995 14810816 14911073 15280534 15647783 16195303 16852172
3824A6852172O26112M55860K99758N12818Q3504K51442J91044R3334n2409Q1845
$$ 16852172 17478284 17934144 18233902 18746720 18830224 19081666 19272710 19366044 19313635 19395480
3814A9395480K05745J83437J98848n6901j67245n4578L8696j60963j92390o6948
$$ 19395480 19601225 19784662 19983510 19926609 19759364 19704786 19743482 19582519 19390129 19323181
3804A9323181j15792M61j64146k15960q0587k5160J85601N4840k08512k25389
$$ 19323181 19207389 19207850 19043704 18827744 18747157 18721997 18907598 18962438 18753926 18528537
3794A8528537O7963J6505J56427M917q3405p515L03813M59485K63549K74209M45464
$$ 18528537 18596500 18613005 18769432 18774349 18690944 18683429 18987242 19446727 19710276 19984485 20429949
3783B0429949M94075M76945P85909O09736Q97381J115093J049414J225620J348687
$$ 20429949 20924024 21400969 22186878 22796614 23693995 24809088 25858502 27084122 28432809
3774B8432809J059628R78409R51341R59599J034489Q28718Q64864R30301O27243
$$ 28432809 29492437 30470846 31422187 32381786 33416275 34244993 35109857 36040158 36667401
3765C6667401Q22350R92380J089076J005758O56238P35161L08281P1573k17908
$$ 36667401 37489751 38482131 39571207 40576965 41233203 41968364 42276645 42348218 42130310
3756D2130310l68188m86342n45384m20827l58424l57215k37336k36978j66588
$$ 42130310 41762122 41275780 40730396 40309569 39951145 39593930 39356594 39119616 38953028
3747C8953028l58912m40583n8824n2457m57593k00119k50371q3707J07883P9639
$$ 38953028 38594116 38153533 38094709 38042252 37584659 37384540 37134169 37050462 37158345 37237984
3737C7237984M04438M63328Q66271Q22364Q41003R28151Q79079P10736L20403
$$ 37237984 37642422 38105750 38972021 39794385 40635388 41563539 42442618 43153354 43473757
3728D3473757J04506j22803o8173N7556k9539q7069j26204n2463k93931q3793
$$ 43473757 43578263 43455460 43387287 43444843 43415304 43328235 43202031 43149568 42855637 42771844
3718D2771844J63953k00223k74502l00001k84842k77957l95326m19680q15634
$$ 42771844 42935797 42735574 42461072 42161071 41876229 41598272 41202946 40783266 39967632
3709C9967632q52842r35414r49612j094426p24633j144908j281175o58768o86097
$$ 39967632 39114790 38179376 37229764 36135338 35410705 34265797 32984622 32325854 31639757
3700C1639757p12944o31092o04133l36941m75764l06455p6326Q2201K02301j34865
$$ 31639757 30926813 30295721 29691588 29354647 28878883 28572428 28496102 28578303 28780604 28645739
3690B8645739l28487L5039J94987K98547L12303M62099K31521L12302L72352K32820
$$ 28645739 28317252 28352291 28547278 28845825 29158128 29620227 29851748 30164050 30536402 30769222
3680C0769222O76562M43032M49508N74416M18419J65042K36073K70019r1753K15711
$$ 30769222 31445784 31888816 32338324 32912740 33331159 33496201 33732274 34002293 33910540 34126251
3670C4126251L42195p6689k0633L5103J33477N684J98713J11769N2763j96747
$$ 34126251 34468446 34391757 34371124 34406227 34539704 34545388 34744101 34855870 34908633 34711886
3660C4711886P1269o8693k69386k09020p8735l10066k45403k98330n33835l75420
$$ 34711886 34783155 34714462 34445076 34236056 34157321 33847255 33601852 33303522 32769687 32394267
3650C2394267j20969k11169k76598K74k33648j49774k28163K8548Q9105P3186
$$ 32394267 32273298 32062129 31785531 31785805 31552157 31402383 31174220 31202768 31291873 31365059
3640C1365059K05450K42252J64833L56010K72915j26489J56663L75330K88065
$$ 31365059 31570509 31812761 31977594 32333604 32606519 32480030 32636693 33012023 33300088
3631C3300088K96016L34576L58739M28022N57069O48266N05089O62836J115923
$$ 33300088 33596104 33930680 34289419 34717441 35274510 35922776 36427865 37090701 38206624
3622C8206624P68657N92674P23886R57914N30977P36689J089846P14898P73631
$$ 38206624 38975281 39567955 40291841 41249755 41780732 42517421 43607267 44322165 45095796
3613D5095796P07336N58785L78272L5113Q6976J75422l21030k29508k89788o48090
$$ 45095796 45803132 46361917 46740189 46775302 46862278 47037700 46716670 46487162 46197374 45549284
3603D5549284n38462l67540l62234l71661j77032K4414n805M9810M82119L82085
$$ 45549284 45010822 44643282 44281048 43909387 43732355 43756769 43750964 43800774 44282893 44664978
3593D4664978M39089N43707M94776P77067Q70478J096034J180173J170668J002257
$$ 44664978 45104067 45647774 46142550 46919617 47790095 48886129 50066302 51236970 52239227
3584E2239227J125730J231549J103935J309261J303645J162670J304817J205412
$$ 52239227 53364957 54596506 55700441 57009702 58313347 59476017 60780834 61986246
3576F1986246J561383J733694J492404J666704J876949J910187K069120J936435
$$ 61986246 63547629 65281323 66773727 68440431 70317380 72227567 74296687 76233122
3568G6233122J821004J765383J933622J893659K199275J975600J877588K029159
$$ 76233122 78054126 79819509 81753131 83646790 85846065 87821665 89699253 91728412
3560I1728412J690147J608251J596442J307882Q56940O14820K75806N377K46116
$$ 91728412 93418559 95026810 96623252 97931134 98788074 99402894 99678700 99684077 99930193
3551I9930193L31150K47761K08091M94131Q97985J155217J592491K154206K633989
$$ 99930193 100261343 100509104 100717195 101211326 102109311 103264528 104857019 107011225 109645214
3542A09645214L222700L433348M230132M842980N184022N692591O215642O383517
$$ 109645214 112867914 116301262 120531394 125374374 130558396 136250987 142466629 148850146
3534A48850146O469706O316470O487081O546514N983751N396298M317701K830097
$$ 148850146 155319852 161636322 168123403 174669917 180653668 186049966 190367667 193197764
3526A93197764n38793n515309j0968158j3435809j3244125j1483842j0095343
$$ 193197764 192658971 187143662 176175504 162739695 149495570 138011728 127916385
3519A27916385q696824p740194o657219n366885m873018l892831l209003k871765
$$ 127916385 119219561 111479367 104822148 99455263 94582245 90689414 87480411 84608646
3511H4608646k237296j860883j634741j283884p25581n47522k58045J23101L44242
$$ 84608646 82371350 80510467 78875726 77591842 76866261 76318739 76060694 76183795 76528037
3502G6528037M48316N12449P27133P51259N82973M06623L26766J03416M37934
$$ 76528037 76976353 77488802 78215935 78967194 79550167 79956790 80283556 80386972 80824906
3493H0824906J90591p3802j6356m35930n65715m47320o24669o90326n95194r76287
$$ 80824906 81015497 80941695 80925339 80489409 79923694 79476374 78851705 78161379 77566185 76589898
3483G6589898p10191p92909q21977p15296o10949n53305m52354n02109k34123
$$ 76589898 75879707 75086798 74264821 73549525 72938576 72385271 71932917 71430808 71196685
3474G1196685j08447r4361l79298m87569j99085o0075p3185l94765m77629m20199
$$ 71196685 71088238 70993877 70614579 70127010 69927925 69867850 69794665 69399900 68922271 68502072
3464F8502072m28613n82413n26743n41910k52359o91247m63900j54269j93804
$$ 68502072 68073459 67491046 66964303 66422393 66170034 65478787 65014887 64860618 64666814
3455F4666814k89649l53560k05336k12349Q6686O2987J58246J14930o1041J6550
$$ 64666814 64377165 64023605 63818269 63605920 63692606 63755593 63913839 64028769 63967728 63984278
3445F3984278M28189K36704K32731J43554K9013l33293m5493M6539m62627k35537
$$ 63984278 64412467 64649171 64881902 65025456 65054469 64721176 64675683 64722222 64259595 64024058
3435F4024058l6873R9989l52944j23505n4361j44363J0807R83r0512Q1078l9832
$$ 64024058 63987185 64087174 63734230 63610725 63556364 63412001 63422808 63423791 63333279 63414357 63374525
3424F3374525J63546K60621M23528M40515K15030L55702N53238M38247k3425K77787
$$ 63374525 63538071 63798692 64222220 64662735 64877765 65233467 65786705 66224952 66201527 66479314
3414F6479314q8990J15697J96147k54492k2814j74012R0027j36704k36608k34759
$$ 66479314 66390324 66506021 66702168 66447676 66424862 66250850 66340877 66204173 65967565 65732806
3404F5732806k91073j32087m44780n70627p84634o41300l73591n50111l65040
$$ 65732806 65441733 65309646 64864866 64294239 63509605 62868305 62494714 61944603 61579563
3395F1579563j9845L15422J20306L87561P24584P81243Q07804Q71733R25263J393687
$$ 61579563 61559718 61875140 61995446 62383007 63107591 63888834 64696638 65568371 66493634 67887321
3385F7887321J387335J411384J487050J544520J808908J849443J990336K050073
$$ 67887321 69274656 70686040 72173090 73717610 75526518 77375961 79366297 81416370
3377H1416370J945776J587813J482672J590367J127346J043286J091294Q02910
$$ 81416370 83362146 84949959 86432631 88022998 89150344 90193630 91284924 92087834
3369I2087834R42730P99081O93112P83322Q02883O64172O06788L65169Q6092K06935
$$ 92087834 93030564 93829645 94522757 95306079 96108962 96773134 97379922 97745091 97831183 98038118
3359I8038118J31087M6185m155L36676k8990J05361L1547l6308j4658k03263k35583
$$ 98038118 98169205 98215390 98211235 98547911 98518921 98624282 98655829 98619521 98604863 98401600 98166017
3348I8166017R4276J07395L58407N73871M53678P60477O88165P42533J008121
$$ 98166017 98260293 98367688 98726095 99299966 99753644 100514121 101202286 101944819 102952940
3339A02952940J473211J663736J863305K247876K665310K850151L220801L957689
$$ 102952940 104426151 106089887 107953192 110201068 112866378 115716529 118937330 122895019
3331A22895019M355472M770664M933711N133246M598786K938842J867151J798979
$$ 122895019 127250491 132021155 136954866 142088112 146686898 149625740 151492891 153291870
3323A53291870K825279L454824L849953M055324M226131M058060L967332L401881
$$ 153291870 156117149 159571973 163421926 167477250 171703381 175761441 179728773 183130654
3315A83130654L141863K856855K944326K252264J643131J520044K155190K571553
$$ 183130654 186272517 189129372 192073698 194325962 195969093 197489137 199644327 202215880
3307B02215880L224891L161172L237544L250518K709302K391051K170199J791997
$$ 202215880 205440771 208601943 211839487 215090005 217799307 220190358 222360557 224152554
3299B24152554J567890J189620J336013J871593Q38635k159756n373804o067398
$$ 224152554 225720444 226910064 228246077 230117670 230956305 228796549 223422745 217355347
3291B17355347m493262k895072j827674q17396n6667K21340P79641J119943J472042
$$ 217355347 212862085 209967013 208139339 207321943 207265276 207486616 208266257 209386200 210858242
3282B10858242K370207K629965K017674R45867J045005J296392J249154K55578
$$ 210858242 213228449 215858414 217876088 218821955 219866960 221163352 222412506 222668084
3274B22668084j195182k621015l568368l982274l368327k468210j560748o91528
$$ 222668084 221472902 218851887 215283519 211301245 207932918 205464708 203903960 203212432
3266B03212432m2548O48501J543356J829935J174716K45522n13293k85690N74425
$$ 203212432 203169884 203818385 205361741 207191676 208366392 208611914 208098621 207812931 208387356
3257B08387356J765423K928509M161475N299009O240752P666912Q459562R476832
$$ 208387356 210152779 213081288 217242763 222541772 228782524 236449436 244908998 254385830
3249B54385830J0245568J0914920J0636130J0524656J0280224R249211O781118
$$ 254385830 264631398 275546318 286182448 296707104 306987328 316236539 323017657
3242C23017657J897308m023308q794511j0482098r778535q115099o478334n174098
$$ 323017657 324914965 320891657 312097146 301615048 291836513 283721414 277243080 272068982
3234B72068982m027258l444678l092406k705587k214219j848214j984126l404886
$$ 272068982 268041724 264597046 261504640 258799053 256584834 254736620 252752494 249347608
3226B49347608m392850l642384k590398k003696j010916J9584N10449J719977
$$ 249347608 244954758 241312374 238721976 236718280 235707364 235726948 236237397 237957374
3218B37957374K732226L679950M596956N016371N582418O000600N392315M506373
$$ 237957374 240689600 244369550 248966506 253982877 259565295 265565895 270958210 275464583
3210B75464583K453354n81424l966055o861534q512067r781996j0537208j0798713
$$ 275464583 277917937 277336513 273370458 266508924 257996857 248214861 237677653 226878940
3202B26878940j0098674q838012p816022o997328o238412n686049n190570n493288
$$ 226878940 216780266 207942254 200126232 193128904 186890492 181204443 176013873 170520585
3194A70520585n697158n177671m529202m184950l657523l222564l246598k805562
$$ 170520585 164823427 159645756 155116554 150931604 147274081 144051517 140804919 137999357
3186A37999357k945422k698349k408858k210994k061595j806548j367913j154765
$$ 137999357 135053935 132355586 129946728 127735734 125674139 123867591 122499678 121344913
3178A21344913m77810m6734J75752K14713R98922J199330J38881o63060j198435
$$ 121344913 120867103 120820369 120996121 121210834 122209756 123409086 123547967 122884907 121686472
3169A21686472m53976L66216L63299K37293J84195N61285R16783J377033K017722
$$ 121686472 121232496 121598712 121962011 122199304 122383499 122944784 123861567 125238600 127256322
3160A27256322K454336K751329L275253L538440L891009M291021M611509M779747
$$ 127256322 129710658 132461987 135737240 139275680 143166689 147457710 152069219 156848966
3152A56848966M682246M273672L592389K285018M85058j747754l495752l988741
$$ 156848966 161531212 165804884 169397273 171682291 172167349 170419595 166923843 162935102
3144A62935102m030822m421443m638170m641826m739953n103259m914035m096127
$$ 162935102 158904280 154482837 149844667 145202841 140462888 135359629 130445594 126349467
3136A26349467l598157l079966k227689j928805k058941j685364j651169j233061
$$ 126349467 122751310 119671344 117443655 115514850 113455909 111770545 110119376 108886315
3128A08886315j250529r02173p96219o58867n38486j35722N25514R57233J551668
$$ 108886315 107635786 106733613 105937394 105278527 104740041 104604319 105129833 106087066 107638734
3119A07638734K017562K453755K721604J391286j117820l262197l192094k266171
$$ 107638734 109656296 112110051 114831655 116222941 115105121 111842924 108650830 106384659
3111A06384659j612268j082188q21029j011678p02619p50545j256232q38846r77421
$$ 106384659 104772391 103690203 102869174 101857496 101154877 100404332 99148100 98309254 97331833
3102I7331833j632454j760776j625115j615167j737786j720684j739027j503549
$$ 97331833 95699379 93938603 92313488 90698321 88960535 87239851 85500824 83997275
3094H3997275j541732j537720j055468o65665o43646k60411L36617M50818J220699
$$ 83997275 82455543 80917823 79862355 79196690 78553044 78292633 78629250 79080068 80300767
3085H0300767J204821Q24825L6990r55271j386857r13799k29602J15876N32183
$$ 80300767 81505588 82330413 82367403 81412132 80025275 79111476 78881874 78997750 79529933
3076G9529933R72207J047349O93994O89981R32990Q65116O16830K84880L90185
$$ 79529933 80502140 81549489 82243483 82933464 83866454 84731570 85348400 85633280 86023465
3067H6023465K55471m58025m03680o89505o76075q34346j265465j468645j370691
$$ 86023465 86278936 85820911 85417231 84727726 84051651 83217305 81951840 80483195 79112504
3058G9112504j325263j331893j309461j301993q93102r85014r10386p58363q13313
$$ 79112504 77787241 76455348 75145887 73843894 72950792 71965778 71055392 70297029 69483716
3049F9483716o26410k82550j78949K52296k5460L88841J85227L87252K80236J38486
$$ 69483716 68857306 68574756 68395807 68648103 68622643 69011484 69196711 69583963 69864199 70002685
3039G0002685K42171J18755J63625K87476N23624P20431P67810P85097J207080
$$ 70002685 70244856 70363611 70527236 70814712 71338336 72058767 72826577 73611674 74818754
3030G4818754R65066J015565J136458J033994J074981K019680K248131K585439
$$ 74818754 75783820 76799385 77935843 78969837 80044818 82064498 84312629 86898068
3022H6898068L076828L560923M680896N255718N979700O840021Q001311Q345742
$$ 86898068 89974896 93535819 98216715 103472433 109452133 116292154 124293465 132639207
3014A32639207Q085416P366582M936856J182396l410370o760482q168967q135238
$$ 132639207 140724623 148091205 153028061 154210457 150800087 144039605 135870638 127735400
3006A27735400p053219n596087m531352l717082k686665k245228j272428o09835
$$ 127735400 120682181 115086094 110554742 106837660 104150995 101905767 100633339 100023504
2998A00023504l39228K72021O95418J231967J862300K383968K966501L891767
$$ 100023504 99684276 99956297 100651715 101883682 103745982 106129950 109096451 112988218
2990A12988218M940767N832335O920374Q416044R948288J2021551J3999982J6102826
$$ 112988218 117928985 123761320 130681694 139097738 149046026 161067577 175067559 191170385
2982A91170385J7228171J6551425J3517308N828814o048303j7046228k2240189
$$ 191170385 208398556 224949981 238467289 244296103 238247800 221201572 198961383
2975A98961383k1554211j8214761j4619381j1500205q985189p269299n620028
$$ 198961383 177407172 159192411 144573030 133072825 124087636 116818337 111198309
2968A11198309m705112l839235k796197k257709j300997r16089n82771J09259
$$ 111198309 106493197 102653962 99857765 97600056 96299059 95382970 94800199 94909458
2960I4909458M23419P57175J347214J845379K382337K896059L711646M437567
$$ 94909458 95332877 96090052 97437266 99282645 101664982 104561041 108272687 112710254
2952A12710254N355027N801930O406551N958184N005895L089116o3902l752979
$$ 112710254 118065281 123867211 130273762 136231946 141237841 144326957 144263055 140510076
2944A40510076p231004q553786q211497p042749n775362m338858l650573k661258
$$ 140510076 133279072 124725286 116513789 109471040 103695678 99356820 95706247 93044989
2936I3044989k090351j565859j009115p07424k92165j30172P349Q6270j09454
$$ 93044989 90954638 89388779 88379664 87672240 87380075 87249903 87257252 87343522 87234068
2927H7234068M04231O76978N42301Q42117Q40902J009263J254219J203198J615084
$$ 87234068 87638299 88315277 88857578 89699695 90540597 91549860 92804079 94007277 95622361
2918I5622361J675193J955509K145589K575430L040750L245991L261782L944576
$$ 95622361 97297554 99253063 101398652 103974082 107014832 110260823 113522605 117467181
2910A17467181M537794N217300O008344O693126P523849Q772160R941209J1117660
$$ 117467181 122004975 127222275 133230619 139923745 147447594 156219754 166160963 177278623
2902A77278623J2607602J4183713J6783593J9068137K1916514K5148551K8463090
$$ 177278623 189886225 204069938 220853531 239921668 261838182 286986733 315449823
2895C15449823L0854512L1007004K8136163J9965669N957232j0330125k5146680
$$ 315449823 346304335 377311339 405447502 425413171 431370403 421040278 395893598
2888C95893598l4299005l6239352l3134351k8082166k2359269j7878226j4021742
$$ 395893598 361594593 325355241 292220890 264138724 241779455 223901229 209879487
2881B09879487j1136925q694948o707104n399229l794673k266975j541032p11408
$$ 209879487 198742562 190047614 183340510 177941281 174146608 171879633 170338601 169627193
2873A69627193l305M32159J485282J815928K212162K720108K875562K847715K189379
$$ 169627193 169623888 170056047 171541329 173357257 175569419 178289527 181165089 184012804 186202183
2864A86202183R99982l36383j576547k258769l133629k738142k265806j293632
$$ 186202183 187202165 186865782 185289235 183030466 179896837 177158695 174892889 173599257
2856A73599257l06776M75507J199808J908152K424527K913154L116945L201058
$$ 173599257 173292481 173767988 174967796 176875948 179300475 182213629 185330574 188531632
2848A88531632L930006M401584M845014N033039N236682N633406O470756P811493
$$ 188531632 192461638 196863222 201708236 206741275 211977957 217611363 224082119 231893612
2840B31893612J0100675J2538938J5106526J7021910J8395299J7636457J3349797
$$ 231893612 241994287 254533225 269639751 286661661 305056960 322693417 336043214
2833C36043214N065635o272942j6452560k2737314k3117170k0358314j6916728
$$ 336043214 341108849 334835907 318383347 295646033 272528863 252170549 235253821
2826B35253821j4685167j2885359j1655786j0290023q755433p908631p489440
$$ 235253821 220568654 207683295 196027509 185737486 176982053 169073422 161583982
2819A61583982p710702p531235p630614p157084o930849o834761o523861o028907
$$ 161583982 153873280 146342045 138711431 131554347 124623498 117788737 111264876 105235969
2811A05235969n459531n260367m813113m442615m442037l729208l473415l198300
$$ 105235969 99776438 94516071 89702958 85260343 80818306 77089098 73615683 70417383
2803G0417383l040596k858466k588549k412420k050953j883301j962729j547579
$$ 70417383 67376787 64518321 61929772 59517352 57466399 55583098 53620369 52072790
2795E2072790j537837j332511j329929j393320j290507j245953r52511j125767
$$ 52072790 50534953 49202442 47872513 46479193 45188686 43942733 42990222 41864455
2787D1864455q70771j217309r56434j023035j123993q46793r31350q15319m70104
$$ 41864455 40993684 39776375 38819941 37796906 36672913 35826120 34894770 34079451 33609347
2778C3609347q50534q55547o51978p35626o08376q53850n57069m87782m53615
$$ 33609347 32758813 31903266 31251288 30515662 29907286 29053436 28496367 28008585 27554970
2769B7554970l71435o56616p02181n75145n82123m18616m42425n20635m05217
$$ 27554970 27183535 26526919 25824738 25249593 24667470 24248854 23806429 23285794 22880577
2760B2880577k49022k75539m81564k43933k88723n61308l02520k97260k39370
$$ 22880577 22631555 22356016 21874452 21630519 21341796 20780488 20477968 20180708 19941338
2751A9941338j90126n44148l59445m41863l79541O2960m05288m23906j59009k49805
$$ 19941338 19751212 19207064 18847619 18405756 18026215 18089175 17683887 17259981 17100972 16851167
2741A6851167k99780k69453l61828o7635l51771l44561k48453m7371P032k18794
$$ 16851167 16551387 16281934 15920106 15852471 15500700 15156139 14907686 14860315 14867347 14648553
2731A4648553l50891K8609K1938l92059l28695j06674j08126j94992l1174k443
$$ 14648553 14297662 14326271 14348209 13956150 13627455 13520781 13412655 13217663 13186489 13184046
2721A3184046k21407j46506j57644j21701n7753l10622j02741r8851k58777j10177
$$ 13184046 12962639 12816133 12658489 12536788 12479035 12168413 12065672 11966821 11708044 11597867
2711A1597867k47873j34711j09671k90687j26466k15617R2932l8212m21820k63666
$$ 11597867 11349994 11215283 11105612 10814925 10688459 10472842 10565774 10527562 10105742 9842076
2701I842076J1367M6105p5714p3595j28008n0436J05839r2760R0957j38032m7379
$$ 9842076 9853443 9899548 9823834 9750239 9622231 9571795 9677634 9584874 9675831 9537799 9490420
2690I490420K2550R169K1470J09400k27460k77704k32229j48790j63578k45821
$$ 9490420 9512970 9522139 9543609 9653009 9425549 9147845 8915616 8766826 8603248 8357427
2680H357427m4996j28384p2849j08395k06427j44226l13105N9484j18289n548
$$ 8357427 8312431 8184047 8111198 8002803 7796376 7652150 7339045 7398529 7280240 7274692
2670G274692j2154Q1211k00246j36978l3019J56618j98525p5406J7740j74773
$$ 7274692 7262538 7343749 7143503 7006525 6973506 7130124 6931599 6856193 6873933 6699160
2660F699160m8999J49531l7352j88355O4089r833k53927l8337j33760n4210M4527
$$ 6699160 6650161 6799692 6762340 6573985 6638074 6628241 6374314 6335977 6202217 6148007 6192534
2649F192534m8828k408j48539J77053l63184J2100n3189k77451k0476k1427l2423
$$ 6192534 6143706 6141298 5992759 6169812 5806628 5818728 5765539 5488088 5467612 5446185 5413762
2638E413762J3582j56655J02641j42444J47697K2829j92469j53810j6208j43947
$$ 5413762 5427344 5270689 5373330 5230886 5378583 5401412 5208943 5055133 5038925 4894978
2628D894978L8796N1215K06265m8088l1298p2953m0625J55985O137J04556n5686
$$ 4894978 4933774 4984989 5191254 5143166 5111868 5038915 4998290 5154275 5160412 5264968 5209282
2617E209282J50555L823j12917J79400J19155J43976j83513K26992M4147N0100
$$ 5209282 5359837 5363660 5250743 5430143 5549298 5693274 5509761 5736753 5780900 5831000
2607E831000l5984L1098J48329l15170j00440q2974k8395j9250n2890k98411j48144
$$ 5831000 5795016 5826114 5974443 5659273 5558833 5475859 5447464 5428214 5375324 5076913 4928769
2596D928769k86766k24806o9203J16102K3040m4884j59258J37329l873k538Q7035
$$ 4928769 4642003 4417197 4347994 4464096 4487136 4442252 4282994 4420323 4416450 4413912 4500947
2585D500947j33902j11639N2799K5518J9164j64896o3656K04161M1972O50k96385
$$ 4500947 4367045 4255406 4308205 4333723 4352887 4187991 4124335 4328496 4370468 4371118 4074733
2574D074733l4733j5596o0218N9767O7196p6371M2424L2810o2845R9915p7433
$$ 4074733 4040000 4024404 3964186 4023953 4091149 4014778 4057202 4090012 4027167 4127082 4049649
2563D049649k71680J51018K60048L0244k882j03515P1689K31094j34384P7526
$$ 4049649 3777969 3928987 4189035 4219279 4216397 4112882 4184571 4415665 4281281 4358807
2553D358807J26437j2084J7469K16763l4253J6278j79763j19204o0852j3705k66354
$$ 4358807 4485244 4473160 4490629 4707392 4673139 4689417 4509654 4390450 4329598 4315893 4049539
2542D049539k14186K7743j55702l9057p948n1686r6446l3036j62449r6938m6164
$$ 4049539 3835353 3863096 3707394 3668337 3660389 3608703 3512257 3479221 3316772 3219834 3173670
2531C173670J02242k17338J5755k99403K01902l3893q3932q079J18303k50486
$$ 3173670 3275912 3058574 3074329 2774926 2976828 2942935 2859003 2850924 2969227 2718741
2521B718741K6982j02355P1431J29303n0970j03613o5502N2568k4862q1029k07766
$$ 2718741 2745723 2643368 2714799 2844102 2793132 2689519 2624017 2676585 2651723 2570694 2362928
2510B362928N2578o8903j15420j62034K02399J68467k07110k0371R8189j77363
$$ 2362928 2415506 2346603 2231183 2069149 2271548 2440015 2232905 2212534 2310723 2133360
2500B133360j37815N9407K0074J05370j04429j24410L3441k11398K33211j48538
$$ 2133360 1995545 2054952 2075026 2180396 2075967 1951557 1984998 1773600 2006811 1858273
2490A858273p7387o695R6977p6314J62435J0129m5297k605L1016j61516j46060
$$ 1858273 1780886 1774191 1871168 1794854 1957289 1967418 1922121 1919516 1950532 1789016 1642956
2479A642956o587J29103j53033k36511k9432J29955J83130M496r1698J08872j06904
$$ 1642956 1636369 1765472 1612439 1375928 1346496 1476451 1659581 1664077 1572379 1681251 1574347
2468A574347M7286L9527r5475o5883J09800L9108J49253k33252j11629K58728
$$ 1574347 1621633 1661160 1565685 1499802 1609602 1648710 1797963 1564711 1453082 1711810
2458A711810j30843P5557r4524R0052l33780j59499K14039p0933l5716J07809
$$ 1711810 1580967 1656524 1562000 1652052 1318272 1158773 1372812 1301879 1266163 1373972
2448A373972P0360k2296J466N1750k29425K26375r5038j45021m4675J43479j19765
$$ 1373972 1444332 1422036 1423502 1475252 1245827 1472202 1377164 1232143 1187468 1330947 1211182
2437A211182j10976J06132M8326p1025j21716K96607J34667j81439K2114j99973
$$ 1211182 1100206 1206338 1254664 1183639 1061923 1358530 1493197 1311758 1333872 1133899
2427A133899L9224Q6483q4131J1624J03324O7077j14051N6349p4634m1000K23279
$$ 1133899 1173123 1259606 1175475 1187099 1290423 1357500 1243449 1299798 1225164 1184164 1407443
2416A407443j17810j03008j30340J86903k3133K1122k8225j81593l1351j39239
$$ 1407443 1289633 1186625 1056285 1243188 1220055 1241177 1212952 1031359 1000008 860769
2406H60769K50472J21905l51947l1301k3157J28372K75279r9793K3383j7201m4675
$$ 860769 1111241 1233146 881199 849898 826741 955113 1230392 1130599 1153982 1136781 1092106
2395A092106o5752J00108L2939r7587l5j25965J62404O7591m585Q074r8885o4377
$$ 1092106 1026354 1126462 1159401 1061814 1061779 935814 1098218 1165809 1161224 1169298 1070413 1006036
2383A006036J33650J63557q7916j01051m3177j69498j02790K39640j58545K2424
$$ 1006036 1139686 1303243 1215327 1114276 1071099 901601 798811 1038451 879906 902330
2373I02330L7626O4133L1688L0144N3876k21334M2055N1068q3681l2511k1009
$$ 902330 939956 1004089 1035777 1065921 1119797 898463 940518 991586 907905 875394 854385
2362H54385J6361J5814n9267l6634J02434n3718J23857j74379K12888R3325l591
$$ 854385 870746 886560 827293 790659 893093 839375 963232 788853 1001741 1095066 1091475
2351A091475j18097J32261k25013Q2166O3326m6528J24964j71612r0949J18179
$$ 1091475 973378 1105639 880626 962792 1026118 979590 1104554 932942 841993 960172
2341I60172m3358J15544J65044M0108L65657k66298n7856k5997k62626J50759
$$ 960172 916814 1032358 1197402 1237510 1603167 1336869 1279013 1253016 990390 1141149
2331A141149J8431j0293P0764j64839k34943J2677O9482K1215j9581n6486J8318
$$ 1141149 1159580 1149287 1220051 1055212 820269 832946 902428 923643 904062 847576 865894
2320H65894l8513R2573L4546j81606J41170j6876j93946J2981j7763N2223P9496
$$ 865894 827381 919954 954500 772894 914064 897188 703242 716223 698460 750683 830179
2309H30179M7847q0370K6780L9450O190Q1199k91296R1739J20142j08497M0132
$$ 830179 878026 797656 824436 863886 870076 951275 659979 751718 871860 763363 803495
2298H03495O8385j02781J28231J08088j03767k11735N3133J94963j48650j78395
$$ 803495 871880 769099 897330 1005418 901651 689916 743049 938012 789362 610967
2288F10967J10481j14826J18847K01366q5563j32465L0130J87255j80242R4174
$$ 610967 721448 606622 725469 926835 841272 708807 738937 926192 745950 840124
2278H40124P0451R8708j88999p331q0255J15913J71998j05681k03106J73749q7467
$$ 840124 910575 1009283 820284 812953 732698 848611 1020609 914928 711822 885571 798104
2267G98104J65953o5535M0280m9802p6395r6015K38045j17268j74982J33398j70041
$$ 798104 964057 898522 938802 889000 812605 716590 954635 837367 662385 795783 625742
2256F25742K44269J32917j05018k6578l5974J57465J76877P8355j79469l0012
$$ 625742 870011 1002928 897910 871332 835358 992823 1169700 1248055 1068586 1038574
2246A038574j12431J08063p2853j41541r5398n2851J47526l525l2759K1941j02085
$$ 1038574 926143 1034206 961353 819812 724414 671563 819089 815564 782805 804746 702661
2235G02661J7284k3795J8153k9447K34348J00794j79809O6672J2759P3318j22140
$$ 702661 719945 696150 714303 684856 919204 1019998 840189 906861 919620 992938 870798
2224H70798k9662k02839K34819Q4085L9212m0553k64357p2230K8618j12507J10352
$$ 870798 841136 638297 873116 957201 996413 955860 691503 619273 647891 535384 645736
2213F45736K05905m2040k86877k4186J45341J59810L0738m7358P5575J81817J04258
$$ 645736 851641 809601 522724 498538 643879 803689 834427 787069 862644 1044461 1148719
2202A148719j42725p3070n5822j35891J28663J5321N2572K3263n3851o158J69418
$$ 1148719 1005994 932924 877102 741211 869874 885195 937767 961030 907179 901021 1070439
2191A070439o6545j52441K63036J29422j77313J0778j2840O1369P2848l4415m3371
$$ 1070439 1003894 851453 1114489 1243911 1066598 1077376 1064536 1125905 1198753 1164338 1120967
2180A120967J35630M0637j00578J41222j11231j14287K08223j32926j69225J81764
$$ 1120967 1256597 1297234 1196656 1337878 1226647 1112360 1320583 1187657 1018432 1200196
2170A200196K60467k04636J87354J6488O9549R1183k34822J32446j36474K28295
$$ 1200196 1460663 1256027 1443381 1459869 1529418 1620601 1385779 1518225 1381751 1610046
2160A610046J54055j85737n36o0922J97379o408k4860R0438p4783r8381j05106
$$ 1610046 1764101 1578364 1577828 1516906 1714285 1707877 1683017 1773455 1698672 1600291 1495185
2149A495185k21169L07533P8951K3961K96049J5554O5691J74997j57013j80609
$$ 1495185 1274016 1581549 1660500 1684461 1980510 1996064 2061755 2236752 2079739 1899130
2139A899130J84839P1539p4258p8428N9816l5627L6890J51209L6468j70994K32439
$$ 1899130 2083969 2155508 2081250 2002822 2062638 2027011 2063901 2215110 2251578 2080584 2313023
2128B313023J549j55082J43745Q4597l5995j35265L10875J70764N7062P1430j06144
$$ 2313023 2314572 2159490 2303235 2387832 2351837 2216572 2527447 2698211 2755273 2826703 2720559
2117B720559J45740J78157K24629O4580J09425J69721L50821P9796j1088J42506
$$ 2720559 2866299 3044456 3269085 3333665 3443090 3612811 3963632 4043428 4032340 4174846
2107D174846J42364K08487K64819Q4337N4473P2212O3089Q9838N2234K49902O9543
$$ 4174846 4317210 4525697 4790516 4874853 4929326 5001538 5064627 5154465 5206699 5456601 5526144
2096E526144O4360J54023J35761K86219M07778L22132N76247L49605M59131O63129
$$ 5526144 5590504 5744527 5880288 6166507 6574285 6896417 7472664 7822269 8281400 8944529
2086H944529O76556P87887Q26777Q05784O70536M91685Q36720J276419J876070
$$ 8944529 9621085 10408972 11235749 12041533 12712069 13203754 14040474 15316893 17192963
2077A7192963K032257K117281K965094M048533N950258P702506Q184427P853410
$$ 17192963 19225220 21342501 24307595 28356128 34306386 42008892 50193319 58046729
2069E8046729J1741288P340700j0060109j8586150j3716958p943687m859982l446584
$$ 58046729 69788017 77128717 67068608 48482458 34765500 26821813 21961831 18515247
2061A8515247k468762k028291j470723j238680r56453n99360m15569k46835m26318
$$ 18515247 16046485 14018194 12547471 11308791 10352338 9752978 9337409 9090574 8664256
2052H664256q46350p49379n96908m65867l46671k68207l39577k42295j16340k52136
$$ 8664256 7817906 7068527 6471619 6005752 5659081 5390874 5051297 4809002 4692662 4440526
2042D440526j77766l09731j93498R717j03426m22987j07493j10647m79096q8547
$$ 4440526 4262760 3953029 3759531 3769248 3665822 3242835 3135342 3024695 2545599 2457052
2032B457052J68984R603l03744j45929m2555N5244J4298J9658P3265j09886r7147
$$ 2457052 2626036 2635639 2331895 2185966 2143411 2198655 2212953 2232611 2305876 2195990 2098843
2021B098843j21248j61676j090P7853j47180o2459M3098j55233j92868P848K23649
$$ 2098843 1977595 1815919 1814829 1892682 1745502 1683043 1726141 1570908 1378040 1385888 1609537
2010A609537l7147K0680J34831k58499j00858m8382K9700J35658p887k29306m6624
$$ 1609537 1572390 1593070 1727901 1469402 1368544 1320162 1349862 1485520 1477633 1248327 1201703
1999A201703r9537r2258r9711L6157Q8544J0925R7840L0695L3139N9471j60218
$$ 1201703 1102166 1009908 910197 946354 1034898 1045823 1143663 1174358 1207497 1266968 1106750
1988A106750j22860k09693j56108K28792R7377N7743k078r2344K3691j47127M333
$$ 1106750 983890 774197 618089 846881 944258 1002001 999923 907579 931270 784143 788476
1977G88476k8001r0084j80735K39914N4003l9469m5708P4035O3645j12307j40452
$$ 788476 760475 670391 489656 729570 783573 744104 698396 772431 836076 723769 583317
1966E83317J83266r032N6305q1973j0272J67787j08290m692Q5603k78647j98992
$$ 583317 766583 757551 813856 731883 721611 889398 781108 776416 862019 583372 384380
1955C84380K01418Q3583J1600o8107K47894J5615l845j81346j06997j4989j4779
$$ 384380 585798 669381 680981 612874 860768 876383 872538 691192 584195 569206 554427
1944E54427r2699n3366K49654j38479j01150K5726j9813J08985j07920J38570
$$ 554427 461728 408362 658016 519537 418387 444113 424300 533285 425365 563935
1934E63935J15425N1261o6684j14046n7967J9365n9537r7008j21262O4097R7200
$$ 563935 679360 730621 663937 549891 491924 511289 451752 354744 233482 297579 394779
1923C94779N6052J29413J29160J6136k34591j12793j73031R9722P9529r7988o9943
$$ 394779 450831 580244 709404 725540 490949 378156 205125 304847 384376 286388 216445
1912B16445K07234J05624j50605P3995M2257q6927O2517j7995o4671J1459M9618
$$ 216445 423679 529303 378698 452693 494950 408023 470540 452545 387874 399333 448951
1901D48951M8145j62459k9853n3194Q0158K0169K7655J24739k7228J19131Q4733
$$ 448951 497096 334637 304784 251590 331748 351917 379572 504311 477083 596214 680947
1890F80947k76749J31679R2013o8419k9861j88226J34807l4252k14365Q8569J62096
$$ 680947 404198 535877 627890 559471 529610 341384 476191 441939 227574 316143 478239
1879D78239J1056j3608Q9377q8435o3529q2473L80p312r0987K9988M4183l401
$$ 478239 489295 475687 565064 476629 413100 330627 331007 323695 232708 262696 306879 303478
1867C03478J56098J56562j47020k38392J10828R4020K37026j50512j50131M7423
$$ 303478 459576 616138 469118 230726 341554 435574 672600 522088 371957 419380
1857D19380N3183l3163j00925k7874j08304K3968J05178K67887j19890p9292j79673
$$ 419380 472563 439400 338475 310601 202297 226265 331443 599330 479440 400148 220475
1846B20475n1014R0705n673N5518J15588r7728j5770J19789j36259J27945R2957
$$ 220475 169461 260166 254493 310011 425599 327871 312101 431890 295631 423576 516533
1835E16533k94255K8137O8193J66151m6808j6294j5240k14281K05457k81839J0877
$$ 516533 222278 250415 318608 484759 437951 421657 406417 192136 397593 115754 126631
1824A26631J11898j22359J03117j18779M2694n9228j05149J88224P2161K4300
$$ 126631 238529 116170 219287 100508 143202 83974 -21175 167049 239210 263510
1814B63510P9471O9503N0546M1534O4132l820j09923k07286n3045J26654N7194
$$ 263510 342981 412484 463030 504564 568696 564876 454953 247667 194622 321276 378470
1803C78470J83105J24158q8446M9083R7557l23052k40955K22252K12777M488j90688
$$ 378470 561575 685733 597287 646370 743927 420875 179920 402172 614949 619437 428749
1792D28749l7395j6633L8932J965J16121M2661j10465j42573l4358j6834Q3619
$$ 428749 391354 374721 413653 415618 531739 574400 463935 321362 287004 270170 353789
1781C53789j91905J54691R3083j4099J79751N908j56254l9824m8613p7029J9410
$$ 353789 161884 316575 409658 395559 575310 581218 424964 385140 336527 259498 278908
1770B78908l4534r2921K9882J7894O0403m0867M7171P6452k36055j5797J15112
$$ 278908 244374 151453 181335 199229 259632 218765 265936 342388 106333 90536 205648
1759B05648q65q7584J11058Q820q2114k6951K5371J88391J38814j67647k3613
$$ 205648 204783 117199 228257 237077 154963 128012 153383 341774 480588 312941 289328
1748B89328j2824J03354J07143j25627k23153O8461J3643n9168Q9673p7348r2325
$$ 289328 276504 379858 487001 361374 138221 206682 220325 161157 250830 173482 81157
1737H1157K13716k7032J13318n2952o361k1921j890j43355n8338J24810j5383
$$ 81157 294873 267841 381159 328207 321846 299925 298035 154680 96342 221152 205769
1726B05769N7913M0298K4780o7268M6923j97324N0865J56162j98511K7889j15994
$$ 205769 263682 303980 328760 261492 308415 111091 161956 318118 119607 147496 31502
1715C1502Q6443j6498M2588N191r7656O9226R3106J87563n8902r4651J38366R8197
$$ 31502 117945 101447 144035 149226 51570 120796 213902 401465 342563 247912 386278 484475
1703D84475k13288j81645L6974P8541R7809j58764j44674P930M5257O154J94268
$$ 484475 271187 89542 126516 205057 302866 144102 -572 7358 52615 58769 253037
1692B53037J26349j22061r6154j16324K71855o1129p4093K7499j3747K4320O0941
$$ 253037 379386 257325 161171 44847 316702 255573 181480 208979 195232 219552 280493
1681B80493j82838o9175m4808K63748K37485k56974p7453n6694N3126l2245r8062
$$ 280493 97655 28480 -16328 247420 484905 227931 150478 93784 146910 114665 16603
1670A6603K43456J89496j9809P3942j89653j40842M3035j05600j08143M6086J22603
$$ 16603 260059 449555 429746 503688 314035 173193 216228 110628 2485 48571 171174
1659A71174M7524j95716P8981k9559r6061P9377j00768o9798P335J71323J10035
$$ 171174 218698 22982 101963 72404 -23657 55720 -45048 -114846 -107511 63812 173847
1648A73847l0382q0724M1243j20515J59091j41927P0772R3032j3597M0017l8651
$$ 173847 143465 62741 103984 -16531 142560 633 71405 164437 150840 190857 152206
1637A52206q6015J17064q0726r4830q4910J21718J29913j72107N3747p4393J29444
$$ 152206 66191 183255 102529 7699 -77211 44507 174420 2313 56060 -18333 111111
1626A11111J91411p0318N8620K3718m3893k804K4220j22208q3832j30447O9116
$$ 111111 302522 232204 290824 314542 270649 267845 292065 169857 86025 -44422 24694
1615B4694R1228J56264Q2660k21503n5137l1579Q6944J43238k840j21320j17730
$$ 24694 115922 272186 354846 133343 78206 46627 133571 276809 273969 152649 34919
1604C4919j58516K05837l5508J36246J18595L5794j64556j4636K50122j63571
$$ 34919 -123597 82240 46732 182978 301573 337367 172811 158175 408297 244726
1594B44726j28505j9211O5077N7744j78962m390O1111k9711K6238p0682K90786
$$ 244726 116221 97010 162087 219831 40869 36479 97590 67879 94117 23435 314221
1583C14221N0267m65r4259p0208k6019j13160p4227M7827K76301j14942n9948
$$ 314221 364488 364023 269764 199556 173537 60377 -13850 33977 310278 195336 135388
1572A35388j6978M8112L169l8385l6372p1562J4208L08338N3702q5657N1421j95492
$$ 135388 118410 166522 169691 131306 94934 23372 37580 345918 399620 313963 365384 169892
1560A69892j22410K30082r3432K3080Q466l2173q3703k450R5358L5145j31111
$$ 169892 47482 277564 184132 207212 215678 183505 99802 97352 192710 227855 96744
1549I6744J2252K4660J48132o8843n4850N275J48398o5696r3431j58288j9011
$$ 96744 108996 133656 281788 212945 158095 163370 311768 246072 152641 -5647 -24658
1538b4658Q3860J6691k4606j3478J69463j27604J15830j61758L0962L1932P3996
$$ -24658 59202 75893 51287 37809 207272 79668 195498 33740 64702 96634 170630
1527A70630R6040q9229J17718r6884j40790l3383J84063k5734l9425M9672J84106
$$ 170630 266670 177441 295159 198275 57485 24102 208165 182431 143006 192678 376784
1516C76784j5628k63161K44618j38813j14677K00400l81519j44604J79997j40715
$$ 376784 361156 97995 342613 203800 89123 289523 -91996 -236600 -56603 -197318
1506a97318J95158O6172j5090J00833J55729j81940J07927j83706m2224N7873
$$ -197318 -2160 64012 48922 149755 305484 123544 231471 47765 5541 63414
1496F3414j6892N8258k14285J48346p028n4651J12723j02397j07161J45295M9862
$$ 63414 46522 104780 -109505 38841 31813 -22838 89885 -12512 -119673 25622 75484
1485G5484J55546L2779l5416j65212O3006j5858j7762P0020P6700j2674J0904
$$ 75484 231030 263809 228393 63181 126187 110329 92567 162587 239287 226613 237517
1474B37517K4629j69429l5028j19772J52236Q9724J0488N6960O3018m7647J5870
$$ 237517 262146 92717 57689 -62083 90153 179877 190365 247325 310343 262696 278566
1463B78566j06164J38893k687j0478k75597j26953K97582n7376j0839j44315o6532
$$ 278566 172402 311295 308608 298130 22533 -104420 193162 135786 124947 -19368 -85900
1452h5900K41557j00683K15321J15947M501k34516k72749j39618J31319J60591
$$ -85900 155657 54974 270295 386242 390743 156227 -116522 -256140 -124821 35770
1442C5770k3354J61515J40775k95325p5909q728K1500j39085J4043L4324K24896
$$ 35770 12416 173931 314706 19381 -56528 -65256 -43756 -182841 -168798 -134474 90422
1431I0422n8282j09421R3078q4126Q7510L3114J83078j19582K1632n9288o9348
$$ 90422 32140 -77281 15797 -68329 19181 52295 235373 115791 137423 78135 8787
1420H787J36970k3908j1391O7389r1523M8827r0649l3768R2865M8982j66915J51032
$$ 8787 145757 121849 110458 177847 86324 135151 44502 10734 103599 152581 -14334 136698
1408A36698j03105J20245j25307J0833j14154j28568J49996J29092N2584n2287
$$ 136698 33593 153838 28531 39364 -74790 -203358 -53362 75730 128314 76027
1398G6027l7968j6808P0115J4762l6646Q9443k3170j20327j11639J26806r1184
$$ 76027 38059 21251 91366 106128 69482 158925 135755 15428 -96211 30595 -60589
1387f0589o7052j3855J47147K90787l7375q0574j39205j6172J79330K1297k58372
$$ -60589 -127641 -141496 5651 296438 259063 178489 39284 23112 202442 223739 -34633
1376c4633J86761K1894p2280L5785O4666k2230o1695K7641q9804J21765O9553
$$ -34633 152128 174022 101742 137527 202193 179963 118268 145909 56105 177870 247423
1365B47423q7769j10449j58732L943O4544J23624j9725j29470J15765K90252l3484
$$ 247423 159654 49205 -109527 -105584 -41040 82584 62859 -66611 49154 339406 305922
1354C05922n0963j38938K4537l0319k12964Q2746K7947o0438O6564M15358p418
$$ 305922 254959 116021 140558 110239 -102725 -19979 7968 -52470 14094 429452 422034
1343D22034k38377L5410n5733r0226K2076J28307L8795n5517p0248j5970k00956
$$ 422034 183657 219067 163334 73108 95184 223491 262286 206769 136521 120551 -80405
1332h0405q5545J60801J324J63147j02629j00144K00279q2309j47547J45508R2444
$$ -80405 -165950 -5149 -3825 159322 56693 -43451 156828 74519 -73028 72480 164924
1321A64924o6896q6383J34762J72295l45012P9599J92653m1579K06400j18939
$$ 164924 98028 11645 146407 318702 -26310 53289 245942 204363 410763 291824
1311B91824j81841j14061P4466Q0687M809j03402p2412m8939P764J05258o4494
$$ 291824 109983 -4078 70388 151075 155884 52482 -19930 -68869 -61105 44153 -20341
1300b0341j57808K3838J22651J56839j34332r818K79559K7360K4031j5668l90350
$$ -20341 -178149 -154311 -31660 125179 -9153 -18971 260588 287948 311979 296311 -94039
1289i4039J06796O5301j21288q4979J18111L04040o2628J52099k53144k6397l7931
$$ -94039 12757 78058 -43230 -128209 -10098 293942 231314 383413 130269 103872 65941
1278F5941L4577n8111j249M0713K9402r5069q3015R3810N2873J90939j59280L5133
$$ 65941 100518 42407 41158 81871 111273 16204 -66811 26999 79872 270811 111531 146664
1266A46664N9070k15615K02908K73027j59730o9057m1700k30170m0394p7228p0293
$$ 146664 205734 -9881 193027 466054 306324 237267 195567 -34603 -74997 -152225 -222518
1255b22518K5828J18895j0224K8260n5696p4213O1048J39109P2509R7225M804
$$ -222518 -196690 -77795 -88019 -59759 -115455 -189668 -128620 10489 82998 180223 185027
1244A85027j22857r1646P7297l5797J31365M1300L4018m2306k68444K05272j9138
$$ 185027 62170 -29476 47821 12024 143389 184689 218707 176401 -92043 113229 94091
1233I4091r591o1713N4658J2713j9796l4512o0961O4065l1041P4613K7227O0133
$$ 94091 84500 22787 77445 90158 70362 35850 -25111 38954 7913 82526 109753 169886
1221A69886j4231j41844k29447J37511o782L6816n379P8927r7436R3819O9914
$$ 169886 155655 13811 -215636 -78125 -84907 -48091 -53470 25457 -71979 21840 91754
1210I1754j48408J51829o3717j1126J70393k36317m4708j01055m453R1882K718
$$ 91754 -56654 95175 31458 20332 190725 -45592 -90300 -191355 -195808 -103926 -101208
1199a01208K68862L2330j01073j54353j68757J74475J42565j44562R818j83224
$$ -101208 167654 199984 98911 -55442 -224199 -49724 92841 -51721 -41903 -225127
1189b25127K19267R5206j18718n704J82687j28703O8682p2286n128q8816j59656
$$ -225127 -5860 89346 -29372 -35076 147611 18908 87590 15304 10176 -78640 -238296
1178b38296j4017J27918Q8449R6225o828j92161p4959J00684L49558O1624j14869
$$ -238296 -252313 -124395 -35946 60279 53451 -138710 -213669 -112985 236573 298197 183328
1167A83328l9135j59427L1605K2059N5322N2853n8767m8194J35006m6707j23624
$$ 183328 144193 -15234 16371 38430 93752 146605 87838 39644 174650 127943 4319
1156D319m5009M005J9697L6474m6635j09196r612K3195Q472J05873r9681L1969
$$ 4319 -40690 -36685 -16988 19486 -27149 -136345 -145957 -122762 -114290 -8417 -108098 -76129
1144g6129J2031O5182J32600q7228k63345P0934m8271K2108K81155n5562J74484
$$ -76129 -64098 1084 133684 46456 -216889 -145955 -194226 -172118 109037 53475 227959
1133B27959j01692N4109k00850K7734K9902j63942R3114O6340K88205k26639j38264
$$ 227959 126267 180376 -20474 7260 37162 -126780 -33666 32674 320879 94240 -44024
1122d4024J68300r3028K21186l05529O9621J06827r0046P3755J24775j34140j88356
$$ -44024 124276 31248 252434 -53095 16526 123353 33307 107062 231837 97697 -90659
1111i0659K83887O413j75252R6930j09912M9597K59236q1177j90938L3163k79450
$$ -90659 193228 199641 24389 121319 11407 61004 320240 239063 48125 81288 -198162
1100a98162P6664K68044K32297l0990m49740k29772J34748K95517M9275J2085
$$ -198162 -121498 146546 378843 347853 -101887 -331659 -196911 98606 147881 159966
1090A59966L0014j35637j87808R3876K93652k12931j91481N1275J52118Q9140
$$ 159966 189980 54343 -133465 -39589 254063 41132 -150349 -99074 53044 142184
1080A42184j1388p0980j05436J53703J49715l4166q2075j44808j50361J52909
$$ 142184 130796 59816 -45620 108083 257798 223632 141557 -3251 -153612 -703
1070g03n1823k2702M654K55534j6793k5096j3697l9388q5125o7366J5134J75478
$$ -703 -52526 -75228 -70574 184960 168167 143071 129374 89986 4861 -62505 -47371 128107
1058A28107k6050q7627l7805j02764j52604J72653n9426R3538J6865j22642p9383
$$ 128107 102057 14430 -23375 -126139 -278743 -106090 -165516 -71978 -55113 -177755 -257138
1047b57138K55299o5447j29671J10740O4668k06k3356j19541N0630K19815p198
$$ -257138 -1839 -67286 -196957 -86217 -21549 -21755 -45111 -164652 -114022 105793 98595
1036I8595Q2189j67999j46967P3763j5028J41789Q5134n2874m1995j41302M0308
$$ 98595 180784 12785 -134182 -60419 -75447 66342 151476 98602 56607 -84695 -44387
1025d4387k16591J58022P2755k0681q0707K53248p9837K7874K2986j14379O1439
$$ -44387 -260978 -102956 -30201 -50882 -131589 121659 41822 69696 92682 -21697 39742
1014C9742J18389q9831l7019k26531J61892Q4641j22402k5061J09571K6743M8327
$$ 39742 158131 68300 31281 -195250 -33358 51283 -71119 -96180 13391 40134 88461
1003H8461l00984j72830K66134K51592k45459K29613j153j3166P4098k43585P2133
$$ 88461 -212523 -385353 -119219 132373 -113086 116527 115374 102208 176306 -67279 4854
992D854J8021J19385j18680l1515p5660J6934N2780Q7771j17994M2176p1989Q4737
$$ 4854 22875 142260 23580 -7935 -83595 -66661 -13881 73890 -44104 -1928 -73917 10820
980A0820l0728J0998J56452j00222J10587m2833J1455p2161r5365n1576j30373
$$ 10820 -19908 -8910 147542 47320 157907 115074 126529 54368 -40997 -92573 -222946
969b22946J96618J18635M2441k9334J75630M3440p3128j52021l22198j05698J37392
$$ -222946 -26328 92307 134748 105414 281044 324484 251356 99335 -222863 -328561 -191169
958a91169J4177l6399J8124q2637J7017L93076j27465O6228p5435L2375o0860
$$ -191169 -176992 -213391 -195267 -277904 -260887 132189 4724 70952 -4483 27892 -32968
947c2968p721N6597Q4615L1737r5761l5712o3338l6555K3129J28795p6662j81137
$$ -32968 -40689 15908 100523 132260 36499 787 -62551 -99106 -75977 52818 -23844 -204981
935b04981J71626P7337J54631j82972r0633M8091J555j66793j48911L30509m2807
$$ -204981 -33355 43982 198613 15641 -74992 -26901 -25346 -192139 -341050 -10541 -53348
924e3348J55611m7056j84058j67553L9408K46802J40983k4139J05699j09959k04572
$$ -53348 102263 55207 -128851 -296404 -256996 -10194 130789 106650 212349 102390 -102182
913a02182N5814K6793j14063K6940j4015J22726o1900L6163Q613m2409l3892j26908
$$ -102182 -46368 -19575 -133638 -106698 -120713 2013 -59887 -23724 -15111 -57520 -91412 -218320
901b18320J42785k1517l2507O997J2973J90829K1920j26127k03983K09642L03315
$$ -218320 -75535 -97052 -129559 -122562 -109589 81240 103160 -22967 -226950 -17308 286007
890B86007n2655k28628o6831L355k56817J6550J49037J41277n1864r2716j05527
$$ 286007 233352 4724 -62107 -58752 -315569 -299019 -149982 -8705 -60569 -153285 -258812
879b58812K09225J54943k17276N4681J11099m6559k32734N5663j00564K33439
$$ -258812 -49587 105356 -111920 -57239 53860 7301 -225433 -169770 -270334 -36895
869c6895n08j64381J46753j1360R2690j11627j33442J84885J91108p8983q7804
$$ -36895 -37403 -201784 -55031 -66391 26299 -85328 -218770 -33885 157223 78240 -9564
858i564n9189m4831k1151J77951l1064l1996q832o294R5527L7228J611o8K9332
$$ -9564 -68753 -113584 -134735 43216 12152 -19844 -28676 -34970 60557 97785 99396 99328 128660
845A28660J55881r4629j53440l08026L1745K20352P3851j59900p5042J49713p9896
$$ 128660 284541 189912 36472 -271554 -239809 -19457 54394 -105506 -180548 -30835 -110731
834a10731O580j75291M2401J86808j68610N260J23993k8537q4273K7165J41857
$$ -110731 -104151 -279442 -237041 -50233 -218843 -213583 -89590 -118127 -202400 -175235 -33378
823c3378j51387j00531K56665M4303k40531r0254K84342j54983n2087K34544r5660
$$ -33378 -184765 -285296 -28631 15672 -224859 -315113 -30771 -185754 -237841 -3297 -98957
812i8957P6101k61535J5963m897J34788O7599O2770L5584o9148m2253J64009K11702
$$ -98957 -22856 -284391 -268428 -273325 -138537 -70938 -8168 27416 -41732 -83985 80024 291726
800B91726k19521M935j02098j32855J00457q9870L790J28854j8109M7858O8401
$$ 291726 72205 77140 -24958 -157813 -57356 -147226 -143436 -14582 -32691 15167 83568
789H3568j23012J70070l3950O1244k9029k06729K9491p7630J353O4960Q479J47357
$$ 83568 -39444 130626 96676 157920 128891 -77838 -48347 -125977 -124624 -59664 -51185 96172
777I6172j54568J9375n1274Q5135P4131n8342O3972J27687J4081j52648K5559
$$ 96172 -58396 -39021 -90295 -5160 68971 10629 74601 202288 216369 63721 89280
766H9280J9128l3802o6566l3077k3392K02264L2913k8400k35080r254k1819J4119
$$ 89280 108408 74606 8040 -25037 -48429 153835 186748 158348 -76732 -85986 -107805 -93686
754i3686M268j14700P5825K18090o0213n8395m3553Q0047n9750J81509r5742j17164
$$ -93686 -89418 -204118 -128293 89797 29584 -28811 -72364 7683 -52067 129442 33700 -83464
742h3464m5173L6804j4017k6221K8533j07096o471K80319n2255j94710J03786
$$ -83464 -128637 -91833 -105850 -132071 -103538 -210634 -217105 63214 10959 -183751 -79965
731g9965O2567P3285q8484M7714k13724O5432J00160k28194m005Q8287J24425
$$ -79965 -17398 55887 -32597 15117 -198607 -133175 -33015 -261209 -265214 -176927 -52502
720e2502J29869R0962j15875o8609m3315N8405l1069M2934J14491J453l6666k54175
$$ -52502 77367 168329 52454 -16155 -59470 -1065 -32134 10800 125291 126744 90078 -164097
708a64097k17882J81067Q1913j73904K24328K3746m4534r898O8726M8992M0765
$$ -164097 -381979 -200912 -118999 -292903 -68575 -44829 -89363 -99261 -30535 18457 59222
697E9222j56144m7103j77201O8604J04787k3670J62201k12579n4432J8247o4487
$$ 59222 -96922 -144025 -321226 -252622 -147835 -171505 -9304 -221883 -276315 -258068 -322555
686c22555K27537k298j25752J4423J22637L6639P2653k13548J07186J74366k6607
$$ -322555 -95018 -97316 -223068 -208645 -86008 -49369 23284 -190264 -83078 91288 64681
675F4681n8411j82231k01053j06519J07345P4197J67646N6689q0580m3954L3674
$$ 64681 6270 -175961 -377014 -483533 -376188 -301991 -134345 -77656 -158236 -202190 -168516
664a68516O4278M6755j26908K9041k8402O1998N8634N8109k4906j68665j2496
$$ -168516 -104238 -57483 -184391 -155350 -183752 -121754 -63120 -5011 -29917 -198582 -211078
653b11078N2882Q534R416p6009Q9196K9162o4782O62O0248o5934O0435p507J3412
$$ -211078 -158196 -149662 -140246 -216255 -127059 -97897 -162679 -162017 -101769 -167703 -107268 -114775 -101363
640a01363q4979N2474K2301N3758k5711J17257j05918P4704L05712j06137k26143
$$ -101363 -186342 -133868 -111567 -57809 -83520 33737 -72181 2523 308235 202098 -24045
629b4045l49926K06388Q25m4127k6135J01288L2227j65295o05Q815O3306K84703
$$ -24045 -373971 -167583 -166758 -210885 -237020 -135732 -103505 -268800 -269405 -260590 -197284 87419
617H7419J2303J08686l5259r5443q8887r9978P2789O8478k41656m6682J92149
$$ 87419 99722 208408 173149 77706 -11181 -111159 -38370 30108 -211548 -258230 -66081
606f6081k4147K23187M7747r8080j0392k33138p8627j7562J44815J01523J4006
$$ -66081 -90228 132959 180706 82626 72234 -160904 -239531 -257093 -112278 -10755 3251
595C251p8490n4801J09311q2744R4719o7697L3369j42281j60380P8519J42073
$$ 3251 -75239 -130040 -20729 -103473 -8754 -76451 -43082 -185363 -345743 -267224 -125151
584a25151M9541J27305j31062j42898J1208K05986r3036k5985J29673k41831J10621
$$ -125151 -75610 51695 -79367 -222265 -211057 -5071 -98107 -124092 5581 -236250 -125629
573a25629k78115m1258J20379K59237J36781m4436k7711r4840j68458J01676j66580
$$ -125629 -403744 -445002 -324623 -65386 71395 26959 -752 -95592 -264050 -162374 -328954
562c28954j42065J21075J96708l7311O1455k5523j50225J39892m8116j6795k12967
$$ -328954 -471019 -349944 -153236 -190547 -129092 -154615 -304840 -164948 -213064 -229859 -442826
551d42826J74344k641p4144m8384r8396J11909J94223R3483p9070K9715J76672
$$ -442826 -268482 -271123 -345267 -393651 -492047 -380138 -185915 -92432 -171502 -141787 34885
540C4885j64096p8638j922J32153J54946P1957l904k10630m5367M5115j8442p672
$$ 34885 -129211 -207849 -209771 -77618 77328 149285 145381 -65249 -110616 -65501 -83943 -91615
528i1615k8241Q115M9793j92517J69728K40992j14961j31343n7842P5093m896
$$ -91615 -119856 -111741 -61948 -254465 -84737 156255 41294 -90049 -147891 -72798 -77694
517g7694R608j1405J0817M9390j30937j40480j24513K47166J25097O4485M7629
$$ -77694 -68086 -79491 -68674 -19284 -150221 -290701 -415214 -168048 -42951 21534 69163
506F9163J3840K3030j83947j39445K07109R965p9408L3121j1807J81692k21352
$$ 69163 83003 106033 -77914 -217359 -10250 -285 -79693 -46572 -58379 123313 -98039
495i8039Q0297j62302n6592J74041L4842K2358p7549L7322j42142N0080K99302
$$ -98039 -17742 -180044 -236636 -62595 -27753 -5395 -82944 -45622 -187764 -137684 161618
484A61618p821j13851P44m3985j96225O4177l5908q8486J19223k09088o5690K63037
$$ 161618 153797 39946 40690 -3295 -199520 -135343 -171251 -259737 -140514 -349602 -415292 -152255
472a52255O0728K22827J2930k04838j77418J09056K80868j18726P9330j11386
$$ -152255 -91527 131300 144230 -60608 -238026 -128970 151898 33172 112502 1116
462A116j59459m2665j16513j1651J25646j06417m2340Q2056K10052M3072l5443
$$ 1116 -158343 -201008 -317521 -329172 -203526 -309943 -352283 -270227 -60175 -17103 -52546
451e2546M079j35394k1934k6254o2047q9057K23741J55579m40904J18239J38080
$$ -52546 -48467 -183861 -205795 -232049 -294096 -383153 -159412 -3833 -444737 -326498 -188418
440a88418Q079J80196p3206j55451O5310K33641o2715l2714j12873K617l0125
$$ -188418 -180339 -143 -73349 -228800 -163490 70151 7436 -25278 -138151 -135534 -165659
429a65659j08377o4797J2561N5006J18806o450J91976r123j77501q0362P8578
$$ -165659 -274036 -338833 -326272 -271266 -152460 -158910 33066 23943 -153558 -233920 -155342
418a55342J14010j0774j55233N3574O0428J56964r432q5535o946l17109r0203
$$ -155342 -41332 -52106 -207339 -153765 -93337 63627 54195 -31340 -38286 -355395 -445598
407d45598J68113Q7236L6497M1837p9288J71191Q9885k26548P7250m5828r6227
$$ -445598 -277485 -190249 -153752 -111915 -191203 -20012 69873 -156675 -79425 -125253 -221480
396b21480J92375p7206r3903p0527J10077m9780p2334J4403p788l7919L6911j18497
$$ -221480 -29105 -106311 -200214 -270741 -160664 -210444 -282778 -268375 -276163 -314082 -277171 -395668
384c95668Q8406J4107K23930P756j03665K489J52978j18248j36578K24405L0822
$$ -395668 -307262 -293155 -69225 -61469 -165134 -162645 -9667 -127915 -264493 -40088 -9266
373i266l0340K1352m3407o7356j56818p7045K4834J6762J68191K48076q2173j61861
$$ -9266 -39606 -18254 -61661 -129017 -285835 -362880 -338046 -321284 -153093 94983 12810 -149051
361a49051j74922m1057K79411Q0049k342O471j04391j55638K58365p5939m3509
$$ -149051 -323973 -365030 -85619 -5570 -7912 -1441 -105832 -261470 -3105 -79044 -122553
350a22553j3469p0218J35501p2547L7183k36671J46790r8385j0841K19692j57230
$$ -122553 -136022 -206240 -70739 -143286 -106103 -342774 -195984 -294369 -305210 -85518 -242748
339b42748q7947N0795R5873j12574j9510J37647N9281p7500J8396j35900K08185
$$ -242748 -330695 -279900 -184027 -296601 -316111 -178464 -119183 -196683 -178287 -314187 -106002
328a06002M4345k1994j12433P9993K4885k11913J9744M4913L2158J67076J07113
$$ -106002 -61657 -83651 -196084 -116091 -91206 -303119 -283375 -238462 -206304 -39228 67885
317F7885P988k27111j60224j7970J98315J03205j24810J06327J96191k40171J38100
$$ 67885 75873 -151238 -311462 -329432 -131117 -27912 -152722 -46395 149796 -90375 47725
306D7725k1451l18542j35508K7103P390j00811K40530L115L9620M8308l2260J5573
$$ 47725 26274 -292268 -427776 -400673 -393283 -494094 -253564 -250449 -210829 -162521 -194781 -179208
294a79208k0418l5298L8898p0035q1606J47493Q7305j23614m5409l8819k19304
$$ -179208 -199626 -234924 -196026 -266061 -347667 -200174 -112869 -236483 -281892 -320711 -540015
283e40015J08343J34537N9841r645J04584L1122k02235K47758N0357j83897Q8731
$$ -540015 -431672 -297135 -237294 -246939 -142355 -111233 -313468 -65710 -15353 -199250 -110519
272a10519k7638k85922p4100L87856M71j3538k4795m1649j68039j56060J49495
$$ -110519 -138157 -424079 -498179 -110323 -109852 -123390 -148185 -189834 -357873 -513933 -364438
261c64438J18274k2693P9962J20748j00469j77471l9832J51725p4110P4625K0235
$$ -364438 -246164 -268857 -188895 -68147 -168616 -346087 -385919 -234194 -308304 -233679 -213444
250b13444r3814J69165J05651K6932K00812m5795j46980l62343L1016J32880p3815
$$ -213444 -307258 -138093 -32442 -5510 195302 149507 2527 -359816 -328800 -195920 -269735
239b69735o8510o9111M9550K62805J84905q3333j10650K785j08754q3067j8970
$$ -269735 -338245 -407356 -357806 -95001 89904 6571 -104079 -101294 -210048 -293115 -312085
228c12085M1844J15353l3487k21852Q5698J92194N0346o9441o4952N952j3581
$$ -312085 -270241 -154888 -188375 -410227 -324529 -132335 -81989 -151430 -216382 -210430 -224011
217b24011j68756N7074O8809O374J75567J42523o1868k15888r1947K1275j9313
$$ -224011 -392767 -335693 -266884 -260510 -84943 57580 -4288 -220176 -312123 -290848 -310161
206c10161j04478K51587p2583o5295K63248O8261k9986k89941k23021R5595J35564
$$ -310161 -414639 -163052 -235635 -300930 -37682 30579 593 -289348 -512369 -416774 -281210
195b81210k9776J8148R29K08662k9501k17160j2757K1517P5498l922K2568K7340
$$ -281210 -310986 -292838 -291909 -83247 -112748 -329908 -342665 -321148 -245650 -249572 -227004 -199664
183a99664k3488j19528m5692J32883J25902j00224k18976J87019K38700j40419
$$ -199664 -223152 -342680 -388372 -255489 -129587 -229811 -448787 -261768 -23068 -163487
173a63487j49791J5128J26352J91000O5770r678j69679r9058k29522O3918K05891
$$ -163487 -313278 -298150 -171798 19202 84972 75294 -94385 -193443 -422965 -359047 -153156
162a53156J50228L7421o8386j76234J9181m3329j29292R2066J70174N6330n3187
$$ -153156 -2928 34493 -33893 -210127 -190946 -234275 -363567 -271501 -101327 -44997 -98184
151i8184l7034k19715O5415j16739Q5992R900J13073j1526j03601Q6372J2790
$$ -98184 -135218 -354933 -289518 -406257 -320265 -310365 -197292 -208818 -312419 -226047 -213257
140b13257j08030J83598R0960j58727j08303J84055J53904j46818j96606l0397
$$ -213257 -321287 -137689 -46729 -205456 -313759 -129704 24200 -122618 -319224 -349621
130c49621N2720P7388J7159k8070m3278J13388l8895Q8645j58923k5908P6832
$$ -349621 -296901 -219513 -202354 -230424 -273702 -160314 -199209 -110564 -269487 -295395 -218563
119b18563j47922L2904m1222J15381J16928j3771O3691J8950K2359o5669n440
$$ -218563 -366485 -333581 -374803 -259422 -142494 -156265 -92574 -73624 -51265 -116934 -122374
108a22374p9626j57808R7121R9044L6804m0200L538j3474j21906J96696j82392
$$ -122374 -202000 -359808 -262687 -163643 -126839 -167039 -163501 -176975 -298881 -102185 -284577
97b84577k38340R536K15247M6010L9200l2348L8043M1531Q5071j53342m0825J09271
$$ -284577 -522917 -513381 -298134 -252124 -212924 -245272 -207229 -165698 -80627 -233969 -274794 -165523
85a65523j54795R1202p8519p5108N1296N6276q3020J36417l9434N0039l3191m7740
$$ -165523 -320318 -229116 -307635 -382743 -331447 -275171 -358191 -221774 -261208 -211169 -244360 -292100
73b92100o4614o012K0640J369N6424K7908j02387K7801n3764Q2556N7789J5260
$$ -292100 -356714 -362726 -342086 -340717 -284293 -256385 -358772 -330971 -384735 -302179 -244390 -229130
61b29130j1354p2466j9852O153j01220R4903J04027j00806N4511P8066j07689
$$ -229130 -240484 -312950 -332802 -326649 -427869 -332966 -228939 -329745 -275234 -197168 -304857
50c04857L4993J66486p314k9350P305n6255j9778l4703M9952l941q8971L5906
$$ -304857 -269864 -103378 -110692 -140042 -132737 -188992 -208770 -243473 -193521 -197462 -286433 -250527
38b50527k9816j2725P662j18290N6538q292J59067j26910P3742p5958M0401O9205
$$ -250527 -280343 -293068 -285406 -403696 -347158 -355450 -196383 -323293 -249551 -325509 -285108 -215903
26b15903j49809j0464K2348J79500j12221J45469M0234P0978m1768j52078J7182
$$ -215903 -365712 -376176 -353828 -174328 -286549 -141080 -100846 -29868 -71636 -223714 -206532
15b06532K1184j7549r6978P9868j28076P8503J40594j11647j14366K1869K8171
$$ -206532 -185348 -202897 -299875 -220007 -348083 -269580 -128986 -240633 -354999 -333130 -304959
4c04959J08688O7316j49908j48364
$$ -304959 -196271 -128955 -278863 -427227
0d27227
$$ -427227
$$ Imaginary data points
##PAGE= N=2
##DATA TABLE= (X++(I..I)), XYDATA
16383e144996R211K09346k4766J9914J02545j9031Q7859Q2127J98452M1703R056
$$ -5144996 -5135785 -4926439 -4951205 -4931291 -4828746 -4847777 -4759918 -4677791 -4479339 -4437636 -4428580
16372d428580J30720Q4425R1530j5823J05962R0602M5408o2948J09471J69407
$$ -4428580 -4297860 -4213435 -4121905 -4137728 -4031766 -3941164 -3895756 -3958704 -3849233 -3679826
16362c679826L4231l8809R3289J68731R4040O0603J79282L9531M9080O8396n0397
$$ -3679826 -3645595 -3684404 -3591115 -3422384 -3328344 -3267741 -3088459 -3048928 -2999848 -2931452 -2981849
16351b981849M5863J08381J41407M7216n4021Q377P3259J40507J3093J09579J85711
$$ -2981849 -2935986 -2827605 -2686198 -2638982 -2693003 -2684626 -2611367 -2470860 -2457767 -2348188 -2162477
16340b162477K75650K8855J05853Q386l3970o1919L7123Q9094K14933N8033m3381
$$ -2162477 -1886827 -1857972 -1752119 -1743733 -1777703 -1839622 -1802499 -1713405 -1498472 -1440439 -1483820
16329a483820O6150J60803K3567q8366J60367P8108j31156J08235O5395K72216
$$ -1483820 -1417670 -1256867 -1233300 -1321666 -1161299 -1083191 -1214347 -1106112 -1040717 -768501
16319g68501K17715J45109j23897Q7488O7436P5545K56711k23557q843J29493
$$ -768501 -550786 -405677 -529574 -442086 -374650 -299105 -42394 -265951 -274794 -145301
16309a45301O2646k4438J74178j6842R9634l2025M4709J3902P7282J22458R8978
$$ -145301 -82655 -107093 67085 50243 149877 117852 162561 176463 253745 376203 475181
16298D75181p5945M2940J88918j7112K9274K21115J52233K1736j38075K21979
$$ 475181 399236 442176 631094 613982 643256 864371 1016604 1038340 900265 1122244
16288A122244j16044J44288J16253J36880j5074k07327Q6299J36836J72941J9047
$$ 1122244 1006200 1150488 1266741 1403621 1388547 1181220 1267519 1404355 1577296 1596343
16278A596343J64265K1058j91973N5569J04370N1705J58066J41245j46813J66895
$$ 1596343 1760608 1781666 1589693 1645262 1749632 1801337 1959403 2100648 1953835 2120730
16268B120730j65481J69206O2006J40325J42757n3733m1308R0674j849K3576N5217
$$ 2120730 1955249 2124455 2186461 2326786 2469543 2415810 2374502 2465176 2463327 2486903 2542120
16257B542120J088J61985R0462o2481m696O0241J05202J73797j30882q8316k988
$$ 2542120 2543208 2705193 2795655 2733174 2728478 2788719 2893921 3067718 2936836 2848520 2845532
16246B845532J91207k9681O1724K36263q1212O4233P3200J6637R2120K329K7506
$$ 2845532 3036739 3007058 3068782 3305045 3223833 3288066 3361266 3377903 3470023 3472352 3499858
16235C499858J21726J64792J6111m2953p8375J73907K0076n8816m1400Q1200J13754
$$ 3499858 3621584 3786376 3802487 3759534 3681159 3855066 3875142 3816326 3774926 3856126 3969880
$$ [...]
##END NTUPLES=NMR SPECTRUM
##END=
