##TITLE=1H_TG-2374
 CDCl3
 8 sc, 
 3.10.2023
##JCAMPDX= 6.0         $$ Bruker NMR JCAMP-DX V2.0
##DATA TYPE= NMR SPECTRUM
##DATA CLASS= NTUPLES
##ORIGIN= UXNMR, Bruker Analytische Messtechnik GmbH
##OWNER= root
$$ XWIN-NMR		Version 3.5
$$ Tue Oct  3 14:00:44 2023 Russian Standard Time (UT+4h)  she@DPX200
##.OBSERVE FREQUENCY= 200.13135
##.OBSERVE NUCLEUS= ^1H
##.ACQUISITION MODE= SIMULTANEOUS
##.ACQUISITION SCHEME= undefined
##.AVERAGES= 8
##.DIGITISER RES= 18
##SPECTROMETER/DATA SYSTEM= spect
##.PULSE SEQUENCE= zg30
##.SOLVENT NAME= CDCl3
##.SHIFT REFERENCE= (INTERNAL, CDCl3, 0, 15.7711)
##AUDIT TRAIL= $$ (NUMBER, WHEN, WHO, WHERE, WHAT)
$$ ##TITLE= Audit trail, XWIN-NMR		Version 3.5
$$ ##JCAMPDX= 5.01
$$ ##ORIGIN= Bruker BioSpin GmbH
$$ ##OWNER= she
$$ F:/spectra/data/she/nmr/H-F/1/pdata/1/auditp.txt
$$ ##AUDIT TRAIL=  $$ (NUMBER, WHEN, WHO, WHERE, WHAT)
(   1,<2023-10-03 13:59:45.67 +0400>,<she>,<DPX200>,
      <created by zg, POWCHK disabled, PULCHK disabled
       configuration hash MD5:
       00 E9 B6 7A A2 85 ED C7 34 08 36 98 17 FE 4E 26
       data hash MD5: 16K
       27 EB 41 DC F2 AA E8 20 A2 BC 85 E1 91 C4 AD 6B>)
(   2,<2023-10-03 13:59:48.65 +0400>,<she>,<DPX200>,
      <Start of raw data processing
       efp BC_mod = 2 LB = 0.24 FT_mod = 6 PKNL = 1 PHC0 = -21707.28 PHC1 = 8.452709 SI = 16K 
       data hash MD5: 16K
       A9 FC 72 AC 83 AA AA ED 03 91 0B C2 5E 1E 24 9F>)
(   3,<2023-10-03 14:00:05.75 +0400>,<she>,<DPX200>,
      <pk PHC0 = -1.427356 PHC1 = 0 
       data hash MD5: 16K
       F1 54 8E E6 60 8C 87 43 47 4F 96 F4 A8 02 B1 57>)
(   4,<2023-10-03 14:00:09.14 +0400>,<she>,<DPX200>,
      <abs ABSG = 5 
       data hash MD5: 16K
       DD EF F9 B2 54 E2 0C F4 AE 13 B6 3A 44 19 B4 2B>)
$$ ##END=
$$ 
$$ hash MD5
$$ BF 80 2F F6 C0 74 6C 2B CE A8 3D 77 9D 3D A6 30
##$RELAX= 
##$RELAX= 
##$RELAX= 
##$RELAX= 
##$RELAX= 
##$RELAX= 
$$ Bruker specific parameters
$$ --------------------------
##$DU= <F:/spectra>
##$EXPNO= 1
##$NAME= <H-F>
##$PROCNO= 1
##$TYPE= <nmr>
##$USER= <she>
##$AMP= (0..31)
100 100 100 100 100 100 100 100 100 100 100 100 100 100 100 100 100 100 
100 100 100 100 100 100 100 100 100 100 100 100 100 100 
##$AQSEQ= 0
##$AQ_mod= 1
##$AUNM= <au_zg>
##$AUTOPOS= <>
##$BF1= 200.13
##$BF2= 200.13
##$BF3= 200.13
##$BF4= 200.13
##$BF5= 200.13
##$BF6= 200.13
##$BF7= 200.13
##$BF8= 200.13
##$BYTORDA= 1
##$CFDGTYP= 0
##$CFRGTYP= 5
##$CHEMSTR= <none>
##$CNST= (0..31)
1 1 145 1 1 1 1 1 1 1 1 1 1 1 1 1 1 1 1 1 1 1 1 1 1 1 1 1 1 1 1 1 
##$CPDPRG= <>
##$CPDPRG1= <>
##$CPDPRG2= <>
##$CPDPRG3= <>
##$CPDPRG4= <mlev>
##$CPDPRG5= <mlev>
##$CPDPRG6= <mlev>
##$CPDPRG7= <mlev>
##$CPDPRG8= <mlev>
##$CPDPRGB= <>
##$CPDPRGT= <>
##$D= (0..31)
0 1.2 0 0 0 0 0 0 0 0.06 0 0.03 0 0 0 0 0.0002 0 0 0 0 0 0 0 0 0 0 0 0 
0 0 0 
##$DATE= 1696327185
##$DBL= (0..7)
120 120 120 120 120 120 120 120 
##$DBP= (0..7)
150 150 150 150 150 150 150 150 
##$DBP07= 0
##$DBPNAM0= <>
##$DBPNAM1= <>
##$DBPNAM2= <>
##$DBPNAM3= <>
##$DBPNAM4= <>
##$DBPNAM5= <>
$$ [...]
##$SUBNAM3= <"">
##$SUBNAM4= <"">
##$SUBNAM5= <"">
##$SUBNAM6= <"">
##$SUBNAM7= <"">
##$SUBNAM8= <"">
##$SUBNAM9= <"">
##$SW= 18.05172834244
##$SWIBOX= (0..15)
0 0 2 0 0 0 0 0 0 0 0 0 0 0 0 0 
##$SW_h= 3612.71676300578
##$TD= 16384
##$TD0= 1
##$TE= 0
##$TE2= 300
##$TE3= 300
##$TEG= 300
##$TL= (0..7)
0 120 120 120 120 120 120 120 
##$TP= (0..7)
150 150 150 150 150 150 150 150 
##$TP07= 0
##$TPNAME0= <>
##$TPNAME1= <>
##$TPNAME2= <>
##$TPNAME3= <>
##$TPNAME4= <>
##$TPNAME5= <>
##$TPNAME6= <>
##$TPNAME7= <>
##$TPOAL= (0..7)
0.5 0.5 0.5 0.5 0.5 0.5 0.5 0.5 
##$TPOFFS= (0..7)
0 0 0 0 0 0 0 0 
##$TUNHIN= 0
##$TUNHOUT= 0
##$TUNXOUT= 0
##$USERA1= <user>
##$USERA2= <user>
##$USERA3= <user>
##$USERA4= <user>
##$USERA5= <user>
##$V9= 5
##$VALIST= <valist>
##$VCLIST= <CCCCCCCCCCCCCCC>
##$VD= 0
##$VDLIST= <DDDDDDDDDDDDDDD>
##$VPLIST= <PPPPPPPPPPPPPPP>
##$VTLIST= <TTTTTTTTTTTTTTT>
##$WBST= 1024
##$WBSW= 4
##$XGAIN= (0..3)
0 0 0 0 
##$XL= 0
##$YL= 0
##$YMAX_a= 640135
##$YMIN_a= -898432
##$ZGOPTNS= <>
##$ZL1= 120
##$ZL2= 120
##$ZL3= 120
##$ZL4= 120
##$ABSF1= 15.73697
##$ABSF2= -2.314879
##$ABSG= 5
##$ABSL= 3
##$ALPHA= 0
##$AQORDER= 0
##$ASSFAC= 0
##$ASSFACI= 0
##$ASSFACX= 0
##$ASSWID= 0
##$AUNMP= <proc_1d>
##$AZFE= 0.1
##$AZFW= 0.1
##$BCFW= 0
##$BC_mod= 2
##$BYTORDP= 0
##$COROFFS= 0
##$CY= -3
##$DATMOD= 1
##$DC= 0
##$DFILT= <>
##$DTYPP= 0
##$F1P= 0
##$F2P= 0
##$FCOR= 1
##$FTSIZE= 16384
##$FT_mod= 6
##$GAMMA= 0
##$GB= 0
##$INTBC= 1
##$INTSCL= 3.70164e-10
##$ISEN= 128
##$LB= 0.24
##$LEV0= 0
##$LPBIN= 0
##$MAXI= 10000
##$MC2= 0
##$MEAN= 0
##$ME_mod= 0
##$MI= 1.114404
##$NCOEF= 0
##$NC_proc= -7
##$NLEV= 6
##$NOISF1= 3.799351
##$NOISF2= 2.8
##$NSP= 0
##$NTH_PI= 0
##$NZP= 0
##$OFFSET= 15.77113
##$PC= 1
##$PHC0= -21708.71
##$PHC1= 8.452709
##$PH_mod= 1
##$PKNL= yes
##$PPARMOD= 0
##$PSCAL= 0
##$PSIGN= 0
##$REVERSE= no
##$SF= 200.13000008256
##$SI= 16384
##$SIGF1= 3
##$SIGF2= 2
##$SINO= 5.538805
##$SIOLD= 16384
##$SREGLST= <1H.CDCl3>
##$SSB= 0
##$STSI= 16384
##$STSR= 0
##$SW_p= 3612.71676300578
##$SYMM= 0
##$S_DEV= 0
##$TDeff= 16384
##$TDoff= 0
##$TI= <>
##$TILT= no
##$TM1= 0
##$TM2= 0
##$TOPLEV= 0
##$USERP1= <user>
##$USERP2= <user>
##$USERP3= <user>
##$USERP4= <user>
##$USERP5= <user>
##$WDW= 1
##$XDIM= 16384
##$YMAX_p= 413747938
##$YMIN_p= -3191391
$$ End of Bruker specific parameters
$$ ---------------------------------
##NTUPLES= NMR SPECTRUM
##VAR_NAME=  FREQUENCY,     SPECTRUM/REAL,   SPECTRUM/IMAG
##SYMBOL=    X,             R,               I
##VAR_TYPE=  INDEPENDENT,   DEPENDENT,       DEPENDENT
##VAR_FORM=  AFFN,          ASDF,            ASDF
##VAR_DIM=   16384,         16384,           16384
##UNITS=     HZ,            ARBITRARY UNITS, ARBITRARY UNITS
##FACTOR=    0.220516191357247, 1,           1
##FIRST=     3156.27616978198, 0,            0
##LAST=      -456.440593223796, 0,           0
##MIN=       -456.440593223796, -3191391,    0
##MAX=       3156.27616978198, 413747938,    0
$$ Real data points
##PAGE= N=1
##DATA TABLE= (X++(R..R)), XYDATA
$$ [...]
6857A3233255m18107k94187m08150l44810k34623k57795n357n9479m0730m99J5934
$$ 13233255 12815148 12520961 12112811 11768001 11533378 11275583 11270226 11210747 11170017 11169518 11185452
6846A1185452q0237o3025P9399n9183J60204J83752m6296j07938l6108k29402
$$ 11185452 11105215 11042190 11121589 11062406 11222610 11406362 11360066 11252128 11216020 10986618
6836A0986618J33880k97420l77039k9530Q0555K50597Q6652j44773J32702K08286
$$ 10986618 11120498 10823078 10446039 10416509 10497064 10747661 10834313 10689540 10822242 11030528
6826A1030528J24506P3755J20633Q4621J19750L09886L16692K43862N9708P6270
$$ 11030528 11155034 11228789 11349422 11434043 11553793 11863679 12180371 12424233 12483941 12560211
6816A2560211L0511L07626L04324K20045J41673K28344N31984L39312J34979J42552
$$ 12560211 12590722 12898348 13202672 13422717 13564390 13792734 14324718 14664030 14799009 14941561
6806A4941561K30701O01014k4737M17139L55088K64480Q1842l8945J29189P267
$$ 14941561 15172262 15773276 15748539 16165678 16520766 16785246 16867088 16828143 16957332 16964599
6796A6964599J66520J37843n4341O31N0614j39451K4775M74448L84307j6464K60590
$$ 16964599 17131119 17268962 17214621 17215252 17265866 17126415 17151190 17625638 18009945 17993481 18254071
6785A8254071j72446n6696K90130K79724L6400M11028L14058K14691M57918K74965
$$ 18254071 18081625 18024929 18315059 18594783 18631183 19042211 19356269 19570960 20028878 20303843
6775B0303843J21983L89477K84037L78275K64681J65215K66092J3914K49087J47473
$$ 20303843 20425826 20815303 21099340 21477615 21742296 21907511 22173603 22187517 22436604 22584077
6765B2584077n2104K09149J66869m7652p1807j69876L5267m4302L3648k25491
$$ 22584077 22531973 22741122 22907991 22860339 22788532 22618656 22653923 22609621 22643269 22417778
6755B2417778j83859j71257j18101q9928k85283j23899l09479k67610l19059k09780
$$ 22417778 22233919 22062662 21944561 21854633 21569350 21445451 21135972 20868362 20549303 20339523
6745B0339523m49841k77352J24339l27436k37211P7943J25301k70760k07190l45100
$$ 20339523 19889682 19612330 19736669 19409233 19172022 19249965 19375266 19104506 18897316 18552216
6735A8552216k08353o5530M6709j07686l85264k35153m2666j11838k62086k9033
$$ 18552216 18343863 18278333 18325042 18217356 17832092 17596939 17554273 17442435 17180349 17151316
6725A7151316k43147k02634N983k4568k60491j90592j41364m35110l87352l48467
$$ 17151316 16908169 16705535 16711518 16686950 16426459 16235867 16094503 15659393 15272041 14923574
6715A4923574j79588j30234k22158o39622j34268j14327n76928n16740k15147
$$ 14923574 14743986 14613752 14391594 13751972 13617704 13503377 12926449 12409709 12194562
6706A2194562k53977l22547m24482k80902j48093m87201l04702k47471k76889
$$ 12194562 11940585 11618038 11193556 10912654 10764561 10277360 9972658 9725187 9448298
6697I448298l51035n1284r5283j50983j12361k00513j80876o2361L1465k58819
$$ 9448298 9097263 9045979 8950696 8799713 8687352 8486839 8305963 8243602 8275067 8016248
6687H016248m8642j39990k13100k74225J00052j03771j79771R3834j65682j40203
$$ 8016248 7967606 7827616 7614516 7340291 7440343 7336572 7156801 7250635 7084953 6944750
6677F944750r9931q5076j14255J56883k61673j04585r4262n2229l0648r7766j42857
$$ 6944750 6844819 6759743 6645488 6802371 6540698 6436113 6341851 6289622 6258974 6161208 6018351
6666F018351J38897k78327O5300q0330j30162J53262j97588O7156j0748j7088
$$ 6018351 6157248 5878921 5944221 5863891 5733729 5886991 5689403 5756559 5745811 5728723
6656E728723p5101l6128o5759k96299M0506J4150R1338L38664J56814k58983j53453
$$ 5728723 5653622 5617494 5551735 5255436 5295942 5310092 5401430 5740094 5896908 5637925 5484472
6645E484472j0693O5287Q5120k17986J869J37172j6630M3917N3412r8532j390
$$ 5484472 5473779 5539066 5624186 5406200 5408069 5545241 5528611 5572528 5625940 5527408 5526018
6634E526018M0966L4087J04627j99386k75473j04j83079N3486q181q3597N8346
$$ 5526018 5566984 5601071 5705698 5506312 5230839 5230735 5047656 5101142 5092961 5009364 5067710
6623E067710l2090L1019k35167k25918K67117L583j13664j11302m5217J86078
$$ 5067710 5035620 5066639 4831472 4605554 4872671 4876254 4762590 4651288 4606071 4792149
6613D792149m5846j31074j21926j7874J76900j79452p597j21181K3925p1525K5615
$$ 4792149 4746303 4615229 4493303 4475429 4652329 4472877 4465280 4344099 4368024 4296499 4322114
6602D322114Q7299j1703J93840p3234l6554j62211N953P5536q7576J38094R3676
$$ 4322114 4409413 4397710 4591550 4518316 4481762 4319551 4325504 4401040 4313464 4451558 4545234
6591D545234r3245K3444k8591n9285j87495P3199J89172j01269k20263j4234J55959
$$ 4545234 4451989 4475433 4446842 4387557 4200062 4273261 4462433 4361164 4140901 4126667 4282626
6580D282626l1407O504P7880j65704J56198J69074M0319J307k24849j99465m5937
$$ 4282626 4251219 4257723 4335603 4169899 4326097 4495171 4535490 4536797 4311948 4112483 4066546
6569D066546K1421P0152J86175J20046P3635J1695n935j27154j24304l6169o0836
$$ 4066546 4087967 4158119 4344294 4464340 4537975 4549670 4543735 4416581 4292277 4256108 4195272
6558D195272R8211o3583m2575J08805k01912j97689K14341Q9720Q1992k24285
$$ 4195272 4293483 4229900 4187325 4296130 4094218 3896529 4110870 4200590 4282582 4058297
6548D058297p5857J94914j06578m1491M016J3723J2167L6582r1502J28645r908
$$ 4058297 3982440 4177354 4070776 4029285 4033301 4047024 4059191 4095773 4004271 4132916 4123008
6537D123008O8887L9511M862l50946R3351Q3255M615J27323Q7879j30849Q7180
$$ 4123008 4191895 4231406 4236268 3885322 3978673 4061928 4066543 4193866 4281745 4150896 4238076
6526D238076K07087j84976O9957k6360P8946J02678q7378L430J89822K49984k9289
$$ 4238076 4445163 4260187 4330144 4303784 4382730 4485408 4398030 4401460 4591282 4841266 4811977
6515D811977j25191L3100J39861J72719J78388J2505N5105K36163l9900k8148
$$ 4811977 4686786 4719886 4859747 5032466 5210854 5223359 5278464 5514627 5474727 5446579
6505E446579K49769K55728O3566l52289J11398K12266l4407l9098j98085L07301
$$ 5446579 5696348 5952076 6015642 5663353 5774751 5987017 5952610 5913512 5715427 6022728
6495F022728j12912k6130j07877l5413j13291r2867J75896L8361R6255Q7499N2559
$$ 6022728 5909816 5883686 5775809 5740396 5627105 5534238 5710134 5748495 5844750 5932249 5984808
6484E984808J17850J30334O4156j6479J1988J71558J12110K80223K86534o5716
$$ 5984808 6102658 6232992 6297148 6280669 6292657 6464215 6576325 6856548 7143082 7077366
6474G077366K06885l4039l8837p0469j98537j46111m8932J52039J89347O0183
$$ 7077366 7284251 7250212 7211375 7140906 6942369 6796258 6747326 6899365 7088712 7148895
6464G148895J64842K72965n775N1649N2855j12595o4585K77073L14288J7236J43368
$$ 7148895 7313737 7586702 7580927 7632576 7685431 7572836 7508251 7785324 8099612 8116848 8260216
6453H260216J78759j43591K92757K03543L22975K22729M2133j717R2542P4352
$$ 8260216 8438975 8295384 8588141 8791684 9114659 9337388 9379521 9377804 9470346 9544698
6443I544698L7718J42320r5813k8686J22872q3285k36086o2092j18344k16570
$$ 9544698 9582416 9724736 9628923 9600237 9723109 9639824 9403738 9341646 9223302 9006732
6433I006732r2049j47670m948j50168j30628k8896j45474K60230o33M2847j37532
$$ 9006732 8914683 8767013 8762065 8611897 8481269 8452373 8306899 8567129 8566496 8609343 8471811
6422H471811L9569k8110K60427J74691k939o0701j46167K41827K5368o8375J11381
$$ 8471811 8511380 8483270 8743697 8918388 8915449 8854748 8708581 8950408 8975776 8907401 9018782
6411I018782R2363r2711j7162J30508J90917j863p825j51939o933K00731K40217
$$ 9018782 9111145 9018434 9001272 9131780 9322697 9320834 9313009 9161070 9154137 9354868 9595085
6400I595085q6488j14504j08628K3022J41616K17245q4812r9119J59628J65324
$$ 9595085 9508597 9394093 9285465 9308487 9450103 9667348 9582536 9483417 9643045 9808369
6390I808369K17293P7081j7087j8427J25418K51485J83756L08408L16370Q5480
$$ 9808369 10025662 10102743 10085656 10067229 10192647 10444132 10627888 10936296 11252666 11338146
6380A1338146J08448J15734K0826L4292L04744K47806J06236J95628K69815K39817
$$ 11338146 11446594 11562328 11583154 11617446 11922190 12169996 12276232 12471860 12741675 12981492
6370A2981492J30195P7394K18783J94530j8503M7623K67434R7677K20497K84429
$$ 12981492 13111687 13189081 13407864 13602394 13583891 13631514 13898948 13996625 14217122 14501551
6360A4501551p2780J92396O5502K13526Q7346K04218J05471R6445M02283J75057
$$ 14501551 14428771 14621167 14686669 14900195 14987541 15191759 15297230 15393675 15795958 15971015
6350A5971015K09584l1609N37629M19117L16647K39787J1100K52919N96199O27242
$$ 15971015 16180599 16148990 16686619 17105736 17422383 17662170 17673270 17926189 18522388 19149630
6340A9149630L30885M19752N42011P22167O11171L74531N19439N41919R28003
$$ 19149630 19480515 19900267 20442278 21164445 21775616 22150147 22669586 23211505 24139508
6331B4139508N82185Q02416R69197J011481J194752J055455J103148J313454J323576
$$ 24139508 24721693 25524109 26493306 27504787 28699539 29754994 30858142 32171596 33495172
6322C3495172J576599K009607J736132K348128K683743K564195K471265K385727
$$ 33495172 35071771 37081378 38817510 41165638 43849381 46413576 48884841 51270568
6314E1270568K897265K946073K534016K534983K425612J973862J814752J760825
$$ 51270568 54167833 57113906 59647922 62182905 64608517 66582379 68397131 70157956
6306G0157956J369365J050171Q82045P42473M90590o113j47784k93548p09457
$$ 70157956 71527321 72577492 73459537 74202010 74692600 74686487 74538703 74245155 73535698
6297G3535698o48083j397245j766813j983721k213303k541999k758394l358835
$$ 73535698 72887615 71490370 69723557 67739836 65526533 62984534 60226140 56867305
6289E6867305l428901k946751k925914k723357k452249k335213k103634j978610
$$ 56867305 53438404 50491653 47565739 44842382 42390133 40054920 37951286 35972676
6281C5972676j757896j512165j475802j192925j190128j150586j057703q85941
$$ 35972676 34214780 32702615 31226813 30033888 28843760 27693174 26635471 25749530
6273B5749530q63605o89023p52320q37918n32563m57338n16128m42143l41450
$$ 25749530 24885925 24196902 23444582 22606664 22074101 21616763 21100635 20658492 20317042
6264B0317042l70019l03305j60750l27066l28820j06941l22490N3480r7749k47961
$$ 20317042 19947023 19643718 19482968 19155902 18827082 18720141 18397651 18451131 18353382 18105421
6254A8105421j7391J06258K28446j5388k3432K59574L54746J86718K27435Q6948
$$ 18105421 18088030 18194288 18422734 18407346 18383914 18643488 18998234 19184952 19412387 19499335
6244A9499335K48091N6994J31454K27315K25048M14533J95909Q370L2322M0130
$$ 19499335 19747426 19804420 19935874 20163189 20388237 20802770 20998679 21007049 21039371 21079501
6234B1079501j16253j18910k60904r6180r6111l29203k52946l41556l19376n9848
$$ 21079501 20963248 20844338 20583434 20487254 20391143 20061940 19808994 19467438 19148062 19088214
6224A9088214m08697l60698k39191l88794k12454m92409k19554k1340k01457p9975
$$ 19088214 18679517 18318819 18079628 17690834 17478380 16985971 16766417 16745077 16543620 16463645
6214A6463645k17124j28600j75043j06569j13472k57877J28194O7976K6896M2795
$$ 16463645 16246521 16117921 15942878 15836309 15722837 15464960 15593154 15661130 15688026 15730821
6204A5730821J85628K12000K8311J49673M51199K61613J7225K51033K63365L49666
$$ 15730821 15916449 16128449 16156760 16306433 16757632 17019245 17036470 17287503 17550868 17900534
6194A7900534L14526M35066N85789N18644N82221P85864R20471P33004P52343
$$ 17900534 18215060 18650126 19235915 19754559 20336780 21122644 22043115 22776119 23528462
6185B3528462P78571Q96659O37491O80776M38747N46591K86044K12308l074j89151
$$ 23528462 24307033 25203692 25841183 26521959 26960706 27507297 27793341 28005649 28002575 27813424
6175B7813424q7363l79649m61422o35209m83331o00701n91106p04084r43044o98511
$$ 27813424 27726061 27346412 26884990 26249781 25766450 25165749 24574643 23870559 22927515 22229004
6165B2229004o90990l86541o09471n91867l17984m08162j09062k51148k89745
$$ 22229004 21538014 21151473 20542002 19950135 19632151 19223989 19114927 18863779 18574034
6156A8574034Q0293r5034O1079n9844k9533K96561J04537m2801J45253L69605
$$ 18574034 18654327 18559293 18620372 18560528 18530995 18827556 18932093 18889292 19034545 19404150
6146A9404150n3117L22079L86979M84064N20911O13966N58958O85925P72954N66697
$$ 19404150 19351033 19673112 20060091 20544155 21065066 21679032 22237990 22923915 23696869 24263566
6136B4263566N61676O32252N47131N06762L75761J73696K45440K32732K33089
$$ 24263566 24825242 25457494 26004625 26511387 26887148 27060844 27306284 27539016 27772105
6127B7772105K09645Q5827O0131J38241J49440K2473K7918k07794k28423l06319
$$ 27772105 27981750 28067577 28127708 28265949 28415389 28437862 28465780 28257986 28029563 27723244
6117B7723244l64730q46037r49597n74854o14428n09396n18848n09494k47509
$$ 27723244 27358514 26512477 25562880 24988026 24373598 23864202 23345354 22835860 22588351
6108B2588351p4394j09338j40373m52207l80098k69187k27534k71212m70174j71517
$$ 22588351 22513957 22404619 22264246 21812039 21431941 21162754 20935220 20664008 20193834 20022317
6098B0022317j03615K4198J3370N3324J20031K87488M67643N04904M69398M94297
$$ 20022317 19918702 19942900 19956270 20009594 20129625 20417113 20884756 21389660 21859058 22353355
6088B2353355N75507P69934Q10244N81572O90399Q49965J041823J018589J162335
$$ 22353355 22928862 23698796 24509040 25090612 25781011 26630976 27672799 28691388 29853723
6079B9853723J352657J487062J769299J607341J246136J136745R34189M33826
$$ 29853723 31206380 32693442 34462741 36070082 37316218 38452963 39387152 39820978
6071C9820978m47477n28335j115678j156256q72456o01865n73997j56146P2691
$$ 39820978 39373501 38845166 37729488 36573232 35700776 35098911 34524914 34368768 34441459
6062C4441459k52697j97830k46524q9907m04874l39450m7969n9091j1059Q6910
$$ 34441459 34188762 33990932 33744408 33654501 33249627 32910177 32862208 32803117 32792058 32878968
6052C2878968J44699K63083J49468J0796j83513l17582k27113k49759l68791M747
$$ 32878968 33023667 33286750 33436218 33447014 33263501 32945919 32718806 32469047 32100256 32105003
6042C2105003P9413K27692J83466K27895j81649k5743L0416N0244L99351J77334
$$ 32105003 32184416 32412108 32595574 32823469 32641820 32616077 32646493 32696737 33096088 33273422
6032C3273422K40300K96438L08478J81577j15640n08490q25281n82993n83681
$$ 33273422 33513722 33810160 34118638 34300215 34184575 33676085 32850804 32267811 31684130
6023C1684130p37867o58276n42654m25905m02504k55400l00801m39379m94216
$$ 31684130 30946263 30287987 29745333 29319428 28916924 28661524 28360723 27921344 27427128
6014B7427128l95773m07888k2051k61048l79771m2120K64101R8035K7663J53799
$$ 27427128 27031355 26623467 26601416 26340368 25960597 25918477 26182578 26280613 26308276 26462075
6004B6462075J88859L655L9744L43359L82466J64749K90753L20091j66049l63638
$$ 26462075 26650934 26654589 26694333 27037692 27420158 27584907 27875660 28195751 28029702 27666064
5994B7666064m60143o72448n39747n06096o02942m12405j59346k03114k19679
$$ 27666064 27205921 26533473 25993726 25487630 24884688 24472283 24312937 24109823 23890144
5985B3890144m28231l62881k71753j14894k85331m07116m04261m49981k56457
$$ 23890144 23461913 23099032 22827279 22712385 22427054 22019938 21615677 21165696 20909239
5976B0909239o7760k31264k17595q1575m4872J66597j18840J3309J42165L32023
$$ 20909239 20841479 20610215 20392620 20311045 20266173 20432770 20313930 20327239 20469404 20801427
5966B0801427K62356L13308J95002M15607L87333J71859J36226N87112N76495
$$ 20801427 21063783 21377091 21572093 21987700 22375033 22546892 22683118 23270230 23846725
5957B3846725O47282Q94260N50352O71432O85182M61906K91502k8160O2393k22749
$$ 23846725 24494007 25388267 25938619 26610051 27295233 27757139 28048641 28020481 28082874 27860125
5947B7860125n75664o44496n26056n37973q42330l30209l13138m96538l04252
$$ 27860125 27284461 26639965 26113909 25575936 24733606 24403397 24090259 23593721 23289469
5938B3289469j53535j35817k52174j65271n496J43755J99282J7546J87637L17292
$$ 23289469 23135934 23000117 22747943 22582672 22577176 22720931 22920213 22937759 23125396 23442688
5928B3442688M42095Q04793M50822L95944O41774N80926N49309M74843L36697
$$ 23442688 23884783 24689576 25140398 25536342 26178116 26759042 27308351 27783194 28119891
5919B8119891L46900L99874L82299J18492k4637n0476Q813p3770N4145K54435
$$ 28119891 28466791 28866665 29248964 29367456 29342819 29292343 29301156 29227386 29281531 29535966
5909B9535966J54930M66395K11878K63014K28330P4718K478k9906l19513l88244
$$ 29535966 29690896 30157291 30369169 30632183 30860513 30935231 30937709 30907803 30588290 30200046
5899C0200046l75520m48474n68457m49205n00103k79134J5902r4070o5931J81417
$$ 30200046 29824526 29376052 28807595 28358390 27858287 27579153 27595055 27500985 27435054 27616471
5889B7616471M09927M42534L86620P04687J031083J015818J108743J481036J685001
$$ 27616471 28026398 28468932 28855552 29560239 30591322 31607140 32715883 34196919 35881920
5880C5881920J414266R69096Q81767M07905n61149r81547j054441j102220j300190
$$ 35881920 37296186 38265282 39147049 39554954 38993805 38012258 36957817 35855597 34555407
5871C4555407j161311q42329o28962n62848o61207n97987l24831k93293j95043
$$ 34555407 33394096 32551767 31922805 31359957 30698750 30100763 29775932 29482639 29287596
5862B9287596l6620K44472O63772O05447P60254L13076M4823j08525o81600j190765
$$ 29287596 29250976 29495448 30159220 30764667 31524921 31837997 31882820 31774295 31092695 29901930
5852B9901930j640847j653791j448768j176308j381270q62273p67222n28799k62616
$$ 29901930 28261083 26607292 25158524 23982216 22600946 21738673 20971451 20442652 20180036
5843B0180036l76664l38823m57586l89621j90831N8427M3557q7544j13440l2611
$$ 20180036 19803372 19464549 19006963 18617342 18426511 18484938 18528495 18440951 18327511 18294900
5833A8294900R2916R2405Q4428r8860M142k4849N926L1934k63177m4184J71274
$$ 18294900 18387816 18480221 18564649 18465789 18469931 18445082 18451008 18482942 18219765 18175581 18346855
5822A8346855m1376K9981Q8697J44616p2289k63353j70412N08p5901j75496o4780
$$ 18346855 18305479 18335460 18424157 18568773 18496484 18233131 18062719 18063227 17987326 17811830 17747050
5811A7747050L4292k37743j14609O1258J35828N3096J14505J05998R1778L16708
$$ 17747050 17781342 17543599 17428990 17490248 17626076 17679172 17793677 17899675 17991453 18308161
5801A8308161M801K33911K10222l0474j91361l60600l54237n74658m35283l01823
$$ 18308161 18312962 18546873 18757095 18726621 18535260 18174660 17820423 17245765 16810482 16508659
5791A6508659m10784j80096j34487o29906k72939k61804k34141l86991j30185
$$ 16508659 16097875 15917779 15783292 15153386 14880447 14618643 14384502 13997511 13867326
5782A3867326l90702k66356o9157k15137p7150j24848P3466K12271R3016J33614
$$ 13867326 13476624 13210268 13141111 12925974 12848824 12723976 12797442 13009713 13102729 13236343
5772A3236343J63048L81912K61959M1157r3299j36537J50538k14003l72188n60443
$$ 13236343 13399391 13781303 14043262 14084419 13991120 13854583 14005121 13791118 13418930 12858487
5762A2858487k27802m31881l68970l80178l4654q1128j71068k40472m2851n9721
$$ 12858487 12630685 12198804 11829834 11449656 11415002 11333874 11162806 10922334 10879483 10819762
5752A0819762r3863q4342k08077j71508j68530P7695p6856l7028n0533k70155
$$ 10819762 10725899 10641557 10433480 10261972 10093442 10171137 10094281 10057253 10006720 9736565
5742I736565k32372o1928M6665j00188J18800n7056j29929j05759J30242n3262
$$ 9736565 9504193 9442265 9488930 9388742 9507542 9450486 9320557 9214798 9345040 9291778
5732I291778j06617j10833k85186k70733R0576o0020p7880r4965q5085L6953j63828
$$ 9291778 9185161 9074328 8789142 8518409 8608985 8548965 8471085 8376120 8291035 8327988 8164160
5721H164160l36225j34011J61395o5734l39006J01413j44286N7299J11772j66942
$$ 8164160 7827935 7693924 7855319 7789585 7450579 7551992 7407706 7465005 7576777 7409835
5711G409835Q7617m7908l09770r8799K28554k3109p6403m5908j98m2757j21706
$$ 7409835 7497452 7449544 7139774 7040975 7269529 7246420 7170017 7124109 7123911 7081154 6959448
5700F959448j21314K0923j44921K5244J35532J4549j83116J6391k06351j74299
$$ 6959448 6838134 6859057 6714136 6739380 6874912 6889461 6706345 6722736 6516385 6342086
5690F342086k57749L39464L2836k05318j80685r9945J46793M1244R900j4081j6274
$$ 6342086 6084337 6423801 6456637 6251319 6070634 5970689 6117482 6158726 6168626 6154545 6138271
5679F138271q5555l7873J2406l4845j58344K32110j09179k11230k21980K8825
$$ 6138271 6052716 6014843 6027249 5992404 5834060 6066170 5956991 5745761 5523781 5552606
5669E552606Q8682J6494o9603o1510J0082P7539j05352k17767L09415R8999k16556
$$ 5552606 5641288 5657782 5588179 5526669 5536751 5614290 5508938 5291171 5600586 5699585 5483029
5658E483029j32872j94596M8519m9733m0355j18526n5029K16939Q8303j07209
$$ 5483029 5350157 5155561 5204080 5154347 5113992 4995466 4940437 5157376 5245679 5138470
5648E138470q5461J62388N1737j451m1212K71131L7302j07976j66265P1108k0474
$$ 5138470 5053009 5215397 5267134 5265683 5224471 5495602 5532904 5424928 5258663 5329771 5309297
5637E309297p0647L44937J86644k4971K18142R8685O8118K65071J87200j11629
$$ 5309297 5238650 5583587 5770231 5745260 5963402 6062087 6130205 6395276 6582476 6470847
5627F470847K2404l3527j68932R6000J5850k5330J29325M5259P6930q445J10804
$$ 6470847 6493251 6459724 6290792 6386792 6402642 6377312 6506637 6551896 6628826 6620381 6731185
5616F731185m3605j87036N9470O4547J6575j48473j7596k22092p4281J21195P0501
$$ 6731185 6687580 6500544 6560014 6624561 6641136 6492663 6475067 6252975 6178694 6299889 6370390
5605F370390J43304J83041N8772K50786O4144J93832J09410p581M76645k1067
$$ 6370390 6513694 6696735 6755507 7006293 7070437 7264269 7373679 7366098 7842743 7821676
5595G821676J10872N4489m1642L2359L43177K01906M79585L70672K75752L27691
$$ 7821676 7932548 7987037 7945395 7977754 8320931 8522837 9002422 9373094 9648846 9976537
5585I976537M75114K61837J25763J94388l9263n14905m61788o17578l95118k33956
$$ 9976537 10451651 10713488 10839251 11033639 10994376 10479471 10017683 9400105 9004987 8771031
5575H771031k66060K0690J23790O2317m3296N783l1978J12141l9575L43151l9186
$$ 8771031 8504971 8525661 8649451 8711768 8668472 8674255 8642277 8754418 8714843 9057994 9018808
5564I018808R4235M01042J76038J99306M86872N84004M49351N34397N86176N13981
$$ 9018808 9113043 9514085 9690123 9889429 10376301 10960305 11409656 11944053 12530229 13044210
5554A3044210O92223P74185L45614L59038Q0950o4865l27726o80526o42561n16013
$$ 13044210 13736433 14510618 14856232 15215270 15296220 15231355 14903629 14223103 13580542 13064529
5544A3064529k63857k09881Q3417m7057J89271K73972J74130k4628L59213L03559
$$ 13064529 12800672 12590791 12674208 12627151 12816422 13090394 13264524 13239896 13599109 13902668
5534A3902668L04085K40612P06448O94734N12100P08975Q75511Q61201J030717
$$ 13902668 14206753 14447365 15153813 15848547 16360647 17069622 17945133 18806334 19837051
5525A9837051R94591J246240J120946J035151O44586Q52503N92375j13477k20818
$$ 19837051 20831642 22077882 23198828 24233979 24878565 25731068 26323443 26209966 25989148
5516B5989148o40698q47962j019589q45398q14053o18354n12182m47253k08806
$$ 25989148 25348450 24500488 23480899 22635501 21821448 21203094 20690912 20243659 20034853
5507B0034853m72339l4644k42638j44553j71243m9560m13433L4424J68895J6090
$$ 20034853 19562514 19527870 19285232 19140679 18969436 18919876 18506443 18540867 18709762 18725852
5497A8725852J44498L99193M81349K79526L59980N29038O15318O23267P41954
$$ 18725852 18870350 19269543 19750892 20030418 20390398 20919436 21534754 22158021 22899975
5488B2899975P14643P75114N02807N49405N36392N16694M61341P40463P20282
$$ 22899975 23614618 24389732 24892539 25441944 25978336 26495030 26956371 27696834 28417116
5479B8417116J137710P80801J034365J180893Q85922O32950M44413J62737P6818
$$ 28417116 29554826 30335627 31369992 32550885 33436807 34069757 34514170 34676907 34753725
5470C4753725l57211n10351o75694r15655r86569j096184o96826p19750o85238
$$ 34753725 34396514 33886163 33210469 32294814 31308245 30212061 29515235 28795485 28110247
5461B8110247m14371o80395j23775j80110l39605m54169O6775m18219m17299k89013
$$ 28110247 27695876 27015481 26891706 26711596 26371991 25917822 25984597 25566378 25149079 24860066
5451B4860066m09813l11851j9939R787M6279n5450L3548m9885k89821J4872j67689
$$ 24860066 24450253 24138402 24118463 24128250 24174529 24119079 24152627 24102742 23812921 23827793 23660104
5440B3660104l03437J02738J02374K82458M23309N99996P92886P62027R79845
$$ 23660104 23356667 23459405 23561779 23844237 24267546 24867542 25660428 26422455 27402300
5431B7402300J051552J133104R22861N34783L29077L02555k60062n36950n26070
$$ 27402300 28453852 29586956 30509817 31044600 31373677 31676232 31416170 30879220 30353150
5422C0353150q18300j161493j052328j123516o96739o22521o04108j45079l77287
$$ 30353150 29534850 28373357 27321029 26197513 25500774 24878253 24274145 24129066 23751779
5413B3751779m52435l87821n08334k85181l98135k19789Q5324k17056m2918K01416
$$ 23751779 23299344 22911523 22403189 22118008 21719873 21500084 21585408 21368352 21325434 21526850
5403B1526850L61066O93945P17578O53599M98798K83387O56932O10203L53105
$$ 21526850 21887916 22581861 23299439 23953038 24451836 24735223 25392155 26002358 26355463
5394B6355463j09900k42240n00430o06381p88085q87216o07991n76667m36693
$$ 26355463 26245563 26003323 25502893 24896512 24108427 23221211 22613220 22036553 21599860
5385B1599860l37465o3402n7675j01224p6026q0536p6675J5920M8491P9072m987
$$ 21599860 21262395 21198993 21141318 21040094 20964068 20883532 20806857 20822777 20871268 20950340 20945353
5374B0945353k0896J20263J39596n1452K78693K56971K61781M13180M56527M11789
$$ 20945353 20924457 21044720 21184316 21132864 21411557 21668528 21930309 22343489 22800016 23211805
5364B3211805M11246O5290J58761O2118K79057n338L14588L01882L67657M42913
$$ 23211805 23623051 23688341 23847102 23909220 24188277 24182939 24497527 24799409 25167066 25609979
5354B5609979N41054O15881O05771P18505P87496P45797O09289R97772R33503
$$ 25609979 26151033 26766914 27372685 28091190 28878686 29624483 30233772 31231544 32165047
5345C2165047M54752M68548M56826J88015L61915N15297J70441K57747J74500
$$ 32165047 32619799 33088347 33545173 33733188 34095103 34610400 34780841 35038588 35213088
5336C5213088L60058M75261M02881L80486q7179J27678m2166J954K83777L64200
$$ 35213088 35573146 36048407 36451288 36831774 36744595 36872273 36830107 36832061 37115838 37480038
5326C7480038L57175O60383P72255R98642J644788J710417J727839J978891J934629
$$ 37480038 37837213 38497596 39269851 40268493 41913281 43623698 45351537 47330428 49265057
5317D9265057K013274K228053K089888J805197J480172J001525N93120m0462m54204
$$ 49265057 51278331 53506384 55596272 57401469 58881641 59883166 60476286 60435824 59981620
5308E9981620j035120j178519r72165j385572j480237j315564j254253j384789
$$ 59981620 58946500 57767981 56795816 55410244 53930007 52614443 51360190 49975401
5300D9975401j238605r25926o84981l42711k21467Q1537J39056M82346P28019
$$ 49975401 48736796 47810870 47125889 46783178 46561711 46643248 46782304 47264650 47992669
5291D7992669O36981Q40024Q30604R28684J562355J664606J666975J807251J871192
$$ 47992669 48629650 49469674 50300278 51228962 52791317 54455923 56122898 57930149 59801341
5282E9801341J613872J486264J063400P37010R5272m47343q34602j449067j354992
$$ 59801341 61415213 62901477 63964877 64701887 64797159 64349816 63515214 62066147 60711155
5273F0711155j742205j745718k243239k254996j786671j911968j830258j495164
$$ 60711155 58968950 57223232 54979993 52724997 50938326 49026358 47196100 45700936
5265D5700936j304671q65219m47381o32480j98326r2968J9221N3980j4275K88244
$$ 45700936 44396265 43531046 43083665 42451185 42252859 42159891 42179112 42233092 42218817 42507061
5255D2507061J78868k83334J47481r629k8282k66606k85204l12361l78470k81526
$$ 42507061 42685929 42402595 42550076 42540447 42512165 42245559 41960355 41647994 41269524 40987998
5245D0987998m96767o00849p87977p58390r24682q91805r16057j121020r76362
$$ 40987998 40491231 39890382 39102405 38344015 37419333 36527528 35611471 34490451 33514089
5236C3514089q70244n46086p29958m41481n70941l67019j59538l73425N0115l6370
$$ 33514089 32643845 32097759 31367801 30926320 30355379 29988360 29828822 29455397 29505512 29469142
5226B9469142j0373O7727K86583K23105O32243M83135N59289L21892M53610N58063
$$ 29469142 29458769 29526496 29813079 30036184 30668427 31151562 31710851 32032743 32486353 33044416
5216C3044416L05040J17960n6966k12676m38351o74865p77652j242597q98388
$$ 33044416 33349456 33467416 33410450 33197774 32759423 32084558 31306906 30064309 29165921
5207B9165921q89342r45368q65434j020075n83262o13907n15331m49229o76841
$$ 29165921 28276579 27331211 26465777 25445702 24862440 24248533 23733202 23283973 22607132
5198B2607132p1310k50733k53209j54083j71112j37690M4247j528k02526j85382
$$ 22607132 22535822 22285089 22031880 21877797 21706685 21568995 21613242 21611714 21409188 21223806
5188B1223806r4531R8070P0112J85646K02153J12755k6521J97968R6931K65018
$$ 21223806 21129275 21227345 21297457 21483103 21685256 21798011 21771490 21969458 22066389 22331407
5178B2331407L82395L38769M93379J39791k26212m6911j9306k76034n74063l35356
$$ 22331407 22713802 23052571 23545950 23685741 23459529 23412618 23393312 23117278 22543215 22207859
5168B2207859n02633m73512m96080k58819k83591p3287j45439r9694l79363k72156
$$ 22207859 21705226 21231714 20735634 20476815 20193224 20119937 19974498 19874804 19495441 19223285
5158A9223285m47998k03780l35381J9908j54550k82039l9010j54366K0766L27257
$$ 19223285 18775287 18571507 18236126 18256034 18101484 17819445 17780435 17626069 17646835 17974092
5148A7974092K10705p4153J76817p9258N4929j72325L7674j37290j33916k40791
$$ 17974092 18184797 18110644 18287461 18208203 18263132 18090807 18128481 17991191 17857275 17616484
5138A7616484q7458k06791j39811M3917n8468R500P5027J26471K14073n6340j0207
$$ 17616484 17529026 17322235 17182424 17226341 17167873 17177373 17252400 17378871 17592944 17536604 17526397
5127A7526397j04551k64319J82565Q9741p1088l33339J16575M36803K46146K4835
$$ 17526397 17421846 17157527 17340092 17429833 17358745 17025406 17141981 17578784 17824930 17849765
5117A7849765J78069N25444N34174M43426L35979J07660M9558J85049o4266M45025
$$ 17849765 18027834 18553278 19087452 19530878 19866857 19974517 20024075 20209124 20144858 20589883
5107B0589883n8040k4195J0776K25035P4817M68542L73259K36115M56801L83451
$$ 20589883 20531843 20507648 20518424 20743459 20818276 21286818 21660077 21896192 22352993 22736444
5097B2736444M09973L35452J54524k03670k63052k78758r2168o0514j11642k87269
$$ 22736444 23146417 23481869 23636393 23432723 23169671 22890913 22798745 22738231 22626589 22339320
5087B2339320P8242J16197J22021K94938K66217M44192L72705L06198M41589K58881
$$ 22339320 22417562 22533759 22655780 22950718 23216935 23661127 24033832 24340030 24781619 25040500
5077B5040500N38312L14877J33233J08954P2474r9762j24501j65237l80841j29095
$$ 25040500 25578812 25893689 26026922 26135876 26208350 26108588 25984087 25818850 25438009 25308914
5067B5308914k08877k46958J09933m1641K24221L36011L43778N69970O51067L69472
$$ 25308914 25100037 24853079 24963012 24921371 25145592 25481603 25825381 26395351 27046418 27415890
5057B7415890M99675N99334N31869N35479N39651j2226j32381m150m02261j91008
$$ 27415890 27915565 28514899 29046768 29582247 30121898 30109672 29977291 29973141 29570880 29379872
5047B9379872m13150j47675j40184j10248J60743Q2268L48425L37107M44728L45450
$$ 29379872 28966722 28819047 28678863 28568615 28729358 28811626 29160051 29497158 29941886 30287336
5037C0287336M34345L30005L89702K52730L22275L62765M42115K31512K07848
$$ 30287336 30721681 31051686 31441388 31694118 32016393 32379158 32821273 33052785 33260633
5028C3260633N87974N04631R21005Q07884J036124J246981J491867J305694J172550
$$ 33260633 33848607 34353238 35274243 36082127 37118251 38365232 39857099 41162793 42335343
5019D2335343R73254P76813P52337L42253n6024L9759m14464l49368n8522j08334
$$ 42335343 43308597 44085410 44837747 45180000 45123976 45163735 44749271 44399903 44341381 44233047
5009D4233047L97282K98708L21826K93272J58564K78245J57111J20929J74854
$$ 44233047 44630329 44929037 45250863 45544135 45702699 45980944 46138055 46258984 46433838
5000D6433838L17697R68342J100748J632658J889372K233942K462806K505560
$$ 46433838 46751535 47719877 48820625 50453283 52342655 54576597 57039403 59544963
4992E9544963K790803K454121K813811K303946K526649K141833J445345R03670
$$ 59544963 62335766 64789887 67603698 69907644 72434293 74576126 76021471 76925141
4984G6925141K32585l88377r35370j619150j988274j870409k104096j731049j217959
$$ 76925141 77157726 76769349 75833979 74214829 72226555 70356146 68252050 66521001 65303042
4975F5303042j246036r60271m33459k58523j26294j97023N8791M67171Q08376
$$ 65303042 64057006 63096735 62663276 62404753 62278459 62081436 62140227 62607398 63415774
4966F3415774J540238K077006K453044K860384K966650L312255L336747L145304
$$ 63415774 64956012 67033018 69486062 72346446 75313096 78625351 81962098 85107402
4958H5107402K631456K048344J558376R56794j50532r22038j470892k015092k378709
$$ 85107402 87738858 89787202 91345578 92302372 92151840 91229802 89758910 87743818 85365109
4949H5365109k891679l198798l495936l573614l512169l317571k576807k464032
$$ 85365109 82473430 79274632 75778696 72205082 68692913 65375342 62798535 60334503
4941F0334503j703920j308725r24104n72657o3181J86871L64438P07350Q87975
$$ 60334503 58630583 57321858 56397754 55825097 55761916 55948787 56313225 57020575 57908550
4932E7908550J639894J822210J837495K106160K022599J578952J265500N61545
$$ 57908550 59548444 61370654 63208149 65314309 67336908 68915860 70181360 70742905
4924G0742905o3554p83736j907023k329293k453160k667895k682408k433670k391788
$$ 70742905 70679351 69895615 67988592 65659299 63206139 60538244 57855836 55422166 53030378
4915E3030378k177097k288777k221230k111660j661162j679377j407020j219219
$$ 53030378 50853281 48564504 46343274 44231614 42570452 40891075 39484055 38264836
4907C8264836j018743p90908o89953k99389k24208q4624K28133J42110K40529
$$ 38264836 37246093 36455185 35765232 35465843 35241635 35157011 35385144 35527254 35767783
4898C5767783N61503M83378N79892M50253M42046J24807j15750p58558q36662
$$ 35767783 36329286 36812664 37392556 37842809 38284855 38409662 38293912 37535354 36698692
4889C6698692j141124j069503j337738j525399j355689j220914p20122r14472
$$ 36698692 35557568 34488065 33150327 31624928 30269239 29048325 28328203 27413731
4881B7413731p76222q37342o83113n05466n84853l09231k77909j60184k46263
$$ 27413731 26637509 25800167 25117054 24611588 24026735 23717504 23439595 23279411 23033148
4872B3033148M4846k61302q0574K44997K70908K40645L11081L82592K30183L79322
$$ 23033148 23077994 22816692 22736118 22981115 23252023 23492668 23803749 24186341 24416524 24795846
4862B4795846N15320R7798J49857L10337N4515q2424j54366j35523l03533l54817
$$ 24795846 25311166 25408964 25558821 25869158 25923673 25841249 25686883 25551360 25247827 24893010
4852B4893010j46999k13871m12648k16944k09154k42983m48701k03463k48931
$$ 24893010 24746011 24532140 24119492 23902548 23693394 23450411 23001710 22798247 22549316
4843B2549316j52879k60214j46947M7223J02938J75008l899J01831J47710p0198
$$ 22549316 22396437 22136223 21989276 22036499 22139437 22314445 22310546 22412377 22560087 22489889
4833B2489889J87465K78672L09242K96162K27154N34652L56877L03955N61791
$$ 22489889 22677354 22956026 23265268 23561430 23788584 24323236 24680113 24984068 25545859
4824B5545859M69236M80729M76972K99511M32844J45933J96076k32761j34462
$$ 25545859 26015095 26495824 26972796 27272307 27705151 27851084 28047160 27814399 27679937
4815B7679937m50949k83603m78861m86955m86641m08373m57540n02879j77947
$$ 27679937 27228988 26945385 26466524 25979569 25492928 25084555 24627015 24124136 23946189
4806B3946189j51187n2194k02649r2896R9411L2502R3417J948j33144j16734n6203
$$ 23946189 23795002 23742808 23540159 23447263 23546674 23579176 23672593 23674541 23541397 23424663 23368460
4795B3368460R5311L40463K28604J37329O64950N03676N53142R1258L14833L18529
$$ 23368460 23463771 23804234 24032838 24170167 24835117 25338793 25891935 25983193 26298026 26616555
4785B6616555K6790k75173m44851l72566m33288p78520m80977n54376o89635m96399
$$ 26616555 26643345 26368172 25923321 25550755 25117467 24338947 23857970 23303594 22613959 22117560
4775B2117560m39179n55546n77668k10289l12294j4916j80014k32736k69065j23076
$$ 22117560 21678381 21122835 20545167 20334878 20022584 20007668 19827654 19594918 19325853 19202777
4765A9202777l95560m14091l12320j33420k19420l69874n4803k20692q9213j86422
$$ 19202777 18807217 18393126 18080806 17947386 17727966 17358092 17303289 17082597 16993384 16806962
4755A6806962l7411Q0347r1916k52923k76788p5715l505l45398k85164k15249
$$ 16806962 16769551 16849898 16757982 16505059 16228271 16152556 16149051 15803653 15518489 15303240
4745A5303240k14332l10571l36994j88355l86091r9979l181k40800j85562m22966
$$ 15303240 15088908 14778337 14441343 14252988 13866897 13766918 13763737 13522937 13337375 12914409
4735A2914409r9149j68838l29171l53665j5761k1456m2714k55590j32865k13432
$$ 12914409 12815260 12646422 12317251 11963586 11947825 11926369 11883655 11628065 11495200 11281768
4725A1281768J16163K7431l50999J3356N8578R5504q2138R0407p186m737o8740
$$ 11281768 11397931 11425362 11074363 11087719 11146297 11241801 11159663 11250070 11242884 11238147 11169407
4714A1169407M9747j55373r237J71032M1133n2974j47385l9554l2175L1278j44472
$$ 11169407 11219154 11063781 11054544 11225576 11266709 11213735 11066350 11026796 10994621 11025899 10881427
4703A0881427j25735k05120J7229k00677j07639j52440p5234J2342J983l24609
$$ 10881427 10755692 10550572 10567801 10367124 10259485 10107045 10031811 10044153 10046136 9721527
4693I721527k10772J20309l64O0830q0036J42833K2418l7012L09370Q2117q4979
$$ 9721527 9510755 9631064 9630700 9691530 9611494 9754327 9776745 9739733 10049103 10131220 10046241
4682A0046241J79824N7116n768k6630K09454M1943Q7003J66660J3926J65121K07834
$$ 10046241 10226065 10283181 10277413 10250783 10460237 10502180 10589183 10755843 10769769 10934890 11142724
4671A1142724J0040j25176J24637J56007L0975J21083J66706Q3311l7868o5374
$$ 11142724 11152764 11027588 11152225 11308232 11339207 11460290 11626996 11710307 11672439 11607065
4661A1607065q840j56614R046K8726k79810K6974j94579j78232j66930k2294j79786
$$ 11607065 11598225 11441611 11450657 11479383 11199573 11226547 11031968 10853736 10686806 10664512 10484726
4650A0484726l15527j9148L067j77668J6139n448L2251k0574j17135N7438J81928
$$ 10484726 10169199 10150051 10153118 9975450 9991589 9986141 10018392 9997818 9880683 9938121 10120049
4639A0120049k27117K67288J00637L8904j04769r3595o2644j31668O1338j84989
$$ 10120049 9892932 10160220 10260857 10299761 10194992 10101397 10038753 9907085 9968423 9783434
4629I783434r9904k30194j52641k27706O8143K11474k37211m6237j13158r2126
$$ 9783434 9683530 9453336 9300695 9072989 9141132 9352606 9115395 9069158 8956000 8863874
4619H863874R3696P0108O1314j51893j18733j36643k7428m2358j20923j24103
$$ 8863874 8957570 9027678 9088992 8937099 8818366 8681723 8654295 8611937 8491014 8366911
4609H366911J8490L3278o9113R8195R4649j33619Q4882k33813j89469p3206j0361
$$ 8366911 8385401 8418679 8349566 8447761 8542410 8408791 8493673 8259860 8070391 7997185 7986824
4598G986824J57248j81961j76580K50076j45175k39388K33903P4867o256Q7846
$$ 7986824 8144072 7962111 7785531 8035607 7890432 7651044 7884947 7959814 7953558 8041404
4588H041404r0194j57414J9383R6014j48377N300P3814O7448J0264j87439q8221
$$ 8041404 7951210 7793796 7813179 7909193 7760816 7766116 7839930 7907378 7917642 7730203 7641982
4577G641982M9677J31531m1297Q0314q3580O7709j02087R3J98287N6322Q459J53206
$$ 7641982 7691659 7823190 7781893 7862207 7778627 7846336 7744249 7744342 7942629 7998951 8007410 8160616
4565H160616n6336n7612K2507M5185J64781k39867q0035K36091L06076j86397
$$ 8160616 8104280 8046668 8069175 8114360 8279141 8039274 7959239 8195330 8501406 8315009
4555H315009k12251k3269P5565r4326J67247m5199j0839O8922l47065J58517K10053
$$ 8315009 8102758 8079489 8155054 8060728 8227975 8182776 8171937 8240859 7893794 8052311 8262364
4544H262364J95198k55478l11608J57808P8659J39935k3691l57182Q9632N6059
$$ 8262364 8457562 8202084 7890476 8048284 8126943 8266878 8243187 7886005 7975637 8031696
4534H031696j38568p0842K07591k0255j0329J75132r4571q181k46307K21309j11388
$$ 8031696 7893128 7822286 8029877 8009622 7999293 8174425 8079854 8071673 7825366 8046675 7935287
4523G935287P3347j09830K4912k3189j7352K7905R452N2166n0338K14620m9846
$$ 7935287 8008634 7898804 7923716 7900527 7883175 7911080 7920532 7972698 7922360 8136980 8087134
4512H087134n63k01817j7840K01289K17263k256M6018J30193M8933K12942j18231
$$ 8087134 8086571 7884754 7866914 8068203 8285466 8283210 8329228 8459421 8508354 8721296 8603065
4501H603065l0526n8997Q861j30358P0757N5381P7920k8452L1878J69025q8166
$$ 8603065 8572539 8513542 8522403 8392045 8462802 8518183 8596103 8567651 8599529 8768554 8680388
4490H680388N6820Q0763J31143J50474k23634j43174J88698n8011Q2768K5263
$$ 8680388 8737208 8817971 8949114 9099588 8875954 8732780 8921478 8863467 8946235 8971498
4480H971498o887J6136j1041J1927m9144k33090l7277K00186L7937J41838J56065
$$ 8971498 8964611 8980747 8969706 8981633 8932489 8699399 8662122 8862308 8900245 9042083 9198148
4469I198148P2159q3919q4292R1118K85115J80630J232L8371r4897J62673K03607
$$ 9198148 9270307 9186388 9102096 9193214 9478329 9658959 9660191 9698562 9603665 9766338 9969945
4458I969945o2549j17177M7056j61493m4738M6452J09497J08172J83723n1072
$$ 9969945 9907396 9790219 9837275 9675782 9631044 9677496 9786993 9895165 10078888 10027816
4448A0027816q2598M4720J41129j30264J14783J68310k79133j27265J09525O147
$$ 10027816 9945218 9989938 10131067 10000803 10115586 10283896 10004763 9877498 9987023 9993170
4438I993170J13887K15686j13162J52106K54634L8307l5904m4571k1182J31580
$$ 9993170 10107057 10322743 10209581 10361687 10616321 10654628 10618724 10574153 10552971 10684551
4428A0684551J29494Q9393J2372J00518k02411o3973R9180M7806L0635J63304
$$ 10684551 10814045 10903438 10915810 11016328 10813917 10749944 10849124 10896930 10927565 11090869
4418A1090869Q4195P8864J94038l9326K4947K65585K51204j60492j5374Q5378
$$ 11090869 11175064 11253928 11447966 11408640 11433587 11699172 11950376 11789884 11774510 11859888
4408A1859888K63697M4441R5092m4610J64682j93440Q7921K21656J39417J43190
$$ 11859888 12123585 12168026 12263118 12218508 12383190 12189750 12277671 12499327 12638744 12781934
4398A2781934J4075J58215J19343Q9479j48824j52659l88266P3996o2751R71n1765
$$ 12781934 12796009 12954224 13073567 13163046 13014222 12861563 12473297 12547293 12484542 12485513 12433748
4387A2433748o4803j44645k22737J53010N437n4264J24214m7188j49933O4772
$$ 12433748 12368945 12224300 12001563 12154573 12160010 12105746 12229960 12182772 12032839 12097611
4377A2097611j3522j58892p0759J32413j18286J31166J66373m705j94878K30201
$$ 12097611 12084089 11925197 11854438 11986851 11868565 11999731 12166104 12161399 11966521 12196722
4367A2196722j2734R7131J58084k2895j01314n346Q1818J6336J67516p1715k4359
$$ 12196722 12183988 12281119 12439203 12416308 12314994 12309648 12391466 12407802 12575318 12503603 12479244
4356A2479244L1063j2488N550J08550J71271q4962m5562J4733J42672Q0895l8126
$$ 12479244 12510307 12497819 12503369 12611919 12783190 12698228 12652666 12667399 12810071 12890966 12852840
4345A2852840L3257l06785J06562K46956l0818j273K23062j14786K54359J84205
$$ 12852840 12886097 12579312 12685874 12932830 12902012 12900739 13123801 13009015 13263374 13447579
4335A3447579N9341M3228l6054P5172O1054J22247K40107p8341J27433M0349J09082
$$ 13447579 13506920 13550148 13514094 13589266 13650320 13772567 14012674 13934333 14061766 14102115 14211197
4324A4211197K31397O9301p5008J06526J12734J37996R8541j6240Q8192R7798
$$ 14211197 14442594 14511895 14436887 14543413 14656147 14794143 14892684 14876444 14964636 15062434
4314A5062434L8575O2319K80513l0124J26163J70695q261K71567Q4377J89363
$$ 15062434 15101009 15163328 15443841 15413717 15539880 15710575 15702314 15973881 16058258 16247621
4304A6247621J86405R8053J26178J18468L87430J7699j63692N0942M33629K76002
$$ 16247621 16434026 16532079 16658257 16776725 17164155 17181854 17018162 17069104 17502733 17778735
4294A7778735o2363L45410K73855J93232J0266J64694Q1050K41282K64818J11490
$$ 17778735 17716372 18061782 18335637 18528869 18539135 18703829 18784879 19026161 19290979 19402469
4284A9402469K28527L51983L89726M86870K47175M77519N23084O69726N68783
$$ 19402469 19630996 19982979 20372705 20859575 21106750 21584269 22107353 22777079 23345862
4275B3345862O72789Q98394Q71661Q53669P48739R52574R93054Q60085O39832
$$ 23345862 24018651 24917045 25788706 26642375 27391114 28343688 29336742 30196827 30836659
4266C0836659P11726L49691J78992L48255L05710j28531J80972L26691K55217
$$ 30836659 31548385 31898076 32077068 32425323 32731033 32602502 32783474 33110165 33365382
4257C3365382K87105M64950K25887K73506K00596K97227Q6387N6853j46682j04713
$$ 33365382 33652487 34117437 34343324 34616830 34817426 35114653 35201040 35257893 35111211 35006498
4247C5006498k701q1358l09026j41876k27879j65308p4529j17276J20723J5859
$$ 35006498 35003797 34922439 34613413 34471537 34243658 34078350 34003821 33886545 34007268 34023127
4237C4023127j46875K35486K40228M5004M51506L59423K06462M42067M02014K47430
$$ 34023127 33876252 34111738 34351966 34396970 34848476 35207899 35414361 35856428 36258442 36505872
4227C6505872L40896Q1209K30826J76650K86879R3170O48L2828L48081M38316
$$ 36505872 36846768 36927977 37158803 37335453 37622332 37715502 37716150 37748978 38097059 38535375
4217C8535375M30720P64859N52009R63163J192465R57540J088323J340441J370391
$$ 38535375 38966095 39730954 40282963 41246126 42438591 43396131 44484454 45824895 47195286
4208D7195286J102258R18493R10346R14597R21772M37006J1370P8629j24754m14381
$$ 47195286 48297544 49216037 50126383 51040980 51962752 52399758 52411128 52489757 52365003 51950622
4198E1950622l23592p01533q03552o28944l01704j27284j04242J5686J22309J72592
$$ 51950622 51627030 50925497 50121945 49493001 49191297 49064013 48959771 48975457 49097766 49270358
4188D9270358K85935L27258K62137J37765L59274M35866O96176N70123M09505
$$ 49270358 49556293 49883551 50145688 50283453 50642727 51078593 51774769 52344892 52754397
4179E2754397Q26000P22918N63070M96682Q49136O73598N84690M63738N11713
$$ 52754397 53580397 54303315 54866385 55363067 56212203 56885801 57470491 57934229 58445942
4170E8445942N64462M58987N00142N75833O12982Q99200J076111Q19161J189395
$$ 58445942 59010404 59469391 59969533 60545366 61158348 62057548 63133659 63952820 65142215
4161F5142215J373787J331178J332765J721892J562182J482169J877680J679043
$$ 65142215 66516002 67847180 69179945 70901837 72464019 73946188 75823868 77502911
4153G7502911J699893K085671J924846K122883K239979K443595K405672K641336
$$ 77502911 79202804 81288475 83213321 85336204 87576183 90019778 92425450 95066786
4145I5066786K805380K871576K861190K933102L402500L654750M117467M685187
$$ 95066786 97872166 100743742 103604932 106538034 109940534 113595284 117712751 122397938
4137A22397938N357936O145401O974683P611412Q725057R942409J1075225J1608052
$$ 122397938 127755874 133901275 140875958 148487370 157212427 167154836 178230061 189838113
4129A89838113J1985180J1947327J0677734R297468P618549N716407M032443L146831
$$ 189838113 201823293 213770620 224448354 233745822 241364371 247080778 251113221 254260052
4121B54260052L504133M231994N728502P070312Q134331R402378J1582246J4011982
$$ 254260052 257764185 261996179 267724681 274794993 282929324 292331702 303913948 317925930
4113C17925930J6889268J9142640J9930865J8085299J4052851P721085j203368
$$ 317925930 334815198 353957838 373888703 391974002 406026853 413747938 412544570
4106D12544570j1727920k1212272k8512095l1615965l1166490k8008824k3560241
$$ 412544570 400816650 379604378 351092283 319476318 288309828 260301004 236740763
4099B36740763j9022612j4959992j2199089j0377389q593395p602020p055100
$$ 236740763 217718151 202758159 190559070 180181681 171588286 163986266 156931166
4092A56931166o085622n628255n212488m449996l753759l378204k699488k433402
$$ 156931166 150845544 145217289 140004801 135554805 131801046 128422842 125723354 123289952
4084A23289952j704145j524076r11535q68169o35080l76042k87963p4211K6803
$$ 123289952 121585807 120061731 119150196 118282027 117646947 117270905 116982942 116908731 116935534
4075A16935534J60394J02675N30396R78424Q54535P01553J230546J073993J028071
$$ 116935534 117095928 117198603 117728999 118707423 119561958 120263511 121494057 122568050 123596121
4066A23596121J082586J476342J107672J020272J136449Q66368J017602R94856
$$ 123596121 124678707 126155049 127262721 128282993 129419442 130285810 131303412 132298268
4058A32298268J027182Q99279N51332P14626M82209M90532K99453o230q6852m30065
$$ 132298268 133325450 134224729 134776061 135490687 135972896 136463428 136762881 136756651 136669799 136239734
4048A36239734n09673l84997o40177p64597q06966q79904n77952q38254q15758
$$ 136239734 135730061 135345064 134704887 133940290 133133324 132253420 131675468 130837214 130021456
4039A30021456p87704o56802q86170j120423j105908r68366j101324j258070j114217
$$ 130021456 129233752 128576950 127690780 126570357 125464449 124496083 123394759 122136689 121022472
4030A21022472j038274j480001j098791p24156o86699o76050l45123k91531k76658
$$ 121022472 119984198 118504197 117405406 116681250 115994551 115318501 114973378 114681847 114405189
4021A14405189j90388k05117L358J23955L51431O06278N93446N84326Q56117Q32253
$$ 114405189 114214801 114009684 114013042 114136997 114488428 115094706 115688152 116272478 117128595 117960848
4011A17960848Q66945J208345J131966J304096J422632J340492J409643J602340
$$ 117960848 118827793 120036138 121168104 122472200 123894832 125235324 126644967 128247307
4003A28247307J246085J417768J423615J226450J424074J314504J030417R35733
$$ 128247307 129493392 130911160 132334775 133561225 134985299 136299803 137330220 138265953
3995A38265953J185941J009298R63629Q74993O99054Q24316O52358L50268N32371
$$ 138265953 139451894 140461192 141424821 142299814 142998868 143823184 144475542 144825810 145358181
3986A45358181K00724j59650J19185l15399l61016o57500p88916o64006q47114
$$ 145358181 145558905 145399255 145518440 145203041 144842025 144184525 143395609 142731603 141884489
3977A41884489r56105r77715j268189j311699j292852j375003j546391j610466
$$ 141884489 140928384 139950669 138682480 137370781 136077929 134702926 133156535 131546069
3969A31546069j674361j962229j730150j819322j763801j715188j854804j909687
$$ 131546069 129871708 127909479 126179329 124360007 122596206 120881018 119026214 117116527
3961A17116527j584106j864253j632731j558286j637252j673797j451744j552125
$$ 117116527 115532421 113668168 112035437 110477151 108839899 107166102 105714358 104162233
3953A04162233j434579j316742j197091r53328j235280r40006p61235p00456p43375
$$ 104162233 102727654 101410912 100213821 99260493 98025213 97085207 96323972 95623516 94880141
3944I4880141q08660m74027m12856l38798j89847k86843k92223j70483J5169o9321
$$ 94880141 94071481 93597454 93184598 92845800 92655953 92369110 92076887 91906404 91921573 91852252
3934I1852252m01340j89004Q463j61500K652l8174Q8353J92826p5896j11568k28764
$$ 91852252 91450912 91261908 91270371 91108871 91111523 91073349 91161702 91354528 91278632 91167064 90938300
3923I0938300j45843j6844k42104m01374m50601n33520m38790n73543l54826k92480
$$ 90938300 90792457 90775613 90533509 90132135 89681534 89148014 88709224 88135681 87780855 87488375
3913H7488375n94885k10529K24138J498j34574J13705J38048M78433L03668M14721
$$ 87488375 86893490 86682961 86907099 86908597 86774023 86887728 87025776 87504209 87807877 88222598
3903H8222598P60508P36356Q85035J248746J310118J530872J862578J944338K031565
$$ 88222598 88983106 89719462 90604497 91853243 93163361 94694233 96556811 98501149 100532714
3894A00532714K147488K717236K944276L200021L357408L567371L751164L857057
$$ 100532714 102680202 105397438 108341714 111541735 114899143 118466514 122217678 126074735
3886A26074735M220764M183347M384285M395354M572583M741231M532925N296859
$$ 126074735 130295499 134478846 138863131 143258485 147831068 152572299 157105224 162402083
3878A62402083N059705M926727N101817M841998M944466M634515M247677L904515
$$ 162402083 167461788 172388515 177490332 182332330 187276796 191911311 196158988 200063503
3870B00063503L794503L160477K541853K284552J808587J683504J254721J083882
$$ 200063503 203858006 207018483 209560336 211844888 213653475 215336979 216591700 217675582
3862B17675582Q95918N58516l8120m69467q67597j322057j514369k311871k801682
$$ 217675582 218571500 219130016 219091896 218622429 217754832 216432775 214918406 212606535 209804853
3853B09804853k913876l320040l533399l817667l424050l447228l440826l268595
$$ 209804853 206890977 203570937 200037538 196219871 192795821 189348593 185907767 182639172
3845A82639172l473769l401996l229876l189749l023006l057769k976909k860334
$$ 182639172 179165403 175763407 172533531 169343782 166320776 163263007 160286098 157425764
3837A57425764k614971k612444k574184k245307k354612j594915j593133j433822
$$ 157425764 154810793 152198349 149624165 147378858 145024246 143429331 141836198 140402376
3829A40402376j061358p87360l45068j07596P7810M25463N55823P42795J002321
$$ 140402376 139341018 138553658 138208590 138100994 138178804 138604267 139160090 139902885 140905206
3820A40905206J015079M86232J77849K33191O6024k83576o04194n33616p04774
$$ 140905206 141920285 142406517 142584366 142817557 142883581 142600005 141995811 141462195 140757421
3811A40757421m49317p38792r22937j143051r14733j038499j117443j448040j780355
$$ 140757421 140308104 139569312 138646375 137503324 136588591 135550092 134432649 132984609 131204254
3802A31204254j787343k138069j828620k252080k166822k071271k023831k013605
$$ 131204254 129416911 127278842 125450222 123198142 121031320 118960049 116936218 114922613
3794A14922613j725665j708243j432290j319363j046496r02750r78780j026206
$$ 114922613 113196948 111488705 110056415 108737052 107690556 106787806 105809026 104782820
3786A04782820q06557p10063o98305n71602m73641n53960l76429m45004m40389
$$ 104782820 103976263 103266200 102567895 101996293 101522652 100968692 100592263 100147259 99706870
3777I9706870n43012m30585k77021o7153j60139l22598L3838j55339l51446l9991
$$ 99706870 99163858 98733273 98456252 98389099 98228960 97906362 97940200 97784861 97433415 97393424
3767I7393424j82825P6222q0726J66375j96515j93423J17226m4020J03737L3779
$$ 97393424 97210599 97286821 97206095 97372470 97175955 96982532 97099758 97055738 97159475 97193254
3757I7193254K04505P7371K40797L40762N43501L04416M87392L51813O66549M05285
$$ 97193254 97397759 97475130 97715927 98056689 98600190 98904606 99391998 99743811 100410360 100815645
3747A00815645P45704O79664P55149P86065O21032J029329J036809J076181J253576
$$ 100815645 101561349 102241013 102996162 103782227 104403259 105432588 106469397 107545578 108799154
3738A08799154J232182J221024Q99016J306776J467099J248384J191943J059759
$$ 108799154 110031336 111252360 112151376 113458152 114925251 116173635 117365578 118425337
3730A18425337J188785J003745J117043J122569J024390P85573P13650P34629
$$ 118425337 119614122 120617867 121734910 122857479 123881869 124667442 125381092 126115721
3722A26115721P39657O20683N80588K50774J06637J92048j4071q781m30962m81412
$$ 126115721 126855378 127476061 128056649 128307423 128414060 128606108 128592037 128583256 128152294 127670882
3712A27670882n77132q86862p61914r34040j255437j221931j161588j062182j247170
$$ 127670882 127093750 126206888 125444974 124510934 123255497 122033566 120871978 119809796 118562626
3703A18562626j105987j028571j089298j289196j221055j282264j223605j181459
$$ 118562626 117456639 116428068 115338770 114049574 112828519 111546255 110322650 109141191
3695A09141191j120992r84577p58050n15455l02201k45650k21988J04575K29313
$$ 109141191 108020199 107035622 106277572 105762117 105459916 105214266 104992278 105096853 105326166
3686A05326166O28974R72511R11770J015288J617320J560459J427095J762316
$$ 105326166 105955140 106927651 107839421 108854709 110472029 112032488 113459583 115221899
3678A15221899J725972J707521J769917J644789J592635J622769J480762J573024
$$ 115221899 116947871 118655392 120425309 122070098 123662733 125285502 126766264 128339288
3670A28339288J294934J068396J132789J095817J175346R43423Q21522P06328
$$ 128339288 129634222 130702618 131835407 132931224 134106570 135049993 135871515 136577843
3662A36577843N60235K16253Q8737M9510j02464m35546l68718n44960r47121n82661
$$ 136577843 137138078 137354331 137443068 137492578 137390114 136954568 136585850 136040890 135093769 134511108
3652A34511108l83096o55028o01579o92741n91773n04500j81147n44667k29306
$$ 134511108 134128012 133472984 132871405 132178664 131586891 131082391 130901244 130356577 130127271
3643A30127271O2181q0841m157L14372M19064O07898Q26753R86841J151250J431840
$$ 130127271 130189452 130108611 130104454 130418826 130837890 131445788 132272541 133259382 134410632 135842472
3633A35842472J950075J603447J930922K272607K397270K395447K614843K991267
$$ 135842472 137792547 139395994 141326916 143599523 145996793 148392240 151007083 153998350
3625A53998350K941565L245205L272083L517067L606736L818491M125396M434776
$$ 153998350 156939915 160185120 163457203 166974270 170581006 174399497 178524893 182959669
3617A82959669M968108N174959N635152N959753O323715O488287P063017P420585
$$ 182959669 187927777 193102736 198737888 204697641 211021356 217509643 224572660 231993245
3609B31993245P804215Q144579Q059045Q420263Q466097Q347514Q495667P927633
$$ 231993245 239797460 247942039 256001084 264421347 272887444 281234958 289730625 297658258
3601B97658258P653518P202454O737790O696346O291065N951484O223111O081885
$$ 297658258 305311776 312514230 319252020 325948366 332239431 338190915 344414026 350495911
3593C50495911N656196N466667M688763M077852L178965K028181J264080K10879
$$ 350495911 356152107 361618774 366307537 370385389 373564354 375592535 376856615 377067494
3585C77067494j001621j786010l030463l337347l674189l789478l862563l614632
$$ 377067494 376065873 374279863 371249400 367912053 364237864 360448386 356585823 352971191
3577C52971191l623376l741798l548648l914123l951329m264967m435554m556590
$$ 352971191 349347815 345606017 342057369 338143246 334191917 329926950 325491396 320934806
3569C20934806m774146n094171m925252n025937m461007m404497m051174l587440
$$ 320934806 316160660 311066489 306141237 301115300 296654293 292249796 288198622 284611182
3561B84611182l709640l254030l373894l284286l000427k653190k513448k738256
$$ 284611182 280901542 277647512 274273618 270989332 267988905 265335715 262822267 260084011
3553B60084011k809052k901304k604185k968303l180429k938741k994544k803383
$$ 260084011 257274959 254373655 251769470 248801167 245620738 242681997 239687453 236884070
3545B36884070k938993k939766l098494l142273l154111l201713l171717l219590
$$ 236884070 233945077 231005311 227906817 224764544 221610433 218408720 215237003 212017413
3537B12017413l332060l296971l091898k540610k270168k337670k303770k042563
$$ 212017413 208685353 205388382 202296484 199755874 197485706 195148036 192844266 190801703
3529A90801703j841678j962517j852500j796579j870673j308895j249058j509666
$$ 190801703 188960025 186997508 185145008 183348429 181477756 180168861 178919803 177410137
3521A77410137j316376j326235j117689j205132r98246j135255j267882j120054
$$ 177410137 176093761 174767526 173649837 172444705 171446459 170311204 169043322 167923268
3513A67923268j264180j669165j791655k102788k561139k601302k667627k814965
$$ 167923268 166659088 164989923 163198268 161095480 158534341 155933039 153265412 150450447
3505A50450447k574284k823719k833968k557242k331799k494992k442760k259761
$$ 150450447 147876163 145052444 142218476 139661234 137329435 134834443 132391683 130131922
3497A30131922k354533k442207k328030k429785k176841k093558j995398j707652
$$ 130131922 127777389 125335182 123007152 120577367 118400526 116306968 114311570 112603918
3489A12603918j713297j506935j595494j149252j287909j145205n99847n73733
$$ 112603918 110890621 109383686 107788192 106638940 105351031 104205826 103605979 103032246
3481A03032246p51747n47666n17752k69450l86009l71837k94381k55435l84709
$$ 103032246 102280499 101732833 101215081 100945631 100559622 100187785 99893404 99637969 99253260
3472I9253260m17423k17172n75915m87199n06039m67923n43962m55771m12315
$$ 99253260 98835837 98618665 98042750 97555551 97049512 96581589 96037627 95581856 95169541
3463I5169541n74885n98446m19473n07216q21372q44803r42504j211791j179061
$$ 95169541 94594656 93996210 93576737 93069521 92248149 91403346 90460842 89249051 88069990
3454H8069990j010799j141354j348449j129644j017096j114236r05803j217533
$$ 88069990 87059191 85917837 84569388 83439744 82422648 81308412 80402609 79185076
3446G9185076j133908j213163j026611j081317j230723j255933j167178j095747
$$ 79185076 78051168 76838005 75811394 74730077 73499354 72243421 71076243 69980496
3438F9980496j031313r55500r20616r20223r66912q94720q38767o03949p71723
$$ 69980496 68949183 67993683 67073067 66152844 65185932 64291212 63452445 62848496 62076773
3429F2076773n39199m94470p63771o60128l86215n07507o96345m51982m03818
$$ 62076773 61537574 61043104 60279333 59619205 59232990 58725483 58029138 57577156 57173338
3420E7173338l01977m72485l97087j75730l57983n03732l82363m60407k26135
$$ 57173338 56871361 56398876 56001789 55826059 55468076 54964344 54581981 54121574 53895439
3411E3895439j51706l79288m23911l82579k12389J14425O0821k54099L7468J19731
$$ 53895439 53743733 53364445 52940534 52557955 52345566 52459991 52520812 52266713 52304181 52423912
3401E2423912l8798j12368M0538O4656J34776p9508K3068l8609M9056J19921m2553
$$ 52423912 52385114 52272746 52313284 52377940 52512716 52433208 52456276 52417667 52466723 52586644 52544091
3390E2544091j21358k5783k9619j6373J28872j65576J15763n0650R4746K15375
$$ 52544091 52422733 52396950 52367331 52350958 52479830 52314254 52430017 52379367 52474113 52689488
3380E2689488L5909K00973J43551J45827J04577O0992K13390M28114L98238K25255
$$ 52689488 52725397 52926370 53069921 53215748 53320325 53381317 53594707 54022821 54421059 54646314
3370E4646314L20070N29321J80393K10119N95132L32273L64511L32767P2650j16542
$$ 54646314 54966384 55495705 55676098 55886217 56481349 56813622 57178133 57510900 57583550 57467008
3360E7467008J80583L53114J79275k780K24757K11032N7281K37418J71209L27111
$$ 57467008 57647591 58000705 58179980 58177200 58401957 58612989 58670270 58907688 59078897 59406008
3350E9406008K68479L62298K12737M34010O02225M51950M08314L77893N58975
$$ 59406008 59674487 60036785 60249522 60683532 61285757 61737707 62146021 62523914 63082889
3341F3082889Q01521O85864O14348Q57583J114120Q78127J135391J349547J624039
$$ 63082889 63884410 64570274 65184622 66042205 67156325 68034452 69169843 70519390 72143429
3332G2143429J469996J483548J548407J864342J921114J888391K124109K238678
$$ 72143429 73613425 75096973 76645380 78509722 80430836 82319227 84443336 86682014
3324H6682014K278290J679261J697670J263839Q17308K91112k19287l98766k13615
$$ 86682014 88960304 90639565 92337235 93601074 94418382 94709494 94490207 94091441 93877826
3315I3877826j30053R3682N38111P26573O83994P29403N97523M60330O55364O99283
$$ 93877826 93747773 93841455 94379566 95106139 95790133 96519536 97117059 97577389 98232753 98932036
3305I8932036Q52289P71941R39823J347780J747168J825460K126634K475314K898532
$$ 98932036 99784325 100556266 101496089 102843869 104591037 106416497 108543131 111018445 113916977
3296A13916977L125233L574101L840551M272805M115644L940408L605392K730980
$$ 113916977 117042210 120616311 124456862 128729667 132845311 136785719 140391111 143122091
3288A43122091K168386Q17386j80363q37229q68842m48592j0546M46190J085343
$$ 143122091 145290477 146107863 145927500 145090271 144221429 143772837 143762291 144208481 145293824
3279A45293824J066045J092496J119836J309420J084361J458704J943166K334861
$$ 145293824 146359869 147452365 148572201 149881621 150965982 152424686 154367852 156702713
3271A56702713K764777L333290L912801M346948M652145M857503M684877M661481
$$ 156702713 159467490 162800780 166713581 171060529 175712674 180570177 185255054 189916535
3263A89916535M448112L814309L150523K307874J306735K17625o26147j616924
$$ 189916535 194364647 198178956 201329479 203637353 204944088 205161713 204535566 202918642
3255B02918642j957790k244559k232149j665146n61765K03864J113969J788689
$$ 202918642 200960852 198716293 196484144 194818998 194257233 194461097 195575066 197363755
3247A97363755K472060K879546L582426M111845M338572M914375N639410O399253
$$ 197363755 199835815 202715361 206297787 210409632 214748204 219662579 225301989 231701242
3239B31701242P094897P710279Q147199Q890850R106676R137963R321021Q871471
$$ 231701242 238796139 246506418 254653617 263544467 272651143 281789106 291110127 299981598
3231B99981598Q059462O865668N355298L578336J866158M82653n43769n62173
$$ 299981598 308041060 314906728 320262026 323840362 325706520 326189173 325645404 325083231
3223C25083231J80553J971738L562541N653974P521414Q455911R533783J0191422
$$ 325083231 325263784 327235522 330798063 336452037 343973451 352429362 361963145 372154567
3215C72154567R891521R030090P649679N566897K814020j8537l056765n589816
$$ 372154567 382046088 391076178 398725857 404292754 407106774 407088237 404031472 398441656
3207C98441656p685004r228372r272225q928621q372210p427692o740781o020051
$$ 398441656 390756652 381528280 372256055 363327434 354955224 347527532 340786751 334766700
3199C34766700n598883n449344n589370o196918p085182p974661r149657r957642
$$ 334766700 329167817 323718473 318129103 311932185 304847003 296872342 287722685 277765043
3191B77765043j0346419j0099053r623012r055196q555359p812812o969726o659576
$$ 277765043 267418624 257319571 247696559 238641363 230086004 222273192 215303466 208643890
3183B08643890o093072n837759n609673n154723m948918m720092m375420m025017
$$ 208643890 202550818 196713059 191103386 185948663 180999745 176279653 171904233 167879216
3175A67879216l621162l162107k772499k394054j936318j612954j193951p46185
$$ 167879216 164258054 161095947 158323448 155929394 153993076 152380122 151186171 150439986
3167A50439986j49950K20258M27294M03074R5222k73947n58821j460765k530568
$$ 150439986 150290036 150510294 150937588 151340662 151435884 151161937 150603116 149142351 146611783
3158A46611783l025340l174827l277363l067132k354150j607652j050724o63462
$$ 146611783 143586443 140411616 137134253 134067121 131712971 130105319 129054595 128391133
3150A28391133r04517j312708j789218k071128k764637l422327l651599l259303
$$ 128391133 127486616 126173908 124384690 122313562 119548925 116126598 112474999 109215696
3142A09215696l162669k324634j636165j232118o72439m06760j21449K30412N59668
$$ 109215696 106053027 103728393 102092228 100860110 100187671 99780911 99659462 99889874 100449542
3133A00449542R31893R17837R70516N17015O39846L56467L32771J53591L000N0072
$$ 100449542 101381435 102299272 103269788 103786803 104426649 104783116 105115887 105269478 105272478 105322550
3123A05322550O2959Q00940J179191J353122J553663J524416J267813P88984n60565
$$ 105322550 105385509 106186449 107365640 108718762 110272425 111796841 113064654 113853638 113293073
3114A13293073k135274l593283m673319n107817m759118m213910l184573k388512
$$ 113293073 111157799 107564516 102891197 97783380 93024262 88810352 85625779 83237267
3106H3237267j618917j235035j013772o31614m83859m51849r4219j84879K79558
$$ 83237267 81618350 80383315 79369543 78737929 78254070 77802221 77708002 77523123 77802681
3097G7802681L68646L59480K48257K80859L67559L36263M51334O96398P34707
$$ 77802681 78171327 78530807 78779064 79059923 79427482 79763745 80215079 80911477 81646184
3088H1646184Q55766R01557Q49393O66016M89513k9969n71517j559374j815334
$$ 81646184 82501950 83403507 84252900 84918916 85408429 85378460 84806943 83247569 81432235
3079H1432235k216383k309558k027572j435238j103881o88322k09410j29087k0446
$$ 81432235 79215852 76906294 74878722 73443484 72339603 71651281 71441871 71312784 71292338
3070G1292338K18361L15524K44634N12470M70403P60155M04791L9855M2689j32749
$$ 71292338 71510699 71826223 72070857 72583327 73053730 73813885 74218676 74258531 74301220 74168471
3060G4168471l20040p7858J47990J24002J38224J85475R0021k45420n92321n53803
$$ 74168471 73848431 73770573 73918563 74042565 74180789 74366264 74456285 74210865 73618544 73064741
3050G3064741q39804l82781j41267k18196J6200K05653J69649L10844L13212L52491
$$ 73064741 72224937 71842156 71700889 71482693 71498893 71704546 71874195 72185039 72498251 72850742
3040G2850742N59404M63660N63796Q85942Q97843P96029R98641J104641J186313
$$ 72850742 73410146 73873806 74437602 75323544 76221387 77017416 78016057 79120698 80307011
3031H0307011J219648J223723J550564J545677J869253J894592K348553K740376
$$ 80307011 81526659 82750382 84300946 85846623 87715876 89610468 91959021 94699397
3023I4699397L307191L568448L932537M427756M783156N203149N251049N504497
$$ 94699397 98006588 101575036 105507573 109935329 114718485 119921634 125172683 130677180
3015A30677180N543661N246455M331230L138337J495490j17098k063829l711033
$$ 130677180 136220841 141467296 145798526 148936863 150432353 150315255 148251426 144540393
3007A44540393m623174m807586m894543m609850m016434l176840k278510j528022
$$ 144540393 139917219 135109633 130215090 125605240 121588806 118411966 116133456 114605434
2999A14605434q97033p65591K27233J045419J118799J908931K694328L755369
$$ 114605434 113708401 112942810 113170043 114215462 115334261 117243192 119937520 123692889
2991A23692889M541494N171089O204139P558745Q525884R551777J0590166J1222778
$$ 123692889 128234383 133405472 139609611 147168356 155694240 165246017 175836183 187058961
2983A87058961J1452037J0986931R329853P116664L790088o11615m844903r019880
$$ 187058961 198510998 209497929 218827782 225944446 229734534 229122919 224278016 215258136
2975B15258136j1982580j3461494j3639837j2601619j0958457r370122p561382
$$ 215258136 203275556 189814062 176174225 163572606 152614149 143244027 135682645
2968A35682645o383004n065313m275879l179293k573210k100383j145425j008712
$$ 135682645 129299641 124234328 119958449 116779156 114205946 112105563 110960138 109951426
2960A09951426n72677K96175P46060J156372J778631K100721K655818L319646
$$ 109951426 109378749 109674924 110420984 111577356 113355987 115456708 118112526 121432172
2952A21432172L366462L678531L667188L056657K318132J354454j30803j763414
$$ 121432172 124798634 128477165 132144353 135201010 137519142 138873596 138742793 136979379
2944A36979379l410284m693921n605266o000489n754433n629251n256275m475106
$$ 136979379 133569095 128875174 123269908 117269419 111514986 105885735 100629460 96154354
2936I6154354l820196l268847l069380k627486k032292k074299j842496j289890
$$ 96154354 92334158 89065311 85995931 83368445 81336153 79261854 77419358 76129468
2928G6129468j289542r87051o76760j120405o61229p03934o42523l66042j67007
$$ 76129468 74839926 73852875 73176115 72055710 71394481 70690547 70048024 69681982 69514975
2919F9514975j49842k1660l7552J6648K53613J10545M48511O08690O65147Q13524
$$ 69514975 69365133 69343473 69305921 69322569 69576182 69686727 70135238 70743928 71409075 72222599
2909G2222599M11425P60828J084518J040095P39602R22320J009916J055851J226020
$$ 72222599 72634024 73394852 74479370 75519465 76259067 77181387 78191303 79247154 80473174
2900H0473174J054605R83645J025852R18197P57003P55699N24645M72063K37014
$$ 80473174 81527779 82511424 83537276 84455473 85212476 85968175 86492820 86964883 87201897
2891H7201897J59419J35433J85620K97667N05832N87680M53942R73442J370466
$$ 87201897 87361316 87496749 87682369 87980036 88485868 89073548 89527490 90500932 91871398
2882I1871398J306097J367777J741850K287651K511381K484963K433555K798237
$$ 91871398 93177495 94545272 96287122 98574773 101086154 103571117 106004672 108802909
2874A08802909K983021K749380K731970K320489J827924J031413L1755q55345
$$ 108802909 111785930 114535310 117267280 119587769 121415693 122447106 122478861 121623516
2866A21623516j865447k562321l016941k827813k749049k328641j741622j528701
$$ 121623516 119758069 117195748 114178807 111350994 108601945 106273304 104531682 103002981
2858A03002981r39070n14332j64232R6204L14535L66583L63089O62226O06085
$$ 103002981 102063911 101549579 101385347 101481551 101796086 102162669 102525758 103187984 103794069
2849A03794069N07052M36693L41971J53489M75166K33086j40255p06903o08248
$$ 103794069 104301121 104737814 105079785 105233274 105708440 105941526 105801271 105094368 104486120
2840A04486120j159394j564583j966077k474880k351526k210659k368485k545421
$$ 104486120 103326726 101762143 99796066 97321186 94969660 92759001 90390516 87845095
2832H7845095k253964k161167j649017j496514j107702j061374j201291r65287
$$ 87845095 85591131 83429964 81780947 80284433 79176731 78115357 76914066 75948779
2824G5948779o60696j261984j139608j480997j216988j287389j691457j598550
$$ 75948779 75288083 74026099 72886491 71405494 70188506 68901117 67209660 65611110
2816F5611110j448205j646747j638784j776570j584866j569675j423206j356531
$$ 65611110 64162905 62516158 60877374 59100804 57515938 55946263 54523057 53166526
2808E3166526j505046j123678j144821j010488j230524j163214j119174r19609
$$ 53166526 51661480 50537802 49392981 48382493 47151969 45988755 44869581 43949972
2800D3949972q94215o06975r73732p21569o11087n72059q46337r94063p69255
$$ 43949972 43055757 42448782 41475050 40753481 40142394 39570335 38723998 37729935 36960680
2791C6960680q18244p75084o93582o06704o40881o64481m50549o72946n42220
$$ 36960680 36142436 35367352 34673770 34067066 33426185 32761704 32311155 31638209 31095989
2782C1095989m53560m66903n19373o78337m42837m49966l23460m78002n11523
$$ 31095989 30642429 30175526 29656153 28977816 28534979 28085013 27761553 27283551 26772028
2773B6772028n79005n50205l15037n04471n77085m24150m96504k65562k49625
$$ 26772028 26193023 25642818 25327781 24823310 24246225 23822075 23325571 23060009 22810384
2764B2810384n04958k67084l76160k06671m07656m35145j62937j57501j87684
$$ 22810384 22305426 22038342 21662182 21455511 21047855 20612710 20449773 20292272 20104588
2755B0104588m85251n84071l31657m6919j45694k65623m60153l14532k36424j38879
$$ 20104588 19619337 19035266 18703609 18656690 18510996 18245373 17785220 17470688 17234264 17095385
2745A7095385l18698m86705m85978j50405j78400k26282j64225l36074l33517
$$ 17095385 16776687 16289982 15804004 15653599 15475199 15248917 15084692 14748618 14415101
2736A4415101n7223p2953j39481k68703k86461j05076k49162k40682K1621k19160
$$ 14415101 14357878 14284925 14145444 13876741 13590280 13485204 13236042 12995360 13016981 12797821
2726A2797821j23013q5442k06999j74661j06571k66653k40135l4165k44317j68712
$$ 12797821 12674808 12589366 12382367 12207706 12101135 11834482 11594347 11560182 11315865 11147153
2716A1147153k36148j32494j79449l17174k04936j23599J8621n3686k91801p9109
$$ 11147153 10911005 10778511 10599062 10281888 10076952 9953353 9971974 9918288 9626487 9547378
2706I547378k57563j34954o4112p723j07487j90443j82150p2578j35467j3045
$$ 9547378 9289815 9154861 9090749 9083026 8975539 8785096 8602946 8530368 8394901 8381856
2696H381856J17494l50123Q0597r891p192J47038l55194L9523j99824k67763J36910
$$ 8381856 8499350 8149227 8229824 8219933 8212741 8359779 8004585 8044108 7844284 7576521 7713431
2685G713431k9283k53576k84537k81963J15649k01059k24530P0039r690K8939
$$ 7713431 7684148 7430572 7146035 6864072 6979721 6778662 6554132 6624171 6614481 6643420
2675F643420l80205j75947M233m5137k68718Q7978o4915m0224P1228J49817j09362
$$ 6643420 6263215 6087268 6091501 6046364 5777646 5865624 5800709 5760485 5831713 5981530 5872168
2664E872168K7573K6503j78379R9029k09275k87775l3687R7084n3299q5271j5610
$$ 5872168 5899741 5926244 5747865 5846894 5637619 5349844 5316157 5413241 5359942 5274671 5259061
2653E259061l5104j41945k7072n4526j28048p4693l2533j06972k86997j78536
$$ 5259061 5223957 5082012 5054940 5000414 4872366 4797673 4765140 4658168 4371171 4192635
2643D192635r2455K94863K67197j19343j22281o439j1684k46786r5634K39464
$$ 4192635 4100180 4395043 4662240 4542897 4420616 4414177 4402493 4155707 4060073 4299537
2633D299537M9224j28398m3360k151j80045j18125L9632K7678m7341l9938M3483
$$ 4299537 4348761 4220363 4177003 4174852 3994807 3876682 3916314 3943992 3896651 3856713 3900196
2622C900196r3002l8985m9100k353J6179p7071O4963p4368k45834J41640k3957
$$ 3900196 3807194 3768209 3719109 3716756 3732935 3655864 3720827 3646459 3400625 3542265 3518308
2611C518308r7136L5794k12601k79861J61834K59326j64980M5344O1064J92216
$$ 3518308 3421172 3456966 3244365 2964504 3126338 3385664 3220684 3266028 3327092 3519308
2601C519308k07873n2873k7397q3164K9708J6668M2710n1951o5979K40156J80514
$$ 3519308 3311435 3258562 3231165 3148001 3177709 3194377 3237087 3185136 3119157 3359313 3539827
2590C539827j67483K73157j88251j16341P1645l1847J17000j37481j95245p8170
$$ 3539827 3372344 3645501 3457250 3340909 3412554 3380707 3497707 3360226 3164981 3086811
2580C086811n6974J09520m4096q9599j91351L6589k23703Q1016J78377J18667
$$ 3086811 3029837 3139357 3095261 3005662 2814311 2850900 2627197 2708213 2886590 3005257
2570C005257m630Oj37949j15796J04752J08093p9281J5989o262j4362k2135R0511
$$ 3005257 3000627 3000633 2862684 2746888 2851640 2959733 2880452 2896441 2890179 2875817 2853682 2944193
2558B944193n1513j94573R624N6610k6880M4814j10782p7349K1102j43687q2888
$$ 2944193 2892680 2698107 2707731 2764341 2737461 2782275 2671493 2594144 2615246 2471559 2388671
2547B388671j94829J05662l01200k8862L37034N1525n9229K7058p5558k21758
$$ 2388671 2193842 2299504 1998304 1969442 2306476 2358001 2298772 2325830 2250272 2028514
2537B028514P8055j37864J6633P113o5328J47245j05926m0311j22174r7263O6682
$$ 2028514 2106569 1968705 1985338 1992451 1927123 2074368 1968442 1928131 1805957 1708694 1775376
2526A775376O7140j23310J9312J55605j2648k75088L3312j7271L8164n8613N6947
$$ 1775376 1842516 1719206 1738518 1894123 1881475 1606387 1639699 1622428 1660592 1601979 1658926
2515A658926n7473Q2237m9642j55778j8113k85739j17300M9249R6634j0820M6793
$$ 1658926 1601453 1683690 1634048 1478270 1460157 1174418 1057118 1106367 1203001 1192181 1238974
2504A238974O4614n5985m5600j4887j12621k8141L3609J07448M8829j48602j33383
$$ 1238974 1303588 1247603 1202003 1187116 1074495 1046354 1079963 1187411 1236240 1087638 954255
2493I54255K9789J00734K7603K22848j90238k44530j12920M0953m6707q7420P1501
$$ 954255 984044 1084778 1112381 1335229 1144991 900461 787541 828494 781787 694367 765868
2482G65868K00652K00764j20884j91044m3591q043N4960j0651K3443j56800p8971
$$ 765868 966520 1167284 1046400 855356 811765 803722 858682 848031 871474 714674 635703
2471F35703L12466k5955k761j5704k50451K11336n2512j04904J1577j3122J55910
$$ 635703 948169 922214 919453 903749 653298 864634 812122 707218 718795 705673 861583
2460H61583P3426r1760k29139N3202M4116j48546r7526j83520N9769K42036j1666
$$ 861583 935009 843249 614110 667312 711428 562882 465356 281836 341605 583641 571975
2449E71975j40937q4696o3936l2842K69641L391j84460J0859L8532J52961k3183
$$ 571975 431038 346342 282406 249564 519205 522596 338136 348995 387527 540488 517305
2438E17305j12600R8564j0373J44656o6768k71600l7362J04678N4345l9046k55289
$$ 517305 404705 503269 492896 637552 570784 299184 261822 366500 420845 381799 126510
2427A26510Q8388l2944J64395k2715l6693p5648O9027J4022J3297r6002K89385
$$ 126510 214898 181954 346349 323634 286941 211293 280320 294342 307639 211637 501022
2416E01022p9944q0410J60420p1466J23019j11740k57274p5344J08131j42088
$$ 501022 421078 340668 501088 429622 552641 440901 183627 108283 216414 74326
2406G4326k4813Q2791K07292l5446K4430M7963j95393J14690k01198j50540L34272
$$ 74326 49513 132304 339596 304150 328580 376543 181150 295840 94642 -55898 278374
2395B78374P1854L6052j46450j74627L1291J72907N6644o4059p518L894r1406
$$ 278374 350228 386280 239830 65203 96494 269401 326045 261986 254468 258362 166956
2384A66956N1422M3730j60157j41682O7942J72242Q5945j33674J04689R3131Q6949
$$ 166956 218378 262108 101951 -39731 28211 200453 286398 152724 257413 350544 437493
2373D37493j74921q902q7011o4424O1632m143K27866j72981K9409k3166k83573
$$ 437493 262572 253670 166659 102235 163867 159724 387590 214609 244018 220852 -62721
2362f2721O4707k6819O7247l2816N8234l5208r571J18836m125O790P4281j96009
$$ -62721 1986 -24833 42414 9598 67832 32624 23053 141889 137764 144554 218835 22826
2350B2826J09986J18974n6536k63982o1452J87214J17599R3111K5648j4217j78532
$$ 22826 132812 251786 195250 -68732 -130184 57030 174629 267740 293388 279171 100639
2339A00639J41767J45445m7307k34218N6672j05217j05570P4187j1120r1001Q5227
$$ 100639 242406 387851 340544 106326 162998 57781 -47789 26398 15278 -75723 9504
2328I504R5391l8238P4459J09903l69646M2139R1355L0788j13331J05123J00939
$$ 9504 104895 66657 141116 251019 -118627 -76488 14867 45655 -67676 37447 138386
2317A38386j0186k35752o0254O4843L8323J20796L4081O232J6899M0673k09646
$$ 138386 128200 -107552 -167806 -102963 -64640 56156 90237 96469 113368 154041 -55605
2306e5605k9880K62133l7527j21078j47971K4282M531P6331j71142n441J64785
$$ -55605 -85485 176648 139121 18043 -129928 -105646 -101115 -24784 -195926 -201367 -36582
2295c6582j13952q684q7184R4297j63543K03737Q8829j6500j68591J43823j06016
$$ -36582 -150534 -159218 -246402 -152105 -315648 -111911 -23082 -39582 -208173 -64350 -170366
2284a70366K6433l90914j5852L12476J77139J03351j84183N509J08704J01739
$$ -170366 -143933 -534847 -550699 -238223 -61084 42267 -141916 -136407 -27703 74036
2274G4036l9514j18109j40806K46288o5971j0103R1309l20003K71333o2957n3288
$$ 74036 34522 -83587 -224393 21895 -44076 -54179 37130 -282873 -11540 -74497 -127785
2263a27785q3537n4939N2662P1479J73428J96688j7242J58316j69829o4971j39432
$$ -127785 -211322 -266261 -213599 -142120 31308 227996 210754 369070 199241 134270 -5162
2252e162j11291K13535P6590k89134j9626J68158l16634K10118J65702J3537l55273
$$ -5162 -116453 97082 173672 -115462 -135088 33070 -283564 -73446 92256 105793 -249480
2241b49480J32939O517J02617J40372k18667j04938l2787P3959P6316K33756K53758
$$ -249480 -116541 -110024 -7407 132965 -85702 -190640 -223427 -149468 -73152 160604 414362
2230D14362j58893j29481q8510r7373k3208L7667K01761J68069k04304P7527r3547
$$ 414362 255469 125988 37478 -59895 -83103 -45436 156325 324394 120090 197617 104070
2219A04070j47892R382K48009j32542J11751P0119P4746n8526k15074o1013O2648
$$ 104070 -43822 -34440 213569 81027 192778 262897 337643 279117 64043 3030 65678
2208F5678K05024P0032L378J9649N5735j30670r9847O7137k51087k7769K19685
$$ 65678 270702 340734 344112 363761 419496 288826 188979 256116 5029 -22740 196945
2197A96945m2208O7902O4280j29770J34434J28780j52641n9341J16240M7670N5941
$$ 196945 154737 222639 286919 157149 291583 420363 267722 208381 324621 372291 428232
2186D28232J02974n8731j048O4388M5352k0186K6324j66446O7822K84008L989
$$ 428232 531206 472475 471427 535815 581167 560981 587305 420859 488681 772689 776678
2175G76678j80498k61486R3452P0798m1767J18618j38461J17069J07272K11658
$$ 776678 596180 334694 428146 498944 457177 575795 437334 554403 661675 873333
2165H73333n6695L4659l823L7262O8355M63K1415j3851P6766m6320J21700M4150
$$ 873333 816638 851297 847474 884736 953091 953554 974969 961118 1037884 991564 1113264 1157414
2153A157414J54815r5908J90909J62186q3838m685j49341o6021K8352J65087r7087
$$ 1157414 1312229 1216321 1407230 1569416 1485578 1480893 1331552 1265531 1293883 1458970 1361883
2142A361883K8333K3555l6724m4987R5877p8774M3369J06062M8362n7265L7082
$$ 1361883 1390216 1413771 1377047 1332060 1427937 1349163 1392532 1498594 1546956 1489691 1526773
2131A526773J35243L2607O2863J44600n373O3049L3197P8382J26657P0051j2529
$$ 1526773 1662016 1694623 1757486 1902086 1896713 1959762 1992959 2071341 2197998 2268049 2255520
2120B255520Q3781K34972n5044J38962R7834O3954O0960R9654M72167J26010K56505
$$ 2255520 2339301 2574273 2519229 2658191 2756025 2819979 2880939 2980593 3452760 3578770 3835275
2109C835275J65715K8112K35442K02421K18330j5472R386R4607L67329J46570
$$ 3835275 4000990 4029102 4264544 4466965 4685295 4669823 4679209 4773816 5141145 5287715
2099E287715L12578j4394J18491L22278J80413M06544K48231K64546L96600P34824
$$ 5287715 5600293 5585899 5704390 6026668 6207081 6613625 6861856 7126402 7523002 8257826
2089H257826M44124O68665O41955M98628P81130R62308J251276J133988J330022
$$ 8257826 8701950 9370615 10012570 10511198 11292328 12254636 13505912 14639900 15969922
2080A5969922K086986K485318K743398L320322M233779N238485N698339N540714
$$ 15969922 18056908 20542226 23285624 26605946 30839725 36078210 41776549 47317263
2072D7317263M853298M039733J039015l341141o177899p850001q032932o548571
$$ 47317263 52170561 56210294 57249309 53908168 47730269 39880268 31847336 25298765
2064B5298765m530027l089140k264003j490646j111194r64268q74979o04466n69146
$$ 25298765 20768738 17679598 15415595 13924949 12813755 11849487 10974508 10370042 9800896
2055I800896m78497o05497o77356p76809n70124l81137m45580n03629m74511k84344
$$ 9800896 9322399 8716902 8039546 7262737 6692613 6311476 5865896 5362267 4887756 4603412
2045D603412k48028k14924j39073k31223m50533k54614k35956k7298j28159j27797
$$ 4603412 4355384 4140460 4001387 3770164 3319631 3065017 2829061 2801763 2673604 2545807
2035B545807J1537k3025p4944k08251r8751r8388j5775m6546j77135M7636J83237
$$ 2545807 2557344 2534319 2459375 2251124 2152373 2053985 2038210 1991664 1814529 1862165 2045402
2024B045402O1149n6693n23770m8753J6799q8854J27163J21500k56003l23684
$$ 2045402 2106551 2049858 1526088 1477335 1494134 1405280 1532443 1653943 1397940 1074256
2014A074256l4249J55976j2140j22189o1008j20558j54463k3871K27724r8280
$$ 1074256 1040007 1195983 1183843 1061654 1000646 880088 725625 701754 929478 831198
2004H31198j35602k32859k76359K14804K31187q8983K2302m3094o0586k8477n791
$$ 831198 695596 462737 186378 401182 632369 543386 565688 522594 462008 433531 427740
1993D27740j00274K6348k9498k59176O5216L5253M712J14034j17514J15497r8974
$$ 427740 327466 353814 324316 65140 130356 165609 170321 284355 166841 282338 183364
1982A83364k2702J0882J04061l0765L3840j20472j40828q3981K79935j0485l22886
$$ 183364 160662 171544 275605 244840 278680 158208 17380 -66601 213334 202849 -120037
1971a20037J51673q2543J07239J36740J38222r9102J34926k16411n9218M088j44477
$$ -120037 31636 -50907 56332 193072 331294 232192 367118 150707 91489 95577 -48900
1960d8900j8195K5216K0546J48274P5639J9231j41262j60254J92673r7374R3661
$$ -48900 -67095 -41879 -21333 126941 202580 221811 80549 -79705 112968 15594 109255
1949A09255l8957q0527k02477J26020L1990j6322k9211J0266p9114q2776J32040
$$ 109255 70298 -10229 -212706 -86686 -54696 -71018 -100229 -89963 -169077 -251853 -119813
1938a19813M7543P7902j05973j02967K7443J45498j23943P8753J27225R1505k7966
$$ -119813 -72270 5632 -100341 -203308 -175865 -30367 -154310 -75557 51668 143173 115207
1927A15207o5830O7606r4386k4595q6946l2599J58795K3621j14950j98061j23317
$$ 115207 49377 116983 22597 -1998 -88944 -121543 37252 60873 -54077 -252138 -375455
1916c75455J22718M4227j99444j80815K88432J02832j03695J63710r0386j37001
$$ -375455 -252737 -208510 -407954 -588769 -300337 -197505 -301200 -137490 -227876 -364877
1906c64877N9197N1663J7445j11020J41725J96175k7738j01149j3102J1354O8446
$$ -364877 -305680 -254017 -236572 -347592 -205867 -9692 -37430 -138579 -151681 -140327 -71881
1895g1881Q6890o1411j06563n9503L8993r7004j29510K3034J73448j52483j90908
$$ -71881 15009 -46402 -152965 -212468 -173475 -270479 -399989 -376955 -203507 -355990 -546898
1884e46898J6904J20715O9994L9307j40798R1358R3999j81496K83028j5032L1177
$$ -546898 -529994 -409279 -339285 -299978 -440776 -349418 -255419 -436915 -153887 -168919 -137742
1873a37742M4689k9931J34693k34498K63227j7295j92219l06299K42158J08028
$$ -137742 -93053 -122984 11709 -222789 40438 23143 -169076 -475375 -233217 -125189
1863a25189j20433r8203K17090K15149l04884j32631J89019J62174k14061n0954
$$ -125189 -245622 -343825 -126735 88414 -216470 -349101 -160082 2092 -211969 -262923
1853b62923l5311J54548j28355J62833J09288k72306n7395J49301K14779j05230
$$ -262923 -298234 -143686 -272041 -109208 80 -272226 -329621 -180320 34459 -70771
1843g0771k18232J05748k17610J54979k3921J06226j03700j26237J01752j06082
$$ -70771 -289003 -183255 -400865 -245886 -269807 -163581 -267281 -393518 -291766 -397848
1833c97848J85456R2842j28214k6776j35602j75597K73872K0232l3063R1963J27151
$$ -397848 -212392 -119550 -247764 -274540 -410142 -585739 -311867 -291635 -324698 -232735 -105584
1822a05584J7890j5365n5899P6125r7549O6751j36735J03914O2061j17730J01863
$$ -105584 -87694 -103059 -158958 -82833 -180382 -113631 -250366 -146452 -84391 -202121 -100258
1811a00258L5967j36243J20281o3604j64041J41917J95053q4649P7019j27855
$$ -100258 -64291 -200534 -80253 -143857 -307898 -165981 29072 -55577 21442 -106413
1801a06413j14505K36718L5856k10896j03911n610R7243J69798r2547j9395j87104
$$ -106413 -220918 15800 51656 -159240 -263151 -268761 -171518 -1720 -94267 -113662 -300766
1790c00766p3515j60284K55098N1399Q403j07955m0532K03593J29476j17802r2180
$$ -300766 -374281 -534565 -279467 -228068 -219665 -327620 -368152 -164559 -35083 -152885 -245065
1779b45065O225j14410J24037J11539j02417J22996j12298l7231q3624K3561k7181
$$ -245065 -238840 -353250 -229213 -117674 -220091 -97095 -209393 -246624 -330248 -306687 -333868
1768c33868O934p8534n1213P6710Q816Q1884O9053j75982n3911l5694O2906J80456
$$ -333868 -326934 -405468 -456681 -379971 -371155 -289271 -220218 -396200 -450111 -485805 -422899 -242443
1756b42443K029l1445J48371J9627r6908J2114r3022R9210n7696O2035J58116
$$ -242443 -240414 -271859 -123488 -103861 -200769 -188655 -281677 -182467 -240163 -178128 -20012
1745b0012j76592q5156J81253m8470j48919j42393J98301K2507l2854K1630o9812
$$ -20012 -196604 -281760 -100507 -148977 -297896 -440289 -241988 -219481 -252335 -230705 -300517
1734c00517P4222j98017P9397Q8618k16919j1962J93697J22684J80804n1998M0922
$$ -300517 -226295 -424312 -344915 -256297 -473216 -485178 -291481 -168797 12007 -39991 931
1723I31o6851r3770n4281J1324Q7474j26726R9393j52950N1353J60407r0314q736
$$ 931 -65920 -159690 -213971 -202647 -115173 -241899 -142506 -295456 -244103 -83696 -174010 -182746
1711a82746j67212Q309n632O6111K16249j55189P3826Q2522q9086Q727j09701
$$ -182746 -349958 -341649 -347281 -281170 -64921 -220110 -146284 -63762 -152848 -144121 -253822
1700b53822k3808Q1821J9617J16780N7639j55418k05178J65084l8635K61030j11288
$$ -253822 -277630 -195809 -176192 -59412 -1773 -157191 -362369 -197285 -235920 25110 -86178
1689h6178j34012J49P963l5996K07584R7013J06052l09809k11082K02063L2742
$$ -86178 -220190 -220041 -212078 -248074 -40490 56523 162575 -147234 -358316 -156253 -123511
1678a23511k6743K01206j28942j78998R5000J66945M2765l9979j21485k5825M9235
$$ -123511 -150254 50952 -77990 -256988 -161988 4957 47722 7743 -113742 -139567 -90332
1667i0332J49244J15996k23129j33197m9059K47153j14544j09047P3964j21579
$$ -90332 58912 174908 -48221 -181418 -230477 16676 -97868 -206915 -132951 -254530
1657b54530j28063k37128K56938K81246p0113r6267n0153K0606j36206n2779K0438
$$ -254530 -382593 -619721 -362783 -81537 -151650 -247917 -298070 -277464 -413670 -466449 -446011
1646d46011J48490n12J17690j13040J14314p0431m8416m8072k4072J81858L0106
$$ -446011 -297521 -298033 -180343 -293383 -179069 -249500 -297916 -345988 -370060 -188202 -158096
1635a58096m0401m9603J01788J4736m2295j26080J38542J79346k0906M5917j33038
$$ -158096 -198497 -248100 -146312 -131576 -173871 -299951 -161409 17937 -2969 42948 -90090
1624i0090j77252L298j50956j33617J07657J14205Q6338k26770L7001K09176L2402
$$ -90090 -267342 -264044 -415000 -548617 -440960 -326755 -240417 -467187 -430186 -221010 -188608
1613a88608m9588Q5202p9423J21682L8165K8199n3680J89965R7848k15349j69464
$$ -188608 -238196 -152994 -232417 -110735 -72570 -44371 -98051 91914 189762 -25587 -195051
1602a95051R1489q8410k3144N315J06717r581j25746L0887k5883r6031J80486
$$ -195051 -103562 -191972 -215116 -209801 -103084 -112665 -238411 -207524 -233407 -329438 -148952
1591a48952J33586j04313J0872k87223J10965J76961j49416j38842l5370O9553
$$ -148952 -15366 -119679 -108807 -396030 -285065 -108104 -257520 -396362 -431732 -362179
1581c62179K95790p9534J20775O3508p8768j37833q5915r6071J65766L42947j86170
$$ -362179 -66389 -145923 -25148 38360 -40408 -178241 -264156 -360227 -194461 148486 -37684
1570c7684K5806j21984J30621j01471L4376R1502j02459M6709k51712k60569J10590
$$ -37684 -11878 -133862 -3241 -104712 -70336 21166 -81293 -34584 -286296 -546865 -436275
1559d36275J36555P3662J22394L5943P2628k02870r7629J47611P4673r3612k38891
$$ -436275 -299720 -226058 -103664 -67721 4907 -197963 -295592 -147981 -73308 -166920 -405811
1548d05811K2983L0081l5859K56213J59493j45986j35377O46j34312K67917J09280
$$ -405811 -382828 -352747 -388606 -132393 27100 -118886 -254263 -253617 -387929 -120012 -10732
1537a0732p6470j13261J47592J15284j45484l5132k78260j37492J83105n753k461
$$ -10732 -87202 -200463 -52871 62413 -83071 -118203 -396463 -533955 -350850 -356603 -359064
1526c59064J44822J23757L07108j73202k84740k1199n8231Q324J01186J8976k69115
$$ -359064 -214242 -90485 216623 43421 -241319 -262518 -320749 -312425 -211239 -192263 -461378
1515d61378K39477O0419N126n7895j3390J77510l9161k09045J40161k512p0579
$$ -461378 -221901 -161482 -156356 -214251 -227641 -50131 -89292 -298337 -158176 -160688 -231267
1504b31267r0902R0424J11713J33555K57075k30821r8426K6884o8563o1115n7775
$$ -231267 -322169 -231745 -120032 13523 270598 39777 -58649 -31765 -100328 -161443 -219218
1493b19218p951J7879m7572K59661q84j98772j10877p8531Q5258K04078q2960
$$ -219218 -227169 -209290 -256862 2799 1915 -196857 -307734 -386265 -301007 -96929 -179889
1482a79889m9884P5608J54154J75685l5174j13114j22111M2637j61923j6086M2143
$$ -179889 -229773 -154165 -11 175674 140500 27386 -94725 -52088 -214011 -230097 -187954
1471a87954J02186K2577l6470k9772r4987J6064j62358o3212K18561J49654J23948
$$ -187954 -85768 -63191 -99661 -129433 -224420 -208356 -370714 -433926 -215365 -65711 58237
1460E8237j62066K4848J85729j83663k00113j5607P0541j5809N14K30166O8833
$$ 58237 -103829 -78981 106748 -76915 -277028 -292635 -222094 -237903 -237389 -7223 61610
1449F1610p9683j04264n8177P5990q0638n5033j14485p4465K38153J5662j6192
$$ 61610 -18073 -122337 -180514 -104524 -185162 -240195 -354680 -429145 -190992 -175330 -191522
1438a91522J114J56525j11592j41993l6007K45006j56323N5857J43728k61726
$$ -191522 -190408 -33883 -145475 -287468 -323475 -78469 -234792 -178935 -35207 -296933
1428b96933K25751j23051K60646K459j12037j275q7790j55252K16035J63729k13398
$$ -296933 -71182 -194233 66413 68872 -43165 -44440 -132230 -287482 -71447 92282 -121116
$$ [...]
##END NTUPLES=NMR SPECTRUM
##END=
