##TITLE=1H_TG-2374-2
 CDCl3
 8 sc, 
 4.10.2023
##JCAMPDX= 6.0         $$ Bruker NMR JCAMP-DX V2.0
##DATA TYPE= NMR SPECTRUM
##DATA CLASS= NTUPLES
##ORIGIN= UXNMR, Bruker Analytische Messtechnik GmbH
##OWNER= root
$$ XWIN-NMR		Version 3.5
$$ Wed Oct  4 14:32:25 2023 Russian Standard Time (UT+4h)  she@DPX200
##.OBSERVE FREQUENCY= 200.13135
##.OBSERVE NUCLEUS= ^1H
##.ACQUISITION MODE= SIMULTANEOUS
##.ACQUISITION SCHEME= undefined
##.AVERAGES= 8
##.DIGITISER RES= 18
##SPECTROMETER/DATA SYSTEM= spect
##.PULSE SEQUENCE= zg30
##.SOLVENT NAME= D2O
##.SHIFT REFERENCE= (INTERNAL, D2O, 0, 15.7447)
##AUDIT TRAIL= $$ (NUMBER, WHEN, WHO, WHERE, WHAT)
$$ ##TITLE= Audit trail, XWIN-NMR		Version 3.5
$$ ##JCAMPDX= 5.01
$$ ##ORIGIN= Bruker BioSpin GmbH
$$ ##OWNER= she
$$ F:/spectra/data/she/nmr/H-F/1/pdata/1/auditp.txt
$$ ##AUDIT TRAIL=  $$ (NUMBER, WHEN, WHO, WHERE, WHAT)
(   1,<2023-10-04 14:30:56.09 +0400>,<she>,<DPX200>,
      <created by zg, POWCHK disabled, PULCHK disabled
       configuration hash MD5:
       00 E9 B6 7A A2 85 ED C7 34 08 36 98 17 FE 4E 26
       data hash MD5: 16K
       65 08 05 5B 99 84 9D CB EB E3 40 E7 BA 14 B9 22>)
(   2,<2023-10-04 14:30:58.93 +0400>,<she>,<DPX200>,
      <Start of raw data processing
       efp BC_mod = 2 LB = 0.24 FT_mod = 6 PKNL = 1 PHC0 = -21711.22 PHC1 = 12.45271 SI = 16K 
       data hash MD5: 16K
       51 70 D8 D2 1C C5 CE B5 78 1A FA 1F F9 A7 5C 4E>)
(   3,<2023-10-04 14:31:15.95 +0400>,<she>,<DPX200>,
      <pk PHC0 = 0.06761932 PHC1 = 0.2 
       data hash MD5: 16K
       32 CE 5C FB B4 D7 AE EC AA C9 E1 83 A4 A6 02 4E>)
(   4,<2023-10-04 14:31:19.53 +0400>,<she>,<DPX200>,
      <abs ABSG = 5 
       data hash MD5: 16K
       33 0B F3 16 F6 E0 92 F4 64 63 AA B3 6E CE 5B 4B>)
$$ ##END=
$$ 
$$ hash MD5
$$ 33 CA CE CC FD 35 EE BD CC 30 98 DB E9 C7 2B 4C
##$RELAX= 
##$RELAX= 
##$RELAX= 
##$RELAX= 
##$RELAX= 
##$RELAX= 
$$ Bruker specific parameters
$$ --------------------------
##$DU= <F:/spectra>
##$EXPNO= 1
##$NAME= <H-F>
##$PROCNO= 1
##$TYPE= <nmr>
##$USER= <she>
##$AMP= (0..31)
100 100 100 100 100 100 100 100 100 100 100 100 100 100 100 100 100 100 
100 100 100 100 100 100 100 100 100 100 100 100 100 100 
##$AQSEQ= 0
##$AQ_mod= 1
##$AUNM= <au_zg>
##$AUTOPOS= <>
##$BF1= 200.13
##$BF2= 200.13
##$BF3= 200.13
##$BF4= 200.13
##$BF5= 200.13
##$BF6= 200.13
##$BF7= 200.13
##$BF8= 200.13
##$BYTORDA= 1
##$CFDGTYP= 0
##$CFRGTYP= 5
##$CHEMSTR= <none>
##$CNST= (0..31)
1 1 145 1 1 1 1 1 1 1 1 1 1 1 1 1 1 1 1 1 1 1 1 1 1 1 1 1 1 1 1 1 
##$CPDPRG= <>
##$CPDPRG1= <>
##$CPDPRG2= <>
##$CPDPRG3= <>
##$CPDPRG4= <mlev>
##$CPDPRG5= <mlev>
##$CPDPRG6= <mlev>
##$CPDPRG7= <mlev>
##$CPDPRG8= <mlev>
##$CPDPRGB= <>
##$CPDPRGT= <>
##$D= (0..31)
0 1.2 0 0 0 0 0 0 0 0.06 0 0.03 0 0 0 0 0.0002 0 0 0 0 0 0 0 0 0 0 0 0 
0 0 0 
##$DATE= 1696415455
##$DBL= (0..7)
120 120 120 120 120 120 120 120 
##$DBP= (0..7)
150 150 150 150 150 150 150 150 
##$DBP07= 0
##$DBPNAM0= <>
##$DBPNAM1= <>
##$DBPNAM2= <>
##$DBPNAM3= <>
##$DBPNAM4= <>
##$DBPNAM5= <>
$$ [...]
##$SUBNAM3= <"">
##$SUBNAM4= <"">
##$SUBNAM5= <"">
##$SUBNAM6= <"">
##$SUBNAM7= <"">
##$SUBNAM8= <"">
##$SUBNAM9= <"">
##$SW= 18.05172834244
##$SWIBOX= (0..15)
0 0 2 0 0 0 0 0 0 0 0 0 0 0 0 0 
##$SW_h= 3612.71676300578
##$TD= 16384
##$TD0= 1
##$TE= 0
##$TE2= 300
##$TE3= 300
##$TEG= 300
##$TL= (0..7)
0 120 120 120 120 120 120 120 
##$TP= (0..7)
150 150 150 150 150 150 150 150 
##$TP07= 0
##$TPNAME0= <>
##$TPNAME1= <>
##$TPNAME2= <>
##$TPNAME3= <>
##$TPNAME4= <>
##$TPNAME5= <>
##$TPNAME6= <>
##$TPNAME7= <>
##$TPOAL= (0..7)
0.5 0.5 0.5 0.5 0.5 0.5 0.5 0.5 
##$TPOFFS= (0..7)
0 0 0 0 0 0 0 0 
##$TUNHIN= 0
##$TUNHOUT= 0
##$TUNXOUT= 0
##$USERA1= <user>
##$USERA2= <user>
##$USERA3= <user>
##$USERA4= <user>
##$USERA5= <user>
##$V9= 5
##$VALIST= <valist>
##$VCLIST= <CCCCCCCCCCCCCCC>
##$VD= 0
##$VDLIST= <DDDDDDDDDDDDDDD>
##$VPLIST= <PPPPPPPPPPPPPPP>
##$VTLIST= <TTTTTTTTTTTTTTT>
##$WBST= 1024
##$WBSW= 4
##$XGAIN= (0..3)
0 0 0 0 
##$XL= 0
##$YL= 0
##$YMAX_a= 226100
##$YMIN_a= -350266
##$ZGOPTNS= <>
##$ZL1= 120
##$ZL2= 120
##$ZL3= 120
##$ZL4= 120
##$ABSF1= 15.72595
##$ABSF2= -2.325899
##$ABSG= 5
##$ABSL= 3
##$ALPHA= 0
##$AQORDER= 0
##$ASSFAC= 0
##$ASSFACI= 0
##$ASSFACX= 0
##$ASSWID= 0
##$AUNMP= <proc_1d>
##$AZFE= 0.1
##$AZFW= 0.1
##$BCFW= 0
##$BC_mod= 2
##$BYTORDP= 0
##$COROFFS= 0
##$CY= -3
##$DATMOD= 1
##$DC= 0
##$DFILT= <>
##$DTYPP= 0
##$F1P= 0
##$F2P= 0
##$FCOR= 1
##$FTSIZE= 16384
##$FT_mod= 6
##$GAMMA= 0
##$GB= 0
##$INTBC= 1
##$INTSCL= 3.70164e-10
##$ISEN= 128
##$LB= 0.24
##$LEV0= 0
##$LPBIN= 0
##$MAXI= 10000
##$MC2= 0
##$MEAN= 0
##$ME_mod= 0
##$MI= 1.114404
##$NCOEF= 0
##$NC_proc= -7
##$NLEV= 6
##$NOISF1= 3.799351
##$NOISF2= 2.8
##$NSP= 0
##$NTH_PI= 0
##$NZP= 0
##$OFFSET= 15.74469
##$PC= 1
##$PHC0= -21711.15
##$PHC1= 12.65271
##$PH_mod= 1
##$PKNL= yes
##$PPARMOD= 0
##$PSCAL= 0
##$PSIGN= 0
##$REVERSE= no
##$SF= 200.130005373711
##$SI= 16384
##$SIGF1= 3
##$SIGF2= 2
##$SINO= 5.538805
##$SIOLD= 16384
##$SREGLST= <1H.CDCl3>
##$SSB= 0
##$STSI= 16384
##$STSR= 0
##$SW_p= 3612.71676300578
##$SYMM= 0
##$S_DEV= 0
##$TDeff= 16384
##$TDoff= 0
##$TI= <>
##$TILT= no
##$TM1= 0
##$TM2= 0
##$TOPLEV= 0
##$USERP1= <user>
##$USERP2= <user>
##$USERP3= <user>
##$USERP4= <user>
##$USERP5= <user>
##$WDW= 1
##$XDIM= 16384
##$YMAX_p= 387595839
##$YMIN_p= -937715
$$ End of Bruker specific parameters
$$ ---------------------------------
##NTUPLES= NMR SPECTRUM
##VAR_NAME=  FREQUENCY,     SPECTRUM/REAL,   SPECTRUM/IMAG
##SYMBOL=    X,             R,               I
##VAR_TYPE=  INDEPENDENT,   DEPENDENT,       DEPENDENT
##VAR_FORM=  AFFN,          ASDF,            ASDF
##VAR_DIM=   16384,         16384,           16384
##UNITS=     HZ,            ARBITRARY UNITS, ARBITRARY UNITS
##FACTOR=    0.220516191357247, 1,           1
##FIRST=     3150.98488258105, 0,            0
##LAST=      -461.731880424734, 0,           0
##MIN=       -461.731880424734, -937715,     0
##MAX=       3150.98488258105, 387595839,    0
$$ Real data points
##PAGE= N=1
##DATA TABLE= (X++(R..R)), XYDATA
$$ [...]
6987B324756l1489O2565j251Q6897L2074j57133K86095j33587J1090J57621P6057
6976B713695j04971L8919J14746Q1395J10399j07881j18585K33305K85016n4423
6966C191615P0642j23395j51977J93465j7122l40271K18280J30486p0942J822
6956C102603j19217J3913K15665K39617n7428p3684J78059J52742R0775k8777
6946C714268L93527M11053O6615P8045m06829k78755K81977k74534K00511Q9923
6936D275801k69399k44364r6382J47028R1039o6232k2029l7701J1135O1777J20060
6925C970733K08997K86627J93287o5908j11738Q8979j43540o1299L2535l44620
6915D054053j13858K59491L00124J22318k824k4977k46769n04811o8401j07983
$$ y = [2324756, 2293267, 2355832, 2354581, 2441478, 2473552, 2316419, 2602514, 2468927, 2480017, 2637638, 2713695, 2608724, 2647643, 2762389, 2843784, 2954183, 2846302, 2727717, 2961022, 3246038, 3191615, 3262257, 3138862, 2986885, 3180350, 3163228, 2822957, 3041237, 3171723, 3100781, 3102603, 2983386, 2997299, 3212964, 3452581, 3395153, 3321469, 3499528, 3652270, 3743045, 3714268, 4107795, 4518848, 4585463, 4663508, 4256679, 3977924, 4259901, 3985367, 4185878, 4275801, 4006402, 3762038, 3665656, 3812684, 3903723, 3837491, 3815462, 3777761, 3788896, 3850673, 3970733, 4179730, 4466357, 4659644, 4593736, 4481998, 4570977, 4427437, 4366138, 4398673, 4054053, 3940195, 4199686, 4499810, 4622128, 4619304, 4594327, 4347558, 3842747, 3774346, 3666363]
6905C666363q0023R9912M021O5988J32969r5104m9878j20844K08741J42109J7569
6894C991823j73013J51514J48865L29704K84931k60354j0732j94713k70679k84849
6884C712497j93545J11885N0948j42430j99912r2261R6400N6363j25727J20217
6874C394435J46528J25216J5504k7620K47974J63187n1610q7246Q0871K632j6208
6863C993663j44878N3759m1227K79707j38301R5349J22143J0731P2051J47222
6853D450219j59493L6133J85092j3813J72330J42369o744N6356K21438R3405n9832
6842E117460K09180P9984K07005L4869L03257L63138K91599M48028L51736J93047
6832G599303l2440K2804K58469K70462L0549K70622N6564K24387L38157O3908
$$ y = [3666363, 3586340, 3686252, 3690273, 3756261, 3889230, 3794126, 3744248, 3623404, 3832145, 3974254, 3991823, 3818810, 3970324, 4119189, 4448893, 4733824, 4473470, 4462738, 4268025, 3997346, 3712497, 3518952, 3630837, 3681785, 3539355, 3339443, 3247182, 3343582, 3399945, 3274218, 3394435, 3540963, 3666179, 3681683, 3654063, 3902037, 4065224, 4013614, 3926368, 4007239, 4009871, 3993663, 3848785, 3902544, 3861317, 4141024, 4002723, 4098072, 4220215, 4230946, 4302997, 4450219, 4290726, 4326859, 4511951, 4498138, 4670468, 4812837, 4806093, 4862449, 5083887, 5177292, 5117460, 5326640, 5406624, 5613629, 5648498, 5951755, 6314893, 6606492, 7054520, 7406256, 7599303, 7566863, 7589667, 7848136, 8118598, 8149147, 8419769, 8476333, 8700720, 9038877, 9102785]
6822I102785p5771L7368L46485K31973J06855j9105j7594l7959J07917Q4030J20406
6811I987390K70698J04188P6800j16217j22403q4592Q4295l42617q3526K88488
6801A0062504j6522n0999K44356Q9678O3141J23812K42847N02122N36557l6250
6791A1761246R2159M75772J86087j92821K53792J17502k64005L7019n2613l02452
6781A2111686J796m4199k50222l14699J03773K37941O0577q2288m16246j92764
6771A1215355m21571k15382j60474m71230J6441j82141j91054l16214p3775p0615
6761I129340K34178J1124j85150k55913r1401j67290j43164k35781J13716k2032
6751H387627J12947o4050m7390L33053P0544j12172k2441L14969j49295k04062
$$ y = [9102785, 9027014, 9064382, 9410867, 9642840, 9749695, 9730590, 9712996, 9675037, 9782954, 9866984, 9987390, 10258088, 10362276, 10439076, 10322859, 10200456, 10115864, 10200159, 9857542, 9774016, 10062504, 10045982, 9994983, 10239339, 10329017, 10392158, 10515970, 10758817, 11260939, 11797496, 11761246, 11853405, 12329177, 12515264, 12322443, 12576235, 12693737, 12429732, 12466751, 12414138, 12111686, 12113482, 12069283, 11819061, 11504362, 11608135, 11846076, 11906653, 11824365, 11408119, 11215355, 10793784, 10578402, 10417928, 9946698, 9963139, 9780998, 9589944, 9273730, 9199955, 9129340, 9363518, 9374642, 9189492, 8933579, 8842178, 8674888, 8531724, 8295943, 8409659, 8387627, 8500574, 8436524, 8389134, 8722187, 8792731, 8680559, 8658118, 8973087, 8823792, 8619730]
6741H619730k37442j79056m8814N088l43002k92080m8887j54399k18552j45390
6731F957196M115k31724j54710K1163Q355l14672l09236J36778j88787k93217
6721E635261j18232j72166l68474j20701n9791J49447j98992j44318J84566o7277
6711D719323o9456j10939k42346J13653j1547j12920j09210k0375R1164J93503
6701D440850j56970K16714j78007j48526j4943J13440j2662M0577J40066P79j25433
6690D315885n77822J00310K36628k24503k58625Q1854k7198k68318L37924K42545
6680C958680K10785J569k94995j22403L480k13789J84482j98515k11615j58385
6670C159294N1615M39385k92455k87068r0030p0243K70617k08853l4512K1665
$$ y = [8619730, 8382288, 8203232, 8154418, 8159506, 7816504, 7524424, 7475537, 7321138, 7102586, 6957196, 6961311, 6729587, 6574877, 6596040, 6604395, 6289723, 5980487, 6117265, 5928478, 5635261, 5517029, 5344863, 4976389, 4855688, 4795897, 4945344, 4746352, 4602034, 4786600, 4719323, 4649867, 4538928, 4296582, 4410235, 4398688, 4285768, 4176558, 4156183, 4247347, 4440850, 4283880, 4500594, 4322587, 4174061, 4159118, 4272558, 4259896, 4300473, 4440539, 4441318, 4315885, 3738063, 3838373, 4075001, 3850498, 3591873, 3673727, 3646529, 3378211, 3716135, 3958680, 4169465, 4171034, 3876039, 3753636, 3757116, 3543327, 3727809, 3529294, 3317679, 3159294, 3210909, 3650294, 3357839, 3070771, 2980741, 2910498, 3181115, 2972262, 2937750, 2959415]
6660B959415K04836J20854k01691l3565k9433k02765r2808J11446L4902J59424
6650C030615k34256N8361K34812L7515k12695j89114J29910p2047k2480M1977
6640B802598k17133Q5302J08272J6240r8262j9454L2883m0677q2756J35738P7034
6629B799785J16798r2418J75244K3635j48125q2743j11101j92793o1278k2352
6619B404652R8982P5099K2355j4791K15775M6795j7156q0588P9215J34403J51496
6608C116237k63859j12915J64149j41306j0278k81281j22389J35090R4827O3940
6598B642215J71498J4534m5036J84400j0757M6760l66145j14643K13555R0320
6588B826701j12496j54226R6195L0j46497J83650j18026j57727J70684j6750m2506
$$ y = [2959415, 3164251, 3285105, 3083414, 3049849, 3020416, 2817651, 2724843, 2836289, 2871191, 3030615, 2796359, 2854720, 3089532, 3127047, 2914352, 2725238, 2855148, 2783101, 2760621, 2802598, 2585465, 2670767, 2779039, 2795279, 2697017, 2677563, 2710446, 2669769, 2587013, 2722751, 2799785, 2916583, 2824165, 2999409, 3023044, 2874919, 2792176, 2681075, 2488282, 2427004, 2404652, 2503634, 2578733, 2601088, 2586297, 2802072, 2848867, 2831711, 2751123, 2830338, 2964741, 3116237, 2852378, 2739463, 2903612, 2762306, 2752028, 2470747, 2348358, 2483448, 2578275, 2642215, 2813713, 2828247, 2783211, 2967611, 2956854, 3003614, 2637469, 2522826, 2736381, 2826701, 2714205, 2559979, 2656174, 2656204, 2509707, 2693357, 2575331, 2417604, 2588288, 2571538, 2529032]
6577B529032l7923j08529R2417J64363J15161J21843m23355j5715J72275m759
6567B604810K32560P5259k45679M1923J74916J08118j40220q9089J7735m138k07660
6556B568535P9732p8032J14414M1458j56221P3514M4908o9087J99663l3754M3268
6545B828398L41910l78108m05129m4638J31958J53470J6979j19752r6793J93545
6535B621840P7971L8913N5153j98050J31978K60373m965j46458p7462j07355q5949
6524B565989J10841J28634O7j31502J46608J41585O9389K2843r4234J00927L4799
6513C095946j12472J28914L12778K4719J71287m6983J57818n0250j0901K0505
6503C691361j11005J9256J2961O3557J73904N0972k08541j95761j60923Q7309
$$ y = [2529032, 2491109, 2382580, 2474997, 2639360, 2754521, 2876364, 2453009, 2437294, 2609569, 2604810, 2837370, 2912629, 2666950, 2708873, 2883789, 2991907, 2851687, 2762598, 2780333, 2776195, 2568535, 2648267, 2570235, 2684649, 2726107, 2569886, 2643400, 2688308, 2619221, 2818884, 2785130, 2828398, 3170308, 2792200, 2387071, 2342433, 2474391, 2627861, 2644840, 2525088, 2428295, 2621840, 2699811, 2738724, 2793877, 2595827, 2727805, 2988178, 2983213, 2836755, 2759293, 2651938, 2565989, 2676830, 2805464, 2805531, 2674029, 2820637, 2962222, 3031611, 3054454, 2960220, 3061147, 3095946, 2983474, 3112388, 3425166, 3449885, 3621172, 3574189, 3732007, 3681757, 3670856, 3691361, 3580356, 3599612, 3612573, 3676130, 3850034, 3901006, 3692465, 3496704, 3335781, 3423090]
6493C423090Q0279j70777k11298K5050M2197K29494m5185J25923J71133n3696
6483C616210j71669M7314J24064l64274p634K59207K12376j07378k17122J77131
6473C568225o0132j46009J47001J68120O6373J11318J53320o2143j19169L9291
6463C866195J66599L67558m1756O4332j86559J43735K32970J34494K43606J10355
6453E101529j14035J87344M9631l82475q5291J32084M9313j3403P0126j22839
6443D871984q6987k0276m2553J2591k30810J1140J68037l28378k52370J55610
6433D257988K47384j44562K1227J33418j29326k6800O8109j24873J18455j18697
6423D302323k5468J6348M1111j11478P4529M2678J62319p5743J23593J62049m0206
$$ y = [3423090, 3503369, 3332592, 3121294, 3146344, 3188541, 3418035, 3372850, 3498773, 3669906, 3616210, 3444541, 3491855, 3615919, 3251645, 3244011, 3503218, 3715594, 3608216, 3391094, 3568225, 3508093, 3362084, 3509085, 3677205, 3743578, 3854896, 4008216, 3946073, 3826904, 3866195, 4032794, 4400352, 4358596, 4422928, 4236369, 4380104, 4613074, 4747568, 4991174, 5101529, 4987494, 5174838, 5224469, 4841994, 4756703, 4888787, 4938100, 4924697, 4994823, 4871984, 4784997, 4764721, 4722168, 4734759, 4503949, 4515089, 4683126, 4354748, 4102378, 4257988, 4505372, 4360810, 4382037, 4515455, 4386129, 4359329, 4427438, 4302565, 4421020, 4302323, 4276855, 4293203, 4334314, 4222836, 4297365, 4340043, 4502362, 4426619, 4550212, 4712261, 4672055]
6412D672055q2460J71383K3854k18000p6745J91357j07768J1109K42484j42168
6402D685101P2980Q2138J48893j883l6217J1989K57260R3633J66018j28864j23948
6391E227100O6478K89747L4671Q1845R3399j25782J57014O7287j56349K52876
6381E988286R6013j44710j59273K96584L89479r6769J38787j29400J8712p2189
6371F325520M1816M83925K37208J8584J06015L87312j26248R3271J64001J87621
6361G919025J71401k20710r4748J47749J66103J93287L11563J17819K10705J37981
6351I060175J33441Q2048J13762L10597J72207R7533L97782M03212K36816L96327
6341A1403900J37080K20113K81539L53209K54856L26908P57151M86104R09246
$$ y = [4672055, 4589595, 4760978, 4784832, 4566832, 4490087, 4681444, 4573676, 4584785, 4827269, 4685101, 4758081, 4840219, 4989112, 4987229, 4951012, 4963001, 5220261, 5313894, 5479912, 5351048, 5227100, 5293578, 5583325, 5617996, 5699841, 5793240, 5667458, 5824472, 5891759, 5735410, 5988286, 6084299, 5939589, 5780316, 6076900, 6466379, 6369610, 6508397, 6378997, 6397709, 6325520, 6367336, 6851261, 7088469, 7107053, 7213068, 7600380, 7474132, 7567403, 7731404, 7919025, 8090426, 7869716, 7774968, 7922717, 8088820, 8282107, 8593670, 8711489, 8922194, 9060175, 9193616, 9275664, 9389426, 9700023, 9872230, 9969763, 10367545, 10770757, 11007573, 11403900, 11540980, 11761093, 12042632, 12395841, 12650697, 12977605, 13734756, 14220860, 15130106]
6332A5130106O03027R84031J091897R59483J101736J302281J602591J629279K160813
6323B6565244K721321K732081K395680K491565K432178J777153N69452Q8118n67756
6314D1205036p86979p01016n40070l5988L6832L53233L91392O14289L6439o22073
6304C9951095r59154k241043k416900k352147k707058k124730k169601k157884
6296B2822578j550548j043133j222344j350040q87472o78781q16964n54657o54200
6287A4064439m44867l98899n76326l78554j18251m96330k71420k6239j6458j43199
6277A1193896m16317N038O9751k40317m6187J21693j58811Q4341J72059R7650
6267A0882796P69l73302n24236j13502q6480m032j2658J12355L498j42073j98019
$$ y = [15130106, 15733133, 16717164, 17809061, 18768544, 19870280, 21172561, 22775152, 24404431, 26565244, 29286565, 32018646, 34414326, 36905891, 39338069, 41115222, 41684674, 41772792, 41205036, 40418057, 39717041, 39176971, 39140983, 39177815, 39531048, 39922440, 40536729, 40573168, 39951095, 38991941, 36750898, 34333998, 31981851, 29274793, 27150063, 24980462, 22822578, 21272030, 20228897, 19006553, 17656513, 16769041, 16090260, 15273296, 14718639, 14064439, 13619572, 13220673, 12644347, 12265793, 12147542, 11651212, 11379792, 11353553, 11337095, 11193896, 10777579, 10782617, 10852368, 10612051, 10565864, 10687557, 10528746, 10613087, 10785146, 10882796, 10883565, 10510263, 9986027, 9872525, 9786045, 9782013, 9769355, 9881710, 9885208, 9743135, 9545116]
6256I545116j49324k97617j07032k82305o9342j3486j66359m61184R9908n9473
6246H038902j56758J74521j04997j23224K74478L5870j84695k3659K34004R3289
6236H257731J7038J54763j0917j00737j9925N034O9371Q1341l5180J16860M8647
6225H584026K38945J98718J42356j95460J63285N38776J90396M32596K89850J59561
6215A0743049J67900N04531N78363O7521m0926J51037j54446k72219K1123j80270
6205A1585663J24353j65130J587j82232j62398l00857n0669k43325l25659j9549
6195A0261784j22177l80330k43761J21876l78478o72881j81090K95130N7267m04645
6185H352695N7144q0599Q3747K87760q4875O0229J3604J00126K02596p2248r7009
$$ y = [9545116, 9395792, 9098175, 8991143, 8708838, 8639496, 8626010, 8459651, 7998467, 8098375, 8038902, 7882144, 8056665, 7951668, 7828444, 8102922, 8138792, 7954097, 7930438, 8164442, 8257731, 8274769, 8429532, 8418615, 8317878, 8297953, 8302987, 8372358, 8453699, 8418519, 8535379, 8584026, 8822971, 9021689, 9164045, 8968585, 9131870, 9670646, 9861042, 10293638, 10583488, 10743049, 10910949, 11415480, 11993843, 12061364, 12020438, 12171475, 12017029, 11744810, 11765933, 11585663, 11710016, 11544886, 11546473, 11364241, 11201843, 10900986, 10850317, 10606992, 10281333, 10261784, 10139607, 9759277, 9515516, 9637392, 9258914, 8586033, 8404943, 8700073, 8757340, 8352695, 8409839, 8329240, 8412987, 8700747, 8615872, 8676101, 8689705, 8789831, 8992427, 8920179, 8823170]
6174H823170R6763j30735p3223N8190q8028J48186K93795R8108j81729K6790q4976
6163H986311P558P3991J24236Q9927j74456L47436L99237j93905P3011L73260
6153A0106606K59151j59000j06744L44001J02000P9235j56127M8930q9695k56158
6143A0172199R287J23835k16440M42371M07574J3531K23363P1564O9588J84826
6133A1501698m3443Q9555O7907J37675L96557m4632j2554K09692N16103M15421
6123A3233979j60320j7518J97362k2383j13028j46316l79916J5328N6352j52317
6113A2511223N4370K09968J80505J24654J30185Q9103N140J09273p2615k64249
6103A3077557n1166j73849k05216j39284K228j37142j34395M14984k58664j46645
$$ y = [8823170, 8919933, 8789198, 8715975, 8774165, 8686137, 8834323, 9128118, 9226226, 9044497, 9071287, 8986311, 8993869, 9067860, 9192096, 9282023, 9107567, 9455003, 9854240, 9660335, 9733346, 10106606, 10365757, 10206757, 10100013, 10444014, 10546014, 10625249, 10469122, 10518052, 10428357, 10172199, 10181486, 10305321, 10088881, 10531252, 10938826, 10952357, 11175720, 11247284, 11316872, 11501698, 11458255, 11547810, 11615717, 11753392, 12149949, 12105317, 12092763, 12302455, 12818558, 13233979, 13073659, 13056141, 13253503, 13231120, 13118092, 12971776, 12591860, 12607188, 12663540, 12511223, 12565593, 12775561, 12956066, 13080720, 13210905, 13300008, 13305148, 13414421, 13341806, 13077557, 13026391, 12852542, 12647326, 12508042, 12510270, 12373128, 12238733, 12653717, 12395053, 12248408]
6093A2248408R167K2937k47893j67852k81583k09040j06376j42929L6141K45578
6083A1406558K30932j93599J01257K62790J4933K248K92551R9902R4191K14008
6073A2525771L57649J03219k7340n6323L33042n3737K10480J24389J3987J91368
6063A3722505J14416k7819n8291K33660K44932M2379O0726M01889K02560L37059
6053A5274016J67332M6025j63378l78247l59818m25436k26381l03151j39560j12189
6043A3379213l39871k06193K3584k42532j51100p8574K73525P3804n5430K04329
6033A2880755K39504K01029L6766J96034M38909J98103K19252J08336p3627J35382
6023A4580443J64904L37343M01884j59651K1148n7833N8324L9588L9316J04456
$$ y = [12248408, 12257575, 12280512, 12032619, 11864767, 11583184, 11374144, 11267768, 11124839, 11160980, 11406558, 11637490, 11443891, 11545148, 11807938, 11822871, 11825119, 12117670, 12217572, 12311763, 12525771, 12883420, 12986639, 12959299, 12902976, 13236018, 13182281, 13392761, 13517150, 13531137, 13722505, 13836921, 13809102, 13750811, 13984471, 14229403, 14271782, 14332508, 14734397, 14936957, 15274016, 15441348, 15487373, 15323995, 14945748, 14585930, 14160494, 13934113, 13630962, 13491402, 13379213, 13039342, 12833149, 12856733, 12614201, 12463101, 12384527, 12658052, 12731856, 12676426, 12880755, 13120259, 13321288, 13358054, 13554088, 13992997, 14191100, 14410352, 14518688, 14445061, 14580443, 14745347, 15082690, 15484574, 15324923, 15346071, 15288238, 15346562, 15386150, 15425466, 15529922]
6013A5529922R3422K18705J45710k61538l88142k75556n9053K5795l23277m2910
6003A4663078p2455j03768K20482J00007J44058N03326L39373K80235L498Q6489
5993A6164323J80570j40089j36050J69801j7482K19642Q5893m06099j86398J71461
5983A6105572p375J57394J6779p8458N4340k8158n21135n87704k37491j76343
5973A4697421k72834k22811l15817j05183m0888K07714p6201j75236p05191n00603
5963A2490371R5872l99832k43436j56814k46101j14517j02073J08594k2184K32552
5953A1642432K60545l74075K0472L43630M76744L61683K88497M55333Q54021N41108
5943A4870390L46401L53160J90009o9811k60550l17146n68543q21664n67729k24139
$$ y = [15529922, 15623344, 15842049, 15987759, 15726221, 15338079, 15062523, 15003470, 15029265, 14705988, 14663078, 14590623, 14486855, 14707337, 14807344, 14951402, 15454728, 15794101, 16074336, 16077834, 16164323, 16344893, 16204804, 16068754, 16238555, 16221073, 16440715, 16526608, 16120509, 15934111, 16105572, 16098197, 16255591, 16272370, 16193912, 16248252, 16220094, 15698959, 15111255, 14873764, 14697421, 14424587, 14201776, 13885959, 13780776, 13739888, 13947602, 13871401, 13696165, 12990974, 12490371, 12586243, 12186411, 11942975, 11786161, 11540060, 11425543, 11323470, 11432064, 11409880, 11642432, 11902977, 11528902, 11549374, 11893004, 12369748, 12731431, 13019928, 13475261, 14329282, 14870390, 15216791, 15569951, 15759960, 15690149, 15429599, 15112453, 14543910, 13722246, 13154517, 12930378]
5933A2930378j02317l88980l67723k2058j32552l47187j3205J18508J30428J7673
5923A1822965M7628L79914J33932J54510L73672K65824J02883L80072N99364N76122
5913A4836886N45260Q61279Q94713M16182L89840K95720K20565m7931N1555M06857
5903A8870926J28776N41313P42833J409145J223895J440740J280060J94999r5924
5894B5736763n28329j203726j290422j412852j345551j137103r69392p12366l17838
5885A6819184m42809n10516K8970L7932J43067R5428M67379N53530O29262Q46099
5875A8667526Q05911O3496N4268k01884m86996n36256q04154m48787Q8077K2420
5865A7223621J08503O5870K30627q792j50948m72288n39570m37819m60678m11234
$$ y = [12930378, 12828061, 12439081, 12071358, 12049300, 11916748, 11569561, 11556356, 11674864, 11805292, 11822965, 11870593, 12250507, 12384439, 12538949, 12912621, 13178445, 13281328, 13661400, 14260764, 14836886, 15382146, 16243425, 17138138, 17554320, 17944160, 18239880, 18460445, 18412514, 18464069, 18870926, 18999702, 19541015, 20283848, 21692993, 22916888, 24357628, 25637688, 25832687, 25736763, 25208434, 24004708, 22714286, 21301434, 19955883, 18818780, 17849388, 17137022, 16819184, 16376375, 15865859, 15894829, 15932761, 16075828, 16171256, 16638635, 17192165, 17821427, 18667526, 19473437, 19536933, 19591201, 19389317, 18902321, 18366065, 17561911, 17113124, 17201201, 17223621, 17332124, 17397994, 17628621, 17619829, 17468881, 16996593, 16457023, 16019204, 15558526, 15147292]
5855A5147292k28572k84542j03311k43872k78496q6446j63035j96047j68808j87961
5845A3206202j10199J74032j32207k08644j59020K12303j53486j38759J04143
5836A2794365j46903j16101N2003J08394n8686J4398n4730j05443N8212k31990
5826A2313519K8641l74560j76055J69464j92906q8158J41622q1157j14443J35692
5816A1761659p3303j00801k2983j61025K40088L03793K5629K26291L57150N23933
5806A3080431M38752O58637P57792J371196K101692K733121K565266J793512n34424
5797B4965975k469493k637643k454496k142953j336525p56798j009143o16739
5789A1542185m92742j51080l68351l55626k49425k13700m4991k19729r7161p8493
$$ y = [15147292, 14918720, 14634178, 14530867, 14286995, 14008499, 13922053, 13759018, 13562971, 13394163, 13206202, 13096003, 13270035, 13137828, 12929184, 12770164, 12982467, 12828981, 12690222, 12794365, 12647462, 12531361, 12583364, 12691758, 12633072, 12647470, 12592740, 12487297, 12545509, 12313519, 12342160, 11967600, 11791545, 11961009, 11768103, 11679945, 11821567, 11740410, 11625967, 11761659, 11688356, 11587555, 11564572, 11403547, 11643635, 11947428, 11973057, 12199348, 12556498, 13080431, 13519183, 14177820, 14935612, 16306808, 18408500, 21141621, 23706887, 25500399, 24965975, 22496482, 19858839, 17404343, 15261390, 13924865, 13168067, 12158924, 11542185, 11049443, 10898363, 10530012, 10174386, 9924961, 9711261, 9666270, 9446541, 9349380, 9270887]
5779I270887j65318m388N671K45100N44428R3971K24320L22080j23527m63629
5769I949595n08498k91438j82986k43358l92211j36478J15599j49029k13338j83124
5759G764734m4412k12921k47925j95123k04409j26174j31594O2295j59589o8091
5749F436791j48597j37426j84921j71843P9319k4871r1352K0096p931j79991n10729
5738E078545M54511j68503p4332K3980k41980O259j20733J7366m1781n8058K00637
5727E075911q8579m39033K87357M2393O2875j11741k67095k0832M3340j46940
5717D437656J75735o560j21055J15485k81967j46309r0312J32661J34685J10815
5707D460834j22472N365P1956n461p6191p4778r5900P4495K6787k67364M167R2956
$$ y = [9270887, 9105569, 9101181, 9106852, 9351952, 9896380, 9990351, 10214671, 10536751, 10413224, 9949595, 9441097, 9149659, 8966673, 8723315, 8331104, 8194626, 8310225, 8161196, 7947858, 7764734, 7720322, 7507401, 7259476, 7064353, 6859944, 6733770, 6602176, 6664471, 6504882, 6436791, 6288194, 6150768, 5965847, 5794004, 5873323, 5848452, 5757100, 5777196, 5769265, 5589274, 5078545, 5533056, 5364553, 5290221, 5314201, 5072221, 5078480, 4957747, 4975113, 4933332, 4875274, 5075911, 4987332, 4548299, 4835656, 4878049, 4940924, 4829183, 4562088, 4541256, 4584596, 4437656, 4613391, 4606831, 4485776, 4601261, 4319294, 4172985, 4082673, 4215334, 4350019, 4460834, 4338362, 4343727, 4415683, 4410222, 4334031, 4259253, 4163353, 4237848, 4264635, 3997271, 4001438, 4094394]
5695D094394l9448j08749J85357k6357k97306j27272K58668J51375k266l16706
5685C771690J9863p2861J2988J78059p9128M2741J385J01954J39007m1278j55498
5674C918922r2436j70955j76599J60473M4818M2798L3310j0365q180J03354J04653
5663C949793k30429M2870K81290q2853l8193p1700n2654k06938J13717L717k186
5652C706434l2045J38217M330R6655o3239J71617j48948r1104J92725j01017k13419
5641C660206q1495M1582K62304L01212O9974L5743K1107J5456j75165J08539R6035
5630D355498j55306k76553J77641q4906J19746j67609P6433J33177K9950J90534
5620D398605J71957j98844l76872J64615L16155n3389J21022k28339J26891J27661
$$ y = [4094394, 4054946, 3946197, 4131554, 4105197, 3807891, 3680619, 3939287, 4090662, 4088396, 3771690, 3791553, 3718692, 3731680, 3909739, 3830611, 3873352, 3874737, 3976691, 4115698, 4074420, 3918922, 3826486, 3655531, 3478932, 3639405, 3684223, 3727021, 3760331, 3749966, 3741786, 3845140, 3949793, 3719364, 3762234, 4043524, 3960671, 3922478, 3850778, 3798124, 3591186, 3704903, 3708620, 3706434, 3674389, 3812606, 3816936, 3913591, 3850352, 4021969, 3873021, 3781917, 3974642, 3873625, 3660206, 3578711, 3620293, 3882597, 4183809, 4253783, 4289526, 4310633, 4326089, 4150924, 4259463, 4355498, 4200192, 3923639, 4101280, 4016374, 4136120, 3968511, 4044944, 4178121, 4208071, 4398605, 4570562, 4371718, 3994846, 4159461, 4475616, 4422227, 4543249, 4314910, 4441801, 4569462]
5610D569462L94788j17544r6240J89591K9518n9368L02127L9452k02165K34476
5600E284097j39239J5998J77258J43392j71757R630K43558J13403K24315M6025
5590E946680K6525j62797J67517J44127J99950K32585N7494K62876R962J0545
5580F895464J49439K65162K19037M12162K0774J75401n212L20699N44812J07031
5570I104769K13791P47850N76048P34057L79924N38288Q04057J247647O54721
5561A5001152R04068Q88697P33018N66728K59957L24924J90151M24954O46936
5552A9940585J805422K557822L155397L627583L142623J97793l096328m620617
5544B6710280m239096l442086k176358j264279p84397n99060m59663m16455l15826
$$ y = [4569462, 4964250, 4846706, 4750466, 4940057, 4969575, 4910207, 5212334, 5251786, 5049621, 5284097, 5144858, 5160856, 5338114, 5481506, 5309749, 5319379, 5562937, 5676340, 5900655, 5946680, 5973205, 5810408, 5977925, 6122052, 6322002, 6554587, 6612081, 6874957, 6884919, 6895464, 7044903, 7310065, 7529102, 7941264, 7962038, 8137439, 8132227, 8452926, 8997738, 9104769, 9318560, 10066410, 10642458, 11376515, 11756439, 12294727, 13098784, 14346431, 15001152, 15905220, 16793917, 17526935, 18093663, 18353620, 18678544, 18868695, 19293649, 19940585, 21746007, 24303829, 27459226, 31086809, 34229432, 34427225, 31330897, 26710280, 22471184, 19029098, 16852740, 15588461, 14804064, 14205004, 13745341, 13328886, 13013060]
5535A3013060l32585m08005j46301m6759j08590L7795J03352J34660K90894N14228
5525A3051749L33381O57407J043426P31515J415741J350325J498062J778665J442063
5516B3302334P46730N21568K6132k5309j09617n33590l38904r80467r86662o82018
5506B0940197n72803l42329N3679O9794k28588p34298j367604j849163j468923
5497A4499962q66251o29686l70498k89565j77386k64686j72552r4040j23282K78305
5487A1790321l7732K08993k729M25308K4879j25026K98350M50570J42124M29785
5477A3604843R25633J103442J250677O52028M16606n14342q01899p19354l91993
5468A5525641j69748j39259j37764k09024k79089m14777n07878m13305m95727
$$ y = [13013060, 12680475, 12272470, 12126169, 12079410, 11970820, 12008615, 12111967, 12246627, 12537521, 13051749, 13385130, 14042537, 15085963, 15817478, 17233219, 18583544, 20081606, 21860271, 23302334, 24049064, 24570632, 24596764, 24571455, 24461838, 23928248, 23589344, 22608877, 21622215, 20940197, 20367394, 20025065, 20078744, 20148538, 19919950, 19185652, 17818048, 15968885, 14499962, 13633711, 13004025, 12633527, 12343962, 12166576, 11901890, 11729338, 11635298, 11512016, 11790321, 11752589, 11961582, 11958853, 12384161, 12409040, 12284014, 12582364, 13032934, 13175058, 13604843, 14530476, 15633918, 16884595, 17536623, 17953229, 17438887, 16636988, 15917634, 15525641, 15355893, 15216634, 15078870, 14869846, 14590757, 14175980, 13668102, 13254797, 12759070]
5459A2759070k60071n34K55120L04584K15540j51080n71931p48649m21628k1493
5449A1358928K3864K27031M26381O97574P27072P19857P61480M72409J30249n08015
5439A5036830r46063j414448j190557q22944n77623l46033l44681m87880j77279
5430H729322l26129j36313R414m61J58960l65681j73067J31299N39233J25595
5420H692172j7272k09103M7606K45823p6525K07399J76507J91248L68068L29637
5410I955560J64035R6538k16286m38928n79588k30013l39477j57425l32966j68443
5400G753007j8831j43925P0065k50451q3336n1037J24999K96188j0794k16949
5390G468936k40676P9996K25693Q7460K15819P8281M5004M38596L35850k0481
$$ y = [12759070, 12498999, 12498465, 12753585, 13058169, 13273709, 13122629, 12550698, 11802049, 11380421, 11358928, 11382792, 11609823, 12036204, 12733778, 13460850, 14180707, 14942187, 15414596, 15544845, 15036830, 14090767, 12676319, 11485762, 10662818, 10085195, 9739162, 9394481, 8906601, 8729322, 8403193, 8266880, 8276294, 8275833, 8434793, 8069112, 7896045, 8027344, 8566577, 8692172, 8674900, 8465797, 8513403, 8759226, 8682701, 8890100, 9066607, 9257855, 9625923, 9955560, 10119595, 10216133, 9999847, 9560919, 8981331, 8751318, 8411841, 8254416, 7921450, 7753007, 7734176, 7590251, 7660316, 7409865, 7326529, 7275492, 7400491, 7696679, 7685885, 7468936, 7228260, 7308256, 7533949, 7621409, 7837228, 7915509, 7960513, 8399109, 8734959, 8714478]
5380H714478M46317M60062k7928L30645K60848J47403P4514K15088Q5613N5846
5370A0762886M00825K05172J36266N2327q1931n953j40005J1336L51052K5186
5360A1717161m1298J36200R6324J22534J46214k50277J22922K27800J97939J1021
5350A2486540M08215K08516Q69698R27036L80862L84557N72951Q06336L26520
5341A7371231J6158m23615j66723L60357L33319j51522p8193j34379n67478o16992
5331A5942163q25760n66890j66279k43511k41718n2727O2775p2026L9989R0150
5321A3966166J37951M52454L80246L45002M41439L84658N73727P47854P85176
5312A8214673P64025N87094K83055K46019j57726P0175J44870k11533j40186k32768
$$ y = [8714478, 9160795, 9620857, 9592929, 9923574, 10184422, 10331825, 10406339, 10621427, 10707040, 10762886, 11163711, 11368883, 11505149, 11557476, 11475545, 11469592, 11329587, 11340923, 11691975, 11717161, 11675863, 11812063, 11908387, 12030921, 12177135, 11926858, 12049780, 12277580, 12475519, 12486540, 12894755, 13103271, 13972969, 14900005, 15280867, 15665424, 16238375, 17044711, 17371231, 17387389, 16963774, 16797051, 17157408, 17490727, 17339205, 17261012, 17126633, 16559155, 15942163, 15116403, 14549513, 14383234, 14139723, 13898005, 13845278, 13908053, 13836027, 13876016, 13966166, 14104117, 14556571, 14936817, 15281819, 15723258, 16107916, 16681643, 17429497, 18214673, 18978698, 19565792, 19848847, 20094866, 19937140, 20007315, 20152185, 19940652, 19800466, 19567698]
5302A9567698k37615j61336o85042o39249q55884o96232o82207k25083r8006k87301
5292A4999743J29365k55947k55266k91550j71634k81176j31618R186K7956k68090
5282A3510969o2947J87842o072O9260j9079L2645J3224o1331j07759k38278k41358
5271A3077116p5816l17639l12075k14180o67598k39471j65432k70679Q586p8324
5261A0744488k75313o7845J5185K3727K61862j15772L8121L32927K33510J84906
5251A1375796O90907K96091J36386K14810J25885k07470l76534r4248j78852k97123
5241A1685648m42529P4198j85613P7608j76863J72323K86664q1646J51350M5142
5231A1606282M41374M85033M94169J4792q28567j269451p69365n85777o03117
$$ y = [19567698, 19330083, 19168747, 18483705, 17844456, 16988572, 16292340, 15610133, 15385050, 15287044, 14999743, 15129108, 14873161, 14617895, 14326345, 14154711, 13873535, 13741917, 13751103, 13779059, 13510969, 13448022, 13635864, 13629792, 13699052, 13679973, 13712618, 13725842, 13664511, 13556752, 13318474, 13077116, 13001300, 12683661, 12371586, 12157406, 11489808, 11250337, 11084905, 10814226, 10822812, 10744488, 10469175, 10401330, 10416515, 10440242, 10702104, 10586332, 10624453, 10957380, 11190890, 11375796, 12066703, 12362794, 12499180, 12713990, 12839875, 12632405, 12255871, 12161623, 11982771, 11685648, 11243119, 11317317, 11131704, 11209312, 11032449, 11204772, 11491436, 11409790, 11561140, 11606282, 12047656, 12532689, 13026858, 13041650, 12213083, 10943632, 10174267, 9588490, 8985373]
5222H985373l89935o1890j79607j95429M7763m6646Q0279o7636j45288J65874
5212H192858l4708K78164J90090p1819o2190m13692k16181r7514j96174M849k26342
5201G347341P2101j80746k94595k02728J00394R2687j52889L2004J43393L5370
5191F992332N0508J7365J71647q9689k67164J26214k47451N156J0147j16191l7179
5180F615695K9249K72583j8867j13608j46356m5197J67051J82745O4929j69853
5170F838371j7512J17209R6432J40067J30698m2648k98287k00927L43824J91614
5160G298841J29897O8075L74983N8625K33848J0240l2881L39171L65005k78296
5150H567508j15989j86312j19080j58856j6286p9999L6651j06867k8432R8743
$$ y = [8985373, 8595438, 8533548, 8353941, 8158512, 8206275, 8159629, 8239908, 8172272, 8026984, 8192858, 8158150, 8436314, 8626404, 8554585, 8492395, 8078703, 7862522, 7765008, 7568834, 7573683, 7347341, 7419442, 7238696, 6944101, 6741373, 6841767, 6934454, 6781565, 6813569, 6956962, 6992332, 7042840, 7060205, 7231852, 7142163, 6874999, 7001213, 6753762, 6758918, 6769065, 6652874, 6615695, 6644944, 6917527, 6898660, 6785052, 6638696, 6593499, 6760550, 6943295, 7008224, 6838371, 6820859, 6938068, 7034500, 7174567, 7305265, 7262617, 6964330, 6763403, 7107227, 7298841, 7428738, 7496813, 7871796, 7930421, 8164269, 8174509, 8141628, 8480799, 8845804, 8567508, 8451519, 8265207, 8146127, 7987271, 7970985, 7890986, 7927637, 7820770, 7792338, 7891081]
5140G891081R9207K67768N7766L05428K25410J61955K70929K18353k33290R1628
5130I356235J05930l8239K86932J84911P1924K35950M82862L64486O50613L75583
5120A2077187l19014l86211m57263k75814J22657j75445j49227j99065j71765
5111A0066040J4729J21916J57050K63544L53795K47485N00035N04388M16783L76086
5101A3021851J80745k633k37452o60831n63902n21553M556n56394r896K61883
5091A0916374M0691K38611L10386L8156K70222M02911N25881O20612L60644K31063
5081A3955551J42058k64192m69458p62124m22702n51955l76181P9873K41297j80346
5071A1391821j54912Q9856J52106K20357K54893j76093J67552N81183M41674N19265
$$ y = [7891081, 7990288, 8258056, 8315822, 8621250, 8846660, 9008615, 9279544, 9497897, 9264607, 9356235, 9462165, 9423926, 9710858, 9895769, 9967693, 10203643, 10686505, 11050991, 11701604, 12077187, 11758173, 11371962, 10914699, 10638885, 10761542, 10586097, 10436870, 10237805, 10066040, 10080769, 10202685, 10359735, 10623279, 10977074, 11224559, 11724594, 12228982, 12645765, 13021851, 13202596, 13199963, 12962511, 12301680, 11737778, 11216225, 11220781, 10664387, 10654491, 10916374, 10957065, 11195676, 11506062, 11544218, 11814440, 12217351, 12743232, 13363844, 13724488, 13955551, 14097609, 13833417, 13363959, 12601835, 12179133, 11627178, 11250997, 11330870, 11572167, 11391821, 11236909, 11326765, 11478871, 11699228, 11954121, 11778028, 11945580, 12526763, 12968437, 13487702]
5061A3487702N94567K86561M75653K39612M58258L72736N92061Q07075J017265
5052A8331490P33830R08395O59443K923l05924q95775p61874r69066o01215q87055
5042A6215172l75604j05997j18655j93474k72630n4978M54604L56406m1738J07913
5032A5971019O35175L45368N36285O10323P41578Q89786J311414J304085J483078
5023B3828111J818609J754487J894235J834997J844669J768155N51008K39913
5015C5534184j109031j953424k229966k153178j721119j657033j411925q78351
5007B2420157o80780k79591j99483j27508p8238J48865J03814M82687O89706O60874
4997B3140503J184559J661531J488402J584985K121017K265399K528346K648833
$$ y = [13487702, 14082269, 14368830, 14844483, 15084095, 15542353, 15915089, 16507150, 17314225, 18331490, 19065320, 19973715, 20633158, 20636081, 20330157, 19434382, 18672508, 17703442, 17102227, 16215172, 15839568, 15733571, 15614916, 15421442, 15148812, 15093834, 15548438, 15904844, 15863106, 15971019, 16606194, 16951562, 17487847, 18098170, 18839748, 19729534, 21040948, 22345033, 23828111, 25646720, 27401207, 29295442, 31130439, 32975108, 34743263, 35294271, 35534184, 34425153, 32471729, 30241763, 28088585, 26367466, 24710433, 23298508, 22420157, 21739377, 21459786, 21260303, 21132795, 21054557, 21203422, 21307236, 21789923, 22479629, 23140503, 24325062, 25986593, 27474995, 29059980, 31180997, 33446396, 35974742, 38623575]
4989C8623575K641017K193226J445563K00495k16235p71793j728323k309506k932981
4980C7145038l014967k484075k303225j957481j845204j308612q64645p55344
4972B2611485o62239l74542k44279j61421J37790Q1841M14134M91804Q04547Q63957
4962B3963077R58572J369627J776677K064569K004256J803754J401189M98971
4954C5840692j196654j584159k019428k263134k244951j562477j535514j742949
4946B1691426j498957j290591j021589r44817n16683m69492n88260m15335l89445
4937A4556257J53966l6683l28785J82910J30021J42167L58131K31359L84448O27415
4927A6401206O91063J340262P40188L26705K91666k02800p91400j025426j252144
$$ y = [38623575, 41264592, 43457818, 44903381, 45103876, 44887641, 44115848, 42387525, 40078019, 37145038, 34130071, 31645996, 29342771, 27385290, 25540086, 24231474, 23366829, 22611485, 21949246, 21574704, 21330425, 21169004, 21306794, 21388635, 21802769, 22294573, 23099120, 23963077, 24921649, 26291276, 28067953, 30132522, 32136778, 33940532, 35341721, 35840692, 34644038, 33059879, 31040451, 28777317, 26532366, 24969889, 23434375, 21691426, 20192469, 18901878, 17880289, 16935472, 16418789, 15949297, 15361037, 14945702, 14556257, 14710223, 14673540, 14344755, 14527665, 14657686, 14799853, 15157984, 15389343, 15773791, 16401206, 17092269, 18432531, 19172719, 19499424, 19791090, 19588290, 18796890, 17771464, 16519320]
4918A6519320j117798j019561r90426o93895p44950l70211n91256m86665k27883
4909A0276675j90204l21858l45669L9925k12068j56287J2362l46120m9O8166k17014
4898H607859k94662J61696J5653p5678J40404L30593L38940M10883K87447J1235
4888I934370m86138l87428n98848l28246m61833m97058o4140l79056j04012Q3990
4878F711601j68534k31472j80605L9094J75724L1871k31229j96364o8579J35252
4868F016759r841J09774P7087k73346J72786O9864K602Q0201j56394l5597L58704
4857F412599K3177k396k38753K2515k9621n3677Q0609M6664j4800K07831p9840
4846F374308k83499J28638R5512J70607j06612J05099K66595k5225O763J05983
$$ y = [16519320, 15401522, 14381961, 13391535, 12697640, 11952690, 11582479, 10991223, 10504558, 10276675, 10086471, 9764613, 9418944, 9458869, 9246801, 9090514, 9102876, 8756756, 8756707, 8824873, 8607859, 8313197, 8474893, 8490546, 8414868, 8555272, 8885865, 9224805, 9635688, 9923135, 9934370, 9448232, 9060804, 8461956, 8133710, 7671877, 7174819, 7110679, 6731623, 6627611, 6711601, 6543067, 6311595, 6130990, 6170084, 6345808, 6377679, 6146450, 5950086, 5881507, 6016759, 6006918, 6116692, 6193779, 5920433, 6093219, 6163083, 6165685, 6245886, 6089492, 6053895, 6412599, 6435776, 6433380, 6194627, 6217142, 6187521, 6133844, 6214453, 6261117, 6246317, 6454148, 6374308, 6090809, 6219447, 6314959, 6485566, 6378954, 6484053, 6750648, 6725423, 6732186, 6838169]
4836F838169k26298J42044K01758j06660J06265j91536k85651P8822j38916j06084
4826F311913M28983k62369m78410k4398J16563r0057J54709k3183K24951o3194
4816F295508J70480J18177p218m1773l50331K02693L30222J93143k27449J07180
4806F790632J39872J30149J6789L0590K7438J61291p5413l07700J20811P0530
4796G104989j09221J02729O6615J88662J57658L26318P0099K06985L57241l3318
4786H438757J04214O1731K49600J2803K84696K15071Q5337M07563K02170J1374
4776A0073316J7473L27578J21486J04108N34143k82566k11655l26134r116j03486
4766A0245147l44981l22793l80479l94023j20267q903M834l57125k0061o4749
$$ y = [6838169, 6611871, 6753915, 6955673, 6849013, 6955278, 6763742, 6478091, 6556913, 6417997, 6311913, 6740896, 6478527, 6000117, 5975719, 6092282, 6002225, 6156934, 6133751, 6358702, 6295508, 6465988, 6584165, 6576947, 6535174, 6184843, 6387536, 6717758, 6910901, 6683452, 6790632, 6930504, 7060653, 7077442, 7108032, 7135470, 7296761, 7221348, 6913648, 7034459, 7104989, 6995768, 7098497, 7165112, 7353774, 7511432, 7837750, 7907849, 8114834, 8472075, 8438757, 8542971, 8604702, 8854302, 8867105, 9151801, 9366872, 9452209, 9859772, 10061942, 10073316, 10090789, 10418367, 10539853, 10643961, 11178104, 10895538, 10683883, 10357749, 10348633, 10245147, 9900166, 9577373, 9196894, 8802871, 8682604, 8673701, 8678535, 8321410, 8301349, 8236600]
4756H236600k07927J85129R4205J48113J78062M55927J0121O0844K98994m5100
4746I414968k71060R0792J71932o0651p3164j76093l28060j01282j29408k24017
4736H313957k52031k99335n33131l57078j64084k65706k74703j26876j84578l02548
4726E553887q0399j40851j16480o3518r0596j17596p0041k5423j82442k89853
4716D376688Q2325M5257N3008j11319k79007L96569M4975j63684k77616L30588
4706D497784P645l35009K8888R5796k21367k40143R2840L06542r3405j43895j80655
4695C815021J02409j90392R4103J76772J26857M6880j19063j23367L4228k6281
4685C937167k5391N7753k60079j68852q254j7552J25134k7727k44421k71767j22814
$$ y = [8236600, 8028673, 8213802, 8308007, 8456120, 8634182, 9090109, 9100230, 9161074, 9460068, 9414968, 9143908, 9234700, 9406632, 9345981, 9272817, 9096724, 8768664, 8667382, 8537974, 8313957, 8061926, 7762591, 7229460, 6872382, 6708298, 6442592, 6167889, 6041013, 5856435, 5553887, 5473488, 5332637, 5216157, 5152639, 5062043, 4944447, 4874406, 4848983, 4666541, 4376688, 4459013, 4504270, 4557278, 4445959, 4166952, 4563521, 4608496, 4444812, 4167196, 4497784, 4505429, 4170420, 4199308, 4295104, 4073737, 3833594, 3926434, 4232976, 4139571, 3995676, 3815021, 3917430, 3727038, 3821141, 3997913, 4124770, 4171650, 4052587, 3929220, 3963448, 3937167, 3911776, 3969529, 3709450, 3540598, 3532344, 3514792, 3639926, 3612199, 3367778, 3096011, 2973197]
4674B973197J7832L3634J33656J21435R5389j49291K23689j36625j09781k18649
4664B984486m4233m9689N5957J99645J04697j40158k48415R0370k22407K22132
4654B952385P4631j59641P2464N4395J6180p4999K1930O095J59100j32281N1969
4643C042228l9407j50512J578J14960K11673k08349n6791M5577N5674M3842j78853
4632B881620j15187K67580J92532k87967n9088j44246j37295J6357J07156J29495
4622B850957N3473o1110j86533R9636j78256j1105K89523j45156j79470j12857
4612B419102P8263j65745j17946k8292J73503M6012j44432J51393K27222j47931
4602B491149L3932k30675P3800J73480P6739J0756n9726k409j5307n5287J88629
$$ y = [2973197, 2991029, 3024663, 3158319, 3279754, 3375143, 3225852, 3449541, 3312916, 3203135, 2984486, 2940253, 2890564, 2946521, 3146166, 3250863, 3110705, 2862290, 2952660, 2730253, 2952385, 3027016, 2867375, 2939839, 2994234, 3010414, 2935415, 2957345, 2963440, 3122540, 2990259, 3042228, 3002821, 2852309, 2853887, 2968847, 3180520, 2972171, 2915380, 2960957, 3016631, 3060473, 2881620, 2766433, 3034013, 3226545, 2938578, 2879490, 2735244, 2597949, 2614306, 2721462, 2850957, 2904430, 2843320, 2656787, 2756423, 2578167, 2567062, 2856585, 2711429, 2531959, 2419102, 2497365, 2331620, 2213674, 2185382, 2358885, 2404897, 2260465, 2411858, 2639080, 2491149, 2525081, 2294406, 2368206, 2541686, 2618425, 2629181, 2569455, 2567046, 2551739, 2496452, 2685081]
4591B685081k9381J93655J63585k21574k18204L8264k44104K08083K14947j90940
4581B599412K25705j54759q6968j32344J39130q836p7323l92590J06451k0154
4571B197724K13217P4706q4478K1729k91912N4776Q3583J52144R4521k75907l359
4560B236744J07184j03942Q3620j97786o2301k9J21040P2237P6932J34894k5222
4549B443371j58184q0898j03550k0773R6795k8453K57161K72256j67842j46373
4539B363510j61854K6586J37927K05995J20223j99096l66374l0553J78032q2368
4529B192028K9807j58400j40265J54161J60557j72227N4936j56928K39475l9382
4519B163762J53384k14693k43835M5485M4909J66556K24787J25644k26197J23855
$$ y = [2685081, 2655700, 2849355, 3012940, 2791366, 2573162, 2611426, 2367322, 2575405, 2790352, 2599412, 2825117, 2670358, 2583390, 2451046, 2590176, 2581340, 2504017, 2111427, 2217878, 2197724, 2410941, 2485647, 2401169, 2422898, 2130986, 2185762, 2269345, 2421489, 2516010, 2240103, 2236744, 2343928, 2239986, 2323606, 2125820, 2063519, 2063490, 2184530, 2256767, 2333699, 2468593, 2443371, 2285187, 2204289, 2100739, 2079966, 2176761, 2148308, 2405469, 2677725, 2509883, 2363510, 2201656, 2228242, 2366169, 2572164, 2692387, 2493291, 2126917, 2096364, 2274396, 2192028, 2221835, 2063435, 1923170, 2077331, 2237888, 2065661, 2120597, 1963669, 2203144, 2163762, 2317146, 2102453, 1858618, 1904103, 1949012, 2115568, 2340355, 2465999, 2239802, 2363657]
4509B363657Q2748l03704J13300J45419j07442l7630p9399K80965j71086j42768
4499B144060R22j20861j18626M12920J90643j45014J77650j47522K8717J68826
4489B591715J5772j10208j3028L19719J8407Q5854p6609j92542J32282l0234l3690
4478B707438J55373K06451j35407N49742L64515K94365L91519L11875k14884m83309
4468D147678l53938l39809j93347j64653l9998k33754l7018J64759l32864P6562
4458B693618K3279j596n2360l1330Q993J45060m8329j31563O5077n7220K60557
4447B874186l17221J82992Q9901J62392J10451n4720j39968l4699L8198m7927
4437B863585J71098O8047l52825q5974J45107L21368M0207L4795K2712K25381
$$ y = [2363657, 2446405, 2142701, 2256001, 2401420, 2293978, 2256348, 2176949, 2457914, 2286828, 2144060, 2144982, 2024121, 1905495, 2318415, 2509058, 2364044, 2541694, 2394172, 2422889, 2591715, 2607487, 2497279, 2484251, 2803970, 2822377, 2908231, 2831622, 2639080, 2771362, 2741128, 2707438, 2862811, 3069262, 2933855, 3483597, 3848112, 4142477, 4533996, 4845871, 4630987, 4147678, 3793740, 3453931, 3260584, 3095931, 3055933, 2822179, 2785161, 2949920, 2617056, 2693618, 2716897, 2715301, 2662941, 2631611, 2640604, 2785664, 2737335, 2605772, 2670849, 2613629, 2874186, 2556965, 2739957, 2829858, 2992250, 3102701, 3047981, 2908013, 2873314, 2911512, 2863585, 3034683, 3102730, 2749905, 2663931, 2809038, 3130406, 3170613, 3205408, 3228120, 3453501]
4427C453501k07754L1534o6286j88391J93815J16305k55859k94608L98816j4606
4417C166467r1454j82878j92426K69425k33779q6948R3855R8636j70884R017L0018
4406B709049P7282o4529J64224p971k4047J24941q2059J94886o8124J19640k17288
4395B926004J02938O2445n9458O4818j87580K04328j749P0491M37307l32901l42035
4384B944608N7927J08717l5247K5233J87522j11050J6356N4677q6659N9822K3068
4373C244974M328P3699L28610k67531p2206m3722J09455K1049Q2490J42496k14874
4362C408768K49246J41623Q1681r1794J48637M3548k34154L03762J02848k08480
4352C945685j09321n6321R7821J59751M421J41471j3p7572j1421K7763l7213K80948
$$ y = [3453501, 3245747, 3277281, 3210995, 3022604, 3216419, 3332724, 3076865, 2782257, 3181073, 3166467, 3075013, 2892135, 2699709, 2969134, 2735355, 2648407, 2742262, 2840898, 2670014, 2679031, 2709049, 2786331, 2721802, 2886026, 2878055, 2854008, 2978949, 2896890, 3091776, 3023652, 3143292, 2926004, 3028942, 3091387, 3031929, 3096747, 2909167, 3113495, 3111746, 3182237, 3619544, 3286643, 2944608, 3002535, 3111252, 3076005, 3101238, 3288760, 3177710, 3194066, 3248743, 3162084, 3221906, 3244974, 3249302, 3323001, 3651611, 3384080, 3311874, 3268152, 3377607, 3398656, 3481146, 3623642, 3408768, 3658014, 3799637, 3881318, 3789524, 3938161, 3981709, 3747555, 4051317, 4154165, 3945685, 3836364, 3780043, 3877864, 4037615, 4042036, 4183507, 4183494, 4105922, 4094501, 4122264, 4085051, 4365999]
4340D365999J73933k4441n3196P9333K7997Q8279r051q9215J24801K29442o5710
4329D848171J3382K87253J17785m442j4503p1499R5277O286N3078L08700J83396
4318E822884k10669K48289J25604J08743M3449k05026K57037q149K45968M91381
4308F919511r8313R1782K7222L22933K55789K8410J11308K41827J11626L7132
4298H049227N49085J21804K0348M8894J87639P1598P1378J87521K45594P2001
4288I625089J48573K03687K08126J13749K71416J40091O10115M33890M92740N64961
4278A2812437N11297M40447K26214L20421M70968J01435N19571O68088N09813
4269A6580691M84018O27514R13594R79978Q90335P72879J018094J239893J179079
$$ y = [4365999, 4539932, 4515491, 4462295, 4541628, 4569625, 4657904, 4648853, 4559638, 4684439, 4913881, 4848171, 4861553, 5148806, 5266591, 5262149, 5247646, 5176147, 5271424, 5277710, 5330788, 5639488, 5822884, 5612215, 5860504, 5986108, 6094851, 6138300, 5933274, 6190311, 6182162, 6428130, 6919511, 6821198, 6912980, 6940202, 7263135, 7518924, 7547334, 7658642, 7900469, 8012095, 8049227, 8598312, 8720116, 8740464, 8789358, 8976997, 9048595, 9119973, 9307494, 9553088, 9625089, 9773662, 9977349, 10185475, 10299224, 10570640, 10710731, 11320846, 11754736, 12247476, 12812437, 13323734, 13764181, 13990395, 14310816, 14781784, 14883219, 15402790, 16070878, 16580691, 17064709, 17692223, 18605817, 19585795, 20476130, 21249009, 22267103, 23506996, 24686075]
4260B4686075J248711J050676O46891J3230j88978r48146j217957j215309j212615
4251B2862578j070590p33896m16892k09253l93611k84877P4981q31N2694L01168
4241B0181471P19705J96263N01667M53899N25467L91588J83264P0947K18720M11393
4231B3854384K66079K47901K86394K1502K31528n0046J64087M04832o4348m20282
4221B4942031R6169J21212j29371j37006k08875Q5265M22135K9076J42506L36860
4211B5700002P3236K3739J30669K37781P8521K58042N44373M66963L15060K45150
4201B8073536L32226K94701l46184k67667k01170l5069J29428j75469L87334K38799
4191B8430465J89130L61131O14701P83447R24268J190653J097968J106672J241925
$$ y = [24686075, 25934786, 26985462, 27632353, 27645583, 27456605, 26508459, 25290502, 24075193, 22862578, 21791988, 21058092, 20641200, 20431947, 20038336, 19753459, 19828440, 19827609, 19880303, 20181471, 20901176, 21097439, 21599106, 22053005, 22578472, 22970060, 23153324, 23224271, 23442991, 23854384, 24120463, 24368364, 24654758, 24676260, 24907788, 24857742, 25021829, 25426661, 25362313, 24942031, 25038200, 25159412, 25030041, 24893035, 24684160, 24769425, 25191560, 25220636, 25363142, 25700002, 25773238, 25796977, 25927646, 26165427, 26243948, 26501990, 27046363, 27513326, 27828386, 28073536, 28405762, 28700463, 28354279, 28086612, 27885442, 27850373, 27979801, 27804332, 28191666, 28430465, 28619595, 28980726, 29595427, 30378874, 31303142, 32493795, 33591763, 34698435, 35940360]
4182C5940360R23100L42894M74100L18621O77769P21700M26120N79617R30785
4173D1335066J118377Q01471J167911J330510J416898J499364J967732K282618
4165E2919947K662567L226374L717090M534644N431215O354508P192708P567738
4157I3606791O736637M183443J867737R43552J688757M031478N987735P038550
4149A26084680O217890N465482N453264P259168J1284287J5603554J8513977J8191459
4141B14073761J2342282J757031j0185577j8209461k0515876k0178924j8479908
4134A40603328j5952390j3318551j0660817q522473o921085o042708m899758m352461
4126F9933085l512432k706297k526802k204522j496898j513151r82275n37004
$$ y = [35940360, 36863460, 37206354, 37680454, 37999075, 38676844, 39398544, 39824664, 40404281, 41335066, 42453443, 43254914, 44422825, 45753335, 47170233, 48669597, 50637329, 52919947, 55582514, 58808888, 62525978, 67060622, 72491837, 78846345, 86039053, 93606791, 100343428, 104526871, 106394608, 107338160, 109026917, 113058395, 119046130, 126084680, 132302570, 137768052, 143221316, 150480484, 161764771, 177368325, 195882302, 214073761, 226416043, 228173074, 217987497, 199778036, 179262160, 159083236, 140603328, 124650938, 111332387, 100671570, 92149097, 85228012, 79185304, 74285546, 69933085, 66420653, 63714356, 61187554, 58983032, 57486134, 55972983, 54990708, 54453704]
4118E4453704q54451k58553k67925l24535L6049K90057O86967O06459K77795P46051
4108E5391618N60477N80002N72887O44448Q23579M82201M81383M96104N42467
4099F0575166N92382O38661N41659N02772P26953O01646P39574O32831N28659
4090F6080303P10635L59943N16920L46240j11918n9260J5250n7356M7526j80082
4080F7668201P4209K23364K98887J87983K54835N67949P05938O12869J136805
4071G1731040J675026K297940L661361L845735L030179j945799n634233n770975
4063G2890274m527509k851295j718679j054310j061738p23423p28435n61357p3274
4054E9590254j25595l09441k79602k14337M0309K00688p888K93529J48475K87458
$$ y = [54453704, 53599253, 53340700, 53072775, 52748240, 52784289, 53074346, 53761313, 54367772, 54645567, 55391618, 55952095, 56532097, 57104984, 57749432, 58573011, 59055212, 59536595, 60032699, 60575166, 61167548, 61806209, 62347868, 62850640, 63577593, 64179239, 64918813, 65551644, 66080303, 66790938, 67150881, 67667801, 68014041, 67902123, 67842863, 67858113, 67800757, 67848283, 67668201, 67742410, 67965774, 68264661, 68452644, 68707479, 69275428, 69981366, 70594235, 71731040, 73406066, 75704006, 79365367, 83211102, 86241281, 84295482, 78661249, 72890274, 68362765, 65511470, 63792791, 62738481, 61676743, 60953320, 60224885, 59663528, 59590254, 59464659, 59155218, 58875616, 58661279, 58701588, 58902276, 58894388, 59187917, 59336392, 59623850]
4044E9623850M82723M09265K44297K78219l2154K27838L89911J69321K28230K82107
4034F2303607Q3688j13185O810n0848R490m0333l0397m8332l22517l90424N4747
4023F1462306k99736n15633n87050n51268l73788n38308r33150p79894n35398
4014E6348081q69064m62258o89115p40943o77337o32657r20212p98100m53597
4005E0104798n93244r59655j084026l73867n78375q25052o37075m04411o05485
3996D4043608n06996m75996o79564n09970n35325m13957j33587n06108o7737k19273
3986C9995095j49813k29554L8976q4266l23428L40394O3014J17322l3098p8632
3976C9656010j47532q1673J65247K88781O6229O4062K06634J74564K47957J01572
$$ y = [59623850, 60106573, 60515838, 60760135, 61038354, 61006200, 61234038, 61623949, 61793270, 62021500, 62303607, 62387295, 62274110, 62280920, 62230072, 62239562, 62199229, 62168832, 62120500, 61797983, 61407559, 61462306, 61162570, 60646937, 60059887, 59508619, 59134831, 58596523, 57663373, 56883479, 56348081, 55479017, 55016759, 54327644, 53586701, 52909364, 52276707, 51356495, 50558395, 50104798, 49511554, 48551899, 47467873, 47094006, 46515631, 45690579, 45053504, 44649093, 44043608, 43536612, 43060616, 42381052, 41871082, 41335757, 40921800, 40788213, 40282105, 40214368, 39995095, 39845282, 39615728, 39654704, 39570438, 39247010, 39587404, 39650418, 39767740, 39734642, 39656010, 39508478, 39426805, 39592052, 39880833, 39947062, 40011124, 40217758, 40392322, 40640279, 40741851]
3966D0741851M82529J43297J02964O8983j93867j02931K81289J05479q6849k77591
3956D1265154J11702N6922k18568j1591q5958n17492m45103l11370n13422l47542
3946C8982732j27113k98266k68439m26325m70230j51059j4388k04605l39744l06620
3936C6375943p2424m46513j12392K01242q6788K66809J83377M13236J66414M96589
3926C7385493P62707R85332J056974P86888J508731J386784J803539J700157J439331
3917D8815936K062419J790291K000108K230585K106740J932210K556992K446415
3909F5941696K415866K315960K538893K339920K584212K471689K429432K113871
3901H5151539J831457K134785J937861J871100J812359J707225J619162J329596
$$ y = [40741851, 41224380, 41367677, 41470641, 41539624, 41345757, 41242826, 41524115, 41629594, 41542745, 41265154, 41376856, 41433778, 41215210, 41203619, 41117661, 40600169, 40155066, 39843696, 39330274, 38982732, 38855619, 38557353, 38288914, 37862589, 37392359, 37241300, 37226912, 37022307, 36682563, 36375943, 36303519, 35857006, 35744614, 35945856, 35859068, 36125877, 36309254, 36722490, 36888904, 37385493, 38148200, 39133532, 40190506, 40977394, 42486125, 43872909, 45676448, 47376605, 48815936, 50878355, 52668646, 54668754, 56899339, 59006079, 60938289, 63495281, 65941696, 68357562, 70673522, 73212415, 75552335, 78136547, 80608236, 83037668, 85151539, 86982996, 89117781, 91055642, 92926742, 94739101, 96446326, 98065488, 99395084]
3893I9395084J197374Q92877L92792j21823l18392j027787j247083j510835j541822
3884I6110385j538419j505552j841155j619000j936730j942484j694948j732738
3876H2299359k042076k122115j832476k316370j874286j991981k306799j857825
3868F5955431j564529j529009j233078j351466j322205j286749j156010j026482
3860E5485903p37317q07286l88439J8135J01942N72787Q52936Q45671J050780
3851E6995112J021167J394084J116545J205873J019414O05289L48321M23419J73747
3842F4302971j06724N230J30583J89953J75166m8743K00106O2988l74970k65278
3832F4271282k60625o21316p14689r31464j257229j045472r36073q46634n61904
$$ y = [99395084, 100592458, 101485335, 101878127, 101756304, 101437912, 100410125, 99163042, 97652207, 96110385, 94571966, 93066414, 91225259, 89606259, 87669529, 85727045, 84032097, 82299359, 80257283, 78135168, 76302692, 73986322, 72112036, 70120055, 67813256, 65955431, 64390902, 62861893, 61628815, 60277349, 58955144, 57668395, 56512385, 55485903, 54748586, 53941300, 53552861, 53570996, 53672938, 54245725, 55098661, 55944332, 56995112, 58016279, 59410363, 60526908, 61732781, 62752195, 63357484, 63705805, 64129224, 64302971, 64196247, 64201477, 64332060, 64522013, 64697179, 64648436, 64848542, 64911530, 64536560, 64271282, 64010657, 63389341, 62674652, 61743188, 60485959, 59440487, 58504414, 57657780, 57095876]
3823E7095876q11520p84294n97553m97307m07002l94784l13440l18301j20805
3814E2850870R4598j86957j30995J87146p0988L42378M9152K69662K10372Q9226
3804E3704464L75298M28315L02388M18706L81290K99345N11067L79807L84792
3795E7185472M01841M84091M98860J65612R9625K24896N41366K54639K7884Q6232
3785E9970518k93315q1145r0509n3572J9273j2780m81322k76418k53062n28963
3775E7918705m71157p87362q73261o73764o94814o29601o63043o33366l03994
3766E2188343o09151q27438n16222k65852r6249k71957k46903M526J17438k26631
3756D9249904l04801m43760k74154j74640k19523k16376m33941j79971o1856J03253
$$ y = [57095876, 56284356, 55500062, 54902509, 54405202, 53998200, 53603416, 53289976, 52971675, 52850870, 52945468, 52758511, 52627516, 52814662, 52743674, 53086052, 53135204, 53404866, 53615238, 53704464, 54079762, 54508077, 54810465, 55229171, 55610461, 55909806, 56420873, 56800680, 57185472, 57587313, 58071404, 58570264, 58735876, 58835501, 59060397, 59601763, 59856402, 59884286, 59970518, 59677203, 59596058, 59505549, 59451977, 59471250, 59458470, 58977148, 58700730, 58447668, 57918705, 57447548, 56660186, 55786925, 55113161, 54418347, 53788746, 53125703, 52492337, 52188343, 51579192, 50751754, 50235532, 49969680, 49873431, 49601474, 49354571, 49359097, 49476535, 49249904, 48945103, 48501343, 48227189, 48052549, 47833026, 47616650, 47182709, 47002738, 46940882, 47044135]
3746D7044135J04085j69575j0918k23453k54268l03768n34104j57587l99003n37733
3736D4557811n35550n54547n29313n88665n22003o03044m53697n78535l00520
3727C9891937l89440n97513k91027m17373n79441m33140k51831m94578P5132j16078
3717C6396648j26365l20429j38551J41120K80405J76823J92581L05034L79124
3708C7286390M98779J20197M24621O85017M30489K82827N59271M70214N71060
3699D1328865N12847L41101L72320N00378N78144M92658N50404M54202M73825
3690D5604744K19277K50168K71898L95760J71510L97849M077K33846J23497J25260
3680D7797886J99133J45645J06148P0443K15345P8160L39480N4454K91650N18913
$$ y = [47044135, 47148220, 46978645, 46967727, 46744274, 46490006, 46186238, 45652134, 45494547, 45095544, 44557811, 44022261, 43467714, 42938401, 42349736, 41827733, 41224689, 40770992, 40192457, 39891937, 39502497, 38904984, 38613957, 38196584, 37617143, 37184003, 36932172, 36437594, 36512726, 36396648, 36270283, 35949854, 35811303, 35952423, 36232828, 36409651, 36602232, 36907266, 37286390, 37785169, 37905366, 38329987, 39015004, 39445493, 39728320, 40287591, 40757805, 41328865, 41841712, 42182813, 42555133, 43055511, 43633655, 44126313, 44676717, 45130919, 45604744, 45824021, 46074189, 46346087, 46741847, 46913357, 47311206, 47315283, 47549129, 47672626, 47797886, 47997019, 48142664, 48248812, 48319255, 48534600, 48612760, 48952240, 49006694, 49298344, 49817257]
3670D9817257N78744K12118L18995N03506M98831M48751O51389Q61334R67476
3661E4858401O17702P72725J226302J552481J136193R27486J251225J738155J702546
3652F5783216J568085J780954J873685K207107K299297K459903K680226K934247
3644H3586720L348257L442631L666829M000931M156952M197572M313198M444180
3636A15157270M478453M028363L896301M049680L630536L552585L455861L348583
3628A45597632L433511L353409L380360L469181K991619K720505K829618K238261
3620A70014096J593563J171998L86794K10766q6645m84396q65908j035764j233493
3611A69671011j525217j636288j368383j521961j458541j266122j373688j763924
$$ y = [49817257, 50396001, 50608119, 50927114, 51430620, 51929451, 52378202, 53029591, 53890925, 54858401, 55476103, 56248828, 57475130, 59027611, 60163804, 61091290, 62342515, 64080670, 65783216, 67351301, 69132255, 71005940, 73213047, 75512344, 77972247, 80652473, 83586720, 86934977, 90377608, 94044437, 98045368, 102202320, 106399892, 110713090, 115157270, 119635723, 123664086, 127560387, 131610067, 135240603, 138793188, 142249049, 145597632, 149031143, 152384552, 155764912, 159234093, 162225712, 164946217, 167775835, 170014096, 171607659, 172779657, 173166451, 173377217, 173290572, 172806176, 171940268, 170904504, 169671011, 168145794, 166509506, 165141123, 163619162, 162160621, 160894499, 159520811, 157756887]
3603A57756887j445212j659281j801320j740861k086949j863420j896094j926089
3595A43337661j760826j585825j646365j432600j674694j413625j044423r00229
3587A31879074j026324q89983p98760n55655n06614n66176o41769m68197l60215
3578A26065381k48827q24102p08452p22509j230579j016371j369877j447090j048751
3569A17448823j195158j527457j360424j151243j231197j184353j290621j377242
3561A07131128j565794j568346j492127k149784j836609j791906j985788j881813
3553I2858961k029014j920771k025083j542277j377193j525990j683639j400493
3545G9354501j356783j644429j364794j192806j223016j505449j535451j107915
$$ y = [157756887, 156311675, 154652394, 152851074, 151110213, 149023264, 147159844, 145263750, 143337661, 141576835, 139991010, 138344645, 136912045, 135237351, 133823726, 132779303, 131879074, 130852750, 129962767, 129164007, 128608352, 128101738, 127535562, 126893793, 126425596, 126065381, 125816554, 124992452, 124284000, 123561491, 122330912, 121314541, 119944664, 118497574, 117448823, 116253665, 114726208, 113365784, 112214541, 110983344, 109798991, 108508370, 107131128, 105565334, 103996988, 102504861, 100355077, 98518468, 96726562, 94740774, 92858961, 90829947, 88909176, 86884093, 85341816, 83964623, 82438633, 80754994, 79354501, 77997718, 76353289, 74988495, 73795689, 72572673, 71067224, 69531773, 68423858]
3537F8423858j502465j272514j220379j393049r25518r43688r62123r27751q63243
3528E8413128p44814n61493p12086r31016q53604q59728r79147q67959p50422
3519E1152859o76002q05300r33275r44789r08642o26075q33057l70284n47918
3510D4507517p31501o17572p75352n12446p43328n98643n71319m56512o65529
3501C8835315p64679m73505q66865n40022n77978n73578j68125k45713j21422
3492C4503428l55937r1237r6127k42524m62570m88716p69467j17726l73230m72839
3482C1033055m94163m45269p02795o50790o86682n67719n31245n37344o18211
3473B5798837l63361o57422m79517n62630q90994o51613m65482m15420p13401
$$ y = [68423858, 66921393, 65648879, 64428500, 63035451, 62109933, 61166245, 60204122, 59276371, 58413128, 57668314, 57106821, 56394735, 55463719, 54610115, 53750387, 52771240, 51903281, 51152859, 50476857, 49671557, 48738282, 47793493, 46884851, 46258776, 45425719, 45055435, 44507517, 43776016, 43158444, 42383092, 41870646, 41127318, 40528675, 39957356, 39500844, 38835315, 38070636, 37597131, 36730266, 36190244, 35612266, 35038688, 34870563, 34624850, 34503428, 34147491, 34056254, 33960127, 33717603, 33255033, 32766317, 31996850, 31879124, 31505894, 31033055, 30538892, 30093623, 29390828, 28740038, 28053356, 27485637, 26954392, 26417048, 25798837, 25435476, 24778054, 24298537, 23735907, 22844913, 22193300, 21727818, 21312398, 20598997]
3464B0598997n73031o85511n09122o23635m80680l41279k75360l91860l44568
3455A6373951m94897o62237r1857k03440k35475l52889j08636j71683k89293J09887
3445A3873431k98807l39521r7385r0234p5249k81050l2285M5751l91024l49592
3435A1964035p4901N4758k74934j06099j22994p9836j81474J80461j27686k35706
3425A0995624J28463J9374q0764J05793n8430k69771j32638N5286R245j95643
3415A0576539k00439m0820n4256j13938r3170j01342k53050L54538j08858J47043
3405A0112247J29513m0514j24594N246k9985j78524m2349o1206K63560k03376
3395I830018Q22L3102k55907L19922M00432p6885j9842n9897j51618j03262k7632
$$ y = [20598997, 20025966, 19340455, 18831333, 18207698, 17727018, 17385739, 17110379, 16718519, 16373951, 15879054, 15216817, 15124960, 14921520, 14686045, 14333156, 14224520, 14052837, 13763544, 13873431, 13574624, 13235103, 13137718, 13047484, 12972235, 12691185, 12658900, 12704651, 12313627, 11964035, 11889134, 11943892, 11668958, 11562859, 11439865, 11360029, 11178555, 11359016, 11231330, 10995624, 11124087, 11143461, 11062697, 11168490, 11110060, 10840289, 10707651, 10762937, 10772182, 10576539, 10376100, 10335280, 10281024, 10167086, 10073916, 9972574, 9719524, 10074062, 9965204, 10112247, 10241760, 10201246, 10076652, 10081898, 10051913, 9873389, 9831040, 9769834, 10033394, 9830018, 9830840, 9863942, 9608035, 9927957, 10328389, 10251504, 10231662, 10171765, 10020147, 9916885, 9889253]
3384I889253L00949j22330o9034J81211P9899j59962O2094M6359j40878J93317
3374A0260878j62218P1749J05847k64408J21305M42705J10152P6044K46354J49740
3364A1158148J54048K73897n1303K86900N19026K02327L32028M43736L30518M09616
3354A4058941M00446J68897K1761m36311l06873l63522r3976K83655k90805J50638
3344A3592851K18484L2099K31696J55222K05287K82500M46131R7470n0063L73188
3334A5584865L42163L52627M90336L68793M60175M84117O13150O14647M97119
3325A9807992Q63764J116262J146073J249936J052958K34900k87780n30528m04195
3316B4249382n3878N291J10284O80383O67859P79156Q20776Q51579J412708J726840
$$ y = [9889253, 10190202, 10067872, 9998838, 10180049, 10259948, 10099986, 10162080, 10208439, 10067561, 10260878, 10098660, 10170409, 10276256, 10011848, 10133153, 10575858, 10686010, 10762054, 11008408, 11158148, 11312196, 11586093, 11534790, 11821690, 12340716, 12543043, 12875071, 13318807, 13649325, 14058941, 14459387, 14628284, 14650045, 14213734, 13906861, 13543339, 13449363, 13733018, 13442213, 13592851, 13811335, 13843434, 14075130, 14230352, 14435639, 14718139, 15164270, 15261740, 15211677, 15584865, 15927028, 16279655, 16769991, 17138784, 17598959, 18083076, 18696226, 19310873, 19807992, 20671756, 21788018, 22934091, 24184027, 25236985, 25471885, 25184105, 24653577, 24249382, 24195504, 24200795, 24311079, 24991462, 25659321, 26438477, 27259253, 28110832, 29523540, 31250380]
3306C1250380J374002J268919J310723Q62028K27669l68284k07125p35561o71707
3297C4311044o10630n67909k40576R0842O16417M99523O21371R02381Q06719M93610
3287C6922792L31807L19222P85538P06870P90029J075682J333876J267582J485067
3278D5018465K018374J995982J948674K480348K787592K916673L108921K743595
3270F5018624J519742l85977j723115k121694k290559j790611j175096r72060
3262E6079254m95920L10582L00835N69037N51239J197628J085852J098213J093768
3253F1790488J545526K101203K151224K383842K735281L500305L560635M246554
3245H4015058M489243M620704M972189N466919N230192M934754N136201M903407
$$ y = [31250380, 32624382, 33893301, 35204024, 36066052, 36293721, 35925437, 35718312, 34982751, 34311044, 33700414, 33132505, 32891929, 32982771, 33599188, 34098711, 34720082, 35622463, 36429182, 36922792, 37254599, 37573821, 38359359, 39066229, 39856258, 40931940, 42265816, 43533398, 45018465, 47036839, 49032821, 50981495, 53461843, 56249435, 59166108, 62275029, 65018624, 66538366, 66152389, 64429274, 62307580, 60017021, 58226410, 57051314, 56079254, 55583334, 55893916, 56194751, 56763788, 57315027, 58512655, 59598507, 60696720, 61790488, 63336014, 65437217, 67588441, 69972283, 72707564, 76207869, 79768504, 84015058, 88504301, 93125005, 98097194, 103564113, 108794305, 113729059, 118865260, 123768667]
3237A23768667N614732N633414N032257M742901M294582L169957K121838L30076
3229A54708424j618440k435688l037595l534068l602911k910481l195369l335925
3221A31037947l011914k738914k827903k665026k791663k445593k370414k181335
3213A10005185k354870k652322l167634l132954m921444o858041o924395o662530
3205G3330995n659507m619291l680311l207012k354968k218152j966279j890850
3197D7734625k200847k117170k240592j942404j872712j364233j621104j288273
3189C3087290o96343r64526p83483o95787q70271n10235l12418k41237R8171M14178
3179B8525339N18005O17809l9276r95727j224662j164263n85135l89538n7120
$$ y = [123768667, 129383399, 135016813, 140049070, 144791971, 149086553, 152256510, 154378348, 154708424, 153089984, 150654296, 147616701, 144082633, 140479722, 137569241, 134373872, 131037947, 128026033, 125287119, 122459216, 119794190, 117002527, 114556934, 112186520, 110005185, 107650315, 104997993, 101830359, 98697405, 93775961, 86917920, 79993525, 73330995, 67671488, 63052197, 59371886, 56164874, 53809906, 51591754, 49625475, 47734625, 45533778, 43416608, 41176016, 39233612, 37360900, 35996667, 34375563, 33087290, 32390947, 31426421, 30642938, 29947151, 29076880, 28566645, 28254227, 28012990, 28111161, 28525339, 29043344, 29661153, 29621877, 28626150, 27401488, 26237225, 25652090, 25262552, 25205432]
3170B5205432J84356M24161K95816K02489j43161j142009j229295j263597j217609
3161B1316583j105657j298565q34305r29638p32843o26002l18503j77198m55792
3152A4838080k34373q8108k91126k36275Q6169r6763m2118j2889J22874J29415
3142A4174886J53450j37655L62500J54075J49315N54360Q8198K07681O0481j25463
3132A5641828k97708o54058p24524n33135n95461l72380r5557j35814j34368l42962
3122A1755861k76743L02172N159l0632q5411j98246M9649R6119m6861J48952L6153
3111A1756172l4581m9895K18268J48616J8866P6410R3561K52490O2242J25294
3101A2667443J42963j69824j46843K24668R0254l5527n1922J45604l0539K03406
$$ y = [25205432, 25389788, 25813949, 26109765, 26312254, 26169093, 25027084, 23797789, 22534192, 21316583, 20210926, 18912361, 18078056, 17148418, 16415575, 15789573, 15471070, 15293872, 14838080, 14603707, 14515599, 14224473, 13988198, 14074367, 13977604, 13935486, 13922597, 14045471, 14174886, 14328336, 14190681, 14553181, 14707256, 14856571, 15410931, 15499129, 15706810, 15767291, 15641828, 15344120, 14690062, 13965538, 13432403, 12836942, 12464562, 12369005, 12233191, 12098823, 11755861, 11479118, 11781290, 11786449, 11755817, 11670406, 11472160, 11521809, 11617928, 11571067, 11720019, 11756172, 11721591, 11671696, 11889964, 12038580, 12057446, 12133856, 12227417, 12479907, 12542149, 12667443, 12810406, 12640582, 12493739, 12718407, 12808661, 12773134, 12721212, 12866816, 12836277, 13039683]
3091A3039683K01594N2603J32430P5497J42129K16969L36714L15452J99690M6309
3081A4759070J58062M73462K18732K52508L46637K87079L43559K00289N34070
3072A7573468L69074J51926M58138O27984N72819P35986P34739Q51744Q88316
3063B2964194J235164J420478J401571J549266J736794K486605K645396K947759
3055C8387227L447375M058324M777285N093399M763279L587980J590938j187877
3047F4517930l224194m501296m567566m121016l046192k590453k250973j447877
3039C8768363j404317j003965p22918m03955l9857M84450M03747P32699J402986
3030C8217233J599173J978755K334333K887715L317697L930855M752037O012488
$$ y = [13039683, 13241277, 13293880, 13426310, 13501807, 13643936, 13860905, 14197619, 14513071, 14712761, 14759070, 14917132, 15390594, 15609326, 15861834, 16208471, 16495550, 16839109, 17039398, 17573468, 17942542, 18094468, 18552606, 19180590, 19753409, 20489395, 21224134, 22075878, 22964194, 24199358, 25619836, 27021407, 28570673, 30307467, 32794072, 35439468, 38387227, 41834602, 45892926, 50670211, 55763610, 60526889, 64114869, 65705807, 64517930, 61293736, 56792440, 52224874, 48103858, 45057666, 42467213, 40216240, 38768363, 37364046, 36360081, 35637163, 35233208, 35193351, 35677801, 36081548, 36814247, 38217233, 39816406, 41795161, 44129494, 47017209, 50334906, 54265761, 59017798, 65030286]
3022F5030286P209881Q916661J0370954J0910575R552647N056990j191223p433847
3014A08422924j1126202j1839327j0537719q786195p053050n773200m915887l764330
3006D4627014l072520k300491k011162j443104j333867r08486o26324l47461j27809
2997C2455790k29888J22245Q65727R30537J156095J484015J843571K471054K815049
2988D3914195L578414L699777L475754K234907L77851j815847l809891m741785
2980D6913375n166441m732161l665605l191521k855758k767625j714522j624548
2972B1195194j227327j196621r71162r09517p73984p68679q31599l83110o58431
2963A3474764o56114k07874k45587l36326n26685r8906J8273m19647j88833k27356
$$ y = [65030286, 72240167, 81156828, 91527782, 102438357, 111991004, 117047994, 115856771, 108422924, 97296722, 85457395, 74919676, 66133481, 59080431, 53307231, 48391344, 44627014, 41554494, 39254003, 37242841, 35799737, 34465870, 33557384, 32931060, 32583599, 32455790, 32225902, 32348147, 33213874, 34144411, 35300506, 36784521, 38628092, 41099146, 43914195, 47492609, 51192386, 54668140, 56903047, 57280898, 55465051, 51655160, 46913375, 41746934, 37014773, 33349168, 30157647, 27301889, 24534264, 22819742, 21195194, 19967867, 18771246, 17800084, 16890567, 16116583, 15347904, 14516305, 14133195, 13474764, 12818650, 12610776, 12365189, 12028863, 11502178, 11403272, 11421545, 11001898, 10813065, 10585709]
2953A0585709j84593l39481k02358j4178j12690k5262k34021j23108k3713o8042
2943I258263l3664j83226l3667M5123P2011j00363J53096M73520J28394k12073
2933I567414J17456L9899P8055N2248L98581L53151j26470J17406L64302J81734
2923A1143776K54332L34612M25454J75608J43139l0065r3420K07193j72803j82073
2913A2205753J38341j28065k55012k6148J10283L12920K72944J3351l1978J81450
2903A2793839M8004K81820L2783K62233J86901J46693M28411Q39329J078980J347581
2893A7446574J125268Q23217J12935q52435j091316j313918j370642j145085p95378
2884A2939220n71688m98215q71289l59954j10693j76122l38449j45273j11299
$$ y = [10585709, 10401116, 10061635, 9859277, 9845099, 9732409, 9707147, 9473126, 9350018, 9326305, 9258263, 9224599, 9041373, 9007706, 9052829, 9124840, 9024477, 9177573, 9651093, 9779487, 9567414, 9684870, 9724769, 9802824, 9855072, 10253653, 10606804, 10480334, 10597740, 10962042, 11143776, 11398108, 11732720, 12158174, 12333782, 12476921, 12446856, 12353436, 12560629, 12387826, 12205753, 12344094, 12216029, 11961017, 11934869, 12045152, 12358072, 12631016, 12644367, 12612389, 12793839, 12841843, 13123663, 13156446, 13418679, 13605580, 13752273, 14180684, 15020013, 16098993, 17446574, 18571842, 19395059, 19507994, 18655559, 17564243, 16250325, 14879683, 13734598, 12939220, 12367532, 11869317, 10998028, 10638074, 10527381, 10351259, 10012810, 9867537, 9756238]
2875I756238p7056k72668j54493N7811P0523J12235n0145J15527K85339q7087
2865I756224n0459K45100K02168K44044J25002m44634l87018m12285l09615m34179
2855H534348m10569l33166n82534j98598k78746k83919l541k19185l35898J6556
2845E904748k69373m3363k6126k73291k55831j49257j64657J59161J56188j11650
2835D926549q9864k7848j17595M192k9241j21378J0039m06239j80661k7602j42150
2824C798202l62094o0551j75020j23379j01882j25335n993j98972j61704p2761
2814B410511L03621j21129m4695j42579m6325K43986j95322J3336l59452j84712
2804A877240N9364Q3064j16284k55106K19934M8203j7128Q2123N0779k6139Q1729
$$ y = [9756238, 9679182, 9406514, 9252021, 9309832, 9380355, 9492590, 9442445, 9557972, 9843311, 9756224, 9705765, 9950865, 10153033, 10397077, 10522079, 10077445, 9690427, 9278142, 8968527, 8534348, 8123779, 7790613, 7208079, 7009481, 6730735, 6446816, 6443275, 6224090, 5888192, 5904748, 5635375, 5592012, 5565886, 5292595, 5036764, 4887507, 4722850, 4882011, 5038199, 4926549, 4836685, 4808837, 4691242, 4695434, 4666193, 4544815, 4554854, 4148615, 3967954, 3940352, 3798202, 3436108, 3375557, 3200537, 3077158, 2975276, 2849941, 2843948, 2644976, 2483272, 2410511, 2714132, 2593003, 2548308, 2405729, 2359404, 2603390, 2408068, 2421404, 2061952, 1877240, 1936604, 2019668, 1903384, 1648278, 1868212, 1916415, 1899287, 1981410, 2032189, 2006050, 2087779]
2793B087779r9075k46201Q3709K40725q1336l6248n3682N1364j05347L8061n8396
2782A821353j96458Q633L0370k5188k00773J02220k48209n4815L81871Q1350j99833
2771A500521Q4979j18492k51547P3369J33279j8865m9784j03790k15635p0178
2761I63857J30185J32508J95174p862J28899N0163j62542l42032r6110K76107
2751A268347J91146k0022k21304M8220M1291p7729L4734k59551n7227M92079p2003
2740A367981l36119J09278j8772R541P0599j24385j10015K30024K09445j35031
2730A272546N7267J06046O4078j48926J02805j67001K22751Q2404k97976k0873
2720A273121K04517j70083j61437N6521l766J33205j84616k03224j96184j65936
$$ y = [2087779, 1988704, 1742503, 1826212, 2066937, 1985601, 1949353, 1895671, 1947035, 1841688, 1879749, 1821353, 1624895, 1633528, 1663898, 1638710, 1437937, 1540157, 1291948, 1237133, 1619004, 1700354, 1500521, 1585500, 1467008, 1215461, 1288830, 1422109, 1403244, 1353460, 1249670, 1034035, 963857, 1094042, 1226550, 1421724, 1413862, 1542761, 1592924, 1430382, 1088350, 992240, 1268347, 1459493, 1439471, 1218167, 1266387, 1307678, 1229949, 1264683, 1005132, 947905, 1439984, 1367981, 1031862, 1141140, 1122368, 1131909, 1202508, 1078123, 968108, 1198132, 1407577, 1272546, 1329813, 1435859, 1499937, 1351011, 1453816, 1286815, 1509566, 1591970, 1293994, 1273121, 1477638, 1307555, 1146118, 1202639, 1198873, 1332078, 1147462, 944238, 748054, 582118]
2710E82118K81063M5848L6745n2598j07305j28378K71639K7484l29047M3567K21251
2699H92387j51702J07696J0485P5464K09811j13856J98020o1256o1124j50779
2689I55146R6360j56088m6644k3928M1604j81079m1188Q2288r1480k6102J70496
2678G79385k6634j33043J9210p3125j82655J37183J69773k38951K9946K46761
2668G27850k18396J29895K32802k2354l3529k00501J24313k97293R2188K34999
2658G69974m5985k52823k08443J60342P6642J29284j09325l29134k1147L79280
2648E48665J69947l4266m95464J63193N0818J66914O7391l2767M0070k05909J98791
2637F37383k48561J74630o1536Q806j22434J34419L5938j76174j02585J17114
$$ y = [582118, 863181, 909029, 945774, 893176, 785871, 657493, 929132, 956616, 627569, 671136, 892387, 740685, 848381, 858866, 934330, 1144141, 1030285, 1228305, 1167049, 1105925, 955146, 1051506, 895418, 848774, 824846, 866450, 685371, 644183, 726471, 634991, 608889, 779385, 752751, 619708, 638918, 565793, 383138, 520321, 690094, 451143, 481089, 727850, 509454, 639349, 872151, 849797, 816268, 615767, 740080, 442787, 534975, 769974, 723989, 471166, 262723, 423065, 499707, 628991, 519666, 190532, 169385, 548665, 718612, 684346, 188882, 352075, 402893, 569807, 637198, 604431, 644501, 438592, 637383, 388822, 563452, 501916, 510722, 388288, 522707, 558645, 382471, 279886, 397000]
2627C97000L69309k12373j35771O3535R051l3885o0448J61432n5358j64514J20826
2616D58804k9319K4199j31567N0840M3301j50786J90101j10334l0269q6207J25059
2605C53822r4555r9907P9563J22584J38901k09360k151l7699Q3197K713l7943
2594B99165o6805K8474J39006n3103o6952j9510P1936K96674l43353j09801M5327
2583B21058R1335Q9119j54577j35955Q2887L0340j6502Q1117p1740K6263j56592
2572H6753J43965J28087O8180Q0614k44973Q3814m0968j19550j97352L3230K14873
2561B36673K95423k39966K08344J71592j75648j73554k48688J44374k2876J11985
2551C07659j75318R9995m6817n1573J30429p3617N3222Q1302J78981p6818J13051
$$ y = [397000, 766309, 553936, 418165, 481700, 490751, 456866, 396418, 557850, 502492, 337978, 458804, 429485, 453684, 322117, 372957, 416258, 265472, 455573, 345239, 314970, 228763, 353822, 259267, 159360, 238923, 361507, 500408, 291048, 288897, 251198, 334395, 337108, 299165, 232360, 260834, 399840, 346737, 279785, 260275, 332211, 628885, 285532, 175731, 221058, 312393, 401512, 246935, 110980, 193867, 224207, 207705, 288822, 217082, 243345, 86753, 230718, 358805, 426985, 507599, 262626, 346440, 305472, 185922, -11430, 21800, 236673, 532096, 292130, 500474, 672066, 496418, 322864, 74176, 218550, 195674, 307659, 132341, 232336, 185519, 133946, 264375, 190758, 243980, 325282, 504263, 427445, 540496]
2540E40496k35389q7360J9286l83701p1172J05110J67828r8568J49356J20632
2530B26518j3043k27280N3132J41807j45179O3421L4953j01329J28650k1233J23955
2519B64372L36127k27205l5276j99418k87195J48311K30084o8444m6998Q0956
2509A95314J43974K72184k10685k45980j27337M7487r8644L7126J66088L0086
2499B09613K22545J04892q3199k60523k45793J20782M968J27340l1449n5888k08691
2488i5403J26718J87789J7122l13203K2461K64162N4654M3375m0332m15675R9868
2477d8464L33875p7696o8690k28207K24395R8101J57441k02229L2608j12907j09906
2466a679J23059J95629J35944l16475j08194K89805j5145n211J4117j76211r5636
$$ y = [540496, 305107, 217747, 237033, -146668, -217840, -112730, 55098, -43470, 105886, 226518, 213475, -13805, 39327, 181134, 35955, 99376, 134329, 33000, 161650, 140417, 264372, 600499, 373294, 338018, 138600, -148595, -284, 229800, 161356, 114358, 195314, 339288, 611472, 400787, 154807, 27470, 74957, -23687, 13439, 179527, 209613, 432158, 537050, 453851, 193328, -52465, 68317, 73285, 200625, 169176, 113288, -95403, 31315, 219104, 236226, -76977, -54516, 209646, 264300, 307675, 267343, -148332, -48464, 285411, 207715, 139025, -89182, 135213, 233314, 390755, 188526, 221134, 108227, -1679, 121380, 317009, 452953, 136478, 28284, 318089, 302944, 297733, 311850, 135639, 40003]
2455D0003j03706j18690P210J01350J92909k13547J06543K53576j79294j47642
2445f1288n2597L40394j17914j69937Q2040K131J28764O4105J89750J9469l06690
2434A18227l08693k8518J49809l9957j6501K43036M1786k28804j13228J90318
2424G475K88391J01465J34223l26977P4537k36318J91214p7738l14682J64434
2414F024K67670K01712l99591q7394J58545n9284J23812p4639P712J64418J32838
2403D41823j5899q8793j61668k41172L10385K8758m5752J44092j1027j93951o9121
2392I7675m4020k35701J41719K09952j37061R55m4770J9202K53864q380N805J20901
2380C80141J96354j18311l23068M3377j11477K06187q1980Q6989j05496J10529
$$ y = [40003, -63703, -182393, -175183, -73833, 119076, -94471, 12072, 265648, 86354, -61288, -113885, 226509, 108595, -61342, 20698, 22829, 151593, 215698, 405448, 424917, 118227, -190466, -218984, -69175, -109132, -125633, 117403, 159189, -69615, -182843, 7475, 295866, 397331, 531554, 204577, 279114, 42796, 234010, 156272, -158410, 6024, 273694, 475406, 75815, -11579, 146966, 87682, 211494, 136855, 144567, 308985, 441823, 425924, 337131, 175463, -65709, 244676, 273434, 227682, 371774, 360747, 166796, 97675, 53655, -182046, -40327, 169625, 32564, 33519, -11251, 7951, 261815, 253435, 259240, 380141, 576495, 458184, 135116, 178493, 67016, 273203, 191223, 278212, 172716, 283245]
2370B83245L08508j31455r1896l7088R3046J81520j19692K8149P159J57674m2223
2359F36947m1205N8403J27476k80988J36121j10381k84339j45970m2157J17298
2349A71205K64370M5143j45683J09345j19153J40116j77786j25182N7484m5117
2339A74742k4686R9873k1210K07375N715j68922m8411J16477k30476Q0473K6426
2328B17376M3429K55566Q9693j61490k17744k65406L006J68004m5107L27784j6801
2317C98310k57447k3091j7043l3286j16503J71340q5712J41209J65303K8211j48403
2306B22888j18858q2641J43280P8520n24Q0684k72718O1281L2934K00227k48716
2295I6357K01918J22448k39533j110K01827M0093J59633P4468q5589j4207j75112
$$ y = [283245, 591753, 460298, 368402, 331314, 424360, 605880, 486188, 514337, 521496, 679170, 636947, 595742, 654145, 781621, 500633, 636754, 526373, 242034, 96064, 53907, 171205, 435575, 480718, 335035, 444380, 325227, 465343, 287557, 162375, 219859, 174742, 150056, 249929, 228719, 436094, 441809, 272887, 224476, 340953, 110477, 190950, 217376, 260805, 516371, 606064, 444574, 226830, -38576, -35570, 132434, 87327, 415111, 398310, 140863, 117772, 100729, 67443, -49060, 122280, 36568, 177777, 343080, 371291, 222888, 104030, 21389, 164669, 243189, 242665, 323349, 50631, 111912, 144846, 345073, 96357, 298275, 420723, 181190, 180080, 381907, 422000, 581633, 656101, 570512, 556305, 381193]
2284C81193j61573j17191K05743R8561q4595q506q9146j16258j9043L05974o6790
2273C28369m2911J27043j72595J04928j18002L14998K4591j07256o8237N6955
2263D47883Q1070k8311k65955J71518Q7829r1825j03577K68934J96080j53024
2253F10622p384R5124r9324j78923r4519j37655J46204n7969J13362R5260J74781
2242F59579n665j70843j14016J01875q395N7392N8057j77918j7768J07203p4142
2231D15359K6348J36844j33593J79006M2479j58698m0024j95363J92626J76357
2221F41341j71312Q9269m8106J87496r1085k41821R7334J34320m5955o9241P5099
2210E57339p556O0664L4318j20519Q2975j18476Q3571K31799m054N4303l4436
$$ y = [381193, 219620, 102429, 308172, 406733, 322138, 313632, 224486, 108228, 89185, 395159, 328369, 285458, 412501, 239906, 344834, 226832, 541830, 566421, 459165, 390928, 447883, 528953, 500642, 234687, 406205, 494034, 402209, 298632, 567566, 763646, 610622, 603238, 698362, 599038, 420115, 325596, 187941, 334145, 276176, 389538, 484798, 659579, 653914, 483071, 369055, 470930, 462535, 519927, 577984, 400066, 382298, 489501, 415359, 441707, 578551, 444958, 623964, 666443, 507745, 467721, 272358, 464984, 641341, 470029, 559298, 511192, 698688, 607603, 365782, 463116, 597436, 551481, 482240, 557339, 549783, 610447, 644765, 524246, 607221, 488745, 572316, 804115, 800061, 854364, 819928]
2199H19928M6486j10825K23357o7307j44198K32692J52901P492q0357n6550K18463
2188A242082K17077k68522k79254P5056K79450o7759K09542R7984K23029j18225
2178A610460k64076K16645L916J21643J56970P456Q5489L7879P6054R2829k15063
2167A930202L7938q2354l25J09156J06898J94810L5652l9379K2749k90454J61947
2156B186840K57379P171Q9684P0945j66741J6679K18238M19545k23215J74212
2146C050737L31077k38497q1090J76560L35347J96614J93849J00050J06685M32955
2136D604287r5432O5411j18044N50281K18009J30049K08702K67880J45223J30786
2126F107152L55661K26772L10952L4570L24699M22111J84888K52260K54598O30784
$$ y = [819928, 866414, 755589, 978946, 911639, 767441, 1000133, 1153034, 1160526, 1080169, 1023619, 1242082, 1459159, 1190637, 911383, 986439, 1265889, 1198130, 1407672, 1505656, 1728685, 1610460, 1346384, 1563029, 1566945, 1688588, 1845558, 1853014, 1938503, 1976382, 2052436, 2145265, 1930202, 1968140, 1885786, 1885461, 1994617, 2101515, 2296325, 2331977, 2292598, 2315347, 2024893, 2186840, 2444219, 2451390, 2541074, 2612019, 2445278, 2461957, 2680195, 3099740, 2876525, 3050737, 3381814, 3143317, 3062227, 3238787, 3574134, 3770748, 3964597, 4064647, 4171332, 4604287, 4508855, 4574266, 4456222, 5006503, 5224512, 5354561, 5563263, 5831143, 5976366, 6107152, 6462813, 6689585, 7000537, 7035107, 7359806, 7781917, 7966805, 8219065, 8473663, 9104447]
2116I104447L92338O32916Q21819L66210P10564R99742J282464J654636R43654
2107A6908790O21142J072285J667600K137741K387251L308142L910558M882258
2099C6895767O371460Q799265J3153717J9155995J9971229J4104447o914773k1785497
2091H9751610k1960602j5881205j0041795p111258n557985m197321l037879k488076
2083A9475489j895258j417209p31185n48508o21796j245463r58123j061103j026364
2074I970480p11920n71591o96689l43934o04369n20654j57796l06786n57403K515
2064E501853p2375l93932q8233q9670l14031k47285l83718k34257O6671j35339
2054C609684k88274q2110k05649j23983l4135j999j02056j10449q2226N2912k5903
$$ y = [9104447, 9496785, 10129701, 10951520, 11317730, 12028294, 13028036, 14310500, 15965136, 16908790, 17529932, 18602217, 20269817, 22407558, 24794809, 28102951, 32013509, 36895767, 43267227, 52066492, 65220209, 84376204, 104347433, 118451880, 111537107, 89751610, 67791008, 51909803, 41868008, 34756750, 29198765, 25001444, 21963565, 19475489, 17580231, 16163022, 15431837, 14883329, 14261533, 13016070, 12057947, 10996844, 9970480, 9258560, 8686969, 7990280, 7646346, 7041977, 6521323, 6363527, 6056741, 5499338, 5501853, 5429478, 5035546, 4947313, 4857643, 4543612, 4296327, 3912609, 3678352, 3745023, 3609684, 3321410, 3239300, 3033651, 2909668, 2875533, 2873534, 2771478, 2661029, 2578803, 2631715, 2605812]
2043B605812K5413j35141j54999k52522J08079l00352k05224J99011N101j80628
2033A714550j45932m4814R5665m2122k03792o8157j78m4777J28544k74146j15338
2022I99503J33520l3182p0363o9240O8435q1438p6011J06363n1748l1682p2938
2011H21219K33802L73j33517k65305j5916j6165l3135J7781l8043J73496J4525
2000G59115J5527P2934j13636j95762l2906J50670o3030n9193K47014j09051n5678
1989F16004R7463N5108m1895J07672m2152k05372q6618Q5099k61154l5804J35595
1978D23946n6624J14212p6798j18288o0165L7044K40436J28249J68259j80036
1968F20235j61068k67284K52511l6509k37445J2653K03851K15232Q119j32468
$$ y = [2605812, 2631225, 2496084, 2341085, 2088563, 2196642, 1896290, 1691066, 1890077, 1895178, 1714550, 1568618, 1523804, 1619469, 1577347, 1373555, 1305398, 1305220, 1260443, 1388987, 1114841, 999503, 1133023, 1099841, 1029478, 960238, 1028673, 947235, 871224, 977587, 925839, 894157, 821219, 1055021, 1055394, 921877, 656572, 640656, 624491, 591356, 609137, 571094, 744590, 759115, 774642, 847576, 733940, 538178, 505272, 655942, 592912, 533719, 780733, 671682, 616004, 713467, 768575, 726680, 834352, 792200, 586828, 500210, 585309, 324155, 288351, 423946, 367322, 481534, 404736, 286448, 226283, 263327, 503763, 632012, 800271, 620235, 459167, 191883, 444394, 407885, 170440, 183093, 386944, 602176, 610295, 477827]
1958D77827r6316o7458K72397j64566j45557N0761M3903k1340j43405Q1655O1680
1947C49581N7818j72603j00086J17319L45106r0832m18168L43595o3323p0963
1937B97444L6331j63312N1243K02879l0019l62859k5445L8769J35481N1845J67876
1926D00233r4927j71850j89037m7394J29645J57018J9310J31164R5798j02547
1916C27413o9424j1468R9325q5006j97622J29933L05113j21199J37666j62169
1906C52562j71105K24640k45718J76985N9737k53682j06665L7870J30435J5037
1896B20096L0135J71899l61872O4918K40240j09013j35243R728o1516K96988j79140
1885A87220k17155p1449k7811J49472p4853J81939K19608N7239j50370k53210
$$ y = [477827, 381511, 314053, 586450, 421884, 276327, 327088, 370991, 349651, 206246, 287901, 349581, 407399, 234796, 134710, 252029, 597135, 506303, 88135, 431730, 368407, 297444, 333775, 170463, 221706, 424585, 394566, 31707, 6262, 45031, 180512, 232357, 400233, 305306, 133456, -55581, -102975, 26670, 183688, 202998, 334162, 429960, 327413, 257989, 246521, 345846, 260840, 63218, 193151, 498264, 377065, 514731, 352562, 181457, 406097, 160379, 337364, 397101, 143419, 36754, 74624, 205059, 220096, 250231, 422130, 60258, 125176, 365416, 256403, 121160, 130888, 69372, 366360, 187220, -29935, -101384, -129195, 20277, -54576, 127363, 346971, 404210, 253840, 630]
1875F30L1863l9647J34254L98338j40156l05644L965J14241k0377R8226K8207
1864C03900J4418r0245r1057R201J19885j31118m5445j84706k1730M16967L5436
1853C35506j67582j60609K23204k08653m5372K66746J0790j38731p2539r3233
1843e0473O1482j2465l4213l5612j1050K00040j79986R0144Q0005R1082j05596
1832I3358R2835J53453L22153J20337j06196j55152j79796J74934J3213J420k24869
1821C05690L0893p4641j34074R9806M1959l4958j30847L10793o188k21313J2034
1810A99154J4109O1025Q5210j70523j25936j78631J98072J30880J33857r7293
1800B49924k08103K28387Q6729l90371M4225L3793K40349j67087L6363J09565
$$ y = [630, 32493, -7154, 127100, 525438, 385282, 79638, 83603, 197844, 177467, 275693, 303900, 318318, 228073, 137016, 146217, 266102, 134984, 89539, -95167, -116897, 300070, 335506, 167924, 7315, 230519, 21866, -23506, 243240, 254030, 115299, 42760, -50473, 11009, -1456, -35669, -71281, -82331, 117709, -62277, 27867, 107872, 198954, 93358, 186193, 339646, 661799, 782136, 675940, 520788, 340992, 515926, 529139, 530559, 305690, 336583, 261942, 127868, 227674, 269633, 234675, 103828, 414621, 408433, 187120, 199154, 213263, 274288, 359498, 188975, 63039, -115592, 82480, 213360, 347217, 249924, 41821, 270208, 356937, -33434, 10791, 44584, 284933, 117846, 154209, 263774]
1790B63774J69869o6757l17870J25376L7036j5987r2677J15223r2003j37695k09143
1779b20854J41959K3701J43323J96440Q776k10607R6281R5367M962M8388k9208
1768B98528J6436M8555m1418n0589J52628j71194k72875M9656j40988J34979P3723
1757I7441m0033n7397O5947n8444m0589K78268k098j55019m9413J84523j01470
1746A21716j92396M6904o0253q034J88564J05657r3763p3683J4433J12472j03045
1735E8572m7222N6583K61072J43865m05673j81725K12697R4574L3749r4362j37290
1724e160P8783K09880k81097J12871R1591J5758j5642j56667j05765M6616K36380
1713B27548Q0510j79988J4861J4092j13486j66024J6527P9291L3088P0842J36561
$$ y = [263774, 433643, 366886, 49016, 174392, 211428, 195441, 102764, 217987, 125984, -11711, -220854, -78895, -55194, 88129, 284569, 293345, 82738, 179019, 274386, 279348, 327736, 298528, 314964, 363519, 322101, 271512, 424140, 252946, -19929, 29727, -111261, 23718, 97441, 57408, 11, 65958, 7514, -33075, 245193, 243095, 88076, 38663, 223186, 121716, -70680, -23776, -84029, -92063, 96501, 202158, 108395, 34712, 49145, 161617, 58572, 11350, 67933, 329005, 472870, 67197, -114528, 98169, 192743, 226492, 132130, -5160, 73623, 283503, 2406, 115277, 206868, 222626, 206984, 50317, -55448, -8832, 227548, 308058, 128070, 142931, 157023, 43537, -122487, -105960, -26669, 6419, 77261, 213822]
1702B13822j02146l07377J16375K5897J8305O0623R1714j2206J6828l3658k30326
1691a42149K26205J19605j57554J95480m4371k53309L7890m3736k01868J06926
1681a56881O8285J77669k82623O873J94857M4355p9805L26632J4178j28855k0228
1670A64457m0335j69o8252J1589J0136j66358o1446o2124J46581Q7934j22557
1659a00544n5433M1163M8812K16191j51042k82019J11291J01050k37723j5329
1649c23583K55760K0081j34752J41544k4948O0011L5502j66915R5776K29888l6764
1638A51600P193j51058m5574J68331p9733P3988J08965K34858j92101q5642j69246
1627B1581L4652n9156J40003k5463o1148N3487l49579J08792K04231j72501J83098
$$ y = [213822, 111676, -195701, -79326, -53429, -35124, 25499, 117213, 105007, 121835, 88177, -142149, 84056, 203661, 46107, 241587, 197216, -56093, -18203, -61939, -263807, -156881, -88596, 89073, -193550, -186677, 8180, 52535, -27270, 299362, 313540, 184685, 164457, 124122, 123953, 55701, 67290, 77426, -88932, -150378, -212502, -65921, 22013, -100544, -155977, -114814, -66002, 150189, -853, -282872, -171581, -70531, -308254, -323583, -67823, -47742, -182494, -40950, -65898, -5887, 29615, -137300, -41524, 188364, 151600, 158793, 7735, -37839, 130492, 50759, 124747, 233712, 468570, 276469, 190827, 21581, 56233, -2923, 137080, 111617, 50469, 103956, -245623, -136831, 67400, -105101, 77997]
1616G7997j0948j90219K54575Q0002k01274p1767n1240J03347k7083K16342j24254
1605E5478J2897m2172j67194o3607N0354k7767l3506O2391R1840n4879O9648O8209
1593B1692j8605J48797J28959k85917j68069K27394J03295m5972p7440N8056J7110
1582A09300j35418j31610l5463K31936j823k5035K12207m1769l06001j43061K21334
1571d5403L7265J55568J5763j04648j40088n110J78381Q3143L0866j50788R5045
1560A49994N3876r614k7928k34168M6169p6296N0019K11707J505k56414j69784
1549b60934R3598J53698j90972M5135l9964L4860J09893n4057p4164J58072Q2517
1538E7682J24495k8896l08945K58481p0789l6428l0450J48825Q7026j68474j24513
$$ y = [77997, 67049, -123170, 131405, 211407, 10133, -61634, -112874, -9527, -36610, 179732, 55478, 68375, 26203, -140991, -204598, -154244, -182011, -215517, -153126, -61286, -116165, -46517, 21692, 3087, 151884, 280843, -5074, -173143, 54251, 157546, 111574, 34134, 92190, 109300, -26118, -157728, -193191, 38745, 36922, 11887, 224094, 182325, -123676, -266737, -45403, -8138, 147430, 163193, 58545, -81543, -86653, 91728, 174871, 205737, 54949, 149994, 203870, 194256, 166328, -67840, -21671, -97967, -47948, 163759, 165264, -91150, -260934, -167336, -13638, -204610, -159475, -199439, -164579, -54686, -108743, -182907, -24835, 57682, 182177, 153281, -155664, 102817, 32028, -4400, -34850, 113975, 201001, 32527, -91986]
1527i1986J65226r6937j89115J86267K71670Q6474j34478p0968k00156L3194m7705
1516h8514K3596k3386P4146j20770J35048p585M3663k2340j35531j15926K18764
1505a8835k28526J8813J84550J76710k0926L9384j63218o6889K61736m15611K70098
1494C7286O9894m34341J24240L57839j39268m490k70102n4197Q841j51712j8073
1483d74083L03636K5381K9401K70570J25277j31428j26558Q4612R4052M7958j46503
1472A02315M6368j71415m3372j8459m3546J2991j35244N0758J24051J29552K67378
1461C21377l51963j61461r6609J51499L2292j19066N7310M5066Q0329J70507k57442
1450a28161j82267J22275L33207K588k08361J01531j20619J54078q8829J74366
$$ y = [-91986, 73240, -23697, -212812, -26545, 245125, 331599, 197121, 126153, -74003, -40809, -88514, -64918, -88304, -14158, -134928, 120, -7465, 36198, 13858, -121673, -237599, -18835, -247361, -228548, -43998, 132712, 111786, 151170, -12048, -78937, 182799, -232812, 37286, 107180, -327161, -202921, 154918, 15650, 11160, -258942, -313139, -304298, -456010, -474083, -170447, -145066, -115665, 154905, 280182, 148754, 22196, 106808, 200860, 248818, 102315, 148683, -22732, -66104, -84563, -128109, -115118, -250362, -199604, -75553, 53999, 321377, -30586, -192047, -288656, -137157, -104865, -223931, -166621, -121555, -41226, 129281, -128161, -310428, -188153, 145054, 147642, -60719, 40812, -79807, 74271, -14558, 159808]
1440A59808j07227K9512j57147k7664r7418k775L9956L0833j1071n5834M6204
1429a52823N6664n207M691p5362j41725J68626L4450J45424o0431J64797j36804
1418B300j18832K0033k3733J12768J8670Q2971j90693j1513J36645j235k95534
1407b68153J0673Q0028J93014k28386L48673r9619m30794j14829L7007J98106
1397b74280O96J90027j3051J69515K40641m3995k63989r9367K0386l6876J6469
1386i3824p5146K9582K78746j56501l8250J64142j18078R5849M3655l5141q0962
1375A4072J00937j4937Q4370j6380O4996j03463R7131j47630k05605K17337j85412
1364i4584j67580k337K92114O4102q2518o8752J21766j0290o7248J00182K45671
$$ y = [159808, 52581, 82093, -75054, -102718, -200136, -202911, -162955, -132122, -143193, -199027, -152823, -96159, -101366, -96675, -172037, -313762, -145136, -110686, 34738, -25693, 139104, 2300, -116532, -96499, -120232, -7464, 11206, 94177, -96516, -108029, 28616, 27381, -268153, -257480, -177452, 15562, -212824, 135849, 36230, -394564, -509393, -472386, -274280, -273584, -83557, -96608, 72907, 313548, 269553, 5564, -93803, -73417, -110293, -93824, -168970, -139388, 139358, -17143, -55393, 108749, -9329, 86520, 130175, 95034, 14072, 115009, 100072, 184442, 168062, 233058, 129595, 226726, 79096, -126509, 90828, -94584, -262164, -264501, 27613, 91715, 9197, -59555, 62211, 51921, -15327, 84855, 330526]
1353C30526j77057j25666J13400j24775J06134p817k24128J30047p6416J68368
1343A12616J17868j64547l45557J8707K9348m4039L09245p7329j99991m0671K50549
1332c3801L8220j02300K32650q8388j77681J49026o8628k70879n5826N2523R1429
1321b33655p6595J79364J91774Q0025j53402p4433l617k5263p8601p8713p5088
$$ y = [330526, 153469, 27803, 141203, 16428, 122562, 114745, -109383, 20664, -55752, 112616, 230484, 65937, -279620, -260913, -231565, -275604, 33641, -43688, -243679, -284350, -33801, 4419, -97881, 134769, 46381, -131300, 17726, -50902, -321781, -377607, -325084, -233655, -310250, -130886, 60888, 140913, -12489, -86922, -90539, -115802, -194403, -273116, -348204]
$$ [...]
##END NTUPLES=NMR SPECTRUM
##END=
