##TITLE=1H_TG-2374-1
 CDCl3
 8 sc, 
 4.10.2023
##JCAMPDX= 6.0         $$ Bruker NMR JCAMP-DX V2.0
##DATA TYPE= NMR SPECTRUM
##DATA CLASS= NTUPLES
##ORIGIN= UXNMR, Bruker Analytische Messtechnik GmbH
##OWNER= root
$$ XWIN-NMR		Version 3.5
$$ Wed Oct  4 14:24:21 2023 Russian Standard Time (UT+4h)  she@DPX200
##.OBSERVE FREQUENCY= 200.13135
##.OBSERVE NUCLEUS= ^1H
##.ACQUISITION MODE= SIMULTANEOUS
##.ACQUISITION SCHEME= undefined
##.AVERAGES= 8
##.DIGITISER RES= 18
##SPECTROMETER/DATA SYSTEM= spect
##.PULSE SEQUENCE= zg30
##.SOLVENT NAME= D2O
##.SHIFT REFERENCE= (INTERNAL, D2O, 0, 15.726)
##AUDIT TRAIL= $$ (NUMBER, WHEN, WHO, WHERE, WHAT)
$$ ##TITLE= Audit trail, XWIN-NMR		Version 3.5
$$ ##JCAMPDX= 5.01
$$ ##ORIGIN= Bruker BioSpin GmbH
$$ ##OWNER= she
$$ F:/spectra/data/she/nmr/H-F/1/pdata/1/auditp.txt
$$ ##AUDIT TRAIL=  $$ (NUMBER, WHEN, WHO, WHERE, WHAT)
(   1,<2023-10-04 14:23:16.31 +0400>,<she>,<DPX200>,
      <created by zg, POWCHK disabled, PULCHK disabled
       configuration hash MD5:
       00 E9 B6 7A A2 85 ED C7 34 08 36 98 17 FE 4E 26
       data hash MD5: 16K
       FF 9D 9F 1F 02 C9 CC 55 2C 15 31 93 A0 89 C0 4D>)
(   2,<2023-10-04 14:23:19.18 +0400>,<she>,<DPX200>,
      <Start of raw data processing
       efp BC_mod = 2 LB = 0.24 FT_mod = 6 PKNL = 1 PHC0 = -21709.13 PHC1 = 9.252709 SI = 16K 
       data hash MD5: 16K
       2C 32 92 E1 51 E5 4C A0 A5 C3 01 8F 62 15 CB 36>)
(   3,<2023-10-04 14:23:33.17 +0400>,<she>,<DPX200>,
      <pk PHC0 = -2.093392 PHC1 = 3.2 
       data hash MD5: 16K
       8A 09 11 A3 AC 16 C9 F0 60 E0 D3 C6 F2 83 99 C6>)
(   4,<2023-10-04 14:23:36.68 +0400>,<she>,<DPX200>,
      <abs ABSG = 5 
       data hash MD5: 16K
       1E C5 7F CB 63 DA E7 6F 04 21 69 3A 4D D7 74 4F>)
$$ ##END=
$$ 
$$ hash MD5
$$ E4 EB 91 6A 69 E1 42 F5 82 3A 80 22 F6 96 E3 D9
##$RELAX= 
##$RELAX= 
##$RELAX= 
##$RELAX= 
##$RELAX= 
##$RELAX= 
$$ Bruker specific parameters
$$ --------------------------
##$DU= <F:/spectra>
##$EXPNO= 1
##$NAME= <H-F>
##$PROCNO= 1
##$TYPE= <nmr>
##$USER= <she>
##$AMP= (0..31)
100 100 100 100 100 100 100 100 100 100 100 100 100 100 100 100 100 100 
100 100 100 100 100 100 100 100 100 100 100 100 100 100 
##$AQSEQ= 0
##$AQ_mod= 1
##$AUNM= <au_zg>
##$AUTOPOS= <>
##$BF1= 200.13
##$BF2= 200.13
##$BF3= 200.13
##$BF4= 200.13
##$BF5= 200.13
##$BF6= 200.13
##$BF7= 200.13
##$BF8= 200.13
##$BYTORDA= 1
##$CFDGTYP= 0
##$CFRGTYP= 5
##$CHEMSTR= <none>
##$CNST= (0..31)
1 1 145 1 1 1 1 1 1 1 1 1 1 1 1 1 1 1 1 1 1 1 1 1 1 1 1 1 1 1 1 1 
##$CPDPRG= <>
##$CPDPRG1= <>
##$CPDPRG2= <>
##$CPDPRG3= <>
##$CPDPRG4= <mlev>
##$CPDPRG5= <mlev>
##$CPDPRG6= <mlev>
##$CPDPRG7= <mlev>
##$CPDPRG8= <mlev>
##$CPDPRGB= <>
##$CPDPRGT= <>
##$D= (0..31)
0 1.2 0 0 0 0 0 0 0 0.06 0 0.03 0 0 0 0 0.0002 0 0 0 0 0 0 0 0 0 0 0 0 
0 0 0 
##$DATE= 1696414995
##$DBL= (0..7)
120 120 120 120 120 120 120 120 
##$DBP= (0..7)
150 150 150 150 150 150 150 150 
##$DBP07= 0
##$DBPNAM0= <>
##$DBPNAM1= <>
##$DBPNAM2= <>
##$DBPNAM3= <>
##$DBPNAM4= <>
##$DBPNAM5= <>
$$ [...]
##$SUBNAM3= <"">
##$SUBNAM4= <"">
##$SUBNAM5= <"">
##$SUBNAM6= <"">
##$SUBNAM7= <"">
##$SUBNAM8= <"">
##$SUBNAM9= <"">
##$SW= 18.05172834244
##$SWIBOX= (0..15)
0 0 2 0 0 0 0 0 0 0 0 0 0 0 0 0 
##$SW_h= 3612.71676300578
##$TD= 16384
##$TD0= 1
##$TE= 0
##$TE2= 300
##$TE3= 300
##$TEG= 300
##$TL= (0..7)
0 120 120 120 120 120 120 120 
##$TP= (0..7)
150 150 150 150 150 150 150 150 
##$TP07= 0
##$TPNAME0= <>
##$TPNAME1= <>
##$TPNAME2= <>
##$TPNAME3= <>
##$TPNAME4= <>
##$TPNAME5= <>
##$TPNAME6= <>
##$TPNAME7= <>
##$TPOAL= (0..7)
0.5 0.5 0.5 0.5 0.5 0.5 0.5 0.5 
##$TPOFFS= (0..7)
0 0 0 0 0 0 0 0 
##$TUNHIN= 0
##$TUNHOUT= 0
##$TUNXOUT= 0
##$USERA1= <user>
##$USERA2= <user>
##$USERA3= <user>
##$USERA4= <user>
##$USERA5= <user>
##$V9= 5
##$VALIST= <valist>
##$VCLIST= <CCCCCCCCCCCCCCC>
##$VD= 0
##$VDLIST= <DDDDDDDDDDDDDDD>
##$VPLIST= <PPPPPPPPPPPPPPP>
##$VTLIST= <TTTTTTTTTTTTTTT>
##$WBST= 1024
##$WBSW= 4
##$XGAIN= (0..3)
0 0 0 0 
##$XL= 0
##$YL= 0
##$YMAX_a= 325397
##$YMIN_a= -415970
##$ZGOPTNS= <>
##$ZL1= 120
##$ZL2= 120
##$ZL3= 120
##$ZL4= 120
##$ABSF1= 15.65985
##$ABSF2= -2.391997
##$ABSG= 5
##$ABSL= 3
##$ALPHA= 0
##$AQORDER= 0
##$ASSFAC= 0
##$ASSFACI= 0
##$ASSFACX= 0
##$ASSWID= 0
##$AUNMP= <proc_1d>
##$AZFE= 0.1
##$AZFW= 0.1
##$BCFW= 0
##$BC_mod= 2
##$BYTORDP= 0
##$COROFFS= 0
##$CY= -3
##$DATMOD= 1
##$DC= 0
##$DFILT= <>
##$DTYPP= 0
##$F1P= 0
##$F2P= 0
##$FCOR= 1
##$FTSIZE= 16384
##$FT_mod= 6
##$GAMMA= 0
##$GB= 0
##$INTBC= 1
##$INTSCL= 3.70164e-10
##$ISEN= 128
##$LB= 0.24
##$LEV0= 0
##$LPBIN= 0
##$MAXI= 10000
##$MC2= 0
##$MEAN= 0
##$ME_mod= 0
##$MI= 1.114404
##$NCOEF= 0
##$NC_proc= -7
##$NLEV= 6
##$NOISF1= 3.799351
##$NOISF2= 2.8
##$NSP= 0
##$NTH_PI= 0
##$NZP= 0
##$OFFSET= 15.72596
##$PC= 1
##$PHC0= -21711.22
##$PHC1= 12.45271
##$PH_mod= 1
##$PKNL= yes
##$PPARMOD= 0
##$PSCAL= 0
##$PSIGN= 0
##$REVERSE= no
##$SF= 200.130009123188
##$SI= 16384
##$SIGF1= 3
##$SIGF2= 2
##$SINO= 5.538805
##$SIOLD= 16384
##$SREGLST= <1H.CDCl3>
##$SSB= 0
##$STSI= 16384
##$STSR= 0
##$SW_p= 3612.71676300578
##$SYMM= 0
##$S_DEV= 0
##$TDeff= 16384
##$TDoff= 0
##$TI= <>
##$TILT= no
##$TM1= 0
##$TM2= 0
##$TOPLEV= 0
##$USERP1= <user>
##$USERP2= <user>
##$USERP3= <user>
##$USERP4= <user>
##$USERP5= <user>
##$WDW= 1
##$XDIM= 16384
##$YMAX_p= 455143248
##$YMIN_p= -2579225
$$ End of Bruker specific parameters
$$ ---------------------------------
##NTUPLES= NMR SPECTRUM
##VAR_NAME=  FREQUENCY,     SPECTRUM/REAL,   SPECTRUM/IMAG
##SYMBOL=    X,             R,               I
##VAR_TYPE=  INDEPENDENT,   DEPENDENT,       DEPENDENT
##VAR_FORM=  AFFN,          ASDF,            ASDF
##VAR_DIM=   16384,         16384,           16384
##UNITS=     HZ,            ARBITRARY UNITS, ARBITRARY UNITS
##FACTOR=    0.220516191357247, 1,           1
##FIRST=     3147.23647380841, 0,            0
##LAST=      -465.480289197369, 0,           0
##MIN=       -465.480289197369, -2579225,    0
##MAX=       3147.23647380841, 455143248,    0
$$ Real data points
##PAGE= N=1
##DATA TABLE= (X++(R..R)), XYDATA
$$ [...]
$$ plain form
6056 3886748 3632358 3439886 3516991 3654657 3823506 3759904 3641918 4041020 3912035 3607674
6046 3607674 3285926 3124908 2614484 2676915 2885459 2959547 2847471 2880048 3154178 2901088
6036 2901088 2975542 3195275 3557782 3658797 3560213 3507315 3454538 3403382 3660183 3691666 3472536
6025 3472536 3491880 3893719 4374489 4334293 4741123 5223485 5144686 4693061 3783694 3444850
6015 3444850 3129115 2730751 2790966 2851546 2768294 2684929 2531544 2140664 2081143 1998290 2026237
6004 2026237 1882971 1730595 1740432 1898084 2165562 1872896 1977736 2314981 2291952 2614475
5994 2614475 2822527 2589785 2677714 2809017 3078518 3318560 3039019 2779255 2323320 2171027
5984 2171027 1970014 2055120 1967849 1808462 1836225 1729859 1673598 1436660 1372147 1262205
$$ packed form
6056C886748k54390j92472P7105J37666J68849o3602j17986L99102j28985l04361
6046C607674l21748j61018n10424O2431K08544P4088j12076L2577K74130k53090
6036B901088P4454K19733L62507J01015r8584n2898n2777n1156K56801L1483k19130
6025C472536J9344M01839M80770m0196M06830M82362p8799m51625r09367l38844
6015C444850l15735l98364O0215O0580q3252q3365j53385l90880n9521q2853K7947
6004B026237j43266j52376R837J57652K67478k92666J04840L37245k3029L22523
5994B614475K08052k32742Q7929J31303K69501K40042k79541k59764m55935j52293
5984B171027k01013Q5106q7271j59387K7763j06366n6261k36938o4513j09942
$$ plain form
5974 1262205 1291646 1626687 1481547 1447278 1464426 1298298 1464979 1801486 1738852 1504757
5964 1504757 1904940 1998684 2056759 1933891 1982504 1798914 1860824 1772219 2010894 2286430
5954 2286430 2409939 2475446 2432549 2302452 2185779 2410596 2352795 2848156 2966985 2852959
5944 2852959 2876261 2923310 2560702 2725834 2921763 2873084 2935781 2714891 2901630 3142319
5934 3142319 3303193 3003393 2881704 2912442 3374938 3625515 3653949 3678132 3795775 3687500
5924 3687500 3888783 4200480 3837681 4181417 4234265 4148829 4398644 4984669 5293383 5652149
5914 5652149 6175122 6232953 6656599 7230656 8111235 9182343 10003219 11350994 12709679
5905 12709679 13815632 14505858 14658253 14350268 14196326 13640188 12429878 10909401 9214859
$$ packed form
5974A262205K9441L35041j45140l4269J7148j66128J66681L36507o2634k34095
5964A504757M00183R3744N8075j22868M8613j83590O1910q8605K38675K75536
5954B286430J23509O5507m2897j30097j16673K24817n7801M95361J18829j14026
5944B852959K3302M7049l62608J65132J95929m8679O2697k20890J86739K40689
5934C142319J60874k99800j21689L0738M62496K50577K8434K4183J17643j08275
5924C687500K01283L11697l62799L43736N2848q5436K49815N86025L08714L58766
5914E652149N22973N7831M23646N74057Q80579J071108Q20876J347775J358685
5905A2709679J105953O90226J52395l07985j53942n56138j210310j520477j694542
$$ plain form
5896 9214859 8296328 7686841 7336106 7150408 7197342 7349804 7480504 7924208 7952603 8351272
5886 8351272 9206139 9805064 10899974 12103245 12703363 12613552 12266615 11866581 11522104
5877 11522104 11233973 11076809 10028536 8617835 7373357 6702311 6095089 5709446 5209931
5868 5209931 4624302 4506111 4217833 3927329 3341881 3310864 2966257 2571765 2385551 2304227
5858 2304227 2604256 2623919 2642780 2890935 2739906 2592076 2447299 2233601 2213420 1787271
5848 1787271 1820676 2097242 2104533 1968884 2169047 2040504 2337140 2407616 2156562 2513679
5838 2513679 2945342 3056510 3185326 3010912 2758570 2644405 2158177 2131678 1958143 2332729
5828 2332729 2365744 2211747 1917270 1871188 1671055 1545463 1474864 1602608 1972693 1806422
$$ packed form
5896I214859r18531o09487l50735j85698M6934J52462J30700M43704K8395L98669
5886H351272Q54867N98925J094910J203271O00118q9811l46937m00034l44477
5877A1522104k88131j57164j048273j410701j244478o71046o07222l85643m99515
5868E209931n85629j18191k88278k90504n85448l1017l44607l94492j86214q1324
5858B304227L00029J9663J8861K48155j51029j47830j44777k13698k0181m26149
5848A787271L3405K76566P291j35649K00163j28543K96636P0476k51054L57117
5838B513679M31663J11168J28816j74414k52342j14165m86228k6499j73535L74586
5828B332729L3015j53997k94477m6082k00133j25592p0599J27744L70085j66271
$$ plain form
5818 1806422 1835105 2100388 2145079 2241873 2241081 2503831 2582655 2753450 2804675 2364769 2388687
5807 2388687 2250963 2178403 2525440 2570086 2859007 2919003 2924709 2349633 2228342 2089142
5797 2089142 1832485 1750391 1450513 1543246 1697739 1680853 1368223 1549297 1369630 1435225
5787 1435225 1554701 1609818 1578465 1679282 1704970 1626616 1377563 1535350 1569060 1612805 1670078
5776 1670078 1813644 1944881 1796826 2147579 2245104 2150363 2433791 2197308 1686394 1270011
5766 1270011 1542154 1485279 1564154 1799888 1483627 1254242 1226167 1353293 1844071 1741112
5756 1741112 1329832 1281352 1271097 1576726 1340025 1308399 1295057 767342 752210 946946
5746 946946 1116586 882224 850291 969482 762295 711454 1017395 1242907 1374120 1252925
$$ packed form
5818A806422K8683K65283M4691R6794p92K62750P8824J70795N1225m39906K3918
5807B388687j37724p2560L47037M4646K88921N9996N706n75076j21291j39200
5797B089142k56657q2094k99878R2733J54493j6886l12630J81074j79667O5595
5787A435225J19476N5117l1353J00817K5688p8354k49053J57787L3710M3745N7273
5776A670078J43566J31237j48055L50753R7525r4741K83428k36483n10914m16383
5766A270011K72143n6875P8875K35734l16261k29385k8075J27126M90778j02959
5756A741112m11280m8480j0255L05629k36701l1626j3342n27715j5132J94736
5746I46946J69640k34362l1933J19191k07187n0841L05941K25512J31213j21195
$$ plain form
5736 1252925 1568003 1364055 1283800 1468104 1233500 984232 934855 1204543 1204171 1386181
5726 1386181 1290865 1406465 1246016 1411406 1333138 1296538 1411088 1263513 1403374 1514606
5716 1514606 1316491 1035295 976495 1442884 1631035 1550633 1113521 1086686 1196819 1182816
5706 1182816 1029143 804466 1160871 1414236 875460 862550 943875 1259793 1224006 1092508
5696 1092508 1523035 1238553 884806 1137497 1223964 1303825 1180111 1320235 1419691 1355002
5686 1355002 1485214 1451717 1660519 1914903 2079403 2319535 2377043 2324302 2486768 2095384
5676 2095384 1926347 1467793 1722401 2025761 1930765 1844971 1721073 1772260 1989656 2076478
5666 2076478 2260356 2539731 2574375 2594355 2709129 2413380 2047580 2437042 2420710 2238225
$$ packed form
5736A252925L15078k03948q0255J84304k34604k49268m9377K69688l72J82010
5726A386181r5316J15600j60449J65390p8268l6600J14550j47575J39861J11232
5716A514606j98115k81196n8800M66389J88151q0402m37112k6835J10133j4003
5706A182816j53673k24677L56405K53365n38776j2910Q1325L15918l5787j31498
5696A092508M30527k84482l53747K52691Q6467P9861j23714J40124R9456o4689
5686A355002J30212l3497K08802K54384J64500K40132N7508n2741J62466l91384
5676B095384j69037m58554K54608L03360r4996q5794j23898N1187K17396Q6822
5666B076478J83878K79375L4644J9980J14774k95749l65800L89462j6332j82485
$$ plain form
5656 2238225 2262350 2224191 1904286 1940705 2388407 2483204 2846776 2606337 2503551 2840973
5646 2840973 3100253 2802722 2688089 2626552 2759466 2648137 2742963 3299578 3511514 3893045
5636 3893045 4218569 4573827 5245786 6001337 6296598 5942409 5161868 4620489 4195971 3653833
5626 3653833 3347259 3093517 2634653 2593512 2814231 2787742 2787725 2985999 2740648 2449353 2504148
5615 2504148 2733480 2575415 2673082 2841421 2919347 2842207 2967244 3262124 3660220 3855540
5605 3855540 4211665 4974274 5675866 6076131 6887750 7663925 7628990 7357620 7052879 6120345
5595 6120345 5177824 4592303 3872713 3733160 3362391 3167690 3280094 3104647 2940690 2941867
5585 2941867 3203528 3029746 2970310 2898985 2833773 2621604 2851038 2849813 2913816 3335762 3631726
$$ packed form
5656B238225K4125l8159l19905L6419M47702R4797L63572k40439j02786L37422
5646B840973K59280k97531j14633o1537J32914j11329R4826N56615K11936L81531
5636C893045L25524L55258O71959P55551K95261l54189p80541n41379m24518n42138
5626C653833l06574k53742m58864m1141K20719k6489j7J98274k45351k91295N4795
5615B504148K29332j58065R7667J68339P7926p7140J25037K94880L98096J95320
5605C855540L56125P62609P01592M00265Q11619P76175l4935k71370l04741r32534
5595F120345r42521n85521p19590j39553l70769j94701J12404j75447j63957J177
5585B941867K61661j73782n9436p1325o5212k12169K29434j225O4003M21946K95964
$$ plain form
5574 3631726 3462513 3747015 4186669 4463440 5028548 5723069 6559625 6931334 7206467 7002323
5564 7002323 6579349 5531054 4714733 4367234 4179775 3538775 3269255 3384761 3414806 3079867
5554 3079867 3157284 3042466 2834283 3214237 3126814 2975360 2886238 3017335 3085882 3095601 3370971
5543 3370971 3258188 3406324 3435273 3588084 3432921 3578230 4060533 4610650 5229809 5549245
5533 5549245 5791382 6255155 6391102 6029015 5411551 5037307 4467211 4145312 4109434 3592140
5523 3592140 3760353 3928439 3678361 4041457 4328715 4062287 3724274 3550225 3493604 3097580
5513 3097580 2959937 2830082 2819986 3137239 3130543 3141081 3304625 3593174 3922253 4137041
5503 4137041 4823763 5258997 5613956 5955339 6375594 6685859 6617476 5789289 5916293 5746640
$$ packed form
5574C631726j69213K84502M39654K76771N65108O94521Q36556L71709K75133k04144
5564G002323m22974j048295q16321l47499j87459o41000k69520J15506L0045l34939
5554C079867P7417j14818k08183L79954q7423j51454q9122J31097O8547R719K75370
5543C370971j12783J48136K8949J52811j55163J45309M82303N50117O19159L19436
5533E549245K42137M63773J35947l62087o17464l74244n70096l21899l5878n17294
5523C592140J68213J68086k50078L63096K87258k66428l38013j74049n6621l96024
5513C097580j37643j29855j0096L17253o696J0538J63544K88549L29079K14788
5503D137041O86722M35234L54959L41383M20255L10265o8383q28187J27004j69653
$$ plain form
5493 5746640 5617997 6027578 6217193 6739564 6917968 6450951 5638144 4854548 4042860 3662959
5483 3662959 3425154 3379310 3296839 3344825 3327693 3423831 3411662 3185691 3137722 2901052 2687601
5472 2687601 2802777 3114841 3419691 3476953 3231183 3232074 3245677 3545392 3622467 3761393 3962462
5461 3962462 4442123 5132896 5738085 5884653 5890180 5686933 4907500 4381037 4312141 3868970
5451 3868970 3533022 3623669 3015233 2961755 3138917 3654184 3499084 3258984 3292045 3184485
5441 3184485 2921938 2899247 2937012 2749930 2769151 2850505 2557665 2455233 2515331 2690260
5431 2690260 2894544 2842859 2877753 2861295 2866282 2691080 2757501 3019978 2976378 3166268 3457187
5420 3457187 3536200 4082623 4415835 4465954 4542244 4944710 4728276 4612263 4354668 4368151
$$ packed form
5493E746640j28643M09581J89615N22371J78404m67017q12807p83596q11688l79901
5483C662959k37805m5844q2471M7986j7132R6138j2169k25971m7969k36670k13451
5472B687601J15176L12064L04850N7262k45770Q91J3603K99715P7075J38926K01069
5461C962462M79661O90773O05189J46568N527k03247p79433n26463o8896m43171
5451C868970l35948R0647o08436n3478J77162N15267j55100k40100L3061j07560
5441C184485k62547k2691L7765j87082J9221Q1354k92840j02432O0098J74929
5431B690260K04284n1685L4894j6458M987j75202O6421K62477m3600J89890K90919
5420C457187P9013N46423L33212N0119P6290M02466k16434j16013k57595J3483
$$ plain form
5410 4368151 4410393 4173960 4030004 3777905 3360384 3443878 3618982 3634095 4059294 3810655
5400 3810655 3531972 3154560 3216482 3742966 3611693 3501795 3403219 3540787 3389486 3578943
5390 3578943 3713970 3948397 4072352 4028872 4343632 4309375 4437710 4488059 5038077 5636119
5380 5636119 6309905 6814793 7464619 8565683 9104279 9664336 10677181 11215869 11256512
5371 11256512 10789148 9767927 8376029 7335510 6664432 6375051 6070861 5458142 5288268
5362 5288268 5045154 4685429 4776418 4861036 4850944 4546528 4683527 4762738 4983736 5208475
5352 5208475 5569680 5597116 5869245 6171985 6750875 7227829 7656626 8397322 9190748 10398703
5342 10398703 11220359 12093131 12016833 11527781 10658657 10435586 10314331 10448005 10941176 11207374
$$ packed form
5410D368151M2242k36433j43956k52099m17521Q3494J75104J5113M25199k48639
5400C810655k78683l77412O1922N26484j31273j09898r8576J37568j51301J89457
5390C578943J35027K34427J23955m3480L14760l4257J28335N0349N50018N98042
5380E636119O73786N04888O49826J101064N38596N60057J012845N38688M0643
5371A1256512m67364j021221j391898j040519o71078k89381l04190o12719j69874
5362E288268k43114l59725R0989Q4618j0092l04416J36999P9211K20998K24739
5352E208475L61205K7436K72129L02740N78890M76954M28797P40696P93426J207955
5342A0398703Q21656Q72772p6298m89052q69124k23071j21255J33674M93171K66198
$$ plain form
5332 11207374 10966598 10150198 8991559 8329174 7426790 6597184 6203574 5723339 5551420
5323 5551420 5311734 5227079 5288732 5012824 4943077 5329378 5447191 5822806 6523052 6809392
5313 6809392 7032935 7905696 8565042 9076010 9668958 10086997 9600772 8579947 7678876
5304 7678876 6608367 5864751 5567446 5326520 5682123 5663326 5563894 5305069 4749962 4316334
5294 4316334 3897302 3737665 3657933 3036997 2960876 2898374 2501580 2496033 2555576 2851849 3072096
5283 3072096 2730974 2534974 2600038 2578999 2658099 2425540 2410091 2489061 2528786 2586774 2637060
5272 2637060 3083488 3257990 3261742 3195122 3083194 3533527 3642152 3413263 3275395 2857729
5262 2857729 3083064 3015700 2885343 2897693 2580866 2183133 2089628 2376449 2658928 2716817
$$ packed form
5332A1207374k40776q16400j158639o62385r02384q29606l93610m80235j71919
5323E551420k39686q4655O1653k75908o9747L86301J17813L75615P00246K86340
5313F809392K23543Q72761O59346N10968N92948M18039m86225j020825r01071
5304G678876j070509p43616k97305k40926L55603j8797r9432k58825n55107m33628
5294D316334m19032j59637p9732o20936p6121o2502l96794n547N9543K96273K20247
5283C072096l41122j96000O5064k1039P9100k32559j5449P8970L9725N7988N0286
5272B637060M46428J74502L752o6620j11928M50333J08625k28889j37868m17666
5262B857729K25335o7364j30357J2350l16827l97733r3505K86821K82479N7889
$$ plain form
5252 2716817 2699187 2767542 2892481 2856951 2682379 2196698 2241885 2376426 2570009 2437292
5242 2437292 2055730 2065881 2046258 2216353 2310362 2176794 2324734 2517439 2681286 2844519
5232 2844519 2719498 2765961 2441602 2318854 2268164 2320696 2250067 1993830 1769721 1825687
5222 1825687 1816086 2105389 2150817 2619862 2688078 2582422 2442493 2468010 2362849 2252674
5212 2252674 2238862 2507431 2697053 2742160 2575949 2464863 2077687 2190763 2404450 2680709
5202 2680709 2473717 2784597 2832002 2508098 2221615 2195611 2278227 2078819 2194875 2371000
5192 2371000 2404713 2234335 2183483 2240412 2350387 2366192 2202321 2046771 2159505 2327317
5182 2327317 2460066 2218474 2087516 2077810 2250428 2374265 2557870 2577091 2788104 2719246
$$ packed form
5252B716817j7630O8355J24939l5530j74572m85681M5187J34541J93583j32717
5242B437292l81562J0151j9623J70095R4009j33568J47940J92705J63847J63233
5232B844519j25021M6463l24359j22748n0690N2532p0629k56237k24109N5966
5222A825687r601K89303M5428M69045O8216j05656j39929K5517j05161j10175
5212B252674j3812K68569J89622M5107j66211j11086l87176J13076K13687K76259
5202B680709k06992L10880M7405l23904k86483k6004Q2616j99408J16056J76125
5192B371000L3713j70378n0852N6929J09975J5805j63871j55550J12734J67812
5182B327317J32749k41592j30958r706J72618J23837J83605J9221K11013o8858
$$ plain form
5172 2719246 2610266 2547485 2775500 2742334 2660991 2835006 2755509 2731414 2724012 2627042 3102955
5161 3102955 3158822 3211339 3242961 3414777 3221073 3126556 3505903 3838984 3870418 3925093 3765192
5150 3765192 3657590 3726869 4022422 3832914 3958369 4400688 4365722 4225900 4352851 4486923
5140 4486923 4787725 5019990 5730888 6178367 6665069 7255043 7394314 7245708 6788096 6318264
5130 6318264 5619456 5239456 5328060 5402318 5368632 5255349 5503160 5800405 5856759 6217759
5120 6217759 6605213 7013575 7144266 7557311 8231831 8561794 8862825 8845863 8542584 7900831
5110 7900831 6985023 6645041 6422838 6383344 6353527 6175008 5982606 5998167 5919172 6038788
5100 6038788 6245455 6464183 6699536 6726923 7142514 7597495 7918996 8168191 8002802 7784073
$$ packed form
5172B719246j08980o2781K28015l3166q1343J74015p9497k4095p402r6970M75913
5161C102955N5867N2517L1622J71816j93704r4517L79347L33081L1434N4675j59901
5150C765192j07602O9279K95553j89508J25455M42319l4966j39822J26951J34072
5140D486923L00802K32265P10898M47479M86702N89974J39271j48606m57612m69832
5130F318264o98808l80000Q8604P4258l3686j13283K47811K97245N6354L61000
5120F217759L87454M08362J30691M13045O74520L29963L01031j6962l03279o41753
5110G900831r15808l39982k22203l9494k9817j78519j92402J5561p8995J19616
5100F038788K06667K18728K35353K7387M15591M54981L21501K49195j65389k18729
$$ plain form
5090 7784073 7633269 7390238 7637374 7781511 8055575 8529712 8905745 9264146 9225494 8442919
5080 8442919 7728572 7369266 7258956 7589829 7721506 7993839 7874037 7535042 7992362 7712222
5070 7712222 7290450 7047791 6776559 6478047 6568119 6898950 6756460 6846825 6945431 7253602
5060 7253602 7725038 8021795 8219323 9079440 9845815 10622610 11296323 11959253 12213774 12475864
5050 12475864 12554679 11807846 10438465 9412127 8255954 7261201 6720838 6528205 6344497
5041 6344497 6012050 5971961 5973493 6128704 6120410 5833932 5895734 6115381 6269022 6812513 7056608
5030 7056608 7248371 8017864 8929965 10084525 11064991 11950089 13229660 14159358 14280784
5021 14280784 13854467 13835374 14031921 13603081 13223017 11703647 10297586 8963201 8021035
$$ packed form
5090G784073j50804k43031K47136J44137K74064M74137L76033L58401l8652p82575
5080H442919p14347l59306j10310L30873J31677K72333j19802l38995M57320k80140
5070G712222m21772k42659k71232k98512R0072L30831j42490R0365R8606L08171
5060G253602M71436K96757J97528Q60117P66375P76795O73713O62930K54521K62090
5050A2475864P8815p46833j369381j026338j156173r94753n40363j92633j83708
5041F344497l32447m0089J532J55211q294k86478O1802K19647J53641N43491K44095
5030G056608J91763P69493R12101J154560R80466Q85098J279571R29698J21426
5021A4280784m26317j9093J96547m28840l80064j519370j406061j334385r42166
$$ plain form
5012 8021035 7261518 6803165 6378451 6274628 5960974 5747253 5708110 5521093 5445536 5475030
5002 5475030 5812121 5833604 6158288 6199013 6561422 7266236 7957351 8716118 9673763 10522446
4992 10522446 11349182 11933990 12349595 11307691 10296676 9288049 8534265 8250147 7369029
4983 7369029 6700903 6315239 5723890 5291987 4914353 4869517 4409497 4189551 4304386 4164419
4973 4164419 4096525 3950213 4273296 4495532 4454721 4425119 4296546 4309829 4606959 4665851
4963 4665851 5021272 5567532 5777165 6306707 6840657 6720593 6370385 5693903 4777461 4401740
4953 4401740 4267724 4048102 3822638 3705071 3856138 3908371 3648725 3262470 3205292 3247474
4943 3247474 3192427 2828149 3133633 3274688 3283739 3285320 3098976 3358489 3278063 3339753 3638502
$$ packed form
5012H021035p59517m58353m24714j03823l13654k13721l9143j87017p5557K9494
5002E475030L37091K1483L24684M0725L62409P04814O91115P58767R57645Q48683
4992A0522446Q26736N84808M15605j041904j011015j008627p53784k84118q81118
4983G369029o68126l85664n91349m31903l77634m4836m60020k19946J14835j39967
4973D164419o7894j46312L23083K22236m0811k9602j28573J3283K97130N8892
4963D665851L55421N46260K09633N29542N33950j20064l50208o76482r16442l75721
4953D401740j34016k19622k25464j17567J51067N2233k59646l86255n7178M2182
4943C247474n5047l64278L05484J41055R051J581j86344K59513q0426O1690K98749
$$ plain form
4932 3638502 3487619 3628986 3831952 3883772 4192652 4175912 4290623 4214980 3869123 3698070
4922 3698070 3684991 3563511 3383882 3137990 3235463 3189651 2941454 3148270 3528722 3285534
4912 3285534 3068542 2821700 3135389 3105674 3003471 2842367 3186197 3211991 3169937 3257975
4902 3257975 3150408 3343589 3352814 3238342 3114587 3197585 3350353 3456600 3700247 3634945
4892 3634945 3375483 3253751 3170210 3056138 3391638 3583507 3260764 3147131 3175993 3264281
4882 3264281 3247031 3220672 3181036 3019778 2922648 3250088 3160545 3208505 3303071 2842888 2937645
4871 2937645 3207058 3285179 3421655 3435779 3385973 3338581 3499380 3285606 3022052 3055514
4861 3055514 3146797 3382727 3491360 3591728 3785710 3448945 3377838 3373925 3305686 3499209
$$ packed form
4932C638502j50883J41367K02966N1820L08880j6740J14711p5643l45857j71053
4922C698070j3079j21480j79629k45892R7473m5812k48197K06816L80452k43188
4912C285534k16992k46842L13689k9715j02203j61104L43830K5794m2054Q8038
4902C257975j07567J93181R225j14472j23755Q2998J52768J06247K43647o5302
4892C634945k59462j21732q3541j14072L35500J91869l22743j13633K8862Q8288
4882C264281j7250k6359l9636j61258r7130L27440q9543M7960R4566m60183R4757
4871B937645K69413P8121J36476J4124m9806m7392J60799k13774k63554L3462
4861C055514R1283K35930J08633J00368J93982l36765p1107l913o8239J93523
$$ plain form
4851 3499209 3777929 3441508 3510503 3364141 3358140 3342721 3554996 3648467 3405327 3384308 3244003
4840 3244003 3575865 3653831 3687488 3738136 3608186 3537713 3324425 3451478 3856678 3843324
4830 3843324 3679313 3611723 3535699 3449103 3553382 3852363 3416247 3349993 3531427 3854470
4820 3854470 3642594 3814165 3708017 3500567 3548832 3650940 3897736 3798409 3538076 3402454
4810 3402454 3368114 3395000 3243674 2908640 2652241 2679057 3076304 3403357 3261394 2811867
4800 2811867 2897711 3108615 3034786 3362100 3606899 3221257 3163393 3158847 3129129 3257110 3572987
4789 3572987 3219089 3022124 2979218 3203577 3264398 3267149 3297400 3288994 2920477 3040415 3230822
4778 3230822 3413270 3544703 3452516 3286415 3216860 2949552 2806108 2828187 2966051 3204048
$$ packed form
4851C499209K78720l36421O8995j46362o001j5419K12275R3471k43140k1019j40305
4840C244003L31862P7966L3657N0648j29950p0473k13288J27053M05200j3354
4830C843324j64011o7590p6024q6596J04279K98981m36116o6254J81434L23043
4820C854470k11876J71571j06148k07450M8265J02108K46796r9327k60333j35622
4810C402454l4340K6886j51326l35034k56399K6816L97247L27053j41963m49527
4800B811867Q5844K10904p3829L27314K44799l85642n7864m546k9718J27981L15877
4789C572987l53898j96965m2906K24359O0821K751L0251q406l68517J19938J90407
4778C230822J82448J31433r2187j66101o9555k67308j43444K2079J37864K37997
$$ plain form
4768 3204048 2957621 3100592 3388981 3317228 2814170 3092909 3341480 3262280 3361128 3521516
4758 3521516 3100642 3137797 3419068 3096526 3352360 3388463 3155106 3343600 3531157 3166153
4748 3166153 3128709 3361269 3486580 3636424 3283551 3070825 3137460 3392294 3340964 2916131
4738 2916131 3027007 3240588 3329878 3649523 3368351 3250246 3350049 3198441 3379954 3544006
4728 3544006 3359853 3461676 3339493 3143822 3163142 3493449 3708769 3511862 3676663 3667970
4718 3667970 3848171 3630232 3591525 3570943 3522432 3737073 3466517 3429906 3319557 3212698
4708 3212698 3311014 3019722 3410257 3681079 3757529 3757305 3781878 3721315 3586811 3533888 4190034
4697 4190034 4063933 3877027 3928177 3686103 3868790 3910438 3845835 4128079 4063196 3857221
$$ packed form
4768C204048k46427J42971K88389p1753n03058K78739K48571p9200R8848J60388
4758C521516m20874L7155K81271l22542K55834L6103k33357J88494J87557l65004
4748C166153l7444K32560J25311J49844l52873k12726O6635K54834n1330m24833
4738B916131J10876K13581Q9290L19645k81172j18105R9803j51608J81513J64052
4728C544006j84153J01823j22183j95671J9320L30307K15320j96907J64801q693
4718C667970J80201k17939l8707k0582m8511K14641k70556l6611j10349j06859
4708C212698R8316k91292L90535K70822P6450k24K4573o0563j34504n2923O56146
4697D190034j26101j86906N1150k42074J82687M1648o4603K82244o4883k05975
$$ plain form
4687 3857221 3946499 3991226 3960288 4049471 4050079 4015751 4113485 4078681 4201013 4369137 3941835
4676 3941835 3842510 3903497 3666074 3808747 3830812 3656160 4107015 4356258 4024149 4376376
4666 4376376 4485732 4306712 4442056 4415541 4250449 4490508 4354912 4247480 4080366 4046011
4656 4046011 4208420 4254268 4494457 4752679 4676338 4507505 4823824 4712690 4492646 4514957
4646 4514957 4531963 4473288 4358681 4819286 4828510 5004763 5254909 5183645 4866800 4875231 5239608
4635 5239608 5324892 5420184 5576085 5584064 5673395 5512874 5512466 5574054 5938379 5664668 5719733
4624 5719733 5888938 5935144 5847397 6114155 6115795 6109616 6153958 6289683 6084071 6201626 6355859
4613 6355859 6131873 6348728 6744073 6874592 6628728 6590056 6558050 6485344 6588751 6705036
$$ packed form
4687C857221Q9278M4727l0938Q9183O08l4328R7734l4804J22332J68124m27302
4676C941835r9325O0987k37423J42673K2065j74652M50855K49243l32109L52227
4666D376376J09356j79020J35344k6515j65092K40059j35596j07432j67114l4355
4656D046011J62409M5848K40189K58222p6341j68833L16319j11134k20044K2311
4646D514957J7006n8675j14607M60605R224J76253K50146p1264l16845Q431L64377
4635E239608Q5284R5292J55901P979Q9331j60521m08O1588L64325k73711N5065
4624E719733J69205M6206q7747K66758J640o179M4342J35725k05612J17555J54233
4613F355859k23986K16855L95345J30519k45864l8672l2006p2706J03407J16285
$$ plain form
4603 6705036 7070817 6980008 6397418 6389633 6703738 6764377 6334184 6325751 6218204 6105672 6101645
4592 6101645 6260230 6115197 6244025 6248783 6410390 6084249 6201762 6196830 6305186 6495168
4582 6495168 6731803 6560699 6256977 6231736 6389218 6772715 6906683 6889388 6761543 6250189
4572 6250189 6169989 6512772 6252456 6444841 6633836 6762590 6865248 6776238 6931291 6412531
4562 6412531 6527829 6677668 6612178 6637717 6793950 7062356 6903411 6877750 6957340 7089983
4552 7089983 7265518 7303840 7334305 7707239 7765128 7829054 7965796 8093514 8138494 8325108
4542 8325108 8286155 8222004 7992010 8137559 8264124 8284363 8253801 8122868 8284614 8167481
4532 8167481 8111402 8071374 8215766 8318271 8080236 7852964 7835260 8063754 8154280 8442766
$$ packed form
4603F705036L65781r0809n82590p785L14105O0639m30193q433j07547j12532m027
4592F101645J58585j45033J28828M758J61607l26141J17513m932J08356J89982
4582F495168K36635j71104l03722k5241J57482L83497J33968j7295j27845n11354
4572F250189q0200L42783k60316J92385J88995J28754J02658q9010J55053n18760
4562F412531J15298J49839o5490K5539J56233K68406j58945k5661P9590J32643
4552G089983J75535L8322L0465L72934N7889O3926J36742J27718M4980J86614
4542H325108l8953o4151k29994J45549J26565K0239l0562j30933J61746j17133
4532H167481n6079m0028J44392J02505k38035k27272j7704K28494R0526K88486
$$ plain form
4522 8442766 8586901 8701797 8802544 8865053 9047238 9088325 9187079 9125724 8887784 9115158
4512 9115158 9417975 9562156 9578633 9513535 9923421 10034561 9895573 10194853 10094687 9817707
4502 9817707 9894052 9973340 9995233 10174499 10417808 10516887 10588808 10466552 10304879 10427266
4492 10427266 9990127 10024222 10048507 9853515 9972254 10048271 10400187 10654775 10539086 10620326
4482 10620326 10503386 10306982 10565312 10389664 10264285 10274444 10594695 10729718 10840818 11095512
4472 11095512 11010125 11032036 10891061 10496732 10667441 10999493 11208685 11376765 11520914 11380335
4462 11380335 11393807 10889215 10743266 10687055 10694762 10770929 10701733 10735014 11010487 11120839 11187292
4451 11187292 10972793 11145653 11249563 11084347 11143835 10750269 10870646 10903592 10711451 10825503
$$ packed form
4522H442766J44135J14896J00747O2509J82185M1087R8754o1355k37940K27374
4512I115158L02817J44181J6477o5098M09886J11140j38988K99280j00166k76980
4502I817707P6345P9288K1893J79266K43309R9079P1921j22256j61673J22387
4492A0427266m37139L4095K4285j94992J18739P6017L51916K54588j15689Q1240
4482A0620326j16940j96404K58330j75648j25379J0159L20251J35023J11100K54694
4472A1095512q5387K1911j40975l94329J70709L32052K09192J68080J44149j40579
4462A1380335J3472n04592j45949n6211P707P6167o9196L3281K75473J10352O6453
4451A1187292k14499J72860J03910j65216N9488l93566J20377L2946j92141J14052
$$ plain form
4441 10825503 10915848 11058134 11049868 11042359 10932114 10797276 10675821 10458387 10569704 10573471 10503384
4430 10503384 10190477 10510994 10774340 10469265 10378024 10194493 10081762 10311220 10246593 10390466
4420 10390466 10323330 10363271 10242048 10041216 10229231 10191938 10095770 10199159 10323853 10568954
4410 10568954 10277980 10224728 10194316 10242128 10068593 10081813 10266715 10476040 10693280 10494378
4400 10494378 10292495 10016883 9952423 10027421 9888517 9972885 9972750 9758795 9782547 9981418 9743873
4389 9743873 9617467 9784205 9773159 9805198 9950698 9710609 9719345 10122967 10468340 10654580
4379 10654580 10559575 10570664 10628252 10760168 10698997 10894759 10617159 10935889 10934120 10653811
4369 10653811 10719089 10421081 10407326 10489174 10241498 10059344 10118507 9846252 9807652 10182992
$$ packed form
4441A0825503R0345J42286q266p509j10245j34838j21455k17434J11317L767p0087
4430A0503384l12907L20517K63346l05075r1241j83531j12731K29458o4627J43873
4420A0390466o7136L9941j21223k00832J88015l7293r6168J03389J24694K45101
4410A0568954k90974n3252l0412M7812j73535J3220J84902K09325K17240j98902
4400A0494378k01883k75612o4460P4998j38904Q4368j35k13955K3752J98871k37545
4389I743873j26406J66738j1046L2039J45500k40089Q736M03622L45373J86240
4379A0654580r5005J1089N7588J31916o1171J95762k77600L18730j769k80309
4369A0653811O5278k98008j3755Q1848k47676j82154N9163k72255l8600L75340
$$ plain form
4359 10182992 10400868 10477749 10740121 10821396 10780920 10643813 10509451 10617042 10552072 10471676
4349 10471676 10342321 10059109 9951920 9717649 9216297 9416974 9480891 9157792 9123729 9445111
4339 9445111 9202026 8898039 8947178 8791762 9204818 9437712 9078672 8705329 8982777 8967305
4329 8967305 8722405 9070135 8763858 8707906 8591903 8623910 8893633 9202258 9025737 9007824
4319 9007824 9035093 9251957 9203044 9005294 8678878 8824080 8968073 8775740 8974434 8535072
4309 8535072 8614106 8871483 9017556 8956802 8799275 8788740 8800852 8904670 8915186 8324450
4299 8324450 8584217 9042524 9011165 8826550 8887425 8988249 9088328 9138974 9060851 9206869
4289 9206869 9061448 8792864 9005294 8616402 8924040 9317243 9395802 9283563 9137375 9638338
$$ packed form
4359A0182992K17876P6881K62372Q1275m0476j37107j34362J07591o4970q0396
4349A0471676j29355k83212j07189k34271n01352K00677O3917l23099l4063L21382
4339I445111k43085l03987M9139j55416M13056K32894l59040l73343K77448j5472
4329H967305k44900L47730l06277n5952j16003L2007K69723L08625j76521j7913
4319I007824K7269K16864m8913j97750l26416J45202J43993j92333J98694m39362
4309H535072P9034K57377J46073o0754j57527j0535J2112J03818J0516n90736
4299H324450K59767M58307l1359j84615O0875J00824J00079N0646p8123J46018
4289I206869j45421k68584K12430l88892L07638L93203P8559j12239j46188N00963
$$ plain form
4279 9638338 9547645 9500586 9637686 9731944 9686967 9907345 9896706 9458175 9572441 9811439
4269 9811439 9950966 10331821 10188470 10119065 10508271 10487953 10374606 10538930 10550617 10592396
4259 10592396 10828332 11068477 10952003 10732444 11068731 10954438 11048924 11453964 11563922 11639942
4249 11639942 11949000 11814659 11783142 11727388 11799480 12117583 12110212 12392112 12468927 12804041
4239 12804041 13031981 12940543 13104666 13156092 13067759 13557555 13845686 14370484 14987701 15315504
4229 15315504 16048964 16501783 16617450 17395267 17597490 17900588 18233810 18627471 19220933
4220 19220933 19509236 19358699 19621246 20054595 20299412 20543096 20990773 21345666 21837025
4211 21837025 22422394 22611512 22977822 23407328 23788586 23863246 24471260 24798056 25231678 25713407
$$ packed form
4279I638338r0693m7059J37100R4258m4977K20378j0639m38531J14266K38998
4269I811439J39527L80855j43351o9405L89206k0318j13347J64324J1687M1779
4259A0592396K35936K40145j16474k19559L36287j14293R4486M05040J09958P6020
4249A1639942L09058j34341l1517n5754P2092L18103p371K81900P6815L35114
4239A2804041K27940r1438J64123N1426q8333M89796K88131N24798O17217L27803
4229A5315504P33460M52819J15667P77817K02223L03098L33222L93661N93462
4220A9220933K88303j50537K62547M33349K44817K43684M47677L54893M91359
4211B1837025N85369J89118L66310M29506L81258P4660O08014L26796M33622M81729
$$ plain form
4201 25713407 26261857 26679691 27341815 28322602 28999662 29293302 30319374 31416894 32643067
4192 32643067 33972898 35414139 37576086 39513397 41416928 43684496 46824590 50209252
4184 50209252 53992918 58680398 64538633 71622817 80627555 91627702 104215971 118124678
4176 118124678 129417678 132332464 124187384 107546489 89764837 76125392 66613586
4169 66613586 60978470 57850345 56387913 56003523 54820332 50715385 45017591 40222390
4161 40222390 36511261 33718727 31839885 30123927 28384283 27365967 26192457 25315466
4153 25315466 24752224 24180883 23386674 22788216 22347840 22041037 21616900 21028952 20579581
4144 20579581 20471272 19749796 19401409 19108426 18717403 18665755 18158552 17716217 17107205 16818462
$$ packed form
4201B5713407N48450M17834O62124R80787O77060K93640J026072J097520J226173
4192C2643067J329831J441241K161947J937311J903531K267568L140094L384662
4184E0209252L783666M687480N858235P084184R004738J1000147J2588269J3908707
4176A18124678J1293000K914786q145080j6640895j7781652j3639445r511806
4169F6613586n635116l128125j462432l84390j183191m104947n697794m795201
4161D0222390l711129k792534j878842j715958j739644j018316j173510q76991
4153B5315466n63242n71341p94209n98458m40376l06803m24137n87948m49371
4144B0579581j08309p21476l48387k92983l91023n1648n07203m42335o09012k88743
$$ plain form
4134 16818462 16715550 16489887 16463171 16586616 16266597 16241555 16138566 16048815 15771764 15841051
4124 15841051 15683428 15692749 15569813 15629296 15621107 15844282 15813597 15440164 15460671 15428028 15481973
4113 15481973 15955169 16100816 15732632 15354446 14927816 15393394 15220407 15079577 15379875
4104 15379875 15635027 15499160 15633154 15867139 16072376 15941316 16016683 16384359 16202460 16463495
4094 16463495 16832357 17122095 17380555 17325420 17610258 17813721 18369821 18698711 18973107 19673754
4084 19673754 20425807 20729991 21329872 21629064 21981179 22365451 22968976 23639624 24083575
4075 24083575 25176963 25894244 26523125 26837136 27311152 28090593 29054743 29628239 30217079
4066 30217079 31306843 31516242 31861517 32399924 33251997 33872179 34206548 34576337 35038426
$$ packed form
4134A6818462j02912k25663k6716J23445l20019k5042j02989q9751k77051O9287
4124A5841051j57623R321j22936N9483q189K23175l0685l73433K0507l2643N3945
4113A5481973M73196J45647l68184l78186m26630M65578j72987j40830L00298
4104A5379875K55152j35867J33994K33985K05237j31060P5367L67676j81899K61035
4094A6463495L68862K89738K58460n5135K84838K03463N56100L28890K74396P00647
4084A9673754P52053L04184N99881K99192L52115L84272O03525O70648M43951
4075B4083575J093388P17281O28881L14011M74016P79441R64150N73496N88840
4066C0217079J089764K09399L45275N38407Q52073O20182L34369L69789M62089
$$ plain form
4057 35038426 35867123 36446115 36792685 36939686 37307881 37850625 38138741 38130999 38451168 38849728
4047 38849728 38630699 38449244 38539365 38455681 38250193 38045628 37872253 37312743 37194850 36958191
4037 36958191 36408395 36003132 35835816 35050223 34548221 33928614 33255555 32805191 32219766
4028 32219766 31657460 30945289 30177156 29382945 28822240 28642836 28045581 26958635 26218168
4019 26218168 25633847 24741763 24293862 23811766 22829708 22176424 21874580 21594942 20905278
4010 20905278 20290813 19764566 19262075 18838424 18387769 17564872 17365102 17181802 16760925
4001 16760925 16609751 16651670 16432216 15753023 15775836 15679427 15247596 14887009 14590497 14353003
3991 14353003 14544662 14448031 14386765 14171517 14215898 13942212 13997249 13946040 13936668 14103099 13920525
$$ packed form
4057C5038426Q28697N78992L46570J47001L68195N42744K88116p742L20169L98560
4047C8849728k19029j81455R0121q3684k05488k04565j73375n59510j17893k36659
4037C6958191n49796m05263j67316p85593n02002o19607o73059m50364n85425
4028C2219766n62306p12171p68133p94211n60705j79404n97255j086946p40467
4019B6218168n84321q92084m47901m82096r82058o53284l01844k79638o89664
4010B0905278o14465n26247n02491m23651m50655q22897j99770j83300m20877
4001A6760925j51174M1919k19454o79193K2813r6409m31831l60587k96512k37494
3991A4353003J91659r6631o1266k15248M4381k73686N5037n1209r372J66431j82574
$$ plain form
3980 13920525 13738506 13684668 13739902 13655570 13636896 13904142 13932226 13964738 14418077 14563697
3970 14563697 15012209 14917861 15136142 15438439 15475772 15419661 15395983 15465428 15132057 15604186
3960 15604186 16127241 16165548 16284551 16317141 16659970 16767123 17153077 17604474 17618970 17865451
3950 17865451 18136709 18461784 19035768 18926125 19439987 19475141 19836704 20426120 20713983 20923972
3940 20923972 21294477 21798810 22336859 22956680 23796762 24003191 24775397 25306685 25887585
3931 25887585 26664580 27454455 28490417 29226758 30380438 31957650 33600953 35383402 37217449
3922 37217449 39339422 41963331 44527312 47819724 51100554 54633681 58501847 61927575
3914 61927575 64756560 66959647 68043621 68537017 68291658 67728562 66798271 65420795 64900962
$$ packed form
3980A3920525j82019n3838N5234q4332j8674K67246K8084L2512M53339J45620
3970A4563697M48512r4348K18281L02297L7333n6111k3678O9445l33371M72129
3960A5604186N23055L8307J19003L2590L42829J07153L85954M51397J4496K46481
3950A7865451K71258L25075N73984j09643N13862L5154L61563N89416K87863K09989
3940B0923972L70505N04333N38049O19821Q40082K06429P72206N31288N80900
3931B5887585P76995P89875J035962P36341J153680J577212J643303J782449J834047
3922C7217449K121973K623909K563981L292412L280830L533127L868166L425728
3914F1927575K828985K203087J083974M93396k45359n63096r30291j377476n19833
$$ plain form
3905 64900962 64414510 63895862 64024596 63686075 63390988 63306423 62635268 61534851 59687609
3896 59687609 57603132 55137305 52195103 49100482 45903476 43321684 41505911 39607747
3888 39607747 37957267 37243669 36450856 35565570 34914904 34768478 35024850 35300195 35517053
3879 35517053 35841052 36263714 37074739 37768405 39205419 40689195 42196776 43911899 46016883
3870 46016883 48419161 50648806 52595350 54146261 55578576 56621733 57259061 57591465
3862 57591465 57352637 57229070 56449629 56312612 55960122 55528237 55200383 54726616 54605303
3853 54605303 54608145 53849062 52843123 51617632 50081366 48330323 46254122 44089767 42079810
3844 42079810 40461181 38414985 36717091 35376899 34311903 33247696 32371969 31995524
$$ packed form
3905F4900962m86452n18648J28734l38521k95087q4565o71155j100417j847242
3896E9687609k084477k465827k942202l094621l197006k581792j815773j898164
3888C9607747j650480p13598p92813q85286o50666j46426K56372K75345K16858
3879C5517053L23999M22662Q11025O93666J437014J483776J507581J715123K104984
3870D6016883K402278K229645J946544J550911J432315J043157O37328L32404
3862E7591465k38828j23567p79441j37017l52490m31885l27854m73767j21313
3853E4605303K842p59083j005939j225491j536266j751043k076201k164355k009957
3844D2079810j618629k046196j697894j340192j064996j064207q75727l76445
$$ plain form
3836 31995524 31668755 31514568 30980592 30677127 30476793 30386761 29980006 29743630 29620712 29194564
3826 29194564 28696966 28151673 27784820 27509530 27520832 27339501 27534390 27161848 26935679 26730613
3816 26730613 26500116 26456427 26260594 25736008 25566340 25299125 24933772 24261849 23902525 23333228
3806 23333228 23126486 22826152 22598887 22032861 22015234 22010827 21688451 21441554 21200787 20993853
3796 20993853 21134633 21206588 21069591 21150309 20744252 20575745 20532978 20645188 20462843 20490953
3786 20490953 20433145 20540219 20687371 20695689 20732521 20804680 20624582 20514829 20659903 20766031
3776 20766031 20813972 20990380 21273616 21373385 21282215 21285278 21565273 21581701 21493445 21453861 21470558
3765 21470558 21505939 21637355 21806413 21844925 22068137 22237321 22189951 22009873 22379770 23097674
$$ packed form
3836C1995524l26769j54187n33976l03465k00334r0032m06755k36376j22918m26148
3826B9194564m97598n45293l66853k75290J1302j81331J94889l72542k26169k05066
3816B6730613k30497m3689j95833n24586j69668k67215l65353o71923l59324n69297
3806B3333228k06742l00334k27265n66026j7627m407l22376k46897k40767k06934
3796B0993853J40780P1955j36997Q0718m06057j68507m2767J12210j82345K8110
3786B0490953n7808J07074J47152Q318L6832P2159j80098j09753J45074J06128
3776B0766031M7941J76408K83236R9769r1170L063K79995J6428q8256l9584J6697
3765B1470558L5381J31416J69058L8512K23212J69184m7370j80078L69897P17904
$$ plain form
3755 23097674 23489910 23426929 23332557 23419227 23638514 24108636 23853492 24275576 24362997 24345161
3745 24345161 24976562 25266285 25487121 25620842 25799374 25948684 26262058 26325838 26238932 26354089
3735 26354089 26825441 26819176 26828420 27321978 27705244 27936837 27980615 28580557 28863508 28980346
3725 28980346 29272050 29549414 29652522 29917454 30408263 30704473 31284248 31655586 32142453
3716 32142453 32392316 33055759 33205308 33327709 33968634 34245521 34415559 34935284 35716926
3707 35716926 36303455 36492925 36671185 37050634 37395994 37944257 38325323 38525927 39009456
3698 39009456 39592025 39804794 40048973 40558894 40752072 41252221 41794082 41953449 42182027
3689 42182027 42953307 43455345 43438149 43799939 44031298 44282440 45108176 45504628 45986397 46322488
$$ packed form
3755B3097674L92236o2981r4372Q6670K19287M70122k55144M22084Q7421j7836
3745B4345161O31401K89723K20836J33721J78532J49310L13374O3780q6906J15157
3735B6354089M71352o265R244M93558L83266K31593M3778N99942K82951J16838
3725B8980346K91704K77364J03108K64932M90809K96210N79775L71338M86867
3716C2142453K49863O63443J49549J22401O40925K76887J70038N19725P81642
3707C5716926N86529J89470J78260L79449L45360N48263L81066K00604M83529
3698C9009456N82569K12769K44179N09921J93178N00149N41861J59367K28578
3689D2182027P71280N02038j7196L61790K31359K51142Q25736L96452M81769L36091
$$ plain form
3679 46322488 46724894 47434102 47969658 48468386 48761493 49304820 50371338 51365355 51962912
3670 51962912 52768405 53468540 54475598 55394286 56537397 58042268 59229955 60589869 62197429
3661 62197429 64210173 65716246 67317298 68991798 71123498 73319102 75393073 77462876
3653 77462876 79469242 81533139 83700248 85971633 87874209 89538601 91223915 93353361
3645 93353361 94852144 96550550 98360064 99703022 101025612 102168125 103176797 104064624
3637 104064624 104754253 105359542 105518173 105885517 106017470 105765018 105191205 104252313 103210801
3628 103210801 102465668 101262070 99751050 98547524 97349112 96148908 95177011 94103656
3620 94103656 92835570 91638357 90317035 88938403 87253997 85730613 84235551 82739940
$$ packed form
3679D6322488M02406P09208N35556M98728K93107N43327J066518R94017N97557
3670E1962912Q05493P00135J007058R18688J143111J504871J187687J359914J607560
3661F2197429K012744J506073J601052J674500K131700K195604K073971K069803
3653G7462876K006366K063897K167109K271385J902576J664392J685314K129446
3645I3353361J498783J698406J809514J342958J322590J142513J008672Q87827
3637A04064624O89629O05289J58631L67344J31953k52452n73813r38892j041512
3628A03210801p45133j203598j511020j203526j198412j200204r71897j073355
3620I4103656j268086j197213j321322j378632j684406j523384j495062j495611
$$ plain form
3612 82739940 81197909 79247782 77486674 76096152 74187027 72699865 71491049 70223755
3604 70223755 69228294 68226008 67496294 66706890 66074225 65387474 65038577 64491697 64486812 64179049
3594 64179049 63762880 64031050 64254434 64860590 65366210 66169032 67111817 68043447 69278794
3585 69278794 70578831 71937588 72831278 73767020 74783025 75299796 74924500 73787072 72420281
3576 72420281 70553118 68881749 66881182 64989599 63031134 61083010 59816291 58499196
3568 58499196 57251498 56225694 55207302 54051971 53204236 52481358 52066391 51844278 51398311
3559 51398311 50809838 49992983 49546183 49127688 48797894 48438931 48279435 47992937 47237441
3550 47237441 46937812 46897270 46912314 46558804 46467413 46454526 46185020 46217941 45630985 45370238
$$ packed form
3612H2739940j542031j950127j761108j390522j909125j487162j208816j267294
3604G0223755r95461j002286p29714p89404o32665o86751l48897n46880m885l07763
3594F4179049m16169K68170K23384O06156N05620Q02822R42785R31630J235347
3585F9278794J300037J358757Q93690R35742J016005N16771l75296j137428j366791
3576G2420281j867163j671369k000567j891583j958465j948124j266719j317095
3568E8499196j247698j025804j018392j155331q47735p22878m14967k22113m45967
3559E1398311n88473q16855m46800m18495l29794l58963j59496k86498p55496
3550D7237441k99629m0542J5044l53510r1391j2887k69506L2921n86956k60747
$$ plain form
3540 45370238 45199278 45020963 44819263 44651400 44600622 44385788 44493675 44389910 44292640 44580304
3530 44580304 44451630 44817373 44886885 44921910 44947375 44709894 44608715 44670605 45002633 44978265
3520 44978265 44831820 44662227 44594353 44606932 44886218 45047558 45250553 45250406 45368693 45182111
3510 45182111 45111230 45396377 45225491 45226940 45311941 45372732 45259815 45321235 45715609 45676387 45835128
3499 45835128 45912955 45777300 46074902 46548593 46319274 46258098 46293502 46325042 46491354 46471674
3489 46471674 46291877 46598595 46848793 46896297 47079707 46924231 46815296 46678969 47043643 47056904
3479 47056904 47174120 47475120 47743277 47867528 47922071 48227876 48042344 48246142 48205802 48253511
3469 48253511 48682196 49044859 49030084 49460716 49675026 49580863 49558623 49643653 49674988 49575885
$$ packed form
3540D5370238j70960j78315k01700j67863n0778k14834J07887j03765r7270K87664
3530D4580304j28674L65743O9512L5025K5465k37481j01179O1890L32028k4368
3520D4978265j46445j69593o7874J2579K79286J61340K02995j47J18287j86582
3510D5182111p0881K85147j70886J449Q5001O0791j12917O1420L94374l9222J58741
3499D5835128P7827j35655K97602M73691k29319o1176L5404L1540J66312j9680
3489D6471674j79797L06718K50198M7504J83410j55476j08935j36327L64674J3261
3479D7056904J17216L01000K68157J24251N4543L05805j85532K03798m0340M7709
3469D8253511M28685L62663j4775M30632K14310r4163k2240Q5030L1335r9103
$$ plain form
3459 49575885 49746848 50007911 50167783 50146972 50013072 50288310 50393259 50235862 50589395 50463712
3449 50463712 50570931 50522043 50827899 51126526 51283000 51585145 51830002 52348088 52545231 52914403
3439 52914403 53202814 53116731 53211172 53549511 53793804 54149274 54331336 54746694 55154854 55166908
3429 55166908 55483460 55713232 55834544 55875516 56082720 56028828 55903807 55854809 56083925 56679220
3419 56679220 56680351 56799719 57270794 57656298 57978918 58556331 59124043 59423448 60065884 60649406
3409 60649406 61628824 62217498 63088473 63501745 64027853 64310387 64325686 64245012 64583518 65178068
3399 65178068 65705586 66612051 67599048 68472495 69247485 70058912 70966536 71368431 70940958
3390 70940958 70246589 69431373 69256001 69081490 69131689 69308478 69704933 70234526 70712990 70989661
$$ packed form
3459D9575885J70963K61063J59872k0811j33900K75238J04949j57397L53533j25683
3449E0463712J07219m8888L05856K98627J56474L02145K44857N18086J97143L69172
3439E2914403K88411q6083R4441L38339K44293L55470J82062M15358M08160J2054
3429E5166908L16552K29772J21312M0972K07204n3892j25021m8998K29116N95295
3419E6679220J131J19368M71075L85504L22620N77413N67712K99405O42436N83522
3409F0649406R79418N88674Q70975M13272N26108K82534J5299q0674L38506N94550
3399F5178068N27518R06465R86997Q73447P74990Q11427R07624M01895m27473
3390G0940958o94369q15216j75372j74511N0199J76789L96455N29593M78464K76671
$$ plain form
3380 70989661 71012789 71376718 71878719 72435788 73062034 73480233 74061159 74313099 74652801 75332776
3370 75332776 75568903 75935582 76780786 77338916 77944070 78640769 79455731 79898259 80402907
3361 80402907 80972867 81623483 82053196 83121607 83737043 84238440 84981336 85339306 86117276
3352 86117276 87015023 87933764 88717123 89375456 89954680 90597255 91110249 92021619 92973437
3343 92973437 93405924 94088034 95224681 96397864 97774090 98552290 99290702 100495740 101769846
3334 101769846 103003196 103836521 105160600 106517935 108082914 109396026 110772285 112516606
3326 112516606 114265253 116114517 117721588 119041975 120560078 122023527 122695645 123184582
3318 123184582 123415165 124112704 124948053 126203167 127686387 129027624 130631642 132391474
$$ packed form
3380G0989661K3128L63929N02001N57069O26246M18199N80926K51940L39702O79975
3370G5332776K36127L66679Q45204N58130O05154O96699Q14962M42528N04648
3361H0402907N69960O50616M29713J068411O15436N01397P42896L57970P77970
3352H6117276Q97747R18741P83359O58333N79224O42575N12994R11370R51818
3343I2973437M32487O82110J136647J173183J376226P78200P38412J205038J274106
3334A01769846J233350Q33325J324079J357335J564979J313112J376259J744321
3326A12516606J748647J849264J607071J320387J518103J463449O72118M88937
3318A23184582K30583O97539Q35349J255114J483220J341237J604018J759832
$$ plain form
3310 132391474 134443929 136803472 139530379 142617356 145517641 148587693 151290752 152140340
3302 152140340 152321596 153139066 153946008 155008597 156667094 158598219 160406748 162664369
3294 162664369 165402981 167691330 169812681 171800967 174050807 176989131 179850835 183382188
3286 183382188 186958102 190710190 195230711 199920723 203986308 207202476 210085041 213652543
3278 213652543 218189995 223195948 228528752 233227269 238091840 244032819 249856867 252068567
3270 252068567 253258765 256378611 260449573 265961046 273192411 281628148 291112095 301575864
3262 301575864 312955728 325339571 338539337 352663462 367477436 382910084 398353716
3255 398353716 413534891 427810900 440032881 449228122 454488686 455143248 450009476 438512822
$$ packed form
3310A32391474K052455K359543K726907L086977K900285L070052K703059Q49588
3302A52140340J81256Q17470Q06942J062589J658497J931125J808529K257621
3294A62664369K738612K288349K121351J988286K249840K938324K861704L531353
3286A83382188L575914L752088M520521M690012M065585L216168K882565L567502
3278B13652543M537452N005953N332804M698517M864571N940979N824048K211700
3270B52068567J190198L119846M070962N511473P231365Q435737R483947J0463769
3262C01575864J1379864J2383843J3199766J4124125J4813974J5432648J5443632
3255C98353716J5181175J4276009J2221981R195241N260564O54562n133772j1496654
$$ plain form
3247 438512822 420762656 398566195 374829457 351941651 331409875 313789254 298803833
3240 298803833 285202026 271960286 259266578 248341129 238639811 229814948 222314863
3233 222314863 215301897 209049506 203647289 198447026 193728622 189313898 185124518 181798026
3225 181798026 178313034 175107973 171834810 168953132 166036608 163191695 160644038 158086995
3217 158086995 155648362 153002772 150773683 148304354 146047842 143685378 141010742 138813144
3209 138813144 136581841 134889502 133385896 131431069 129747475 128301571 126872202 125732478
3201 125732478 124666862 124003964 123580742 123289142 123340255 123918066 124883654 125953679 127135269
3192 127135269 127098771 124906190 120972156 117165191 113887083 111055839 108789134 107022471
$$ packed form
3247D38512822j7750166k2196461k3736738k2887806k0531776j7620621j4985421
3240B98803833j3601807j3241740j2693708j0925449r701318q824863p500085
3233B22314863p012966o252391n402217n200263m718404m414724m189380l326492
3225A81798026l484992l205061l273163k881678k916524k844913k547657k557043
3217A58086995k438633k645590k229089k469329k256512k362464k674636k197598
3209A38813144k231303j692339j503606j954827j683594j445904j429369j139724
3201A25732478j065616o62898m23222k91600N1113N77811R65588J070025J181590
3192A27135269l6498k192581l934034l806965l278108k831244k266705j766663
$$ plain form
3184 107022471 105357046 104489570 103375459 102002396 101315465 100986489 100522599 99710199 98970563
3175 98970563 98673263 98132932 97926796 97761789 97620990 97929925 98284206 98971071 100041243
3166 100041243 101461214 102997361 105362912 108595772 111975144 116448352 119788365 118945888
3158 118945888 113157619 105925906 100002419 95821978 92264352 89891940 88450935 86892804
3150 86892804 85502454 84344915 83089255 82382105 81774387 80786743 79798899 79298217 79037893
3141 79037893 78493509 78294579 78264505 78247023 77804113 77748480 77930285 78248487 78779205 79553302
3131 79553302 80314093 81950633 83573563 85127364 85737270 83969450 80717944 77677591
3123 77677591 75067616 73372608 71918501 70513781 69603226 68805838 67788379 67122286 66851917
$$ packed form
3184A07022471j665425q67476j114111j373063o86931l28976m63890q12400p39636
3175I8970563k97300n40331k06136j65007j40799L08935L54281O86865J070172
3166A00041243J419971J536147K365551L232860L379372M473208L340013q42477
3158A18945888n788269p231713n923487m180441l557626k372412j441005j558131
3150H6892804j390350j157539j255660p07150o07718r87644r87844n00682k60324
3141G9037893n44384j98930l0074j7482m42910n5633J81805L18202N30718P74097
3131G9553302P60791J636540J622930J553801O09906j767820l251506l040353
3123G7677591k609975j695008j454107j404720r10555p97388j017459o66093k70369
$$ plain form
3114 66851917 66494968 65769441 65044142 64763668 64491754 63924268 63574863 63236504 62885325
3105 62885325 62100523 61615952 61396339 61041435 60663413 60221821 60223393 60397667 60235178 59964701
3095 59964701 59733439 59910190 59756926 59654632 59608016 59622683 59539467 59335132 59074803 59043534
3085 59043534 58918663 58363308 57792204 57884117 57902364 57798595 57663902 57179792 57031905 57028737
3075 57028737 56697213 56485004 56486545 56217878 55886912 55817523 55867725 55542385 55857794 55141385
3065 55141385 55087599 54827173 54743306 54696834 54776495 54669175 54324739 54182270 54024413 53784226
3055 53784226 54125457 54134124 53993642 54147254 53818629 53737802 53837631 53751447 53394084 53763697
3045 53763697 53804964 53641511 53479095 53261155 53076408 53201696 53240580 53187342 53130330 53112561
$$ packed form
3114F6851917l56949p25527p25299k80474k71914n67486l49405l38359l51179
3105F2885325p84802m84571k19613l54904l78022m41592J572J74274j62489k70477
3095E9964701k31262J76751j53264j02294m6616J4667q3216k04335k60329l1269
3085E9043534j24871n55355n71104R1913J8247j03769j34693m84110j47887l168
3075E7028737l31524k12209J541k68667l30966o9389N0202l25340L15409p16409
3065E5141385n3786k60426q3867m6472P9661j07320l44436j42469j57857k40187
3055E3784226L41231Q667j40482J53612l28625q0827R9829q6184l57363L69613
3045E3763697M1267j63453j62416k17940j84747J25288L8884n3238n7012j7769
$$ plain form
3035 53112561 53305455 53490583 53708040 53746765 53887994 54194655 54240723 54344609 54502307 54890421
3025 54890421 55328199 55655141 55843225 56340053 56713920 57465296 58018223 58445856 59082491
3016 59082491 59878810 60347091 60516997 60828703 60783843 61156014 61443286 61793296 62206874 62414705
3006 62414705 63125667 63544198 63895179 64380385 64671183 65109311 65614427 66301232 66785441
2997 66785441 67411295 67934784 68518496 69279161 69806752 70432100 71332320 72378543 73453918
2988 73453918 74656520 75767018 77064211 78300378 79631062 80769579 81375989 81495371
2980 81495371 81124676 81011184 81135073 81104928 81654743 82169006 82484244 82949171 83427835 84073805
2970 84073805 84633154 85663819 86627303 87273053 87947891 89067472 90301880 91405239 92418222
$$ packed form
3035E3112561J92894J85128K17457L8725J41229L06661M6068J03886J57698L88114
3025E4890421M37778L26942J88084M96828L73867P51376N52927M27633O36635
3016E9082491P96319M68281J69906L11706m4860L72171K87272L50010M13578K07831
3006F2414705P10962M18531L50981M85206K90798M38128N05116O86805M84209
2997F6785441O25854N23489N83712P60665N27591O25348R00220J046223J075375
2988G3453918J202602J110498J297193J236167J330684J138517O06410J19382
2980H1495371l70695j13492J23889l0145N49815N14263L15238M64927M78664O45970
2970H4073805N59349J030665R63484O45750O74838J119581J234408J103359J012983
$$ plain form
2961 92418222 93276961 94132904 95353597 96710289 98165753 99484019 101039882 102335620
2953 102335620 103928446 105720066 107664473 109485593 111207346 112877582 114686753 116656349
2945 116656349 118741438 120674322 122551545 124315596 126451395 128532817 130194929 132065083
2937 132065083 133810705 134641790 135535830 136612609 137473993 138246203 139042823 140415044 141522121
2928 141522121 143092588 144569747 146567076 148588550 150892070 153752845 156728625 160281450
2920 160281450 164005131 168316067 173366148 179151277 185415079 192095851 199167940 205981851
2912 205981851 211532524 215275126 216395633 214621622 210160891 203955900 197513465 190690218
2904 190690218 184740603 179933634 176025919 173250793 171749641 171322573 171590103 172225745
$$ packed form
2961I2418222Q58739Q55943J220693J356692J455464J318266J555863J295738
2953A02335620J592826J791620J944407J821120J721753J670236J809171J969596
2945A16656349K085089J932884J877223J764051K135799K081422J662112J870154
2937A32065083J745622Q31085Q94040J076779Q61384P72210P96620J372221J107077
2928A41522121J570467J477159J997329K021474K303520K860775K975780L552825
2920A60281450L723681M310936N050081N785129O263802O680772P072089O813911
2912B05981851N550673L742602J120507j774011m460731o204991o442435o823247
2904A90690218n949615m806969l907715k775126j501152m27068K67530O35642
$$ plain form
2896 172225745 173037075 174678855 176728296 179513035 182928578 185976990 189045427 191615921
2888 191615921 193918482 195954627 197728955 199138623 200244503 200677125 200225049 198046071
2880 198046071 194110428 188853931 183312618 177233141 170711903 163900959 157912455 152952250
2872 152952250 148530490 145217862 142239228 139677521 137545918 136382960 135530681 135196176
2864 135196176 134672413 134104757 133378359 132417534 130851641 128643585 126196775 122966806 119956331
2855 119956331 116190904 112702834 108877325 105253831 101889801 98287612 95196008 91969075
2847 91969075 89277512 87103610 84692124 82404711 80629400 78840661 77329538 75889036
2839 75889036 74264566 73298768 72236957 70763480 69575172 68543767 67274778 66434316
$$ packed form
2896A72225745Q11330J641780K049441K784739L415543L048412L068437K570494
2888A91615921K302561K036145J774328J409668J105880M32622m52076k178978
2880A98046071l935643n256497n541313o079477o521238o810944n988504m960205
2872A52952250m421760l312628k978634k561707k131603j162958q52279l34505
2864A35196176n23763n67656p26398r60825j565893k208056k446810l229969l010475
2855A19956331l765427l488070l825509l623494l364030l602189l091604l226933
2847I1969075k691563k173902k411486k287413j775311j788739j511123j440502
2839G5889036j624470r65798j061811j473477j188308j031405j268989q40462
$$ plain form
2831 66434316 65458772 64025892 62653619 61561333 60474639 59336734 58207186 56948652
2823 56948652 55745888 54621613 54098403 53450061 52717971 51843111 50998497 50203472 49207201
2814 49207201 48323094 47378874 46237308 45264773 44280933 43723993 42735954 42264954 41769628
2805 41769628 41095434 40243614 39507785 39145918 38639855 37798749 37163949 37392977 36999760
2796 36999760 36409990 36132904 35505920 34652775 34208779 33631350 32931581 32428371 31825483
2787 31825483 31371874 30963885 30247642 29726504 29136598 28536272 28218030 27749206 27451053
2778 27451053 27168613 26677804 26070741 25315921 25134976 24999948 24530833 24606654 24185809 23807576
2768 23807576 23740955 23524728 23219602 22772038 22288514 21792874 21522119 21444336 21381373 20982975
$$ packed form
2831F6434316r75544j432880j372273j092286j086694j137905j129548j258534
2823E6948652j202764j124275n23210o48342p32090q74860q44614p95025r96271
2814D9207201q84107r44220j141566r72535r83840n56940r88039m71000m95326
2805D1769628o74194q51820p35829l61867n06063q41106o34800K29028l93217
2796C6999760n89770k77086o26984q53145m43996n77429o99769n03210o02888
2787C1825483m53609m07989p16243n21138n89906o00326l18242m68824k98153
2778B7451053k82440m90809o07063p54820j80945j35028m69115P5821m20845l78233
2768B3807576o6621k16227l05126m47564m83524m95640k70755p7783o2963l98398
$$ plain form
2758 20982975 20508684 20080810 19682728 19222350 19134064 18829454 18369711 18172262 17838660 17628271
2748 17628271 17433856 17061781 16483150 16380440 16035679 16082511 15928522 16008838 15959453 15627045
2738 15627045 15261313 15276407 15316602 14956692 14706716 14299590 14362808 14333291 13823485 13510606
2728 13510606 13489232 13454359 13156860 12864899 12470078 12746883 12821883 12519116 12342950 12273844
2718 12273844 12242596 11791808 11587956 11578178 11631423 11403590 11347351 11058013 10701965 10455217
2708 10455217 10659220 10588616 10593666 10550419 10594468 10263553 10129396 10301724 10165336 9890697
2698 9890697 9975687 9984985 9989403 10360709 10020503 9484652 9287194 9468261 9584149 9495575 9421896
2687 9421896 9341669 9165286 9224823 9315585 8905106 8578264 8446304 8643318 8602170 8606891 8140360
$$ packed form
2758B0982975m74291m27874l98082m60378q8286l04610m59743j97449l33602k10389
2748A7628271j94415l72075n78631j02710l44761M6832j53989Q0316m9385l32408
2738A5627045l65732J5094M0195l59910k49976m07126O3218k9517n09806l12879
2728A3510606k1374l4873k97499k91961l94821K76805P5000l02767j76166o9106
2718A2273844l1248m50788k03852r778N3245k27833n6239k89338l56048k46748
2708A0455217K04003p0604N050m3247M4049l30915j34157J72328j36388k74639
2698I890697Q4990R298M418L71306l40206n35851j97458J81067J15888q8574p3679
2687I421896q0227j76383N9537R0762m10479l26842j31960J97014m1148M721m66531
$$ plain form
2676 8140360 8173444 8348144 8296990 8006462 7854153 7923445 7909668 7832960 7917325 7848199 7667739
2665 7667739 7787049 7928002 7721413 7562491 7399206 7840761 7734893 7608519 7707630 7441169
2655 7441169 7652645 7974241 7815575 7376426 7206833 6940848 7043597 7265839 7177861 6707472
2645 6707472 6491542 6543697 6531521 6611037 6836950 6682498 6621857 6480124 6919572 6918027 7086189
2634 7086189 7105076 7137801 7233069 6740300 6949482 7104043 6671598 6765262 6943810 6764097
2624 6764097 6892307 7219415 6923489 6333324 6375314 6528018 6603949 6463433 6419377 6456036
2614 6456036 6397974 6334049 6217188 6469111 6307553 5980799 5990301 6076403 5760266 6111143
2604 6111143 5936405 5703633 5982932 5934579 6088346 6319581 6325112 6466341 6550318 6442058
$$ packed form
2676H140360L3084J74700n1154k90528j52309O9292j3777p6708Q4365o9126j80460
2665G667739J19310J40953k06589j58922j63285M41555j05868j26374R9111k66461
2655G441169K11476L21596j58666m39149j69593k65985J02749K22242q7978m70389
2645F707472k15930N2155j2176P9516K25913j54452o0641j41733M39448j545J68162
2634G086189J8887L2725R5268m92769K09182J54561m32445R3664J78548j79713
2624F764097J28210L27108k95926n90165M1990J52704P5931j40516m4056L6659
2614F456036n8062o3925j16861K51923j61558l26754R502Q6102l16137L50877
2604F111143j74738k32772K79299m8353J53767K31235N531J41229Q3977j08260
$$ plain form
2594 6442058 6175173 6021131 6021606 6167479 6075407 5998692 5698017 5607509 5241486 5187530 5380672
2583 5380672 5369898 5036671 4688794 5047934 5043858 4995492 4975116 4742570 4750897 4942625 4846722
2572 4846722 4793361 4801825 4872285 4657877 4786195 4556246 4531797 4615816 4498688 4256043 3842543
2561 3842543 3883949 4187028 4407430 4387452 4319748 4618840 4479346 4481932 4104783 4093135 4366672
2550 4366672 4047617 3887211 3976146 4124346 3919237 3931980 3724616 3457039 3639450 3794583
2540 3794583 3374560 3357453 3576098 3455235 3301143 3016458 3233597 3230061 2753434 2961768
2530 2961768 3179035 3011551 3291833 3405670 3173996 3043132 3164968 3068370 2716098 3007957
2520 3007957 3175199 3238690 3249523 2918122 2769437 2676028 2521024 2634875 2616286 2543454
$$ packed form
2594F442058k66885j54042M75J45873r2072p6715l00675r0508l66023n3956J93142
2583E380672j0774l33227l47877L59140m076m8366k0376k32546Q327J91728r5903
2572D846722n3361Q464P0460k14408J28318k29949k4449Q4019j17128k42645m13500
2561C842543M1406L03079K20402j9978o7704K99092j39494K586l77149j1648K73537
2550D366672l19055j60406Q8935J48200k05109J2743k07364k67577J82411J55133
2540C794583m20023j7107K18645j20863j54092k84685K17139l536m76627K08334
2530B961768K17267j67484K80282J13837k31674j30864J21836r6598l52272K91859
2520C007957J67242O3491J0833l31401j48685r3409j55004J13851j8589p2832
$$ plain form
2510 2543454 2500681 2233133 2273763 2516839 2597760 2427084 2474730 2567963 2583545 2566886 2638769
2499 2638769 2412338 2224208 1953376 1775025 2218502 2512569 2483075 2347544 2155965 1859671
2489 1859671 1743590 1732245 1901371 2169167 2045674 2415959 2160861 2093801 2209791 2229515
2479 2229515 2111999 1778120 1843276 2001836 1643666 1784258 1913565 1852481 2063997 1669722
2469 1669722 1796911 1858360 1800560 1812205 2098529 1887880 1788161 1937266 1566923 1585420
2459 1585420 1522015 1737207 1900901 1632936 1662250 1580278 1515729 1390717 1231051 1116081
2449 1116081 1109249 1423246 1663349 1450464 1379082 1450798 1672796 1727244 1569938 1643881 1695621
2438 1695621 1669311 1463417 1376340 1415359 1597981 1710723 1545624 1318438 1282940 1403428
$$ packed form
2510B543454m2773k67548M0630K43076Q0921j70676M7646R3233J5582j6659P1883
2499B638769k26431j88130k70832j78351M43477K94067k9494j35531j91579k96294
2489A859671j16081j1345J69126K67796j23493L70285k55098o7060J15990J9724
2479B229515j17516l33879O5156J58560l58170J40592J29307o1084K11516l94275
2469A669722J27189O1449n7800J1645K86324k10649r9719J49105l70343J8497
2459A585420o3405K15192J63694k67965K9314q1972o4549j25012j59666j14970
2449A116081o832L13997K40103k12885p1382P1716K21998N4448j57306P3943N1740
2438A695621k6310k05894q7077L9019J82622J12742j65099k27186l5498J20488
$$ plain form
2428 1403428 1113092 1088202 1103968 1237434 1357433 1323118 1184959 1399707 1469287 1576036
2418 1576036 1497791 1729028 1525583 1342414 1469242 1031203 1017957 1052722 1370403 1290742
2408 1290742 1222593 1329610 1262240 1171203 980476 1111056 1015391 682579 982661 1177274
2398 1177274 1025372 1442573 1430919 1116544 1115119 1431451 1575458 1345528 1379854 1415572
2388 1415572 1325248 1518683 1474775 1450184 1579470 1600270 1488137 1463741 1400606 1459387 1721378
2377 1721378 1673559 1891628 1945434 1439386 1406477 1391725 1344769 1092557 1121865 1263296 1202558
2366 1202558 1364567 929751 1035915 1036727 1099484 1253182 1420083 1292674 1557963 1257520
2356 1257520 1128420 1201000 1007480 990017 949713 1066512 1125984 1026005 799251 855725 857679
$$ packed form
2428A403428k90336k4890J5766J33466J19999l4315j38159K14748O9580J06749
2418A576036p8245K31237k03445j83169J26828m38039j3246L4765L17681p9661
2408A290742o8149J07017o7370r1037j90727J30580r5665l32812L00082J94613
2398A177274j51902M17201j1654l14375j425L16332J44007k29930L4326L5718
2388A415572r0324J93435m3908k4591J29286K0800j12133k4396o3135N8781K61991
2377A721378m7819K18069N3806n06048l2909j4752m6956k52212K9308J41431o0738
2366A202558J62009m34816J06164Q12O2757J53698J66901j27409K65289l00443
2356A257520j29100P2580j93520j7463m0304J16799N9472r9979k26754N6474J954
$$ plain form
2345 857679 1086996 972088 929143 958986 895026 1070647 1102827 1050487 881875 709676 480745
2334 480745 781924 849862 1116387 1304004 1068747 1048360 1222139 1184533 1247700 1310691 1174643
2323 1174643 1076796 1209242 1144657 947827 1093921 1187449 1104355 1114200 911711 574973 941330
2312 941330 946060 794705 765153 798892 791406 925008 832645 801528 948802 1114704 938574
2301 938574 1051675 1243562 1220727 1211095 1021787 966049 1200186 1029047 952141 1029738 984328
2290 984328 972411 1247935 1308329 1245091 1257163 1215197 1350482 1170630 840144 1090987 1478511
2279 1478511 1483959 1111658 1192642 1189225 1191260 1332306 1144650 1152212 927656 771224 1190895
2268 1190895 966709 874061 896109 1021548 1256852 1313603 1405897 1103896 1200979 1251661 1111349
$$ packed form
2345H57679K29317j14908m2945K9843o3960J75621L2180n2340j68612j72199k28931
2334D80745L01179O7938K66525J87617k35257k0387J73779l7606O3167O2991j36048
2323A174643r7847J32446o4585j96830J46094R3528q3094R845k02489l36738L66357
2312I41330M730j51355k9552L3739p486J33602r2363l1117J47274J65902j76130
2301I38574J13101J91887k2835r632j89308n5738K34137j71139p6906P7597m5410
2290I84328j1917K75524O0394o3238J2072m1966J35285j79852l30486K50843L87524
2279A478511N448l72301Q0984l417K035J41046j87656P562k24556j56432M19671
2268A190895k24186r2648K2048J25439K35304N6751R2294l02001R7083N0682j40312
$$ plain form
2257 1111349 999657 1175510 1261814 1507451 1580411 1839525 1534927 1270327 1023502 1315258
2247 1315258 1405455 1521363 1636525 1732312 1699064 1600677 1633749 1353058 1428999 1579018 1618382
2236 1618382 1702096 1716025 1398240 1232248 1338052 1158962 1181666 1468476 1928661 1667628
2226 1667628 1432409 1897010 1793053 1893282 1942380 2146484 1972371 1869511 2113206 2070275
2216 2070275 2223041 2216237 2210229 2386614 2378837 2539194 2809917 2535753 2337948 2320618 2350902
2205 2350902 2647972 2879947 2837863 2346241 2343883 2263594 2315179 2384327 2478114 2926904 3132174
2194 3132174 3064674 3260717 3228678 3203798 3392418 3059566 3171686 3407877 3481290 3649171
2184 3649171 3574427 3935563 3999982 3844230 3634793 3954396 3996081 3854938 3905526 4049823
$$ packed form
2257A111349j11692J75853Q6304K45637P2960K59114l04598k64600k46825K91756
2247A315258R0197J15908J15162R5787l3248r8387L3072k80691P5941J50019L9364
2236A618382Q3714J3929l17785j65992J05804j79090K2704K86810M60185k61033
2226A667628k35219M64601j03957J00229M9098K04104j74113j02860K43695m2931
2216B070275J52766o804o008J76385p777J60357K70723k74164j97805j7330L0284
2205B350902K97070K31975m2084m91622k358q0289N1585O9148R3787M48790K05270
2194C132174o7500J96043l2039k4880J88620l32852J12120K36191P3413J67881
2184C649171p4744L61136O4419j55752k09437L19603M1685j41143N0588J44297
$$ plain form
2174 4049823 4393972 4764152 4853138 4510992 4576099 4632435 4528341 4465855 4901720 5191836
2164 5191836 5232848 5155260 5366260 6039698 6112646 6066399 6316597 6489357 6755930 6876227
2154 6876227 7216220 7751007 7969964 8346691 8617885 8897877 9209281 9684592 9712474 9508946
2144 9508946 9603855 9998399 10217099 10840624 11222069 11658760 12087240 12402337 12815195 13378896
2134 13378896 13550085 14286556 15273564 16069699 16701220 18023267 19466478 20986097 23073579
2125 23073579 25278006 26444153 27481886 29288749 31771387 34601416 39033500 44453911
2117 44453911 51649729 60412336 71356244 86569010 104318089 122987101 146004131
2110 146004131 156557927 127715285 94986165 73028070 55622829 44359545 36117446
$$ packed form
2174D049823L44149L70180Q8986l42146O5107N6336j04094o2486M35865K90116
2164E191836M1012p7588K11000O73438P2948m6247K50198J72760K66573J20297
2154F876227L39993N34787K18957L76727K71194K79992L11404M75311K7882k03528
2144I508946R4909L94544K18700O23525L81445M36691M28480L15097M12858N63701
2134A3378896J71189P36471R87008P96135O31521J322047J443211J519619K087482
2125B3073579K204427J166147J037733J806863K482638K830029M432084N420411
2117D4453911P195818Q762607J0943908J5212766J7749079J8669012K3017030
2110A46004131J0553796k8842642l2729120k1958095j7405241j1263284q242099
$$ plain form
2103 36117446 30417948 26451903 23804405 21747007 20282963 19018686 18180383 17319115
2095 17319115 16661101 15404965 14017316 12557119 11612603 10706885 9683576 9254468 8613308
2086 8613308 7991124 7638185 7399869 6903080 6224843 5808564 5557479 5571736 5366285 5076520
2076 5076520 4911433 4933103 4701684 4363543 4097382 4194170 4236708 4086659 3541169 3549197
2066 3549197 3101075 2932854 2834612 2881751 3010023 3109166 3064173 2856134 2721412 2688561
2056 2688561 2783182 2809658 2331377 2426996 2175021 2151722 2070945 1977124 2171284 2045971 1872392
2045 1872392 2085839 2034015 2112938 2205217 2254915 2233800 2082896 1546971 1538049 1604741 1677856
2034 1677856 1603101 1716888 1570417 1535672 1719083 1631673 1549273 1568230 1620358 1516366 1601245
$$ packed form
2103C6117446n699498l966045k647498k057398j464044j264277q38303q61268
2095A7319115o58014j256136j387649j460197r44516r05718j023309m29108o41160
2086H613308o22184l52939k38316m96789o78237m16279k51085J4257k05451k89765
2076E076520j65087K1670k31419l38141k66161R6788M2538j50049n45490Q028
2066C549197m48122j68221r8242M7139J28272R9143m4993k08039j34722l2851
2056B688561R4621K6476m78281R5619k51975k3299q0777r3821J94160j25313j73579
2045A872392K13447n1824P8923R2279M9698k1115j50904n35925q922O6692P3115
2034A677856p4755J13787j46471l4745J83411q7410q2400J8957N2128j03992Q4879
$$ plain form
2023 1601245 1651571 1398107 1425019 1539725 1291468 1333482 1186178 1149843 1141276 1218505 1192031
2012 1192031 1012992 956898 750433 798400 615629 620628 596524 663439 871207 336904 533315
2001 533315 644261 773327 771748 695718 505528 709826 470913 512930 799560 886476 1005447
1990 1005447 829439 842970 806915 887572 867706 857323 1055881 623140 548366 589444 534748
1979 534748 594707 460006 521761 605401 916342 742733 845748 959873 860291 945068 792640
1968 792640 929977 703722 433891 729113 676098 635613 818569 643590 546115 566143
1958 566143 695101 649977 646732 434450 489880 591206 668943 496684 548938 687114 770015
1947 770015 739214 676647 452541 497173 474491 425719 691211 504263 484807 319436 245684
$$ packed form
2023A601245N0326k53464K6912J14706k48257M2014j47304l6335q567P7229k6474
2012A192031j79039n6094k06465M7967j82771M999k4104O6915K07768n34303J96411
2001E33315J10946J29066j579p6030j90190K04298k38913M2017K86630Q6916J18971
1990A005447j76008J3531l6055Q0657j9866j0383J98558m32741p4774M1078n4696
1979E34748N9959j34701O1755Q3640L10941j73609J03015J14125r9582Q4777j52428
1968G92640J37337k26255k69831K95222n3015m0485J82956j74979r7475K0028
1958E66143J28958m5124l245k12282N5430J01326P7737j72259N2254J38176Q2901
1947G70015l0801o2567k24106M4632k2682m8772K65492j86948j9456j65371p3752
$$ plain form
1936 245684 485047 617738 642252 612747 572476 494191 251301 248478 901562 692634 606540
1925 606540 840394 596458 652596 582754 619657 636023 651255 410982 715506 940071 459910
1914 459910 44092 237138 271153 108846 217295 70922 655405 1013139 576699 358753
1904 358753 418026 430880 588589 785732 773460 452650 446735 386370 121999 217660 237350
1893 237350 474620 427724 376302 466474 497234 136633 347671 708639 991208 1067288 1164456
1882 1164456 886933 488241 357505 383012 673338 634841 331419 432811 423875 607919
1872 607919 905493 876643 730621 660010 738203 565590 574795 364886 242369 557128 545584
1861 545584 158050 -67123 172379 252604 307999 479139 264032 489523 410422 398025
$$ packed form
1936B45684K39363J32691K4514k9505m0271p8285k42890k823O53084k08928q6094
1925F06540K33854k43936N6138o9842L6903J6366J5232k40273L04524K24565m80161
1914D59910m15818J93046L4015j62307J08449j46373N84483L57734m36440k17946
1904C58753N9273J2854J57709J97143j2272l20810n915o0365k64371R5661J9690
1893B37350K37270m6896n1422R0172L0760l60601K11038L60968K82569P6080R7168
1882A164456k77523l98692j30736K5507K90326l8497l03422J01392q936J84044
1872F07919K97574k8850j46022p0611P8193j72613R205k09909j22517L14759j1544
1861E45584l87534k25173K39502Q0225N5395J71140k15107K25491p9101j2397
$$ plain form
1851 398025 595458 623533 786909 488981 647761 801212 781728 753861 905974 1071244
1841 1071244 1066250 1004264 773264 630605 708739 702468 316798 488539 566012 707343 562965
1830 562965 705602 835130 815140 232173 170816 67461 2252 -28784 211787 341361
1820 341361 192678 300180 455575 465065 97910 341391 90838 144083 62291 35205 419366
1809 419366 437263 536401 656454 658160 299772 210273 490276 386847 363867 420077 521540
1798 521540 332033 66620 81054 279632 435706 193390 57881 477854 495705 480731
1788 480731 354160 333060 174969 315407 268309 206768 117856 331165 192908 -135027
1778 -135027 4524 70975 208485 46465 47404 140432 30432 229440 422320 722200 569364
$$ packed form
1851C98025J97433K8075J63376k97928J58780J53451j9484k7867J52113J65270
1841A071244m994o1986k31000j42659P8134o271l85670J71741P7473J41331j44378
1830E62965J42637J29528j9990n82967o1357j03355o5209l1036K40571J29574
1820C41361j48683J07502J55395R490l67155K43481k50553N3245q1792k7086L84161
1809D19366J7897R9138J20053J706l58388q9499K80003j03429k2980N6210J01463
1798E21540j89507k65413J4434J98578J56074k42316j35509M19973J7851j4974
1788D80731j26571k1100j58091J40438m7098o1541q8912K13309j38257l27935
1778a35027J39551O6451J37510j62020R39R3028j10000J99008J92880K99880j52836
$$ plain form
1767 569364 429853 451556 368185 255114 290168 362131 119839 423470 453504 423232 250656
1756 250656 227357 246758 197440 501959 219903 173075 250642 308597 219434 162849 217581
1745 217581 117325 202224 127389 123613 228584 242579 24556 328261 245869 251643 258343
1734 258343 44825 103596 133325 -5620 196134 471639 637348 440584 211125 102644
1724 102644 187727 316856 100538 129878 -68534 112023 196275 45506 158128 -52050
1714 -52050 117808 -38374 62336 207947 420035 267707 -50343 -11299 -55063 -26757
1704 -26757 59354 208581 53631 158262 338747 93024 113886 -3028 -83109 218529
1694 218529 643448 507516 314310 195825 179441 -63276 32582 214317 49918 62952
$$ packed form
1767E69364j39511K1703q3371j13071L5054P1963k42292L03631L0034l0272j72576
1756B50656k3299J9401m9318L04519k82056m6828P7567N7955q9163n6585N4732
1745B17581j00256Q4899p4835l776J04971J3995k18023L03705q2392N774O700
1734B58343k13518N8771K9729j38945K01754K75505J65709j96764k29459j08481
1724A02644Q5083J29129k16318K9340j98412J80557Q4252j50769J12622k10178
1714e2050J69858j56182J00710J45611K12088j52328l18050L9044m3764K8306
1704b6757Q6111J49227j54950J04631J80485k45723K0862j16914q0081L01638
1694B18529M24919j35932j93206j18485j6384k42717R5858J81735j64399J3034
$$ plain form
1684 62952 314492 350664 423236 401837 46814 -31598 -207090 53634 301788 304003 54342
1673 54342 103756 319544 413452 470477 265736 126310 116627 50356 113269 -37572 198679
1662 198679 648290 457314 419292 365643 480258 397881 -38516 191989 306253 -33977
1652 -33977 57801 235010 305409 482323 707926 297154 188115 395371 285015 358299
1642 358299 287350 389526 -32535 380636 279893 287551 390320 282029 147852 209497
1632 209497 298794 317807 166479 243823 501359 500371 599881 495001 365427 539538 477143
1621 477143 -21483 102379 310188 189691 94415 99203 97215 146944 41646 77764 191626
1610 191626 47589 75662 -26586 230569 164409 25671 -69028 -307863 139168 332508
$$ packed form
1684F2952K51540L6172P2572k1399l55023p8412j75492K60724K48154K215k49661
1673E4342M9414K15788R3908N7025k04741j39426r683o6271O2913j50841K36251
1662A98679M49611j90976l8022n3649J14615q2377m36397K30505J14264l40230
1652c3977R1778J77209P0399J76914K25603m10772j09039K07256j10356P3284
1642C58299p0949J02176m22061M13171j00743P658J02769j08291j34177O1645
1632B09497Q9297J9013j51328P7344K57536r88R9510j04880j29574J74111o2395
1621D77143m98626J23862K07809j20497r5276M788j988M9729j05298L6118J13862
1610A91626j44037K8073j02248K57155o6160j38738r4699k38835M47031J93340
$$ plain form
1600 332508 -53721 35409 15465 201525 137221 -132022 -177118 39703 580874 469722
1590 469722 105639 70484 527040 495009 305308 194523 278588 445644 339900 -273627
1580 -273627 -321501 105364 51592 22713 -36852 -155545 114818 137802 270439 248794 195597
1569 195597 179833 72457 82673 266936 107714 122159 251162 159154 274235 103760
1559 103760 -22481 -3457 -56721 -219442 -410572 62672 3174 -81941 220331 266108 270938
1548 270938 329900 270800 90665 427417 260456 23340 209661 239316 229343 136063 121590
1537 121590 -191815 -39973 254592 64747 56972 -97968 -127671 31238 338476 313723
1527 313723 78358 -1221 -346806 -60706 -94794 149298 102788 -11223 126766 -132445
$$ packed form
1600C32508l86229Q9130j9944J86060o4304k69243m5096K16821N41171j11152
1590D69722l64083l5155M56556l2031j89701j10785Q4065J67056j05744o13527
1580b73627m7874M26865n3772k8879n9565j18693K70363K2984J32637k1645n3197
1569A95597j5764j07376J0216J84263j59222J4445J29003r2008J15081j70475
1559A03760j26241J9024n3264j62721j91130M73244n9498q5115L02272M5777M830
1548B70938N8962n9100j80135L36752j66961k37116J86321K9655r973r3280j4473
1537A21590l13405J51842K94565j89845p775j54940k9703J58909L07238k4753
1527C13723k35365p9579l45585K86100l4088K44092m6510j14011J37989k59211
$$ plain form
1517 -132445 -16380 155353 268788 81652 32099 -33022 -317533 187094 367004 110137
1507 110137 171230 456900 309983 192063 267565 -166501 -430390 -282414 -144409 331915
1497 331915 374085 202003 91169 -168183 242877 484036 531815 658970 761828 242964
1487 242964 63695 -227966 -219188 -82550 67798 -155151 -203339 -202761 -439482 -308406 -152177
1476 -152177 515 47693 -340935 -153168 1491 -65013 -52568 -274960 -121091 -191488
1466 -191488 -100459 -122597 14796 123349 50050 87613 -5575 107257 272828 567856 449792
1455 449792 111374 62834 156456 53863 83546 160343 -24726 -56726 -21253 -220607 -182764
1444 -182764 -282313 147405 325380 114893 68558 -351526 -288371 3084 345404 429354
$$ packed form
1517a32445J16065J71733J13435j87136m9553o5121k84511N04627J79910k56867
1507A10137O1093K85670j46917j17920P5502m34066k63889J47976J38005M76324
1497C31915M2170j72082j10834k59352M11060K41159M7779J27155J02858n18864
1487B42964j79269k91661Q778J36638J50348k22949m8188N78k36721J31076J56229
1476a52177J52692M7178l88628J87767J54659o6504J2445k22392J53869p0397
1466a91488R1029k2138J37393J08553p3299L7563r3188J12832J65571K95028j18064
1455D49792l38418m8540R3622j02593K9683P6797j85069l2000L5473j99354L7843
1444a82764r9549M29718J77975k10487m6335m20084O3155K91455L42320Q3950
$$ plain form
1434 429354 223084 175112 -30631 -77694 -166069 -506797 -352464 -79168 130072 424790
1424 424790 390788 356785 346527 70995 227017 333899 -160661 49972 104626 264011
1414 264011 408356 152660 351511 37385 53014 -38115 1892 124776 253339 315674
1404 315674 395841 457728 276934 150062 135619 -98540 94906 119695 139863 121101 148362
1393 148362 206303 269904 527115 483501 186257 -51834 157675 -22585 -154874 -35179
1383 -35179 88120 96494 266892 94824 312469 117512 238402 477320 491694 451157 -119014
1372 -119014 -19100 250374 568821 468789 452584 162082 -30780 -4154 197014 42413
1362 42413 -28705 167620 172077 398348 135650 28277 194702 -59421 -71241 101274 58110
$$ packed form
1434D29354k06270m7972k05743m7063q8375l40728J54333K73296K09240K94718
1424D24790l4002l4003j0258k75532J56022J06882m94560K10633N4654J59385
1414B64011J44345k55696J98851l14126J5629r1129M0007J22884J28563O2335
1404C15674Q0167O1887j80794j26872j4443k34159J93446K4789K0168j8762K7261
1393A48362N7941O3601K57211m3614k97244k38091K09509j80260j32289J19695
1383c5179J23299Q374J70398j72068K17645j94957J20890K38918J4374m0537n70171
1372a19014R9914K69474L18447j00032j6205k90502j92862K6626K01168j54601
1362D2413p1118J96325M457K26271k62698j07373J66425k54123j1820J72515m3164
$$ plain form
1351 58110 -144345 61383 112196 538788 228175 -24675 -34583 -177107 31817 94884 -87794
1340 -87794 -279196 -156167 132537 149583 -26646 123437 61189 156954 -92015 38157
1330 38157 89370 213007 128594 267314 144194 128790 -38237 -208544 -311538 -485490
1320 -485490 -326053 16918 340766 298458 -121293 157590 358828 45910 -305868 -577054
1310 -577054 -481878 -268301 -152145 118387 51116 -169013 72977 16964 80686 23686 -16984
1299 -16984 -179776 6424 51737 -57811 83105 258396 79488 -71429 42109 161577
1289 161577 150500 263718 381010 343957 319195 -114779 40114 362740 239650 70406
1279 70406 17779 97994 131668 151728 160958 224998 86231 -125816 -307017 -46952 -104165
$$ packed form
1351E8110k02455K05728N0813M26592l10613k52850r908j42524K08924O3067j82678
1340h7794j91402J23029K88704J7046j76229J50083o2248R5765k48969J30172
1330C8157N1213J23637q4413J38720j23120j5404j67027j70307j02994j73952
1320d85490J59437L42971L23848m2308m19751K78883K01238l12918l51778k71186
1310e77054R5176K13577J16156K70532o7271k20129K41990n6013O3722n7000m0670
1299a6984j62792J86200M5313j09548J40916J75291j78908j50917J13538J19468
1289A61577j1077J13218J17292l7053k4762m33974J54893L22626j23090j69244
1279G0406n2627Q0215L3674K0060R230O4040j38767k12047j81201K60065n7213
$$ plain form
1268 -104165 110611 415101 411520 397295 376081 274451 116784 474822 431808 73256 -52735
1257 -52735 -135173 -43014 39315 90684 34062 -33129 12619 -113928 -171131 25182 223050
1246 223050 198505 261349 233242 419896 638776 448648 273924 115934 139399 221732 107214
1235 107214 203434 97119 250039 442224 417111 47336 -131435 -48168 -33248 -52627 150415
1224 150415 -10453 -297529 -215127 -67495 129171 -125812 -94482 3147 266910 392899
1214 392899 274312 -120072 -162540 87339 -258320 -109795 28296 -148331 -292714 -309214
1204 -309214 40921 -71645 -21405 231077 118579 -53889 193029 235629 249295 381221
1194 381221 371104 210690 76428 97413 238314 87477 -284412 -228399 -43366 -140993
$$ packed form
1268a04165K14776L04490l581j4225k1214j01630j57667L58038m3014l58552j25991
1257e2735q2438R2159Q2329N1369n6622o7191M5748j26547n7203J96313J97868
1246B23050k4545O2844k8107J86654K18880j90128j74724j57990K3465Q2333j14518
1235A07214R6220j06315J52920J92185k5113l69775j78771Q3267J4920j9379K03042
1224A50415j60868k87076Q2402J47632J96666k54983L1330R7629K63763J25989
1214C92899j18587l94384m2468K49879l45659J48525J38091j76627j44383j6500
1204c09214L50135j12566N0240K52482j12498j72468K46918M2600J3666J31926
1194C81221j0117j60414j34262K0985J40901j50837l71889N6013J85033r7627
$$ plain form
1184 -140993 -162007 -60822 -97677 -253112 -262883 -29285 -127459 -269252 -162439 7565 24776
1173 24776 173219 64628 -25616 -131110 -259662 -184224 51572 259424 304475 186595
1163 186595 91833 -44757 -11819 117648 105568 101745 -15999 -222702 -87292 -172038 -3468
1152 -3468 111639 92471 113299 -35727 37475 -14661 239127 75763 68279 -424243 -232820
1141 -232820 74535 31443 -191743 54344 252903 187230 3209 -119203 -82607 33796
1131 33796 260542 -9565 -407394 -264420 -112461 57946 -48546 -284636 -273814 -686802
1121 -686802 -399887 95290 300938 278663 69504 150134 215733 -91343 -36330 -253649
1111 -253649 12688 -32238 112740 -47569 -59408 170400 368904 313882 119830 378118
$$ packed form
1184a40993k1014J01185l6855j55435r771K33598r8174j41793J06813J70004J7211
1173B4776J48443j08591r0244j05494j28552P5438K35796K07852M5051j17880
1163A86595r4762j36590L2938J29467j2080l823j17744k06703J35410q4746J68570
1152c468J15107j9168K0828j49026P3202n2136K53788j63364p484m92522J91423
1141b32820L07355m3092k23186K46087J98559o5673j84021j22412L6596J16403
1131C3796K26746k70107l97829J42974J51959J70407j06492k36090J0822m12988
1121f86802K86915M95177K05648k2275k09159Q0630O5599l07076N5013k17319
1111b53649K66337m4926J44978j60309j1839K29808J98504n5022j94052K58288
$$ plain form
1101 378118 -98052 -106178 294474 -98396 79651 21877 -58519 105299 -147191 -112842 3297
1090 3297 -95857 185580 143505 97537 232765 180690 -20718 14901 -113945 -40347 158674
1079 158674 -61587 -443788 -482522 -333620 -598654 -310039 -84066 -243182 -177540 -154661
1069 -154661 -315483 -232962 80295 329911 411977 308431 21178 -132503 -227537 -249502
1059 -249502 -83665 91451 23961 361462 219991 207266 190230 293085 408486 289028
1049 289028 158689 65148 32620 -215702 -95687 -209380 -328656 -101427 -183538 -22115
1039 -22115 -212384 -77248 50853 29570 -92917 24727 -74142 -85435 249212 131223
1029 131223 110596 -112923 -127346 -170027 -32999 106563 2130 277483 322896 72204
$$ packed form
1101C78118m76170q126M00652l92870J78047n7774q0396J63818k52490L4349J16139
1090C297r9154K81437m2075m5968J35228n2075k01408L5619j28846P3598J99021
1079A58674k20261l82201l8734J48902k65034K88615K25973j59116O5642K2879
1069a54661j60822Q2521L13257K49616Q2066j03546k87253j53681r5034k1965
1059b49502J65837J75116o7490L37501j41471j2725j7036J02855J15401j19458
1049B89028j30339r3541l2528k48322J20015j13693j19276K27229q2111J61423
1039b2115j90269J35136J28101k1283j22487J17644r8869j1293L34647j17989
1029A31223k0627k23519j4423m2681J37028J39562j04433K75353M5413k50692
$$ plain form
1019 72204 52714 -90188 212546 134557 -318983 -191132 74493 185330 -125694 -139870
1009 -139870 -95717 -65556 207170 -23845 -156345 -35377 86337 46205 -60125 63166
999 63166 -121990 -18168 129339 -69297 -150863 180073 7411 -161302 213536 302997
989 302997 343981 353963 507476 424701 342338 170020 46784 107560 -10304 60283 187595
978 187595 112442 102444 -131600 -370562 -274918 -154309 -144940 -267760 -245689 -229881 -156291
967 -156291 -253145 -40240 107915 231551 469171 385366 528803 86790 133464 165774 -294026
956 -294026 -204958 -189289 -122292 66829 187294 168621 16518 78655 113491 90212 340404
945 340404 73536 -106133 63673 313459 340312 39264 62555 341922 518318 312277
$$ packed form
1019G2204j9490j42902L02734p7989m53540J27851K65625J10837l11024j4176
1009a39870M4153L0161K72726k31015j32500J20968J21714m0132j06330J23291
999F3166j85156J03822J47507j98636q1566L30936j72662j68713L74838Q9461
989C02997M0984R982J53513q2775q2363j72318j23236O0776j17864P0587J27312
978A87595p5153r998k34044k38962R5644J20609R369j22820K2071J5808P3590
967a56291r6854K12905J48155J23636K37620q3805J43437m42013M6674L2310m59800
956b94026Q9068J5669O6997J89121J20465j8673j52103O2137L4836k3279K50192
945C40404k66868j79669J69806K49786K6853l01048K3291K79367J76396k06041
$$ plain form
935 312277 154349 -92050 -74718 -361607 -152207 -281394 -329642 -310548 -142886 -72780 -295656
924 -295656 -51687 145490 20623 -23611 -125159 -118565 -53121 -368675 58020 18511 -78888
913 -78888 -219030 -315651 -249429 -236259 -429775 -326289 -290024 -311676 -38058 139054 134365
902 134365 -23644 -69733 -44755 -1097 -63362 234553 68508 241535 467257 292678 39096
891 39096 -259861 -181267 55083 109668 -38335 62245 -205168 -308743 -254029 -149893 -91621
880 -91621 -119401 -337638 -185617 -139512 91125 223427 -2175 -209322 -277625 -494874 -644262
869 -644262 -340811 -233613 -157157 99235 -16123 -240150 -31473 80392 234677 21280
859 21280 198937 425291 263410 202983 -54890 -119381 -119490 -319080 -252252 -64024 -340464
$$ packed form
935C12277j57928k46399J7332k86889K09400j29187m8248J9094J67662P0106k22876
924b95656K43969J97177j24867m4234j01548O594O5444l15554M26695l9509r7399
913g8888j40142r6621O6222J3170j93516J03486L6265k1652K73618J77112m689
902A34365j58009m6089K4978M3658o2265K97915j66045J73027K25722j74579k53582
891C9096k98957P8594K36350N4585j48003J00580k67413j03575N4714J04136N8272
880i1621k7780k18237J52021M6105K30637J32302k25602k07147o8303k17249j49388
869f44262L03451J07198P6456K56392j15358k24027K08677J11865J54285k13397
859B1280J77657K26354j61881o0427k57873o4491j09j99590O6828J88228k76440
$$ plain form
848 -340464 -362460 -366803 -122306 28458 -225275 -52001 -130705 -35772 93184 90444 -344119
837 -344119 -127952 47686 123975 -213903 -137369 -94842 -208575 -178415 -50830 -203946 -327689
826 -327689 -55532 -54382 -20308 25666 25263 -41138 46849 -374634 -75130 11658 -8316 288602
814 288602 12584 -255756 -310486 -218860 127493 -8896 46399 284082 -108797 -337481
804 -337481 -156405 -150829 -48213 191315 -130993 -81895 176299 210279 357587 368020 247718
793 247718 245300 189419 10117 -108609 -300587 -258762 -295783 -73581 13232 -133218 -376249
782 -376249 -1915 -143598 -346711 -376077 -397673 -553169 -592368 -261275 -306189 -317717 -128393
771 -128393 -15503 71227 296752 477134 169767 -16758 -225482 20564 16531 -171318
$$ packed form
848c40464k1996m343K44497J50764k53733J73274p8704R4933J28956k740m34563
837c44119K16167J75638P6289l37878P6534M2527j13733L0160J27585j53116j23743
826c27689K72157J150L4074M5974m03o6401Q7987m21483K99504Q6788j9974K96918
814B88602k76018k68340n4730R1626L46353j36389N5295K37683l92879k28684
804c37481J81076N576J02616K39528l22308M9098K58194L3980J47308J0433j20302
793B47718k418n5881j79302j18726j91978M1825l7021K22202Q6813j46450k43031
782c76249L74334j41683k03113k9366k1596j55496l9199L31093m4914j1528J89324
771a28393J12890Q6730K25525J80382l07367j86525k08724K46046m033j87849
$$ plain form
761 -171318 -200802 -103534 -31219 241298 233616 -82270 3664 -35511 -109528 -239204 -165295
750 -165295 -479806 -384786 -193459 -221324 -101048 144494 185821 275687 22177 -203073 -226806
739 -226806 -177389 -233555 -74501 -244412 -448771 -190711 -30233 -8685 159714 250714 209637
728 209637 -81783 135277 200482 34047 -100246 -151195 -261681 -164811 -107558 93533 69085
717 69085 59451 -71110 -551913 -208974 -188636 -241733 20938 -199600 -204210 10558 -104626
706 -104626 -128582 -1751 88957 44601 183181 87488 188960 177182 87843 221466 138364
695 138364 -46524 9393 55317 -243265 -228687 -131241 30431 72159 -133651 -98222 -235243
684 -235243 -193883 -43608 149164 396872 29978 -177877 -430079 -104155 -322693 -224545
$$ packed form
761a71318k9484R7268P2315K72517p682l15886Q5934l9175p4017j29676P3909
750a65295l14511R5020J91327k7865J20276K45542M1327Q9866k53510k25250k3733
739b26806M9417n6166J59054j69911k04359K58060J60478K1548J68399R1000m1077
728B09637k91420K17060O5205j66435j34293n0949j10486R6870N7253K01091k4448
717F9085r634j30561m80803L42939K0338n3097K62671k20538m610K14768j15184
706a04626k3956J26831R0708m4356J38580r5693J01472j1778q9339J33623q3102
695A38364j84888N5917M5924k98582J4578R7446J61672M1728k05810L5429j37021
684b35243M1360J50275J92772K47708l66894k07855k52202L25924k18538R8148
$$ plain form
674 -224545 -106966 -460316 -334763 -232293 -135115 -67917 226863 173491 -82636 -266690
664 -266690 -84479 -88919 -37729 -185596 -288425 -382268 -215321 -320184 -93640 -122092 -349650
653 -349650 -537557 -90509 -45908 -121473 -99173 -289424 -190572 -147596 -147372 -23443 -495617
642 -495617 -386151 -69950 18600 74852 -128435 -230652 128320 96953 -224708 72069
632 72069 86576 11427 -117410 185834 -109095 81456 89675 103128 -96203 -287225 -115802
621 -115802 -44883 -118856 -111912 -138792 -589202 -328217 -50088 -260904 -150517 -470113 -806617
610 -806617 -337919 -67357 121626 237790 71528 387572 342351 70894 -275585 120353
600 120353 223089 38595 90474 -37342 -390241 -250272 12480 109274 205191 -102012
$$ packed form
674b24545J17579l53350J25553J02470R7178O7198K94780n3372k56127j84054
664b66690J82211m440N1190j47867j02829r3843J66947j04863K26544k8452k27558
653c49650j87907M47048M4601p5565K2300j90251R8852M2976K24J23929m72174
642d95617J09466L16201Q8550N6252k03287j02217L58972l1367l21661K96777
632G2069J4507p5149j28837L03244k94929J90551Q219J3453j99331j91022J71423
621a15802P0919p3973O944k6880m50410K60985K78129k10816J10387l19596l36504
610h06617M68698K70562J88983J16164j66262L16044m5221k71457l46479L95938
600A20353J02736j84494N1879j27816l52899J39969K62752R6794R5917l07203
$$ plain form
590 -102012 -57297 -145660 -386801 -471294 -262526 -250738 -70187 -98851 -129832 72230 3946
579 3946 -214827 -251471 -260482 -283196 -122656 -133694 -158396 -197248 -177220 -60164 3298 -184985
567 -184985 -25223 -9629 -390441 -409688 -171028 -50689 -12480 -62571 -401077 -452229 -196683
556 -196683 10505 -311979 -684378 -631663 -279170 -145189 -138509 -178518 -161261 -216362 -22343
545 -22343 -136566 -57889 -59572 -16407 132848 377984 272352 166085 -154941 -247516 -86877
534 -86877 -262539 34990 76831 -166057 -21969 160782 67520 -197052 -502059 -642610
524 -642610 -392021 32548 -32180 354636 -9917 -304903 -100692 53405 -28581 -278212
514 -278212 -271507 7029 183326 -7381 -38205 -373331 -438885 -247118 -149440 125792 32608
$$ packed form
590a02012M4715q8363k41141q4493K08768J1788J80551k8664l0981K02062o8284
579C946k18773l6644r011k2714J60540j1038k4702l8852K0028J17056O3462j88283
567a84985J59762J5594l80812j9247K38660J20339L8209n0091l38506n1152K55546
556a96683K07188l22484l72399N2715L52493J33981O680m0009J7257n5101J94019
545b2343j14223P8677j683M3165J49255K45136j05632j06267l21026r2575J60639
534h6877j75662K97529M1841k42888J44088J82751r3262k64572l05007j40551
524f42610K50589M24569o4728L86816l64553k94986K04211J54097q1986k49631
514b78212O705K78536J76297j90707l0824l35126o5554J91767R7678K75232r3184
$$ plain form
503 32608 -31074 -149537 -339035 -160263 153294 306831 -161997 -365985 -194835 -112382
493 -112382 -58573 -144448 -284345 -301216 -231415 -320938 -390965 -261668 -236144 -158188 -193319
482 -193319 -217096 -255907 -308580 34580 -10878 -58604 158207 168324 -94620 97747 48510
471 48510 230204 173441 80543 3818 -2529 15753 -170946 -453726 -409255 -102808 -465442
460 -465442 -798159 -468603 -390109 -377056 -627764 -568735 -373258 -18002 -25841 -169297 65735
449 65735 -109125 115884 169979 242880 -27825 134247 1896 171 -142689 -293173 -325142
438 -325142 -78835 -45663 -52885 -76875 216839 59074 -220698 -88961 -344822 -382537 -536738
427 -536738 -332020 -216808 -160310 -107144 -57384 22299 -75661 -394709 -65314 59741 64461
$$ packed form
503C2608o3682j18463j89498J78772L13557J53537m68828k03988J71150Q2453
493a12382N3809q5875j39897j6871O9801q9523p0027J29297K5524P7956l5131
482a93319k3777l8811n2673L43160m5458m7726K16811J0117k62944J92367m9237
471D8510J81694n6763r2898p6725o347J8282j86699k82780M4471L06447l62634
460d65442l32717L29556P8494J3053k50708N9029J95477L55256p839j43456K35032
449F5735j74860K25009N4095P2901k70705J62072j32351j725j42860j50484l1969
438c25142K46307L3172p222k3990K93714j57765k79772J31737k55861l7715j54201
427e36738K04718J15212N6498N3166M9760P9683r7960l19048L29395J25055M720
$$ plain form
416 64461 -185409 -177384 96049 -42167 111140 -100732 85895 112735 48274 -20918 -138056
405 -138056 -192018 26854 -94934 40805 -159048 -209943 -140966 26655 67554 -20835 -62030
394 -62030 -383354 -12774 7983 285141 220336 -275953 -234454 128746 55227 -35353 119064
383 119064 218176 247432 110830 -237875 -79409 -80299 -16253 -134643 58156 -151293 -181093
372 -181093 72752 -215275 -81115 -40596 9393 -140114 -370825 -200983 -218724 -58434
362 -58434 -81109 -252208 -337628 -192103 168550 -19448 -459221 -180500 -123016 -34436 55700
351 55700 73594 -8218 125577 237376 -207016 -294449 84418 364992 -108436 62257 132672
340 132672 63878 162887 -104570 -265513 -158970 209316 338309 430187 215798 -388415
$$ packed form
416F4461k49870Q025K73433j38216J53307k11872J86627K6840o4461o9192j17138
405a38056n3962K18872j21788J35739j99853n0895O8977J67621M0899q8389m1195
394f2030l21324L70580K0757K77158o4805m96289M1499L63200p3519r0580J54417
383A19064R9112K9256j36602l48705J58466q90O4046j18390J92799k09449k9800
372a81093K53845k88027J34160M0519M9989j49507k30711J69842j7741J60290
362e8434k2675j71099q5420J45525L60653j87998m39773K78721N7484Q8580R0136
351E5700J7894q1812J33795J11799m44392q7433L78867K80574m73428J70693P0415
340A32672o8794R9009k67457j60943J06543L68286J28993R1878k14389o04213
$$ plain form
330 -388415 -170313 49970 -97988 -127305 6502 100550 21428 -386740 -217393 -318034
320 -318034 -383099 -199335 -151499 185 97062 168000 191186 156845 358073 410931 89124
$$ packed form
330c88415K18102K20283j47958k9317J33807R4048p9122m08168J69347j00641
320c18034o5065J83764M7836J51684R6877P0938K3186l4341K01228N2858l21807
$$ [...]
##END NTUPLES=NMR SPECTRUM
##END=
