##TITLE=1H_TG-2371
 CDCl3
 8 sc, 
 24.1.2023
##JCAMPDX= 6.0         $$ Bruker NMR JCAMP-DX V2.0
##DATA TYPE= NMR SPECTRUM
##DATA CLASS= NTUPLES
##ORIGIN= UXNMR, Bruker Analytische Messtechnik GmbH
##OWNER= root
$$ XWIN-NMR		Version 3.5
$$ Tue Jan 24 14:15:47 2023 Russian Standard Time (UT+4h)  she@DPX200
##.OBSERVE FREQUENCY= 200.13135
##.OBSERVE NUCLEUS= ^1H
##.ACQUISITION MODE= SIMULTANEOUS
##.ACQUISITION SCHEME= undefined
##.AVERAGES= 8
##.DIGITISER RES= 18
##SPECTROMETER/DATA SYSTEM= spect
##.PULSE SEQUENCE= zg30
##.SOLVENT NAME= CDCl3
##.SHIFT REFERENCE= (INTERNAL, CDCl3, 0, 15.7612)
##AUDIT TRAIL= $$ (NUMBER, WHEN, WHO, WHERE, WHAT)
$$ ##TITLE= Audit trail, XWIN-NMR		Version 3.5
$$ ##JCAMPDX= 5.01
$$ ##ORIGIN= Bruker BioSpin GmbH
$$ ##OWNER= she
$$ F:/spectra/data/she/nmr/H-F/1/pdata/1/auditp.txt
$$ ##AUDIT TRAIL=  $$ (NUMBER, WHEN, WHO, WHERE, WHAT)
(   1,<2023-01-24 14:14:32.15 +0400>,<she>,<DPX200>,
      <created by zg, POWCHK disabled, PULCHK disabled
       configuration hash MD5:
       00 E9 B6 7A A2 85 ED C7 34 08 36 98 17 FE 4E 26
       data hash MD5: 16K
       00 A4 B2 9E CF 51 D2 C9 2B 43 62 D6 1D 7D 3F CE>)
(   2,<2023-01-24 14:14:36.17 +0400>,<she>,<DPX200>,
      <Start of raw data processing
       efp BC_mod = 2 LB = 0.24 FT_mod = 6 PKNL = 1 PHC0 = -19118.28 PHC1 = 17.60079 SI = 16K 
       data hash MD5: 16K
       41 0C 30 42 8D D1 1C FC C9 00 95 B4 30 23 B7 BA>)
(   3,<2023-01-24 14:14:56.31 +0400>,<she>,<DPX200>,
      <pk PHC0 = 2.831617 PHC1 = -2.2 
       data hash MD5: 16K
       35 FF F1 D6 48 C2 1B A0 44 A6 FA 70 AC 72 38 BD>)
(   4,<2023-01-24 14:14:59.65 +0400>,<she>,<DPX200>,
      <abs ABSG = 5 
       data hash MD5: 16K
       A9 13 E5 A6 52 F9 3B E2 04 E4 32 16 3E C8 65 6C>)
(   5,<2023-01-24 14:15:24.62 +0400>,<she>,<DPX200>,
      <abs ABSG = 5 
       data hash MD5: 16K
       FE E8 78 08 47 53 1A 34 4F CF CC 10 82 05 B1 80>)
$$ ##END=
$$ 
$$ hash MD5
$$ E5 CC F8 AC 6D E2 AB AB B7 B0 98 9D 21 8D 1E 68
##$RELAX= 
##$RELAX= 
##$RELAX= 
##$RELAX= 
##$RELAX= 
##$RELAX= 
$$ Bruker specific parameters
$$ --------------------------
##$DU= <F:/spectra>
##$EXPNO= 1
##$NAME= <H-F>
##$PROCNO= 1
##$TYPE= <nmr>
##$USER= <she>
##$AMP= (0..31)
100 100 100 100 100 100 100 100 100 100 100 100 100 100 100 100 100 100 
100 100 100 100 100 100 100 100 100 100 100 100 100 100 
##$AQSEQ= 0
##$AQ_mod= 1
##$AUNM= <au_zg>
##$AUTOPOS= <>
##$BF1= 200.13
##$BF2= 200.13
##$BF3= 200.13
##$BF4= 200.13
##$BF5= 200.13
##$BF6= 200.13
##$BF7= 200.13
##$BF8= 200.13
##$BYTORDA= 1
##$CFDGTYP= 0
##$CFRGTYP= 5
##$CHEMSTR= <none>
##$CNST= (0..31)
1 1 145 1 1 1 1 1 1 1 1 1 1 1 1 1 1 1 1 1 1 1 1 1 1 1 1 1 1 1 1 1 
##$CPDPRG= <>
##$CPDPRG1= <>
##$CPDPRG2= <>
##$CPDPRG3= <>
##$CPDPRG4= <mlev>
##$CPDPRG5= <mlev>
##$CPDPRG6= <mlev>
##$CPDPRG7= <mlev>
##$CPDPRG8= <mlev>
##$CPDPRGB= <>
##$CPDPRGT= <>
##$D= (0..31)
0 1.2 0 0 0 0 0 0 0 0.06 0 0.03 0 0 0 0 0.0002 0 0 0 0 0 0 0 0 0 0 0 0 
0 0 0 
##$DATE= 1674555271
##$DBL= (0..7)
$$ [...]
##$SUBNAM3= <"">
##$SUBNAM4= <"">
##$SUBNAM5= <"">
##$SUBNAM6= <"">
##$SUBNAM7= <"">
##$SUBNAM8= <"">
##$SUBNAM9= <"">
##$SW= 18.05172834244
##$SWIBOX= (0..15)
0 0 2 0 0 0 0 0 0 0 0 0 0 0 0 0 
##$SW_h= 3612.71676300578
##$TD= 16384
##$TD0= 1
##$TE= 0
##$TE2= 300
##$TE3= 300
##$TEG= 300
##$TL= (0..7)
0 120 120 120 120 120 120 120 
##$TP= (0..7)
150 150 150 150 150 150 150 150 
##$TP07= 0
##$TPNAME0= <>
##$TPNAME1= <>
##$TPNAME2= <>
##$TPNAME3= <>
##$TPNAME4= <>
##$TPNAME5= <>
##$TPNAME6= <>
##$TPNAME7= <>
##$TPOAL= (0..7)
0.5 0.5 0.5 0.5 0.5 0.5 0.5 0.5 
##$TPOFFS= (0..7)
0 0 0 0 0 0 0 0 
##$TUNHIN= 0
##$TUNHOUT= 0
##$TUNXOUT= 0
##$USERA1= <user>
##$USERA2= <user>
##$USERA3= <user>
##$USERA4= <user>
##$USERA5= <user>
##$V9= 5
##$VALIST= <valist>
##$VCLIST= <CCCCCCCCCCCCCCC>
##$VD= 0
##$VDLIST= <DDDDDDDDDDDDDDD>
##$VPLIST= <PPPPPPPPPPPPPPP>
##$VTLIST= <TTTTTTTTTTTTTTT>
##$WBST= 1024
##$WBSW= 4
##$XGAIN= (0..3)
0 0 0 0 
##$XL= 0
##$YL= 0
##$YMAX_a= 214390
##$YMIN_a= -273972
##$ZGOPTNS= <>
##$ZL1= 120
##$ZL2= 120
##$ZL3= 120
##$ZL4= 120
##$ABSF1= 15.76121
##$ABSF2= -2.290639
##$ABSG= 5
##$ABSL= 3
##$ALPHA= 0
##$AQORDER= 0
##$ASSFAC= 0
##$ASSFACI= 0
##$ASSFACX= 0
##$ASSWID= 0
##$AUNMP= <proc_1d>
##$AZFE= 0.1
##$AZFW= 0.1
##$BCFW= 0
##$BC_mod= 2
##$BYTORDP= 0
##$COROFFS= 0
##$CY= -3
##$DATMOD= 1
##$DC= 0
##$DFILT= <>
##$DTYPP= 0
##$F1P= 0
##$F2P= 0
##$FCOR= 1
##$FTSIZE= 16384
##$FT_mod= 6
##$GAMMA= 0
##$GB= 0
##$INTBC= 1
##$INTSCL= 3.70164e-10
##$ISEN= 128
##$LB= 0.24
##$LEV0= 0
##$LPBIN= 0
##$MAXI= 10000
##$MC2= 0
##$MEAN= 0
##$ME_mod= 0
##$MI= 1.114404
##$NCOEF= 0
##$NC_proc= -7
##$NLEV= 6
##$NOISF1= 3.799351
##$NOISF2= 2.8
##$NSP= 0
##$NTH_PI= 0
##$NZP= 0
##$OFFSET= 15.76121
##$PC= 1
##$PHC0= -19115.45
##$PHC1= 15.40079
##$PH_mod= 1
##$PKNL= yes
##$PPARMOD= 0
##$PSCAL= 0
##$PSIGN= 0
##$REVERSE= no
##$SF= 200.130002066528
##$SI= 16384
##$SIGF1= 3
##$SIGF2= 2
##$SINO= 5.538805
##$SIOLD= 16384
##$SREGLST= <1H.CDCl3>
##$SSB= 0
##$STSI= 16384
##$STSR= 0
##$SW_p= 3612.71676300578
##$SYMM= 0
##$S_DEV= 0
##$TDeff= 16384
##$TDoff= 0
##$TI= <>
##$TILT= no
##$TM1= 0
##$TM2= 0
##$TOPLEV= 0
##$USERP1= <user>
##$USERP2= <user>
##$USERP3= <user>
##$USERP4= <user>
##$USERP5= <user>
##$WDW= 1
##$XDIM= 16384
##$YMAX_p= 429479161
##$YMIN_p= -761321
$$ End of Bruker specific parameters
$$ ---------------------------------
##NTUPLES= NMR SPECTRUM
##VAR_NAME=  FREQUENCY,     SPECTRUM/REAL,   SPECTRUM/IMAG
##SYMBOL=    X,             R,               I
##VAR_TYPE=  INDEPENDENT,   DEPENDENT,       DEPENDENT
##VAR_FORM=  AFFN,          ASDF,            ASDF
##VAR_DIM=   16384,         16384,           16384
##UNITS=     HZ,            ARBITRARY UNITS, ARBITRARY UNITS
##FACTOR=    0.220516191357247, 1,           1
##FIRST=     3154.29107824626, 0,            0
##LAST=      -458.42568475952, 0,            0
##MIN=       -458.42568475952, -761321,      0
##MAX=       3154.29107824626, 429479161,    0
$$ Real data points
##PAGE= N=1
##DATA TABLE= (X++(R..R)), XYDATA
$$ [...]
9077 -80796 -173584 -188407 -117974 -173792 -123132 79738 79258 164264 244068 131453 33067 -118522
9065 -118522 4473 101463 6757 -90373 -177945 -182494 51245 -59840 49037 -141507 -226016
9054 -226016 -160287 -236238 -96573 -234837 -161923 -133752 -25651 8607 126222 96343 229476
9043 229476 176762 -205848 -258351 -68750 -106908 51357 -66189 -292411 -156016 847
9033 847 40809 -26823 80983 56203 172851 189309 -50033 56998 -42069 17225 37993
9022 37993 -24930 -4897 46342 149912 -77097 -45069 -84688 -357289 -297790 -156930 -38174
9011 -38174 24246 18254 130758 -127133 -112796 -195049 -166375 60438 -96984 2036 90311
9000 90311 250421 239651 39321 -77904 -113835 -167087 -93521 32046 -149868 -230850 -117597
8989 -117597 8755 -15187 27246 -81590 -328 29767 -7348 -66593 -62191 -73121 -130491
8978 -130491 -126729 -11599 -128834 -194634 -277480 -337246 -89053 -146556 -163183 -202652 -390347
8967 -390347 -256617 -187312 -331719 -234532 -47623 -6123 -69773 36950 55213 -223335 -197740
8956 -197740 -127684 -102587 -154207 -299808 -281127 -317600 -218363 -334784 -297625 21393 161508
8945 161508 -1229 -177349 -135425 -138255 -241494 -162283 -112088 18655 -47295 -25342 7083
8934 7083 -154974 -49904 68578 4323 -152996 -462093 -424295 -431421 -267693 -11420 -12620
8923 -12620 -84904 28553 48505 -145955 -168108 96941 57770 125014 51077 232033 283562
8912 283562 225920 -47751 -182571 -5671 -119013 -102331 -163626 -29544 36850 69415 -287860
8901 -287860 -68615 129921 -255901 -332798 -334606 -91860 -47562 -76114 16079 -24337 -26514
8890 -26514 -100541 -79141 -165728 -26320 -49054 56332 -117674 -232962 -226100 4173 -183300
8879 -183300 -193358 -167836 -154697 -213239 -183681 -253616 -334715 -328922 -261774 -101606 -135303 -63799
8867 -63799 -12831 -235209 -274627 -161048 -199405 -290934 -224774 -305155 -163663 -22057 -100584
8856 -100584 58479 7625 43665 94106 101843 -59924 -167665 14279 27983 -147631 74120
8845 74120 228471 109241 50122 195663 122829 -87815 6290 -47362 -280961 82349 31354
8834 31354 53931 34435 10348 150938 25678 90633 166242 148462 134115 57965 -96288
8823 -96288 158980 80481 -309028 55890 31021 -72714 -44793 165505 66161 118903 89016
8812 89016 179802 429707 322711 134656 37977 57220 85158 120556 301399 445602 288095
8801 288095 210762 313585 130939 240293 471657 373263 282599 162416 212504 346909
8791 346909 223164 165939 280639 284444 285074 268212 316062 232405 244461 254664 366534 296500
8779 296500 161400 82205 189407 404914 379322 267410 364536 497789 590753 659742 576232
8768 576232 508144 592754 921327 913888 796611 758520 870470 957149 874868 882466 623602
8757 623602 684819 665074 798218 783529 806294 939047 896591 950726 974095 1058161 855131
8746 855131 784734 986284 1083343 1042523 998007 1037120 1189419 1241416 1424007 1385432 1157932
8735 1157932 1236437 1552497 1766355 1968662 1900015 1697685 1954000 2156664 2422958 2543980
8725 2543980 2613223 2690006 2947567 3026456 3135977 3212080 3430827 3824161 4096313 4406927
8715 4406927 4819814 5321323 5869072 6448916 7062948 7629084 8445547 9380237 10442928
8706 10442928 12107247 14116710 17021095 20781306 24459713 27609014 27755642 24106178
8698 24106178 19460048 15188805 12076354 9842551 7995456 6646954 5699011 4999249
8690 4999249 4603329 4181977 3508561 3143820 2901301 2678026 2741178 2579680 2461343 2120935
8680 2120935 1907534 1941516 1746641 1608364 1479240 1564493 1402284 1266182 1287395 1308381
8670 1308381 1048690 910636 1038749 902626 708574 701881 974088 979083 825312 718487
8660 718487 721322 725563 448208 435084 565576 541929 580251 627577 543449 564873 670531
8649 670531 417561 278106 127189 185171 406284 329119 156678 138838 221494 76365
8639 76365 168048 125776 172002 195755 195566 -9932 -150757 3222 29964 217248 164237
8628 164237 228096 325983 226543 209880 126818 96429 99713 -121453 -94238 19741 134287
8617 134287 -55791 -94019 -119238 29899 111999 -30854 -12321 -94399 -159958 -233956 -281275
8606 -281275 -216983 -108016 -257628 -118475 -94846 -229443 -190902 -53407 121227 59917
8596 59917 21908 64460 14415 153213 133523 70631 -123079 -267848 -137099 -213273 -193012
8585 -193012 -203404 -272547 -105441 -98467 -59052 31743 -82928 -216567 -207221 -56675 -55314
8574 -55314 -21086 150924 -5306 -371461 -289377 31141 -25369 -158770 -158507 -262593 -118514
8563 -118514 -287896 -320109 -269449 -241651 -291185 -185462 -331192 -301250 -218856 -227235 -190893
8552 -190893 -313882 -414819 -497941 -360474 -172081 -309881 -164808 -78341 -182978 -161292
8542 -161292 -131809 -250256 -396985 -391078 -271257 -228459 -62661 -94126 -52857 -252019 -511711
8531 -511711 -353716 -300905 -157252 -282877 -77743 -83235 -228714 -349716 -210843 -289949
8521 -289949 -206781 -324017 -378591 -345658 -325430 -398151 -359962 -248776 -202577 -115264 -235489
8510 -235489 -174144 -172663 -304885 -238395 -81551 -74625 -114348 36059 -152635 -167374 -162165
8499 -162165 -264543 -274192 -166546 -221356 -372083 -270703 -276770 -433351 -513708 -88546 17542
8488 17542 -183096 -196795 -226884 -196198 -234311 -348280 -416344 -257780 -131941 -275120 -325379
8477 -325379 -306356 -312865 -356648 -256628 -157843 -52716 -98954 -369648 -496562 -397016 -292542
8466 -292542 -237967 -272362 -150048 -181331 -323545 -279193 -323040 -279152 -462928 -498921 -463068
8455 -463068 -65611 85959 -67079 -33068 -334590 -312377 -109536 -113138 -150483 -331165 -70276
8444 -70276 -58482 -208818 -326396 -273378 -344278 -324064 -356190 -372766 -291812 -515850 -761321
8433 -761321 -402975 -159770 -197608 -233282 -210391 -327435 -541997 -461927 -522207 -572531 -559924
8422 -559924 -414260 -181952 -175175 -296385 -180043 -224552 -41891 -149352 -71822 15769 -112393
8411 -112393 -273722 -129200 -151803 23955 101297 -136503 -510825 -354508 -262701 -370394
8401 -370394 -403474 -252196 -203874 -159581 -280049 -273468 -260338 -151479 -171788 -157506 -215796
8390 -215796 -251198 -183673 -176378 -302408 -555580 -509091 -470974 -306347 -224797 -178821 -58781
8379 -58781 -228650 -277724 -303726 -341230 -167257 -120044 -80267 -152019 -155685 -135834 -304810
8368 -304810 -209957 -58434 -73200 -110995 -162676 -292352 -140042 -186874 -63784 65365 -163537
8357 -163537 -296336 -253273 -252109 -316782 -179364 -366111 -137371 -246035 -275986 -313930 -318984
8346 -318984 -68792 -3963 -154783 -249439 -395481 -234759 -291591 -356089 -108032 -141669 -97011
8335 -97011 66484 -104815 -326036 -286760 -202884 -271814 -341290 -433899 -213397 -125244 -290484
8324 -290484 -269626 -150390 -98465 62815 -67868 -178271 34488 -16796 -177467 -222932
8314 -222932 -419816 -184765 -181313 -156013 -93728 -18839 20412 -79119 -203099 -241132 -354654
8303 -354654 -289125 -78596 -260736 -194944 -1613 -34179 -74073 -142108 -254706 -54040 -76608
8292 -76608 -130236 -90942 -233243 -105343 -135038 -100144 -191080 -290416 -134757 -189311 -144068
8281 -144068 -189283 -196174 -380330 -251684 -174845 -261708 -199764 -166351 -133358 23990 -94666
8270 -94666 18514 -56810 -186599 -10859 -127513 -140335 -330607 -203920 -75539 -127271
8260 -127271 103219 13958 -140919 -245316 -245446 -97458 -26928 -147772 -34309 -47050 -243736
8249 -243736 -299469 -281668 -58342 85020 -57598 -138409 -217990 -277456 106644 85871 -36656
8238 -36656 194102 115335 -9409 -144154 -188926 -165917 -142549 -228828 -168999 58623 -108075
8227 -108075 -233341 -154855 -76175 -454 116265 -11753 -158544 -128743 -311835 -209966
8217 -209966 -37022 -196657 -170546 -276505 -178809 -151405 -329560 -76850 3497 38583 -46279
8206 -46279 -64187 65560 17740 -71638 -56194 -47428 -285042 82610 -174035 -153260 -75100
8195 -75100 98817 135256 765726 1856818 223943 -315206 -230467 -119536 -195076 -154902
8185 -154902 20196 55206 -213627 -228094 -86256 -210455 -110604 -218728 -243071 -231199 -150110
8174 -150110 13759 76069 -4945 -38846 -118535 -214367 -381419 -364209 -248862 -275707 -249428
8163 -249428 -179071 -262523 -191608 -42672 -32604 -113472 -24743 -105952 11607 -53007 -1673
8152 -1673 49455 -36678 -60305 88089 18282 -133496 -33236 -91787 -222387 -138943 148017
8141 148017 165684 -33629 -137321 13992 -71124 -22515 -14752 -280014 -234925 -297610 -143072
8130 -143072 -266857 -312358 -157846 -204198 -114608 -161878 -361427 -161652 48959 -153974
8120 -153974 -326640 -343230 -335662 -242678 544 -50253 -99877 -97842 18680 103798 60754
8109 60754 147322 315706 212487 -144861 -269944 -157716 8595 149404 -55158 29958
8099 29958 246797 109927 -2052 -7586 -23554 -33846 -46928 -16280 -84323 -68576 -48597
8088 -48597 -170627 -174243 -101153 159819 -68703 -214906 -100769 105960 77074 -143358 34678
8077 34678 155062 111172 85696 -108836 -61958 36247 35157 -55460 -79760 -160054 -134372 -129182
8065 -129182 59053 262489 247659 52251 21131 -50950 -27377 -13752 -134726 -74648 39115
8054 39115 58530 -95061 1670 112526 153429 106625 71194 119978 58818 80845 124300
8043 124300 -55520 -29832 198872 130258 -47657 -147491 -79343 94221 -10863 -106847 -1619
8032 -1619 -68051 -36155 -81939 266042 278413 278404 226491 185743 236609 213846 266324 230917 69288
8019 69288 -97293 67614 -56887 132095 4029 213613 210946 211350 -21284 714 127103
8008 127103 184132 136451 26301 -48773 63922 88471 69909 120734 257412 275899 97666
7997 97666 122524 231264 91840 175506 237610 322553 274999 35326 44280 232865 240557
7986 240557 74277 84826 25665 -39291 254340 374339 35933 -56367 48429 197236
7976 197236 255484 165729 195023 301212 159685 262286 167943 433566 450475 282620 343288
7965 343288 386198 260633 3054 163280 260845 257123 110564 237533 323517 136332 284720
7954 284720 163969 212773 189432 206966 241174 152239 60158 275392 429984 150549 246375
7943 246375 236270 295213 159965 306075 438701 397836 510918 540916 355524 207466
7933 207466 239335 349657 415578 321953 470942 140096 283003 538247 674669 654924
7923 654924 522802 426725 366497 373865 307782 310817 282769 112074 149960 288517 298466 296511
7911 296511 275073 335184 332065 403388 345450 99097 74557 223605 469081 589963 513285
7900 513285 310163 235761 235055 272795 523853 469656 288271 194401 325996 494013 542948
7889 542948 566079 497973 316620 377403 527287 401922 319806 582813 542443 502178 516217
7878 516217 339497 411483 378106 472108 469479 516526 374485 175792 301580 588532 412207
7867 412207 278861 465240 675438 855944 673927 687895 554982 601848 513073 600290
7857 600290 514148 568054 681404 539118 664673 498550 635852 521381 672980 617696
7847 617696 621144 685814 564844 735427 549717 727065 773178 716882 877592 672207 673136
7836 673136 733908 555833 712795 779155 707996 779401 748767 500650 712445 893458 555540
7825 555540 436190 528954 568702 659538 716688 709291 702434 594288 528525 605990 710073
7814 710073 908130 674158 432477 334475 230419 435329 453367 532803 827995 880830
7804 880830 602920 512171 619702 805649 869916 821856 713569 847441 918140 884365 677518
7793 677518 692850 801096 876057 844369 800708 751185 725652 772078 840225 1059863 1122490
7782 1122490 962475 885580 1058010 1121474 1090540 944826 942301 1120772 1071153 980905 966906
7771 966906 878050 877712 704052 813456 1043046 1062374 1046244 952545 1054456 1228812 1021535
7760 1021535 967502 1139883 1068460 956881 1337140 1123703 955053 1073406 1180595 1073016
7750 1073016 1029168 998903 1236125 1189097 963474 1089408 1175947 1143836 1145753 1268333 1256251
7739 1256251 1197484 1228618 1335356 1452929 1449126 1385447 1326064 1332947 1429820 1338632 1349860
7728 1349860 1573479 1420979 1381402 1329933 1344634 1309595 1226136 1294424 1258601 1279638 1347080
7717 1347080 1490350 1479750 1527448 1322763 1447099 1436637 1492207 1586481 1710684 1648572 1609333
7706 1609333 1538984 1229408 1254654 1298368 1248541 1520434 1617548 1540849 1547347 1598192 1554604
7695 1554604 1754085 1650321 1587486 1698258 1711951 1814056 1707192 1980404 1979721 1860106
7685 1860106 1886939 1831997 1609990 1558982 1591085 1682238 1849010 1834808 1854420 1698641 1751894
7674 1751894 1693115 1733953 1962101 1966256 1989064 2020444 2104272 2090198 2099965 2052528 2217815
7663 2217815 2306088 2041199 2257719 2213881 1993268 1825197 2058722 2152567 2009168 2085803
7653 2085803 2278325 2284501 2233080 2289474 2340455 2473048 2464667 2409135 2261821 2131397 2310233
7642 2310233 2409234 2410341 2316434 2508713 2550606 2260864 2434091 2496781 2581986 2493205 2399453
7631 2399453 2513779 2612096 2659048 2431928 2560966 2763512 2874036 2739723 2758149 2890938
7621 2890938 2867805 2801617 2703391 2652375 2592558 2811973 2912214 2976827 2977302 2864737 2775674
7610 2775674 2965448 3131683 3103259 3069563 3149210 3140272 3366478 3269368 3204973 3178737 3130060
7599 3130060 3120934 3023800 3142404 3380992 3205277 3289846 3352411 3395352 3509523 3297527 3503306
7588 3503306 3803084 3705004 3430658 3362275 3566352 3645445 3632183 3666094 3523962 3638501
7578 3638501 3613861 3510195 3631164 3741505 3817267 3676747 3928816 3851445 3790021 3892900
7568 3892900 3721997 3806866 3731533 3850247 4089322 4172129 4163397 4081491 4088419 4151786 4062245
7557 4062245 4236448 4292665 4276804 4150447 4110770 4254586 4384250 4510945 4328741 4197199
7547 4197199 4552584 4654842 4607053 4469606 4654474 4746519 4601808 4633884 4615747 4594325
7537 4594325 4672326 4952464 4919166 4907752 4938109 5049225 5244055 5255844 5228743 5422326 5175538
7526 5175538 5273186 5245015 5148601 5431520 5460376 5304238 5386031 5495270 5594881 5690740 5783228
7515 5783228 5521588 5459099 5463685 5505187 5523627 5473541 5530642 5569807 5598282 5667616 5785263
7504 5785263 5830199 6098452 6241443 6065664 5916582 5872029 5997420 6190859 6076769 6014886
7494 6014886 6079613 6106879 6230422 6418226 6287174 6293538 6249309 6331646 6447707 6497288 6627758
7483 6627758 6698202 6698108 6734945 6670431 6441958 6557020 6592978 6507136 6747908 6689926 6686789 6464343
7471 6464343 6604469 6656196 6625727 6756323 6822280 6628841 6746346 7073897 7019456 7140630
7461 7140630 7066454 7081189 7236915 7130649 7099739 7096208 7067841 7056368 7178043 7157060 7083043
7450 7083043 7205609 7126503 7179750 7225707 7219205 7229328 7134440 7133369 6937484 6988762 7209897
7439 7209897 7250411 7196481 7368132 7280676 7416749 7554519 7403345 7430619 7395824 7300642 7390240
7428 7390240 7277894 7285215 7547371 7468437 7440018 7424766 7299978 7136018 7212416 7275546 7343506
7417 7343506 7323898 7157282 7029228 7144254 6983625 7083184 7117521 7279628 7327440 7250318
7407 7250318 7282548 7219377 7138180 7233710 7455188 7354618 7284716 7227576 7040773 6814483 6966177
7396 6966177 7065181 7044709 6935793 6856645 6848785 6803844 6776395 6824507 6803030 6584918 6456369
7385 6456369 6481544 6506681 6330614 6431200 6397863 6427161 6435432 6413772 6420312 6296116 6336267
7374 6336267 6463692 6511227 6375642 6152716 6045351 6081084 6116891 6143058 6248110 6062029
7364 6062029 5942848 5861320 5947835 6005914 5798430 5679377 5879435 5908960 5859661 6104972
7354 6104972 5876127 5649251 5451277 5417916 5684194 5811272 5662032 5345439 5504012 5433088
7344 5433088 5394615 5236263 5298798 5338494 5204624 5124744 5166910 5176006 4995997 4878110 4839818
7333 4839818 4992773 4858145 4924375 4949033 4837781 4769633 4648557 4675473 4527069 4653965
7323 4653965 4756910 4782328 4856246 4363332 4435839 4356171 4585765 4552045 4429504 4236539
7313 4236539 4187985 4262123 4208896 4264916 4267220 4307882 4284146 4271892 4287176 4093767 3911603
7302 3911603 3975331 3917443 3943888 3831336 3860797 3723813 3575640 3862535 3890505 3816866 3596225
7291 3596225 3461307 3407202 3461103 3403177 3403896 3482215 3425341 3484874 3385164 3297886 3177765
7280 3177765 3087999 3118404 3053904 2879815 2947814 3311977 3199460 3066007 3131077 2901529
7270 2901529 2929404 2880543 2915700 2864476 2654612 2696988 2862493 2808435 2805658 2886390 2719693
7259 2719693 2557963 2567168 2602737 2525022 2555577 2516833 2652235 2652095 2421469 2444837 2493931
7248 2493931 2575429 2551206 2381571 2293773 2344503 2393633 2245725 2278001 2238509 2169240 2285070
7237 2285070 2155348 2183758 2100754 2070875 2219000 2266298 2040928 2034877 1849772 1884908 1816644
7226 1816644 1893654 2019606 1940193 1869118 1949446 1967889 1991027 1930825 1853295 1889744 1928239
7215 1928239 1731155 1632507 1671846 1753735 1679599 1663628 1818871 1763312 1701999 1723389 1809173
7204 1809173 1589159 1464846 1404877 1570381 1587108 1645265 1623389 1524158 1539748 1614475 1408947
7193 1408947 1347213 1531256 1738320 1589843 1341673 1421683 1605270 1586180 1589495 1377792
7183 1377792 1451096 1374805 1220036 1296770 1426464 1522425 1418705 1563915 1438736 1351037
7173 1351037 1181127 1108877 1458131 1191109 1230664 1179825 993003 990688 1141455 1314292
7163 1314292 1291586 1023362 1011665 1110697 1205717 1052327 944829 1072468 969309 1053478
7153 1053478 1016127 1076480 1306226 1062957 843756 874715 929331 972036 1006837 1154391 1170289
7142 1170289 1056507 878970 823961 935679 918100 805778 742575 690632 883786 865390
7132 865390 1140085 1057814 864759 776144 686595 547092 591020 785379 562094 576923 710381
7121 710381 574134 439997 443557 748342 819988 515916 692894 933350 803423 677807
7111 677807 556618 538218 534054 549510 537016 467799 439645 482165 568855 538224 504899 728368
7099 728368 565757 613864 472927 547855 696196 669130 646995 657058 613663 700531 635063
7088 635063 671053 620605 298075 410470 495553 466333 389525 447715 463694 421122 260224
7077 260224 315469 523010 478352 477281 557471 578585 312072 256666 440039 422940 580121
7066 580121 430542 296554 227547 344974 188859 265461 508656 565215 744366 508251
7056 508251 212044 292850 537333 596797 463356 440474 566292 567190 464098 545428 550583
7045 550583 423377 193776 165674 75624 8435 47573 151853 140882 123953 136625 -80030
7034 -80030 -44172 1072 2099 75050 133106 228057 149138 130057 169043 292449 260728 262042
7022 262042 388243 215326 36003 176877 99396 29466 174398 79828 23421 185560
7012 185560 175080 74086 47630 8107 212070 181970 258147 155867 67546 120527 228207
7001 228207 300000 257100 166336 12497 -85876 -177641 -303823 -63672 149462 131038 -46756
6990 -46756 98397 279402 70097 56284 -49092 -55842 -44712 -90844 -149078 -6785 -65168
6979 -65168 -144715 -129965 105481 120704 333250 17843 -149919 -110298 19595 119643 -55696
6968 -55696 -55908 -57182 121885 -109480 62545 217831 73192 66795 385582 310810 42440
6957 42440 15942 -53848 -72845 -22074 -21950 283530 261482 37938 183228 59908 77480
6946 77480 35223 -223955 12256 57272 126456 114167 41349 -99402 -91037 -118589 -120436 49595
6934 49595 -171146 -265278 -263783 24570 -54865 24398 35480 -57999 -52404 -66265 -9871 134665
6922 134665 218546 73040 110540 25958 17203 56889 -61966 -2968 61769 108679 4129
6911 4129 97980 160310 191623 98969 -115769 -3258 153139 74184 135489 12321 -134317
6900 -134317 131447 125103 60150 -27177 10071 -5315 97481 -40777 -225778 -161086 -29175
6889 -29175 -59335 92604 -45941 -296554 -298037 -395110 -124823 39815 84278 198219 122699
6878 122699 -67380 73162 54580 42731 72562 40278 -133166 -261911 -145616 -56660 -66152
6867 -66152 -155824 -256352 -170928 -3179 -17880 51863 52717 53394 88354 161624 6579 -42347
6855 -42347 -114312 181553 257083 25836 -157037 -158126 -160199 -65578 10279 110767 199330
6844 199330 -91074 -355117 -231838 -116993 33729 105548 171038 -40499 -272388 -84252
6834 -84252 84939 -70766 -61842 -97513 66581 59688 70443 20086 -52386 48657 192370
6823 192370 303311 172268 435261 324714 266541 268323 229509 92776 -44122 -87079 98199
6812 98199 -216919 -112952 -1904 -64184 -176717 -83109 45793 207766 187179 -15268
6802 -15268 -112026 -95342 -124592 -59766 66477 -4199 -10178 -204080 -394388 -224300 -20445
6791 -20445 -23580 22913 117516 -40713 -76068 -90044 -115261 185882 151034 205355 110533 -87424
6779 -87424 63328 201812 195668 268084 124718 -2188 50411 193341 145838 -7178 -246339
6768 -246339 -194932 -342348 -477718 -250165 -122055 229642 308652 -37330 -163284 15467
6758 15467 -149433 110094 183688 47807 -127675 -89492 -95409 -129318 -88310 -166289 -297972
6747 -297972 -216939 -158550 49336 37838 -55772 113415 67495 -15683 -38183 65196 21941
6736 21941 -143966 2548 115384 130139 75585 -32473 -52110 43465 -16151 -158437 -148794
6725 -148794 -28817 113662 51100 26910 109107 170378 213224 105867 -79343 -2438 38155
6714 38155 166359 271824 -4162 -192335 102665 291705 96559 39162 -30012 -49342
6704 -49342 23368 -72638 32396 106927 167861 -56822 -40669 -55540 -40100 151419 205828
6693 205828 -49351 64341 96473 90901 -15500 44289 69449 -81291 -92987 14228 159073
6682 159073 240367 273593 310005 243469 248673 270852 187903 123255 -53730 64886 256272
6671 256272 256806 392619 254616 281266 224838 302338 149225 129257 358015 406614 249123
6660 249123 88281 84950 226666 199034 438859 300034 136321 164501 103858 137858 233487
6649 233487 513148 400111 465446 571824 613924 465421 649408 665388 740828 814516 855074
6638 855074 506513 482249 497473 538410 384315 271778 468489 341663 499088 675038
6628 675038 566250 433474 519617 449831 314752 562028 710582 755270 553640 720751
6618 720751 763851 785426 759415 637334 753382 820086 663647 745465 921457 792752 840080
6607 840080 947693 944184 905981 897617 826073 1014013 1216113 1087912 1036576 990746 1176809
6596 1176809 1147141 1135326 1032843 1009467 1185888 1373672 1496300 1402897 1177358 1046236
6586 1046236 1288059 1157899 1243206 1343753 1303879 1428357 1603518 1768502 1871873 1896994
6576 1896994 1935656 1860619 1716068 1739347 1725011 2016533 2026042 1959653 1946847 2150697 2154054
6565 2154054 2273494 2609547 2601312 2491021 2453853 2343237 2528469 2650049 2672240 2737070
6555 2737070 2861861 3152648 3121751 3107097 3090504 3149674 3364941 3827367 3662747 3674113
6545 3674113 3796456 3747995 3865463 4133292 4402694 4441921 4497569 4868628 4942757 4933916 5248427
6534 5248427 5539388 5832362 5766677 5970225 6359892 6530963 6855523 7084466 7589035 8033377
6524 8033377 8442642 8731525 8931281 9156545 9764146 10013863 10137564 10362839 10959933 11412982
6514 11412982 11382481 11623643 12065064 12241394 12412826 12633103 12940279 13242728 13270760 13609305
6504 13609305 14049502 14388608 15076526 15622878 16096952 16773903 17422575 18324619 19180562
6495 19180562 20113938 20943051 21775852 22719652 23804730 24680312 25465213 26360969 26647327
6486 26647327 26965387 26993546 27058126 26881981 26372990 26347704 26042753 25660778 25330316 25223554
6476 25223554 25030177 24916478 24977674 25185749 25466600 25974550 26599206 27326712 27903711 28687614
6466 28687614 29729028 30940685 32000939 33180332 34335512 35657741 36597101 37546780
6458 37546780 38141876 38379527 38365935 37585687 37039797 36333241 35265718 33934796 32685153
6449 32685153 31417375 30459145 29479245 28650916 27843837 26981949 26389508 25948957 25629420
6440 25629420 25546709 25484979 25588873 25950644 26148631 26270230 26601034 27090330 27736692 28309668
6430 28309668 28707361 28678947 28680712 28689132 28555105 28006374 27061310 26289787 24992523 23765842
6420 23765842 22543805 21404088 20234761 19243454 18250442 17239805 16442760 15620612 15037163
6411 15037163 14333930 14074575 13696356 13266193 12959273 12598227 12428757 12177419 11860361
6402 11860361 11715430 11711251 11593196 11497432 11239639 11098019 11070114 10854464 10458018 9997511
6392 9997511 9413178 8821194 8477564 7891967 7269712 6980727 6853164 6423356 6023723 5927967
6382 5927967 5680173 5232501 4903075 4807758 4518862 4288067 3990436 3849992 3810379 3691137
6372 3691137 3267477 3185888 3283200 3166033 2931013 2615904 2597522 2650416 2463977 2240204
6362 2240204 2282030 2221793 2343037 2236837 2088552 2074459 1979937 1895578 1758196 1717088 1610161
6351 1610161 1560670 1572761 1425629 1407776 1486694 1522901 1518083 1341794 1134258 1156712 1253686
6340 1253686 1283759 1301814 1365629 1342749 1223945 1059300 1019135 973855 738796 778865 767676
6329 767676 676882 627060 689127 730720 566970 532435 485613 830762 698564 521142 478704
6318 478704 464908 570161 800193 876747 576640 355704 452269 423708 440844 442040 501019
6307 501019 495390 477300 429636 378022 606365 587297 654995 448528 475717 489204 591340
6296 591340 500183 378300 475201 359906 181088 210046 265749 61125 225835 92811
6286 92811 53472 338510 294157 135935 124592 1865 -63474 58415 287244 330976 308821
6275 308821 367950 132838 170092 251569 302354 226701 389278 278958 249283 192204 183608
6264 183608 214729 113828 64483 51802 -21546 -33982 -11160 131755 279708 215220 70897
6253 70897 69050 -80736 -91251 88289 98490 144345 152110 365553 394206 356660 256472
6242 256472 107456 204841 102599 34874 64904 18520 123932 96501 161561 75685 64929
6231 64929 101194 159574 85957 49401 153570 86111 -71352 134589 141568 -98318 -91375
6220 -91375 -122355 31813 73623 169106 284265 197552 -9544 58898 169909 263303 239173
6209 239173 -1408 118870 -17593 49452 104019 162442 256651 222294 45375 287581 512237
6198 512237 388665 184249 256960 272846 328781 264005 84323 90474 191758 505719 406758
6187 406758 218771 252069 296533 279042 477745 274320 197929 309787 377104 450121 688539
6176 688539 489117 484886 438653 642713 536905 281775 467879 391806 510330 559620 649092
6165 649092 540048 704456 529627 522049 524388 442659 625242 514799 503176 559628 401609
6154 401609 419023 546163 471730 500457 532376 552816 454783 562054 714631 468627 464350
6143 464350 293629 393470 535838 492843 635259 732598 544674 532257 762325 757966 842961
6132 842961 675783 478365 575915 644078 545534 456633 640211 528684 392280 551182
6122 551182 692505 635713 640606 668253 545085 378328 278995 318957 402094 470142 520647
6111 520647 547882 332162 119168 210169 416761 315870 447736 601355 686083 595622
6101 595622 485725 458754 583643 495283 607757 514685 547454 474070 510474 565928 586536
6090 586536 581724 449724 439928 539409 551543 557512 554621 543393 536481 325127 394677 524959
6078 524959 608322 619224 600292 622883 465435 539080 566411 621012 659028 438703 494724
6067 494724 609348 680994 763003 599043 517321 640145 687063 642079 540321 750413 596064
6056 596064 635598 564209 827570 980518 853275 1015569 1108393 966947 974194 911899 846660
6045 846660 929065 993401 902156 712045 667289 700661 627147 896711 971439 1024059 1046759
6034 1046759 1013801 1065010 1244793 1345145 1189687 1151413 1000647 1088195 1185141 1065071
6024 1065071 1062880 1162011 1421993 1485434 1258690 1243629 1488652 1620051 1530541 1288590 1516726
6013 1516726 1513141 1352258 1328605 1177834 1254668 1390893 1443238 1494440 1425741 1497652 1640983
6002 1640983 1494474 1514119 1645790 1550620 1524001 1698192 1672102 1801878 1625793 1853631
5992 1853631 1854007 1896134 1835459 1880867 1808569 1857720 1927842 1863902 1932387 1902585 2008912 2112279
5980 2112279 1962356 1991968 2059090 2078412 2162439 2164281 2249933 2133112 2128189 2241874 2331638
5969 2331638 2240244 2213391 2248336 2321494 2354626 2316608 2243600 2613183 2614213 2645071 2716070
5958 2716070 2727631 2943617 2930142 2727185 2679510 2716536 2892751 3163635 3062714 2876836
5948 2876836 3077520 3261698 3097623 3031583 3237546 3390986 3547973 3714531 3649514 3580972
5938 3580972 3546691 3652556 3649091 3763937 3801966 3806957 3830096 4159836 4189254 4235251 4347217
5927 4347217 4178103 4432569 4618495 4676692 4951062 4983426 5017074 5016534 4951494 5176649 5326020
5916 5326020 5502268 5691803 5778261 6018121 6077250 6178599 6270046 6420779 6579881 6752597
5906 6752597 6991375 6968823 7115213 7442028 7754101 7866467 8122517 8311455 8488317 8719319
5896 8719319 8867906 9097144 9425376 9610081 9879862 10296440 10766695 11000145 11295027 11648985
5886 11648985 12054297 12550647 13216439 13695527 14014169 14502231 15167475 15564114 16120546
5877 16120546 16867228 17435508 18397735 19299188 20466426 21453283 22688121 24026895 25331659
5868 25331659 26758550 28345405 30228108 32365962 34488986 36749943 39102185 41066652
5860 41066652 43152341 45233679 46654688 47405060 47719297 47801592 47653492 47125819 46599979
5851 46599979 46116949 45776707 45134138 44460056 43549577 42828224 42194468 41529206 41036011
5842 41036011 40789175 40498903 40887560 41509943 42239072 43356548 44635941 46247505 48318519
5833 48318519 50523146 52925841 55315374 57984355 60648016 62995790 65216464 66815932
5825 66815932 68364646 69556470 70963519 72309775 73779774 75349154 77108187 78562030
5817 78562030 79764928 80512343 80923334 81362043 81586292 82280045 82886534 83292284 83281623
5808 83281623 82792056 81435426 79245727 76263301 72983929 69656844 66146606 62768020
5800 62768020 59797612 57503422 55405728 53794467 52721807 52028144 52025318 52169522 52753259
5791 52753259 53734385 54853373 56244075 57461462 58846952 59993761 60899698 61607187 62374494
5782 62374494 62982656 63744867 64442975 64880998 64803284 64273085 62864417 60696414 57756202
5773 57756202 54570520 50898084 47377338 43868315 40436857 37530525 34745426 32378968
5765 32378968 30392709 28591231 26856262 25524283 24330467 23444844 22541026 21524119
5757 21524119 20792025 20311122 19579840 18880346 18256939 17930391 17528032 17220079 16781896
5748 16781896 16363179 16029735 15773527 15720732 15795211 15620856 15275481 15231600 15094109 14831318
5738 14831318 14707920 14790636 14863059 14915324 14717128 14803235 14903253 14802711 14848882 15124362
5728 15124362 15178846 15352355 15425962 15734880 15744238 16061705 16599994 16826509 17104315 17422044
5718 17422044 17942805 18574782 18883604 19456164 20027192 20518411 21060416 21794284 22692917
5709 22692917 23437306 24444408 25281386 26535342 27650425 28813218 30412147 32196401
5701 32196401 33683169 35716956 37767279 40220364 43169629 46228175 49223048 52749396
5693 52749396 56497030 60260144 64026566 67521608 70239534 72442130 73235290 73037690
5685 73037690 72150240 70965702 69415276 67913151 66437831 65144640 63814750 62675152
5677 62675152 61785904 60473053 59181718 58097591 57238746 56767660 56598581 56939682 57656591
5668 57656591 58837895 60244393 62090301 64243483 66672464 69755498 72735683 75705424
5660 75705424 78214268 80223985 81107342 81284669 80437336 79335022 78099709 76933504 75839689
5651 75839689 74845071 73932296 73140528 72371832 71340733 69751739 67901670 66371409 65007284
5642 65007284 63783399 62930969 62195145 61527692 60535131 58993686 56898523 54591297 52068722
5633 52068722 49460268 46983426 44771627 42783076 41213749 39748980 38786813 38357344
5625 38357344 37818157 37654006 37587704 37850024 38446280 38883248 39426490 40014348 40594373 41051626
5615 41051626 41441248 41578149 41936504 42222299 42411998 42267864 41721631 40805544 39092095
5606 39092095 36911939 34463387 31912572 29150287 26714855 24511421 22779839 20983467
5598 20983467 19396022 18124949 16753045 15778815 14779420 14057608 13399401 12816078 12238448
5589 12238448 11571394 10845555 10464748 10072550 9734908 9217115 9035826 8650047 8225608
5580 8225608 7958901 7572058 7471588 7087798 6881395 6609649 6398008 6224990 5884386 5741522
5570 5741522 5606037 5125780 5050049 5127424 5061117 4877356 4850423 4725934 4580972 4402789
5560 4402789 4297819 4129428 3866235 4033752 3962706 3848203 3705231 3422080 3352321 3359582
5550 3359582 3301075 3313359 3031926 2777905 2749239 2763382 2692217 2818965 2906707 2681954 2699440
5539 2699440 2631741 2448456 2510071 2682562 2310911 2275180 2237411 2179575 1956907 2002614 1916287
5528 1916287 1952704 1772704 1642574 1682293 1809018 1785116 1766486 2000481 1834784 1686333
5518 1686333 1588483 1537815 1341238 1542733 1530394 1363524 1396440 1301681 1343860 1453406 1412702
5507 1412702 1338338 1224781 1342937 1243880 1237708 1260960 1375648 1363613 1083355 960276 1092603
5496 1092603 1166683 942575 820443 722698 907344 1039664 1013397 949196 859397 960165
5486 960165 909073 879106 906739 895321 999752 919610 848773 616050 735481 683910 617873
5475 617873 677330 809085 992888 1021780 913227 691083 713960 836566 630185 637336 711517
5464 711517 536956 496534 554457 541777 517537 710007 744224 791396 734720 856510 788136
5453 788136 885290 816653 818002 823793 865434 950877 699582 585906 615814 597803 499957 644323
5441 644323 741205 938472 907492 566700 426337 689780 820043 915941 832778 682264
5431 682264 743789 553786 591810 501288 568612 647320 663305 620753 646034 700724 310683
5420 310683 178390 383813 280309 298799 332831 339762 542679 511379 380798 129917 79030
5409 79030 78779 170070 328986 419216 407819 204155 372137 362652 231373 242177 121237
5398 121237 96593 119897 354973 297887 40621 -228534 -32493 23898 -41650 163930 165407
5387 165407 184503 101274 268434 276254 94831 -130403 -62231 -36232 257279 177747 40886
5376 40886 35237 -36671 -58553 112573 278856 103744 117731 174233 -105238 -38098 125503
5365 125503 211304 386329 305976 237501 271456 93393 52134 208729 285857 178314 241030
5354 241030 292079 178797 258095 199133 325530 418284 389738 347507 214402 467156 409910
5343 409910 128350 218738 307025 392556 285809 308619 178479 161088 196163 288753 386694
5332 386694 520398 291528 168131 -8539 -58647 299055 382816 428809 463638 222214
5322 222214 412674 259699 115185 263309 290799 396573 444166 401176 352828 245215
5312 245215 139878 41940 134464 273165 318035 389167 461351 161107 157912 224611 291237
5301 291237 123140 107611 273457 167250 23428 54310 259490 55749 185110 243198
5291 243198 219718 79935 93569 103449 107312 96026 -37253 -42639 -69804 -223729 -51387
5280 -51387 -312487 -352483 -167678 -56716 81075 -10869 -112137 -10606 -79096 -24308 93054
5269 93054 100675 145109 9851 -106355 -101935 -99617 -195898 -235311 -536537 -438324 -252182 -114503
5257 -114503 -97757 -133976 -185843 -160586 -160937 -203788 -160392 -143489 -50954 -183407 -312385 -190573
5245 -190573 -234766 -128691 -187347 -364066 -383260 -409254 -292366 -289049 -86725 -152380 -316984
5234 -316984 -213536 -168544 -213959 -354624 -333733 -426412 -259428 -408585 -408805 -47117 -201655
5223 -201655 -96500 108834 44421 -247922 -277927 -373638 -373909 -389183 -181995 -235549 -356513
5212 -356513 -206621 -189596 -290574 -175812 -305423 -241456 -99023 -233894 -119482 -84228
5202 -84228 -209510 -465761 -384395 -279747 -402014 -320966 11906 -154723 -200237 -280134 -276587
5191 -276587 -207082 -299031 -325940 -337166 -325887 -146000 -83038 -68004 -185922 -76497 -274936
5180 -274936 -240754 27292 -124958 -191994 -52604 16872 -95566 76619 -31837 -37103 -148245
5169 -148245 -151996 -432015 -172135 -125880 -228803 -123372 154127 108489 100709 -81592 -138669
5158 -138669 -231488 -438426 -388341 -223778 -194251 -161640 -220805 -310024 -276278 -511457 -115567
5147 -115567 -163337 -98079 -116389 -194397 -341376 -264649 -235434 -201041 -394747 -326556 -148166
5136 -148166 -147561 -89306 -157109 -105374 -52791 -98947 -202667 -317569 -274717 -272129 -277668 -269238
5124 -269238 -248818 -344681 -221190 -174207 -215692 -343828 -447477 -93116 -62727 -98776 -169211
5113 -169211 -351942 -112920 -63239 -215240 -305166 -282806 -81250 29868 -129112 -396748
5103 -396748 -193254 -128172 -123686 -214958 -262419 -291923 -236827 -231165 -348856 -271097 -145391
5092 -145391 -34580 -219084 -173818 -100719 -215752 -199082 -133818 19262 -43481 -135741 -158799
5081 -158799 -51440 3897 -14017 -45614 36047 -95972 -68746 113731 133946 122500 22970
5070 22970 -314078 -401922 -51407 32196 -140289 -255066 -221065 -172579 -141753 -282649 -156487
5059 -156487 -72585 -216584 -234699 -328900 -260952 -290538 -232022 -129813 -205976 -105240 36970
5048 36970 84015 -142311 -263780 -364057 -242293 -276639 -341188 -309084 -171865 -5253 -116964
5037 -116964 -448260 -282451 -238155 -52161 -4736 -76734 -30245 -123225 54108 -152943 -134668
5026 -134668 -81876 -67982 -68362 -71223 -304197 -286679 -403795 -353750 -339579 -363353 -275722 -108122
5014 -108122 -38729 -40833 -206132 -596781 -575159 -406217 -333144 -340924 -12893 -212876 -296444
5003 -296444 -298398 -170908 -13926 131692 69843 -282038 -67548 94615 24739 -103299
4993 -103299 -47806 -78037 37128 -44231 244 -28996 -326895 -182314 -58448 -19859 -111788
4982 -111788 -65035 -67938 -156703 51385 -171475 -436870 -354324 -67926 -105607 -152535 -219507
4971 -219507 -303765 -289049 -236343 -95863 55337 16128 -65859 -54864 -221743 -71974 -110703
4960 -110703 -145073 -70548 -8938 -185341 -163940 -482618 -426897 -291314 -363092 -215738 13293
4949 13293 95059 -158058 7798 123644 195502 79603 -47444 30435 -173597 -41025
4939 -41025 -116166 -50505 -9622 -55119 -31222 -105407 -375067 -603348 -409069 -407243 -193262
4928 -193262 -184997 -179299 -127376 -191659 -294447 -144458 -187029 -121163 -118592 -358577 14733
4917 14733 -4245 -114062 -134101 -246191 -216671 52951 32484 21309 306828 151263 77492
4906 77492 292245 359929 31140 -205331 -213554 -182749 -239068 -271792 -276696 -306794 -273695 84315
4894 84315 18102 123828 -50669 -91356 87516 23275 -72982 126861 16339 -152706 -190788
4883 -190788 -163357 65503 212590 89205 62546 147514 -109689 -144539 -173424 -333427 -315890
4872 -315890 -76272 3958 -209444 -206503 -28332 52367 193086 32269 185471 149148 -154158
4861 -154158 -120136 -190756 -151198 -42244 -231303 -262067 -34427 132890 -126672 -147451 -181906
4850 -181906 -252206 -143534 -180920 -36252 -6840 -209377 -90794 -141859 -147303 -26985 -29959
4839 -29959 74272 91087 121798 59943 -45533 -214134 -294192 -22857 -187225 -84474 -46570
4828 -46570 -195166 -106677 -91345 -108489 -229195 -4371 -14661 136281 213340 5549 -158173
4817 -158173 -214643 -65664 10052 99451 56343 -13524 -185960 -310118 -277917 -377666 -368540
4806 -368540 -121146 -95044 -272256 22965 188730 -23319 -177785 -225542 -122481 -70204
4796 -70204 -51862 -128686 -193904 -68136 -32676 -136663 -189486 -223301 -150033 -88131 -56342
4785 -56342 -185191 -34303 -116467 -104187 -239491 -107456 -278696 -389623 -472211 -283078
4775 -283078 -35627 -89776 -238183 -267450 -195507 -212671 -168224 -137038 94787 -28485 -45486
4764 -45486 -53816 -48214 -51002 -215146 -210393 -240299 -168938 3384 -15060 -79838 -50424 -131924
4752 -131924 -60700 111547 -51482 -136686 -215335 -183872 -88728 17783 51110 -168245 -226523
4741 -226523 -146074 -322903 -259689 -166518 5557 -95355 44928 -64908 -51513 -253794
4731 -253794 -348156 -310796 -222415 -291687 -265239 -161929 -250692 -178819 59362 -102389 -129281
4720 -129281 -199068 -248654 -249224 -338490 -93740 -15665 -49242 -148095 -202482 -144203 -76702 -118350
4708 -118350 248764 278156 -65068 -253151 -259332 -318230 -356217 -270931 -338329 -309705 -149002
4697 -149002 60933 -115333 -299138 -242775 -386144 -324804 -109972 -863 -36065 -169610
4687 -169610 99327 240632 330735 -5533 -263784 -141555 -47151 -248199 -181426 22990
4677 22990 -248095 -186535 -115 -2445 146103 -92066 -73854 -61741 -252274 -72384 -116954
4666 -116954 -106481 -246129 -307082 -73085 -16596 -83660 8877 -66589 -29271 -136567 -154597
4655 -154597 -112217 -141376 -117110 -12850 21231 88826 -105034 -263373 -519863 -297819 -122007
4644 -122007 -98724 -149837 -537 2543 81883 19181 -81917 -140695 -79366 -159233 82431
4633 82431 22115 -85843 -29632 -69949 -53476 -157093 -90684 -332594 -94161 12748 -187112
4622 -187112 -164590 8346 88603 17629 -96486 16599 166231 46212 165644 150908
4612 150908 122315 159890 -33821 -4165 112733 -144585 -91646 6114 -11284 48090 -178177
4601 -178177 -161789 -301 -55564 -105578 -53411 -61114 -84757 38417 45373 -186939 -101813
4590 -101813 -14940 -126776 -80993 211193 183009 56430 -97584 -15073 114212 -99393
4580 -99393 -242502 -34784 -109534 -34442 -152580 -387786 -286271 23543 -25067 -147224
4570 -147224 -247165 -75909 95921 153406 22310 96966 74363 -126082 -307939 57063
4560 57063 326957 290924 392462 277391 215498 -15336 -99518 -158550 -94271 -16610 53546
4549 53546 -45103 -88670 -169016 -151209 -28292 -102177 -110448 67291 131659 122493 28661 101241
4537 101241 51874 34276 43517 226006 378370 37834 -95664 -62004 -48780 94136 104675
4526 104675 75115 22991 -14167 -92703 -106639 -150692 -59013 111154 48537 152416 118797
4515 118797 63758 121700 277031 370838 68177 128587 345084 160148 45763 107080 67027
4504 67027 -108564 24985 123313 128170 120726 158091 130324 245177 344018 247201 42213
4493 42213 -83007 42356 208482 151789 -8213 71124 175405 175537 215691 188807 194069
4482 194069 160058 200024 283899 240431 367804 442044 392467 558678 479700 327572 387967
4471 387967 373087 433122 369502 427621 308455 181790 287527 363003 297641 310980 372792
4460 372792 387625 502701 624461 629044 704241 523768 413952 639814 496286 499701 434325
4449 434325 450388 578417 714647 752417 699795 798911 736404 877981 1137727 965717 863315
4438 863315 899701 1024535 954731 840381 763493 838647 930709 1015693 1210516 1051144 1120802
4427 1120802 1137288 1183400 1106037 1296574 1372722 1193361 1077465 1176702 1322473 1217337
4417 1217337 1133733 1243277 1207101 1414783 1438213 1225762 1229799 1222086 1279584 1085205 1217242
4406 1217242 1352139 1167192 1244395 1054168 991944 975598 953626 956864 1007239 1000926 947018
4395 947018 1002934 1074428 1255590 1052235 932703 1064700 1056695 1035099 1092937 1086522 909983
4384 909983 704105 831410 876803 940301 968349 979137 1063990 838359 982434 962410 852377
4373 852377 887584 913041 978238 832206 881929 907617 894410 939476 993108 1076946 1067594 921128
4361 921128 934117 942269 903249 770000 662526 518452 881958 1013200 976444 872281 865187
4350 865187 873938 791542 989506 866104 816483 778540 742658 816653 999806 1068166 1128116
4339 1128116 1095052 1000974 955492 993244 959574 1006352 823399 945755 1098810 1090501 1180661
4328 1180661 1216274 1259235 1175740 1247038 1444983 1490574 1512704 1323019 1392358 1517117 1284682
4317 1284682 1196073 1168029 1310421 1364889 1548784 1482867 1407649 1522251 1595417 1547644 1688054
4306 1688054 1623409 1762220 1598733 1537526 1826853 1874600 2008111 1875540 1723336 1738835
4296 1738835 1847562 1978949 1768900 1797854 1801877 1841557 2049029 2020566 2020921 2087470 2016661
4285 2016661 1973929 2127815 2080794 2240805 2413634 2508838 2377509 2437548 2472932 2562140 2668790
4274 2668790 2875554 2684815 2514562 2687110 2618124 2701442 2719340 2737686 2771751 2903059
4264 2903059 2807813 2988173 2984281 3019207 2883866 2833976 3096573 3194324 3240953 3206866 3222891
4253 3222891 3250183 3277599 3255044 3152983 3555723 3454690 3440742 3526151 3725626 3854444
4243 3854444 3721591 3834759 4067251 4072430 4024267 4245142 4232970 4365859 4447377 4644181
4233 4644181 4793664 4900680 4729325 4693044 4809338 5140701 5279792 5388177 5607496 5489014
4223 5489014 5745259 5877302 5905113 6209387 5926997 5635808 5603884 6095599 6142616 6303803
4213 6303803 6643543 6981405 7046504 7218756 7229282 7514995 7875522 7943413 7999469 8256787
4203 8256787 8470098 8680370 8897472 8879630 9274275 9567934 9494253 9671493 10103502 10454607
4193 10454607 10863986 10900505 11041846 11464697 11612544 11798145 12162757 12725707 13059463 13361253
4183 13361253 13725079 14232594 14592906 14926075 15268568 15628897 16243390 16936811 17465513
4174 17465513 17868525 18520762 19022853 19591875 19950698 20796190 21823377 22606092 23272677
4165 23272677 24387007 25412290 26480217 27457668 28539623 29903207 31382294 32863324
4157 32863324 34193038 35884185 37560137 39140178 41048579 43238360 45395254 47497734
4149 47497734 49919373 52360159 54801446 57477633 60715674 63738061 66774719 69913125
4141 69913125 73414856 77030832 80554588 84163771 87704348 91500605 95212833 99206715
4133 99206715 103068211 106876226 110813102 114848007 118800008 122710709 126475384 129907620
4125 129907620 133260662 136253999 139365276 142188652 144575534 146985178 149104765 151319165
4117 151319165 152939112 154603141 155894558 156807887 157385083 157549841 157611444 156880872 155957283
4108 155957283 154728760 153182179 151075277 149148305 146739942 144374537 141900918 139118608
4100 139118608 136292708 133205575 129776320 126187126 122649050 118608012 114636738 110702826
4092 110702826 106492305 102524456 98502430 94386386 90523668 86751174 83047385 79595326
4084 79595326 76158913 72570685 69160606 65713451 62306064 59460696 56724901 53756993
4076 53756993 50967986 48502421 46268082 43935951 41935044 39871238 38138300 36491327
4068 36491327 34973961 33556968 31967937 30580189 29338427 28471982 27478526 26240658
4060 26240658 25159828 24411943 23709252 22705280 22119522 21550449 20901257 20297781 19585737
4051 19585737 18786411 18190519 17563427 17371268 16901625 16231627 15970611 15665261 15377961
4042 15377961 14663673 14191654 13900575 13641827 13294720 13028960 12797525 12367256 11996019
4033 11996019 11860610 11708919 11474711 11140788 10957730 10805851 10677826 10591196 10159414 10222185
4023 10222185 10167732 9793201 9631794 9546533 9310659 9259118 9176345 9042415 9139913 8984054
4013 8984054 8812299 8698302 8557955 8480920 8385277 8231289 8171118 7962991 8011133 8236627
4003 8236627 8185102 8130526 8092941 7888900 7834729 7856044 8072200 8041030 8105729 8185896 8270915
3992 8270915 8477047 8278534 8524169 8661445 8417349 8549088 9014261 9088230 9147112 9172336
3982 9172336 9415516 9238393 9281521 9348742 9359228 9373600 9325803 9238569 9148429 9394555 9497293
3971 9497293 9382093 9464458 9430855 9427461 9274113 9044379 8863288 8595714 8544302 8343556
3961 8343556 8498258 8435622 8407954 8513595 8415605 8208463 8235982 8334078 8555696 8598679 8609045
3950 8609045 8458380 8486237 8431212 8317294 8311611 8406579 8485368 8466791 8442284 8335727 8464881
3939 8464881 8619846 8677732 8753842 8639492 8755694 8791393 8710387 8949026 9180416 9209018
3929 9209018 9233815 9305868 9708258 9845510 9770517 10050891 10287812 10710252 11190637 11801669
3919 11801669 12478959 13119605 14142742 15146753 15235007 14835183 13960973 13052393 12369643
3910 12369643 11980693 11611766 11189436 11014521 10874121 10840433 10929851 10912236 10830400 10881504
3900 10881504 10827690 10911228 11203052 11119009 10923564 11173130 11299472 11324470 11596456 11688134
3890 11688134 11670049 11888343 11998408 12051925 12141454 12209209 12217348 12342711 12531320 12699087
3880 12699087 12810590 12935488 13107776 13445671 13323611 13536656 13833330 13794916 14054802 14238808
3870 14238808 14393884 14534214 14644718 14816307 14893009 15245079 15488961 15767961 16086365 16211440
3860 16211440 16612826 17037602 17280372 17553993 18011982 18249631 18678368 19118704 19565905
3851 19565905 19975507 20353159 21032003 21501738 21847547 22336675 22770864 23424619 24019507
3842 24019507 24621910 25352442 25946651 26269049 26972410 27621521 28156452 28782340 29404583
3833 29404583 30099844 30825737 31624133 32303559 33029774 33795594 34612769 35531497 36213745
3824 36213745 37190589 37879958 38778457 39788962 40738826 41700358 42815754 43964812 45224295
3815 45224295 46481473 47571724 48816898 50166211 51700457 53488964 55183443 56838499
3807 56838499 58575641 60685106 62859971 65155480 67656697 70128967 72970563 75771480
3799 75771480 79021102 82397167 85999865 89881160 94018169 98069932 102947614 108327502
3791 108327502 113930538 120012404 126867172 134266435 142309282 151352431 161045283 171852733
3783 171852733 183519095 196310752 210170213 225581759 242215580 260507232 279985949
3776 279985949 300668069 321873664 343088756 363677917 382397398 398400132 411182630
3769 411182630 420338731 426148474 429116655 429479161 428342949 426104097 423709633 421008498
3761 421008498 418503921 415424088 411628051 406783255 399872216 390498137 378395608 363479776
3753 363479776 346031741 326406087 305485199 284058618 263309658 243379749 224571792
3746 224571792 207427448 191970497 178413174 166117842 154958558 145068298 136273628
3739 136273628 128709736 121669091 115402074 109722137 104876285 100612471 96339909 92638323
3731 92638323 89194016 85972950 83210976 80527407 78150546 76029249 74226813 72538809
3723 72538809 71216777 69811651 68334413 67516389 66699272 65724599 64779659 64304059 63959552
3714 63959552 63486942 63457621 63580219 63490498 63518303 63815351 64103807 64934836 65422120 65918297
3704 65918297 66559451 67023385 67758575 68473504 68914403 69266967 69882367 70481087 70946139
3695 70946139 71112298 71814949 72048372 72485975 72968669 73276415 73648920 73867228 74025681
3686 74025681 73962168 73529513 72954802 72341062 71830199 71348146 70866996 70393388 69878040 69597650
3676 69597650 69462883 69082246 69025415 68886715 68790826 68387620 68255495 68627082 68829608 69097429
3666 69097429 69679247 70405718 71439684 72694503 74088150 75844351 77787453 80090312
3658 80090312 82745277 85588286 88725250 92381239 96265209 100315926 104825626 109900991
3650 109900991 115486478 121208175 127094598 133508748 140086357 146348387 152314333 158507522
3642 158507522 164469310 170266292 175955962 181439334 187029346 192526087 197934325 203404823
3634 203404823 208324885 213052329 217934614 222070581 225610245 228499398 230644006 232662907
3626 232662907 234214062 235328502 235918034 236452019 237337209 238254239 239152218 239645953 239981167
3617 239981167 240356526 240118002 239601134 238627027 237091014 235384206 233563431 231823920 230086117
3608 230086117 228143129 226293015 224364890 222566651 220492035 218057444 215240741 212099301
3600 212099301 208197250 203961607 199274027 193908238 188596006 182957679 177092336 171239666
3592 171239666 165217723 159318004 153566930 147846352 142155242 136324157 130834512 125177395
3584 125177395 119409109 113644700 107684057 102128693 96753765 91510658 86778277 82385483
3576 82385483 78117690 74354515 70961427 67886694 65493521 63241295 61313831 59740855
3568 59740855 58530023 57327412 56394963 55924259 55309339 54795065 54515659 54367444 54301570
3559 54301570 53994074 54131722 54077277 53837640 53652095 53536076 53391161 53339014 53280755 53293396
3549 53293396 53418045 53425593 53474419 53468755 53217849 52613481 52072349 51223692 50253603 49029269
3539 49029269 47639641 46628860 45405968 43754714 42592385 41605636 40393367 39244306
3531 39244306 37808476 36524858 35377438 33981787 32599224 31053569 29841831 28621550
3523 28621550 27213298 26037019 24834927 23648980 22660864 21490091 20357478 19580420
3515 19580420 18910848 18226039 17352596 16775135 16309866 15894006 15397396 14910719 14494366
3506 14494366 14024077 13715137 13351753 12976503 12560684 12070174 11726443 11785512 11722005 11224741
3496 11224741 10729485 10726785 10464554 10316112 10452973 10213311 10079830 9888291 9760383 9590461
3486 9590461 9447792 9406889 9374586 9502519 9448130 9264129 8967323 9157919 9314511 9315781
3476 9315781 9099470 8808721 8666882 8440059 8238805 8182891 8125931 8066577 7858922 7836420
3466 7836420 7556630 7655411 7585599 7262614 7036744 6847675 7023101 6676987 6435877 6425225
3456 6425225 6522401 6238584 6128739 6007303 5843716 5547647 5253006 5357954 5141482 4926897
3446 4926897 4828376 4486403 4500533 4330792 4188010 4347782 4192263 4005233 4021663 3924741
3436 3924741 3724452 3779404 3873047 3758471 3655685 3642472 3622925 3673836 3644757 3584108 3463513
3425 3463513 3399146 3296961 3165106 3283158 3365256 3321636 3048143 3059990 2967723 2786169
3415 2786169 2793218 2799807 2853982 2820369 2854066 2875019 2868924 2700630 2790815 3055046 2881754
3404 2881754 2773067 2766901 2891559 2763049 2757548 2924809 2727888 2875730 2889175 2748099
3394 2748099 2841933 2795214 2854171 2820595 2695176 2572303 2478026 2426650 2353628 2298670 2397095
3383 2397095 2149892 2104741 2121987 2171581 2033598 2026082 2344447 2436046 2505353 2226533 2083023
3372 2083023 2219107 2463527 2395880 2311254 2218032 2237330 2256539 2117384 2177260 2215718 2261341
3361 2261341 2211258 2296179 2514551 2589367 2710901 2547746 2334790 2346389 2251895 2166796 2194040
3350 2194040 2243397 2382001 2465784 2328625 2362960 2489923 2480285 2714798 2891857 2878518 2594902
3339 2594902 2636679 2686342 2822430 2759471 2811612 3002980 2931834 2746009 2496074 2597351
3329 2597351 2566168 2325386 2386382 2472378 2490430 2500446 2600119 2610009 2529700 2409676 2031267
3318 2031267 2012291 2152585 2447403 2462368 2390084 2381100 2160118 2016832 2196184 2152242 1951698
3307 1951698 2120055 2085334 1771738 1842277 2131809 2003314 1871592 1814446 1733858 1640636
3297 1640636 1714854 1574699 1504410 1379051 1267748 1460326 1570508 1187987 1140391 1283611
3287 1283611 1206664 1177161 1245637 1387378 1324638 1318268 1322283 1422425 1408791 1405491 1327959 1182592
3275 1182592 1213875 1162634 1188048 1179299 1108750 927117 1021914 1118521 1065016 1185636 1326811
3264 1326811 1207022 1114555 1351288 1232556 1236274 1062056 951335 1008587 1026466 1142470
3254 1142470 1263128 1243673 1359962 1531059 1291730 1020747 1183280 1215116 1127432 892234
3244 892234 1152189 1157008 1077970 1479231 1392455 1211673 1434120 1461662 1341854 1241839 1278749
3233 1278749 1266800 1213044 1328029 1330720 1422299 1507964 1604077 1707121 1851438 1764398 1909727
3222 1909727 2037537 2223764 2326030 2363393 2446374 2706216 2777733 2583341 2555281 2481316
3212 2481316 2580246 2287202 2135405 2156722 2032941 1746829 1578362 1410206 1192052 1216556
3202 1216556 1204070 1011391 1248711 1111326 1020339 1103043 1023285 1253064 1175231 1011922
3192 1011922 803584 643890 708251 968232 735661 580588 725714 858269 786649 812777
3182 812777 773264 821775 957854 855336 518662 655104 690930 630449 608726 895056 870340
3171 870340 537628 736366 609387 496284 306886 539057 560465 376308 437147 578289
3161 578289 574970 531756 495432 501784 610569 616800 525672 415387 377598 347126 378000 306752
3149 306752 287359 496981 534669 268375 249217 434208 531103 432335 336111 305049 229284
3138 229284 386699 456692 131897 -52583 48531 -167724 -94722 234665 215709 126661
3128 126661 190625 233824 256410 329323 307386 129847 78938 131762 56629 -83519 -20768
3117 -20768 242851 392269 388226 146374 154744 269035 200325 244319 322835 253074 43080
3106 43080 103257 68623 79851 43905 448608 368164 -39011 7604 12349 192493 204359
3095 204359 222344 101880 292512 431769 399172 153361 104137 115384 235887 240531 164881
3084 164881 27163 185446 262448 154254 217934 364829 215094 118066 195265 241052 154442
3073 154442 121322 80030 142251 250842 218219 -71507 -130627 26037 62878 307210 103119
3062 103119 -36013 -51564 -54768 46356 -7227 -16983 74679 302385 216999 -1043 51932
3051 51932 40029 225809 142721 148784 -22466 -78419 247087 397182 267099 146145 -118133
3040 -118133 -162296 25765 180599 229725 122052 218523 246342 92415 12757 54450 117597
3029 117597 149703 82909 28176 285060 265888 333755 -12618 147648 53469 -52901 148946
3018 148946 -18398 -135249 -544 80524 110227 346548 481767 194959 39953 -69034
3008 -69034 168639 168076 -114729 24792 -60882 146634 -54399 149696 154772 156775 93910
2997 93910 55627 184392 13188 -82611 -14034 30727 211386 186329 186297 83206 49814 236322
2985 236322 96757 165555 251272 289600 240764 273424 47701 -55951 -89037 -50815 -36549
2974 -36549 -122596 -137243 56213 61510 65904 -820 -12077 344553 310808 218835 133051 135175
2962 135175 210754 267551 253133 257484 218043 104353 117585 144959 96620 128408 245789
2951 245789 273789 1979 66675 36999 142827 100717 241496 286122 150693 21632 -40538
2940 -40538 -179745 -275400 -125662 -2033 -2597 37719 -289522 -384291 -227301 -132262 -138704
2929 -138704 -31838 93267 66291 -41485 45154 356 61650 153444 -7754 70041 -177605
2918 -177605 -22258 206676 64664 30878 67647 -183418 -247898 -140429 -51515 -39511 117511
2907 117511 146198 86618 -62001 1947 -107792 27024 333602 408753 432324 456017 465951
2896 465951 249341 274218 131319 18867 11336 60994 71613 79772 171271 15088 -66433
2885 -66433 -70345 -46947 241948 150244 216010 405380 289589 341282 259703 293263 172180
2874 172180 233771 22349 74803 -35680 69861 156606 56957 241225 299861 144006 74121
2863 74121 315966 233428 183318 469353 204189 83574 236622 106189 100497 254900 130092
2852 130092 116244 56705 77563 305036 149330 159306 302116 233140 195961 -18946 -81870
2841 -81870 -73174 240907 346258 421498 223166 105089 164662 -1885 23020 187968 218909
2830 218909 -119694 -156271 -85840 95324 74858 118679 -33284 -95203 -283771 -130367 2651
2819 2651 187456 90952 19097 26659 13328 -37096 24346 -54600 -148358 -134100 -35997 71824
2807 71824 86753 -82678 -209311 -117511 33350 69583 10838 70274 109642 -68487 -138944
2796 -138944 -77453 80138 97486 58802 -88009 -229246 -144233 -224597 -205770 -160044 -86775
2785 -86775 -41786 -93537 -214677 34816 63874 27004 -80782 30888 -80536 -32536 196644
2774 196644 164415 -70764 -237796 -239266 -286863 -293716 -294831 -199459 -207110 -21753 228975 20664
2762 20664 -94707 -184613 -203797 -292418 -536753 -447355 -348366 -50686 -93230 -211072 -40239
2751 -40239 -37103 -298255 -236157 -304849 -26916 18259 -21047 -96391 -201490 -61620 54007
2740 54007 -60076 -68600 -150154 -326851 -269037 -91980 -105174 -293045 -139671 -264894 -189077
2729 -189077 -40523 884 14486 -69644 -128683 -190077 -213101 -211578 -192527 -301968 -343381
2718 -343381 -250563 -157208 -16856 -84501 -199369 -205289 -350737 -319299 -119807 -262814 -178320
2707 -178320 -36842 60127 -37457 -179447 -142816 -58655 -149055 -229567 -172798 -142511 -180606
2696 -180606 -26705 -54191 -246098 -348173 -196082 -107592 -68627 -29892 -159237 -134989 -117878
2685 -117878 -252146 -137405 -194232 -146171 -80047 -86120 -206806 -177106 83433 -79679 -232865
2674 -232865 -114221 -310087 -189872 -140736 -233061 -401841 -437413 -96026 -15556 -174370
2664 -174370 -93565 31566 -282179 -316508 -37686 -12401 -30913 -38261 -9105 -82202 -313128
2653 -313128 -294374 -269119 -258072 -104153 -16935 138797 -104812 -127479 -95351 -253900 -238584
2642 -238584 -261492 -66491 -44714 -15707 -130535 -123250 -323658 -267455 60466 82187 9837
2631 9837 -43264 -318785 -270874 -244380 -131095 -22801 -8788 -1276 28844 57297 11893 17581
2619 17581 126996 -2555 -179230 -99302 -46914 -216258 -360088 -435404 -400732 -354046 -324185
2608 -324185 -204370 87072 12469 -36702 -184032 -167296 -14159 52749 -158315 -244471 -39759
2597 -39759 -230511 -115096 -63451 14516 -75322 -151660 -152724 -24411 44877 -31745 -26949 -43813
2585 -43813 -278919 -294031 -244210 -191395 4927 3001 -17104 -79932 -212082 -219925 -251816 -452365
2573 -452365 -328256 -157182 -194166 -279753 -336759 -111403 -14331 -108327 65604 -202520 -289097
2562 -289097 -27870 -47258 -44727 -190412 -133359 -40867 154661 158002 114882 -36497 -303828
2551 -303828 -286563 -165172 -133544 -212165 -220221 -143569 -173589 -296688 -84256 53454 -47631
2540 -47631 -169150 -94816 -269623 -382964 -100014 38694 23760 -133486 -235658 -36807
2530 -36807 148004 66187 -65551 129639 39302 -131748 -138352 -136947 -186034 -319606 -192961
2519 -192961 -219059 -332689 -406749 -334677 -24460 -18780 -113445 -237808 -277407 -239601 -149769
2508 -149769 -211262 -227123 -286210 -293131 -87555 -24305 -55166 -82459 -88586 -53773 140870 33947
2496 33947 32302 -17175 -193392 -70956 148552 217901 244150 67360 59791 59221 -35580 -92671
2484 -92671 26987 217263 10183 -163872 90552 -26901 57855 27150 -74106 -130991
2474 -130991 -222208 -97067 -184799 -156564 77661 -191410 -315354 -87391 -46664 33154 3426
2463 3426 -131358 -63964 114135 5617 -176592 -168147 -118219 -139600 77236 4158 -79430
2452 -79430 -169838 -341732 -251814 -83956 66307 8226 72757 -39783 -158935 -213394 -99300
2441 -99300 -14305 -239559 -247705 -67603 -72569 -103983 -107060 80251 31921 12436 -82596 -279597
2429 -279597 -258895 -155348 -178663 -106560 -28932 96277 40667 -262668 -102914 -72005 -72176
2418 -72176 21715 101438 135675 -51648 66127 1577 -157102 -114648 -275192 -166813 -27062
2407 -27062 -55543 -113208 -76872 -37631 -124460 -769 -2982 -237610 -244978 -126614 -2388
2396 -2388 41395 239944 3191 -37498 -195121 -108056 54280 135164 68380 -55435 -39943
2385 -39943 199453 -166831 -168305 135770 2413 -11792 -20647 -29656 -98082 -59990 -55975 156292
2373 156292 93939 138834 67046 -120320 -182675 -185113 -321730 -180307 -147811 -197954 -12200
2362 -12200 -87513 338283 474921 183456 -70597 -62306 138670 337147 -100769 -104254 31485
2351 31485 198402 347203 328281 476448 721092 651901 703585 697909 479247 522672 585298
2340 585298 278709 54590 82856 45969 -29729 -20724 59084 7702 97261 14282 105007
2329 105007 33161 -86927 -74853 -207815 -68280 -600 -86905 373484 390410 216351 155684
2318 155684 197763 48897 123013 34256 66086 96478 -61751 46209 180272 1579 -76233
2307 -76233 6034 259595 282407 91257 -88653 -3301 -75292 -197295 10022 95857 126593
2296 126593 81309 84080 328986 286072 123184 173982 368186 431401 315477 134344 175187
2285 175187 252242 162798 49015 83668 185108 279364 401233 346156 316205 255305 223251
2274 223251 177045 294693 273710 126292 188824 164072 226102 96799 118170 310970 416761
2263 416761 224813 37132 328798 331342 76294 234696 371296 426183 292036 278870
2253 278870 251143 377966 447719 450035 599049 517852 404522 233537 264778 161461 229798
2242 229798 178328 73932 219513 308496 260343 583601 553016 501429 775900 685981 266651
2231 266651 310012 514751 471607 311220 404965 317558 435801 445253 403512 473978 329635
2220 329635 211749 214225 696363 628697 562166 601572 623275 612906 510930 552769 414943
2209 414943 420618 525812 477409 454292 577336 654320 670351 671004 562345 728428 876237
2198 876237 737656 690465 805262 824265 835512 787392 682549 965111 918325 793751 853105
2187 853105 959515 1051101 933612 932054 878349 1053669 1089776 1020259 1250041 1204074 1103926
2176 1103926 1248218 1198068 1151895 1283325 1303676 1250845 1167305 1529015 1497735 1466008 1470083
2165 1470083 1463018 1681614 1984605 1873597 1975314 2024089 1877075 1755487 1965444 2175575
2155 2175575 2283667 2038172 1763978 2034573 2168673 2360448 2544068 2734445 2767993 2842440
2145 2842440 2648575 2722742 2784374 2864187 2916331 3111199 3001379 2999156 3129399 3550416 3603004
2134 3603004 3571097 3774690 3681261 3792504 3986039 4144213 4020239 4315572 4495403 4532813
2124 4532813 4632696 4582642 4840257 5089424 5152316 5239642 5448497 5688813 5916528 6307836
2114 6307836 6542773 6931539 7497259 7775780 7945459 8375629 9183258 9584724 9837110 10486227
2104 10486227 11160069 11481994 12173158 12848329 13399823 14356916 15207374 16206855 17798453
2095 17798453 19617969 21485478 23293989 24721312 26304941 28114510 30233814 32499675
2087 32499675 35652287 39501862 44141699 50286591 58655958 69120883 82733127 99306166
2079 99306166 113574222 115507023 105809387 91157001 74895781 61135904 50262491
2072 50262491 42467356 36214713 31527985 27932361 24792206 22450300 20659161 19313140
2064 19313140 18475548 17480895 16365305 15307509 14206178 13076105 12362835 11554074 10809993
2055 10809993 10134359 9455247 8903347 8492626 8131537 7899407 7320141 6926151 6708027
2046 6708027 6461651 6135819 5930058 5784783 5567501 5359809 4971833 4828932 4712459 4695382
2036 4695382 4547194 4497230 4073144 3966750 4070936 3947130 3822869 3696042 3685528 3404521
2026 3404521 3211036 3128949 2923434 3069855 2958514 2806014 2668093 2671697 2646581 2702279
2016 2702279 2525591 2413692 2513580 2423687 2442060 2281356 2103917 2090136 1899358 1732999
2006 1732999 1752429 1762481 1768090 1863860 1918617 1832667 1729522 1502867 1550372 1523969 1503256
1995 1503256 1443389 1282403 1408279 1282519 1161188 1112881 867947 889126 979814 994567
1985 994567 1261710 1180235 966448 933159 929818 925984 827560 976365 661240 864606 853352
1974 853352 641329 597932 572005 754880 717424 397530 477972 537136 346465 589521 774058
1963 774058 595252 525720 569169 592800 655879 545457 439875 396161 334973 448310 705482
1952 705482 751435 642808 334380 337902 275561 314540 288158 407871 415180 539594 281968
1941 281968 456120 570633 392435 452973 489726 379927 447363 466933 443337 556443 595861
1930 595861 537011 568057 618154 628440 571642 432872 495275 593676 458880 165191 103164
1919 103164 249524 308112 259133 340045 263304 197424 373669 384893 305766 287822 48337
1908 48337 83537 180991 331633 363145 155832 155261 74222 -45997 -3698 953 202567 236095
1896 236095 43672 13307 -3192 17382 65443 131269 246794 89115 -41276 -242819 -104431
1885 -104431 169536 110769 137365 279753 282143 211476 273514 263881 238455 444156 387553
1874 387553 217159 214333 486752 388344 103985 48747 33969 118903 198153 36766 143628
1863 143628 36064 -204734 -13642 143635 -33120 -121868 -29547 134242 111242 184485
1853 184485 42573 -31042 -159082 -161641 2022 67513 73819 106192 -6205 -65201 -78105
1842 -78105 51761 237322 116255 29529 -107480 81940 -24921 67177 -109448 46931
1832 46931 156269 71953 -30505 -27947 82963 96085 150016 162747 259828 394110 307177
1821 307177 161564 325273 503715 533954 359293 92872 50280 320662 360770 497764
1811 497764 598440 589474 739454 621237 580595 487946 173389 255493 65314 157480 242981
1800 242981 129303 413588 191306 84876 -34405 89170 194530 200877 66218 -112676
1790 -112676 -138590 9481 9956 117913 272994 43228 46164 282774 413850 332071 202039
1779 202039 100494 52085 28900 -109585 -138843 60257 63727 40749 46790 144283 210858
1768 210858 185324 1566 30172 125528 248250 159424 185035 104713 111607 102733 174844 265479
1756 265479 289494 416789 178188 14227 -17405 -73817 -623 7646 -33870 -58352 -383
1745 -383 83578 63712 -9944 65170 44804 76317 198303 7923 -34991 88291 172497 190800
1733 190800 -26425 30703 -97805 29373 282389 199380 80548 -138929 110474 406870
1723 406870 15939 -107143 -40494 -77216 2676 -7378 62997 82029 139589 -97959 -71601
1712 -71601 -4687 78877 21734 69526 151930 -8324 -43548 -104046 -16186 19645 -337996
1701 -337996 -97709 184110 231904 123052 146750 150864 60194 -119054 -222356 -136415 -104041
1690 -104041 -63219 75292 -9397 56178 -149403 12957 52160 -94654 222559 238088 179419
1679 179419 127449 122011 143920 135805 93083 -114331 -169033 18136 20413 -26931 8159 154652
1667 154652 21411 41797 212738 97072 187825 121642 60725 28693 7966 31425 18479
1656 18479 6567 -205734 -115473 26620 162064 55307 114451 292094 -16327 -132633
1646 -132633 -290140 -153311 15307 187831 151951 -3524 220758 69688 31753 -76850
1636 -76850 69365 144476 98776 108960 130338 77220 164191 134254 194598 207070 252685 107620
1624 107620 121318 8643 144425 253023 147484 -124556 -328616 -92918 -59446 98574
1614 98574 110335 33600 21000 96369 -188267 -172165 21440 33648 20051 -258711 8978
1603 8978 109660 12371 -2517 -108025 -161024 -69446 103122 -30065 17961 -48423 117673
1592 117673 119709 -111973 -186996 -103280 -44839 -77442 27922 -39142 46925 113281 150053
1581 150053 161746 112338 -80698 4514 -66000 -23647 117645 -25780 -39889 145398 70389
1570 70389 125236 -114383 -40954 -46645 73421 -151568 -181560 84372 15288 -33325 -88185
1559 -88185 74970 -47060 -210225 -4677 113359 104251 138455 197660 125591 -185771 4866
1548 4866 -90431 -88263 128945 36848 -185187 -129439 -29987 -40394 -27693 82705 42492 129057
1536 129057 186336 187723 69107 -80629 -86619 -36136 -125584 16720 -29306 135327 -48094
1525 -48094 82341 -15016 -206090 -201497 13397 -15419 -136550 -157036 -170758 -138266 -31605
1514 -31605 65943 68026 84451 42175 -116519 -119741 62055 24988 50535 -58042 -247676
1503 -247676 -105875 -66136 -85694 4245 45775 -169300 -34422 204811 214451 65153 -146061
1492 -146061 81653 103535 -32758 -144408 -133200 -150040 -42240 -164118 -144534 1734
1482 1734 -207310 43776 -1392 -83878 -80296 966 -113549 -200121 -69107 -53845 -161571
1471 -161571 -158016 -47663 -82873 -29583 -101058 -18335 -201177 -65252 67638 114911 -5998
1460 -5998 -58863 -120080 -41641 -75732 -143751 -156297 33937 -59857 -40065 87195 -3428 14769
1448 14769 -169143 -235399 -91577 14799 140742 94116 46904 126841 52152 -30272 118196
1437 118196 145758 -85841 -21203 34397 67549 91740 22483 5633 -134427 -45821 -154466
1426 -154466 -136462 -11523 11675 30021 139537 -9233 -153871 -228352 -270865 -70582 -114715
1415 -114715 274 394626 236159 41177 54621 191832 64915 44366 98413 224853
1405 224853 195617 171348 145063 -88155 8789 63208 -33623 -93535 -7568 -103930 -13113
1394 -13113 52668 -143746 -240758 -33864 60318 -68941 -200553 -182955 26446 155698 169476
1383 169476 27311 -35007 5117 -56363 54202 62918 121272 127787 109809 -154414 -138526
1372 -138526 242974 92206 35983 60929 52112 -55362 -111454 2550 148038 21104 -137431
1361 -137431 80557 50672 83010 79794 271306 179171 -100490 -243807 -162059 -82741 192520
1350 192520 315436 38528 99104 -10577 129268 -70563 -97047 -202458 -6922 111009
1340 111009 -94833 -4398 18701 244444 252224 248005 161297 11676 -235601 -64188 86209
1329 86209 181606 -30132 -75971 -75128 -97934 -309015 -119896 -67037 -55704 -98149 -66418 -119710
1317 -119710 -255455 -99527 -200212 -130852 -39955 -164374 -89487 -32824 -28216 -110613 18140
1306 18140 -9350 55150 316228 373534 -25921 -94124 -13489 -57143 -159712 -129456 77237
1295 77237 -193412 -194291 -167537 -163227 -209076 -191570 -128955 -16520 89546 164682 -60251 -186435
1283 -186435 -78482 156636 123316 -124729 -293517 -57610 -17484 220153 160491 -40328
1273 -40328 47188 87075 -227275 -154382 -93244 -83385 -69545 -52367 142244 375279 68984
1262 68984 -61691 141870 -53361 -83810 -51850 107024 63855 -223020 -108748 -145191 -39761
1251 -39761 22007 168473 254719 151124 -30675 -117226 63036 -23610 112751 131256 94174
1240 94174 -168703 -131947 -111662 18792 -9749 9714 -143730 -187302 -25617 34006 27098
1229 27098 136133 191813 317278 126053 -5450 122168 64229 -29520 -47427 172368 -10709
1218 -10709 -64301 -89318 -74869 45674 -14642 -108781 -99230 -74289 69371 -47433 -306827
1207 -306827 -453339 -469671 -387632 -216288 -260255 -280783 -87422 -55517 -189245 -173105 -157841
1196 -157841 -119736 -204675 -181310 -189520 -338824 -308752 -118432 50219 -35928 -24824 9909
1185 9909 -100112 -48172 47452 -12968 -121307 -273755 -178706 -65765 -49328 110735 -113833
1174 -113833 -80345 4132 -94411 88809 -25429 -204602 -144544 -120415 48259 -32800 31143
1163 31143 164620 23382 -183716 86807 134532 48113 -20839 -143875 19025 -82828
1153 -82828 -100075 -67775 197203 244875 -398 -248200 -23790 294404 145048 -10461
1143 -10461 87231 -4388 -112374 -145655 -60428 167079 174206 142733 180392 126347 169475 -61307
1131 -61307 -63969 27441 -14676 135795 201783 18507 137572 47009 117967 156151 102496
1120 102496 31393 57021 12418 -45100 -7085 -160606 7215 100509 35284 -60470 -242089
1109 -242089 -167131 104231 49285 72477 93653 251919 69609 -97269 -25377 -121699 55692
1098 55692 50952 121652 223882 119118 -59919 -74171 -55542 -16086 -165280 -110242 -122418
1087 -122418 93693 248709 -42316 -247287 -96095 -115885 -222128 -117705 -161915 33661
1077 33661 24698 76116 19514 -147759 85729 118169 295855 172170 -61626 47725 37196
1066 37196 53926 208044 177048 -15394 45754 74270 -147622 -130161 106722 -48297 -106618
1055 -106618 -194839 -150201 -85145 81506 -33396 -38190 -251333 -63212 -44027 43044 63757
1044 63757 3736 92229 124459 134046 106171 -30362 -60122 -67878 28343 166410 93881 287860
1032 287860 351724 225143 234967 23620 5147 47821 88924 -37906 -30660 44695 -1372
1021 -1372 -41563 -139191 -145187 32124 122083 152537 14419 -45827 218233 321145 203961
1010 203961 211319 414575 161306 254696 125174 -83169 -146410 -69786 -120091 -214336 -60375
999 -60375 66130 90808 24550 48747 10610 -25675 -184289 -195916 -62127 -73608 -49644
988 -49644 -31731 -149400 -364310 -230968 -102358 114448 11439 -516 -28548 137765 78480
977 78480 -40170 -35760 -110760 -81105 -47693 -229632 -310188 -97460 -15366 -61951 41276
966 41276 136411 60308 78968 27678 -86284 -176636 -191258 -74306 -60223 -63379 -67937 9509
954 9509 114861 65536 -41570 6216 53797 94696 17636 -61498 -27629 139078 86159 38458
942 38458 -80761 473 54254 -28264 17670 105203 185312 28412 12396 -117122 -99393
931 -99393 -294755 -195824 -13213 -88513 -125792 -195494 -153542 -28830 38950 -108439 39907
920 39907 6331 -48439 282762 378031 280125 -149553 -213254 -148835 -44527 -40903 17997 -34154
908 -34154 -89030 150312 -39559 -70842 -18365 63335 172819 195764 87613 -97409 -128180
897 -128180 -136459 -43304 2841 56084 198797 102643 -207778 -181896 82208 173647 -106623
886 -106623 -222157 -67696 -103086 -117267 -162900 -112664 -216899 -90869 110404 316300 293706
875 293706 24943 74267 -59771 -252068 -194303 -172868 -11367 137492 162570 211263 347923
864 347923 601034 302639 301956 25979 36118 206310 286713 152051 -53920 -158488 -178010
853 -178010 -59937 23307 130525 62920 114733 197274 291038 317317 138758 304021 233575
842 233575 36708 49333 57034 197694 145552 -129876 -104446 -216560 -197697 -184779 130267
831 130267 167725 96574 134582 104784 139001 309194 311847 -42310 -235644 -340363 -176963
820 -176963 -72102 -96407 -79069 -64711 -113371 -60224 -192213 -83481 -102343 19969 138357
809 138357 234404 207469 326792 233633 -99091 -80524 21382 52299 160781 65242 390
798 390 -79009 -84768 -288710 -309601 47008 281282 159123 52211 86792 6802 -167848
787 -167848 12088 119430 12598 -81898 62350 -12132 -103779 55720 -139691 -242360
777 -242360 -250159 -60144 48513 -42202 -106204 2218 163454 55572 -47982 -50223 -45896
766 -45896 172567 283424 119799 61297 -118789 17381 18589 -312105 -280882 -2280 -198935
755 -198935 -103045 -68873 -168954 -304701 -269266 -39417 47025 77743 221297 150629 95383
744 95383 -112692 -261309 -16152 64212 -114001 -141142 11946 37513 107261 182752 205224
733 205224 -40605 -136723 -62850 -47779 84213 23773 -17006 -20951 -90175 63170 221909
722 221909 33684 -186308 -32641 -96786 -48421 -129953 -145514 -40741 90312 182056 -23832
711 -23832 -49450 110440 -7922 127252 21215 95291 -78074 82554 -65291 -108661 19356
700 19356 -5516 -102379 -32654 -23583 211972 142593 -171373 -68357 -61017 -124604 -18484 140375
688 140375 129360 34102 21359 -53569 -132823 -252638 -159827 -100272 -189494 102834 35080
677 35080 -38369 80720 162806 1967 -66707 3284 99570 52936 35606 -143913 -52772
666 -52772 117625 -26532 93781 1032 68454 205060 64482 -48378 -171821 -84965 -231595
655 -231595 -93898 10367 -210591 -129331 49578 28080 -104330 47237 28643 -82103
645 -82103 -60341 155371 132888 140481 311380 75816 27942 21304 -99039 -190012 -53430
634 -53430 46560 33354 22939 35310 71090 47231 231290 76721 68060 97418 100465 168072
622 168072 32936 -8007 92754 189415 -61636 -42822 -90319 -50480 -73465 -32202 120410
611 120410 198623 40831 -54989 -106145 79134 147043 74800 -19408 -6858 -77538 -54364
600 -54364 -86245 -39455 21931 -89832 54254 -252735 -308227 -154451 -332717 -236805 -85943
589 -85943 28085 -143829 -284151 -245063 -35140 12235 113128 -314408 -246527 -143748 -351633
578 -351633 -198407 -246751 -215718 -87202 -13939 -180445 -172491 -200155 21958 -83169 -120786
567 -120786 40075 -27320 -126314 -16693 -61046 -195488 -79289 -271986 -250337 -59337 -143244
556 -143244 -161342 53129 102405 39225 102564 -1134 -100806 -370370 -349235 -209426 -141278
545 -141278 -16260 -17613 -80962 17411 163915 157804 -55708 -336293 -301986 -69271 119150
534 119150 79620 -131838 -55153 -186275 -118592 -175259 -8060 298789 96778 -143068 -170091
523 -170091 -25503 23691 -138356 -181100 65104 -63286 -173320 2248 -46265 142639
513 142639 157054 -33365 -129790 -246470 -93661 -18981 -139357 -143971 -18271 -30739 -96348
502 -96348 169918 210744 62591 -14640 3490 49429 47058 -204186 -113376 -255553 -45475
491 -45475 101700 -135843 109455 46627 121714 171889 -74026 -38052 118583 127646 85499
480 85499 -19672 -72884 -104954 54736 -27280 -122259 -162950 25169 200410 68562 -118627
469 -118627 -102561 -106652 -66456 12330 -57037 -295468 -255592 -127582 -157729 -142417 -344848
458 -344848 -167249 45173 -9122 -168416 -67937 165944 76929 -88685 -157026 82867
448 82867 45056 -63146 -60565 27636 112102 78875 -54951 -10349 -56159 -48060 49672 -8329
436 -8329 20592 51035 -5246 -146221 -164483 -232851 -79245 -99154 -95445 -37054 -20473 9069
424 9069 72719 -16728 -65736 89455 -182404 -239746 -254070 -202727 -304280 -120237 -5208
413 -5208 5230 -69360 -89827 26562 92476 334724 196007 75201 -24299 281 -123128
402 -123128 -156529 -63672 -6328 176610 151132 22936 104493 61697 -32705 -33191 -294672 -67017
390 -67017 -92173 -180562 -86602 -20117 8230 -17719 144919 90039 29246 75179 29648 88150
378 88150 24764 -37449 -17558 -175489 -272562 -158870 152006 261268 136448 -110716 -29561
367 -29561 -122209 38824 104726 145050 202182 103131 115040 53593 -45771 -54840 -81774 113845
355 113845 101837 94450 220560 79167 81981 4311 -34133 -65179 18187 27532 -80915 -92100
343 -92100 58348 11999 90616 59766 10400 -11061 9724 22776 -4248 11499 33286 205289
331 205289 -69928 -62200 22869 -50858 -66172 78561 7376 90205 175761 210624 134727 239322
319 239322 94742 109913 160973 8318 -79872 -114788 92907 -54098 -140538 -62002 68500
308 68500 -38169 -13036 -18691 65572 -32330 96756 29445 -81323 -38307 142883 98462
297 98462 9442 -6931 -16693 213189 2848 -94385 19535 2646 76700 -186957 -200914
286 -200914 -115267 -141292 57149 -22182 -161722 25368 94522 163714 129928 136278 165674
275 165674 310101 78073 -187432 -77354 139729 103665 -100882 -82092 -60195 -153265 -352900
264 -352900 -133029 -224111 -289537 -221182 -165608 -203326 -37360 14522 -81204 -117228 94150
253 94150 180408 -8758 -223379 10722 198548 99194 55166 18049 100697 146962 118699
242 118699 -20116 -258531 -283548 -25646 233398 238312 -4638 -65049 66651 79915 12196
231 12196 32512 156449 173365 104059 67181 -10794 -184426 -195887 130668 141830 170465
220 170465 -76963 -86994 12032 -231344 -67950 -27042 -113522 -234741 -206316 -182544 -341903
209 -341903 -88752 194309 20560 126380 65352 119104 136799 78397 62414 96948 79574
198 79574 -90395 30529 106556 -78941 -104644 -2231 27359 110010 -57767 -19200 -84606
187 -84606 -193335 -336494 -227146 -142258 -119927 -105754 -74605 62293 206204 201829 201108 202143
175 202143 115088 -51801 -96265 -52637 -77587 -72984 35588 -25118 -117348 -86194 75694
164 75694 116925 -214025 -394367 -218672 -113137 -10686 228546 156864 186523 -55454 -33212
153 -33212 119537 -35561 -22797 -22253 -84478 30142 -110244 -154970 70071 105647 -68163
142 -68163 -83960 -97163 -177243 -181749 57504 223244 50189 -5139 58614 -56282 31350
131 31350 88435 -61760 -78925 9419 163483 321788 161466 -91112 -19635 -184919 -44136
120 -44136 20885 -132535 -59005 -31963 108619 57075 78664 94393 -46936 -102343 -28335
109 -28335 60733 243951 233979 126839 14642 -151809 20132 85332 43720 -13878 -25651
98 -25651 -82295 -190940 18817 -20263 -19488 67921 2245 19816 -125021 -77938 -22299 27336
86 27336 58470 16817 -52421 14699 -82814 -46274 -182425 -153748 -136187 -134885 -54532 -3066
74 -3066 113164 -14633 22135 57507 -39524 -124262 -20636 -106848 -110569 74844 -65462 -28232
62 -28232 -108577 -154389 -187890 -140831 -164773 -109438 50283 -53575 -131350 -163246 -274929 -176753
50 -176753 -47263 -121201 -68932 80411 122873 27388 -6999 53620 62364 -11552 31816 -27272
38 -27272 -45322 -122674 -241355 -116154 -41180 -141245 -154996 -187550 -176577 19670 61104
27 61104 101798 86663 -72340 -33538 58834 48634 -13187 -107084 114241 25219 -60253 -324
15 -324 -45086 22851 -6618 -28900 -18320 81123 117922 152 -94320 -358 -201712 -134927
3 -134927 -50910 -1652 -23739
0 -23739
$$ Imaginary data points
##PAGE= N=2
##DATA TABLE= (X++(I..I)), XYDATA
16383 -1958295 -2009040 -2007598 -1880552 -1903392 -1878100 -1816599 -1834084 -1551935 -1615953 -1663619 -1604334
16372 -1604334 -1538405 -1550617 -1549355 -1620793 -1558063 -1521305 -1496262 -1468630 -1304940 -1184681 -1143043
16361 -1143043 -1138015 -1133960 -1078063 -1139285 -1127184 -1078096 -1068065 -940901 -933287 -1028125 -899575
16350 -899575 -869074 -928885 -965383 -938627 -968182 -944149 -838712 -709828 -731461 -667680 -740102
16339 -740102 -699374 -720707 -791155 -603623 -631148 -486226 -490055 -466334 -520264 -489739 -563460
16328 -563460 -508155 -328853 -238998 -355562 -278917 -301275 -206072 -255315 -202838 -119502 -188548
16317 -188548 -106897 41562 48178 160823 48538 68864 -34808 -57417 191317 200973 171387
16306 171387 304368 295823 302309 296644 292325 326250 275091 425590 385765 336903 350264 291699
16294 291699 378729 465221 488773 515109 654582 720472 846310 709601 551976 767221
16284 767221 823381 786583 764297 810897 847688 893019 828150 743742 807336 747604 753392 1041322
16272 1041322 1216819 1193688 1052610 1056319 948436 1111343 1045795 1090227 989915 1080171
16262 1080171 1071663 1172211 1200170 1164252 1201705 975601 1046353 1142461 1215023 1321224 1230878
16251 1230878 1223222 1140071 1131001 1112126 1141900 1220170 1326702 1213095 1292330 1513687 1465057
16240 1465057 1610693 1469151 1378725 1416689 1334332 1384279 1450769 1409523 1552760 1662970
16230 1662970 1347404 1432568 1626779 1746672 1761273 1472133 1615595 1662799 1729013 1781142
16220 1781142 1738598 1670326 1719593 1859556 1672280 1683967 1731234 1870120 1773280 1707276 1713961
16209 1713961 1846668 1770243 1880341 1987859 1747726 1823686 1788618 2045308 1846133 1807561
16199 1807561 2047966 1877935 1826935 1679969 1694371 1884765 2067097 2127604 2199652 2075560
16189 2075560 2099035 2111190 2024940 2136711 2295031 2251812 1868728 1941907 1972579 2064911 2110924
16178 2110924 2106743 2153753 1997640 2047302 2117720 2187715 2275846 2084370 1905840 2042906 1917374
16167 1917374 1908544 2241493 2326886 2264967 2332010 2198872 2101755 2162187 2260867 2060677 2121027
16156 2121027 2271662 2263922 2203872 2403533 2411809 2077803 2239524 2262760 2362642 2277349 2210221
16145 2210221 2416550 2545603 2209844 2351407 2475603 2409879 2267226 2449145 2523725 2235688
16135 2235688 2271995 2279731 2112075 2286882 2501736 2539991 2656782 2752964 2549240 2291748
16125 2291748 2347474 2346598 2282827 2418421 2291573 2261400 2235683 2366125 2571507 2454808 2457302
16114 2457302 2657454 2540709 2331318 2464375 2612943 2671233 2654220 2584475 2394125 2272872
16104 2272872 2302105 2423140 2769081 2693816 2647611 2904764 2733025 2561178 2595203 2673802
16094 2673802 2607040 2457071 2544241 2685254 2564058 2448188 2570265 2637632 2610363 2487779
16084 2487779 2488371 2533319 2457324 2236058 2325641 2632583 2415566 2408623 2517526 2622190 2630469
16073 2630469 2345270 2509280 2439168 2606685 2446906 2640777 2818913 2518514 2330398 2437746
16063 2437746 2492823 2477671 2522878 2605407 2600945 2543568 2707185 2510603 2518560 2430276 2442114
16052 2442114 2455137 2557499 2562467 2592493 2589711 2546636 2534717 2748286 2535141 2733038 2754279
16041 2754279 2810729 2823660 2676571 2446814 2528416 2375427 2470306 2498812 2461471 2449320 2607032
16030 2607032 2545754 2634713 2469033 2497250 2711305 2509523 2616096 2664362 2426654 2411386
16020 2411386 2565432 2570145 2709358 2646996 2672232 2690198 2512623 2511142 2592249 2864494 2688379
16009 2688379 2504701 2229092 2440967 2499927 2516625 2640979 2449735 2707308 2617319 2543861
15999 2543861 2353193 2491067 2290212 2312768 2291823 2306337 2364344 2534364 2478302 2468834 2599785
15988 2599785 2602870 2518768 2546329 2555143 2654603 2496593 2635725 2753898 2734694 2654259 2599716
15977 2599716 2750487 2879397 2875770 2615099 2447512 2468494 2571799 2566246 2507086 2598929 2554503
15966 2554503 2566621 2340626 2555622 2583484 2528373 2645709 2685910 2674990 2650333 2764312
15956 2764312 2792823 2563954 2475538 2526485 2573730 2684440 2643058 2689213 2676596 2600111 2676188
15945 2676188 2636837 2520016 2446547 2515583 2823946 2946046 2798735 2685624 2823649 2774928
15935 2774928 2713511 2643226 2619758 2474972 2691025 2592207 2422766 2431405 2649266 2713407 2577651
15924 2577651 2540788 2357096 2582515 2602218 2454337 2524039 2599236 2844689 2728473 2499414
15914 2499414 2774885 2829368 2784636 2906684 2612885 2618476 2763059 2654701 2620360 2489561
15904 2489561 2620815 2460895 2488994 2589961 2685686 2509657 2550165 2544137 2597203 2542732 2604207
15893 2604207 2758749 2570440 2510574 2610871 2621800 2792321 2954768 2876659 2648019 2580216
15883 2580216 2413874 2352326 2639661 2577134 2477575 2434699 2632351 2608543 2762535 2649327
15873 2649327 2615541 2644782 2642966 2564850 2479922 2433157 2402226 2390487 2615212 2839212 2735215
15862 2735215 2485510 2477870 2379140 2604395 2619530 2671978 2607480 2694794 2646144 2666660 2631567
15851 2631567 2610701 2622576 2621070 2542604 2663313 2713459 2800333 2744345 2675744 2803017 2540338
15840 2540338 2640539 2586707 2682695 2831362 2889351 2643310 2502075 2583234 2631205 2698965
15830 2698965 2728701 2611541 2540847 2595038 2685670 2743487 2681473 2516584 2475517 2433944 2380547
15819 2380547 2554083 2558766 2709900 2659512 2535879 2613671 2639925 2733308 2786677 2734586 2694003
15808 2694003 2437979 2506857 2814434 2837415 2714753 2574863 2551368 2515187 2484442 2344467
15798 2344467 2555638 2374955 2376931 2612971 2671812 2537710 2499386 2382665 2510018 2521685
15788 2521685 2638528 2611373 2589872 2705631 2702580 2927756 2936461 2803000 2791687 2790530 2690814
15777 2690814 2486386 2497713 2561261 2513082 2408802 2719664 2988304 2763909 2754586 2801981
15767 2801981 2756518 2602552 2756543 2891059 2743120 2860011 2695683 2862933 2768923 2617766
15757 2617766 2524897 2547400 2715258 2650743 2586022 2738344 2953512 2776865 2534790 2585437
15747 2585437 2706362 2724303 2813285 2669105 2726178 2776666 2845765 2849806 2698807 2691880 3003599
15736 3003599 2873221 2900868 2836346 2666465 2584682 2642009 2612337 2752008 2645333 2585272
15726 2585272 2719447 2642805 2700668 2726579 2646333 2679743 2654937 2762973 2963386 2803328
15716 2803328 2730630 2718531 2780718 2481737 2524615 2647904 2859386 2678275 2493423 2461727
15706 2461727 2504890 2593462 2733707 2504543 2446293 2641901 2731176 2688920 2666586 2624902 2550772
15695 2550772 2738768 2657663 2852407 2886174 2716869 2874033 2868545 2740911 2783106 2898104
15685 2898104 2980044 2803385 2857830 2640785 2715847 2704171 2702583 2657653 2709439 2794687 2635166
15674 2635166 2643802 2665444 2686176 2655434 2811894 2969457 2721183 2659969 2596190 2464732 2540202
15663 2540202 2627207 2639170 2703871 2697884 2792676 2701035 2782449 2798831 2600037 2523054 2596327
15652 2596327 2629482 2724429 2736610 2478760 2769416 2764830 2678967 2557600 2649091 2536837 2575297
15641 2575297 2753597 2844931 2832105 2602418 2612091 2721583 2754541 2788914 2951048 2843783
15631 2843783 2855346 2837167 3027037 2912953 2790687 2749953 2776868 2600895 2680045 2739319
15621 2739319 2732084 2832973 2669327 2807463 2695637 2561781 2439948 2338042 2386059 2525562
15611 2525562 2516086 2558394 2512957 2538056 2645583 2719333 2689524 2439315 2702698 2761405 2795885
15600 2795885 2732805 2776069 2797784 2584868 2653836 2542527 2716276 2816217 2846931 2738931
15590 2738931 2761267 2615637 2522058 2481446 2424309 2541938 2786973 2649828 2646863 2648282 2739892
15579 2739892 2659240 2593453 2827474 2729413 2682614 2631570 2786466 2769561 2485063 2354672
15569 2354672 2443396 2634930 2696836 2531543 2499194 2470511 2602604 2502039 2518144 2460771
15559 2460771 2566903 2772298 2679137 2650238 2662976 2699447 2641017 2523089 2671911 2549598
15549 2549598 2562117 2880321 2676772 2722054 2803411 2691393 2595727 2634210 2619301 2623369 2640877
15538 2640877 2608683 2446186 2576820 2618741 2633410 2735352 2793264 2827015 2847042 2750529 2840352
15527 2840352 2826078 2723109 2690458 2711560 2615501 2645659 2660594 2593318 2476533 2599604 2655135
15516 2655135 2600276 2699802 2704067 2883477 2778570 2714265 2791432 2790771 2666518 2649127 2696686
15505 2696686 2926047 2687213 2545227 2450029 2709064 2959684 2756155 2810752 2820761 2920987
15495 2920987 2942690 2795582 2558619 2764255 2921152 2916228 2873930 2862759 2891496 2703734
15485 2703734 2661898 2807658 2715948 2608610 2475133 2419523 2474285 2506454 2727303 2964110
15475 2964110 2855071 2795494 2848416 2589935 2855996 2859534 2899600 2669051 2552747 2550249 2595896
15464 2595896 2894027 2723112 2756766 2627719 2770173 2746320 2486524 2624507 2600124 2761256
15454 2761256 2667230 2582826 2708118 2802908 2720295 2715946 2686467 2668359 2812284 2700215 2530279
15443 2530279 2584101 2610653 2675133 2728388 2780522 2786897 2695055 2549000 2652696 2839390 2793093
15432 2793093 2603195 2666598 2812231 2872086 2991126 3010766 2898622 2852447 2900272 2796429
15422 2796429 2745626 2841861 2773590 2747456 2847501 2792334 2814803 2549008 2526181 2762961 2663081
15411 2663081 2558143 2576923 2804426 2767393 2667658 2852116 2825448 2686749 2793772 2852982
15401 2852982 2798096 2670597 2811339 2889189 2801204 2805964 2714475 2706890 2633737 2899104 2955639
15390 2955639 2823052 2720143 2889255 2793745 2627575 2729647 2743168 2731961 2773071 3046213
15380 3046213 3227371 3075772 2960418 2722360 2572978 2734746 2694879 2837589 2843071 2779872
15370 2779872 2641983 2604387 2539147 2526538 2665796 2952761 3044209 2815550 2848558 2708896
15360 2708896 2777105 2697935 2596580 2634988 2619138 2760651 2850101 2923554 2845760 2966088 2910487
15349 2910487 2929515 2916697 2967312 2991191 2781579 2882648 2860593 2911007 3003827 2873485 2752701
15338 2752701 2805092 2839184 2994399 2866812 2809163 2624572 2874093 2711159 2616226 2699169
15328 2699169 2615406 2696348 2663025 2738369 2725069 2752530 2773088 2782612 2659097 2715672 2799631
15317 2799631 2764377 2733539 2629662 2726800 2725358 2894004 2730497 2580732 2798153 2782010
15307 2782010 2546109 2728006 3018895 2929817 2913481 3118682 2898375 2604905 2438308 2540846
15297 2540846 2769687 2668069 2896282 3076738 2896509 2835121 2811942 2632393 2578131 2638676
15287 2638676 2696766 2668066 2741187 2753829 2727718 2875193 2888820 2880034 2763674 2761122 2919457
15276 2919457 2774762 2660957 2597703 2758377 2888992 2887540 2718020 2911886 2978299 2754179
15266 2754179 2857719 2891001 2731351 2712741 2637299 2661138 2667255 2625549 2660830 2702379 2750315
15255 2750315 2588191 2310728 2435062 2687309 2645892 2634455 2632100 2524355 2760198 2725640
15245 2725640 2874023 2955874 2755779 2969353 3006029 3009161 3074252 2873786 2794065 2911226
15235 2911226 3008920 2859460 2815263 2895067 2886417 2791651 2660241 2452244 2697445 2635337 2774237
15224 2774237 2820083 2937478 2992838 2985117 2836196 2684677 2657555 2917466 2851299 2844858 2849800
15213 2849800 2771080 2721390 2859652 2949334 2862879 3001773 2819298 2619170 2698085 2792421
15203 2792421 2704182 2849041 2877702 2978111 2905818 2828362 3008370 2832204 2532438 2653487
15193 2653487 2652419 2670266 2688879 2546172 2320348 2654040 2783887 2707005 2690042 2667852 2738796
15182 2738796 2886928 2819756 2885948 2958245 2741110 2817433 2975394 2670235 2669693 2724485 2717044
15171 2717044 2648565 2730411 2715250 2884594 2751945 2639183 2803415 3094096 3071041 2918230
15161 2918230 2823050 2794926 2853269 2745377 2667565 2667150 2833707 2909398 2689563 2573254 2756252
15150 2756252 2683670 2917343 3044017 2846848 2842364 2935371 2872977 2834574 2862505 2751009 2899529
15139 2899529 2717836 2784371 2712800 2607201 2750922 2801713 2773051 2742954 2800844 2874641 2903781
15128 2903781 3088974 2946656 2987135 2879078 2920191 2878629 2548201 2514684 2796917 2907906
15118 2907906 2959701 2977632 2830928 2954289 2831801 2957854 2982600 2885177 2963359 2960179 2979288
15107 2979288 2997855 2921675 3082508 2962053 2792926 2925463 2892938 2741474 2706460 2639836
15097 2639836 2802257 2778930 2894434 2942856 2898349 2771442 2933830 3282266 3195305 2961756
15087 2961756 2827514 2702030 2769395 2759079 2748997 2949651 2900789 2859490 2937410 2952163 3057370
15076 3057370 3049048 2943126 2749442 2832291 2916151 2881776 2900343 2873702 2785132 2746606 2690161
15065 2690161 2753988 2906329 2775586 2491875 2657586 2561351 2607897 2647437 2610910 2638341
15055 2638341 2801536 2885640 2644851 2679642 2906652 2709913 2509410 2712956 2845880 2804880
15045 2804880 3032094 3153805 3013904 2668158 2712690 2776535 2851588 2665453 2665523 2987252 2743990
15034 2743990 2722262 2736726 2602006 2833506 2808597 2635057 2871458 2970053 2815037 2711872
15024 2711872 2840677 2994641 3126764 2913511 2875838 2841148 2652317 2695869 2775888 2709547
15014 2709547 2871608 2933793 2891171 2814329 2790838 2794161 2907303 2988803 3113769 3012481 2894482
15003 2894482 2971987 3038232 2919147 2824681 2817801 2757246 2818858 2783285 2782176 2800634 2838463
14992 2838463 2932487 2888495 2753960 2744685 2838926 2986165 2923049 2881632 2912637 2889267 2911782
14981 2911782 2996570 2987446 2866451 2849903 2912628 2846929 2715404 2919227 3004830 2932442 2800932
14970 2800932 2979476 3026420 3022131 2803811 2565239 2546976 2649034 2827709 2843572 2669344
14960 2669344 2748091 2894587 2721257 2650002 2643203 2826583 2827916 2855312 2877168 2724189 2674521
14949 2674521 2587418 2870715 2983340 2960864 3096401 2942721 2705388 2680561 2864695 2962529
14939 2962529 2901695 3021490 2908009 2914639 2784965 2712073 2559288 2840909 2987059 3003994
14929 3003994 2892005 2798730 2957548 2891611 2999543 3127953 2911052 2701088 2792036 2906989
14919 2906989 2670722 2702507 2894592 2722376 2795646 2820150 2770558 2624992 2779409 2761831
14909 2761831 3099312 2977439 3030980 2879031 2764178 2787754 2760431 2899783 2906854 3076432
14899 3076432 2988599 2971687 2970353 2964363 2972996 2668388 2813975 3037490 2840521 2862831 2797675
14888 2797675 2834434 2785346 2782356 2948893 2849768 2797232 2745156 2800601 2784844 2817232 2794550
14877 2794550 2738026 2615150 2676479 2803532 2733796 2903633 2892050 2832150 3039904 2921298
14867 2921298 2891956 2703009 2819069 2906822 2719533 2728320 2725742 2833660 2822146 2851954 2824410
14856 2824410 2913697 2710453 2741349 2901646 3164026 3221808 2916846 2900079 2837574 2963601
14846 2963601 3143983 2980931 2918331 2810546 2716135 2768270 2849097 2887511 2941470 3017809 2918619
14835 2918619 2902170 2959591 3047350 3073970 2960100 2982329 2944543 2864494 2895619 3153730 3141871
14824 3141871 3105288 3070787 2837194 2799183 2742655 2700685 2746503 2857519 3067259 3051465 2969584
14813 2969584 3227372 3135653 3147949 3214716 3191208 3049879 2988656 2938658 2910619 2933977 2946489
14802 2946489 2807554 2664608 2831378 2990076 3061718 2887547 2843937 3015285 2946073 2956694
14792 2956694 3185376 3149075 2918227 2660122 2768645 2831662 2800509 2861289 2859542 2859261 2759450
14781 2759450 2911450 2973331 2627587 2579631 2789819 2772048 2771276 2751287 2975539 3190552 3088453
14770 3088453 3102740 2822425 2692716 2627266 2892676 2950344 3006014 3021082 2920754 3112815
14760 3112815 3050267 2924039 3059276 3231762 3181285 3177003 3143866 3105410 3112582 3181295 3141597
$$ [...]
##END NTUPLES=NMR SPECTRUM
##END=
