##TITLE=1H_TG-2371-C
 CDCl3
 8 sc, 
 20.2.2023
##JCAMPDX= 6.0         $$ Bruker NMR JCAMP-DX V2.0
##DATA TYPE= NMR SPECTRUM
##DATA CLASS= NTUPLES
##ORIGIN= UXNMR, Bruker Analytische Messtechnik GmbH
##OWNER= root
$$ XWIN-NMR		Version 3.5
$$ Mon Feb 20 15:54:56 2023 Russian Standard Time (UT+4h)  she@DPX200
##.OBSERVE FREQUENCY= 200.131
##.OBSERVE NUCLEUS= ^1H
##.ACQUISITION MODE= SIMULTANEOUS
##.ACQUISITION SCHEME= undefined
##.AVERAGES= 8
##.DIGITISER RES= 18
##SPECTROMETER/DATA SYSTEM= spect
##.PULSE SEQUENCE= zg30
##.SOLVENT NAME= CDCl3
##.SHIFT REFERENCE= (INTERNAL, CDCl3, 0, 13.9895)
##AUDIT TRAIL= $$ (NUMBER, WHEN, WHO, WHERE, WHAT)
$$ ##TITLE= Audit trail, XWIN-NMR		Version 3.5
$$ ##JCAMPDX= 5.01
$$ ##ORIGIN= Bruker BioSpin GmbH
$$ ##OWNER= she
$$ F:/spectra/data/she/nmr/H-F/1/pdata/1/auditp.txt
$$ ##AUDIT TRAIL=  $$ (NUMBER, WHEN, WHO, WHERE, WHAT)
(   1,<2023-02-20 15:53:49.26 +0400>,<she>,<DPX200>,
      <created by zg, POWCHK disabled, PULCHK disabled
       configuration hash MD5:
       00 E9 B6 7A A2 85 ED C7 34 08 36 98 17 FE 4E 26
       data hash MD5: 16K
       81 09 0F 7A 3A 3B 94 0C DB A0 01 4D E5 29 DD 0F>)
(   2,<2023-02-20 15:53:52.89 +0400>,<she>,<DPX200>,
      <Start of raw data processing
       efp BC_mod = 2 LB = 0.24 FT_mod = 6 PKNL = 1 PHC0 = -19106.38 PHC1 = 7.60078 SI = 16K 
       data hash MD5: 16K
       87 DF 28 8D 92 F6 28 B9 19 4C 01 7E 67 8C C9 4D>)
(   3,<2023-02-20 15:54:09.35 +0400>,<she>,<DPX200>,
      <pk PHC0 = 2.468276 PHC1 = 0 
       data hash MD5: 16K
       C2 AB EE F2 6C 20 0B 1E 94 54 3A CA 1F 33 8A 70>)
(   4,<2023-02-20 15:54:12.57 +0400>,<she>,<DPX200>,
      <abs ABSG = 5 
       data hash MD5: 16K
       B5 A1 F6 6A C7 4E 24 84 70 86 9C B8 2D E4 86 2B>)
(   5,<2023-02-20 15:54:34.78 +0400>,<she>,<DPX200>,
      <abs ABSG = 5 
       data hash MD5: 16K
       94 96 DF 38 04 4C 62 E8 AA 0B FC 85 EA 17 C6 DE>)
$$ ##END=
$$ 
$$ hash MD5
$$ 98 60 7F DC 88 23 82 71 3D AB 37 7E 8F 17 D4 2E
##$RELAX= 
##$RELAX= 
##$RELAX= 
##$RELAX= 
##$RELAX= 
##$RELAX= 
$$ Bruker specific parameters
$$ --------------------------
##$DU= <F:/spectra>
##$EXPNO= 1
##$NAME= <H-F>
##$PROCNO= 1
##$TYPE= <nmr>
##$USER= <she>
##$AMP= (0..31)
100 100 100 100 100 100 100 100 100 100 100 100 100 100 100 100 100 100 
100 100 100 100 100 100 100 100 100 100 100 100 100 100 
##$AQSEQ= 0
##$AQ_mod= 1
##$AUNM= <au_zg>
##$AUTOPOS= <>
##$BF1= 200.13
##$BF2= 200.13
##$BF3= 200.13
##$BF4= 200.13
##$BF5= 200.13
##$BF6= 200.13
##$BF7= 200.13
##$BF8= 200.13
##$BYTORDA= 1
##$CFDGTYP= 0
##$CFRGTYP= 5
##$CHEMSTR= <none>
##$CNST= (0..31)
1 1 145 1 1 1 1 1 1 1 1 1 1 1 1 1 1 1 1 1 1 1 1 1 1 1 1 1 1 1 1 1 
##$CPDPRG= <>
##$CPDPRG1= <>
##$CPDPRG2= <>
##$CPDPRG3= <>
##$CPDPRG4= <mlev>
##$CPDPRG5= <mlev>
##$CPDPRG6= <mlev>
##$CPDPRG7= <mlev>
##$CPDPRG8= <mlev>
##$CPDPRGB= <>
##$CPDPRGT= <>
##$D= (0..31)
0 1.2 0 0 0 0 0 0 0 0.06 0 0.03 0 0 0 0 0.0002 0 0 0 0 0 0 0 0 0 0 0 0 
0 0 0 
##$DATE= 1676894028
##$DBL= (0..7)
$$ [...]
##$SUBNAM3= <"">
##$SUBNAM4= <"">
##$SUBNAM5= <"">
##$SUBNAM6= <"">
##$SUBNAM7= <"">
##$SUBNAM8= <"">
##$SUBNAM9= <"">
##$SW= 18.0517599122864
##$SWIBOX= (0..15)
0 0 2 0 0 0 0 0 0 0 0 0 0 0 0 0 
##$SW_h= 3612.71676300578
##$TD= 16384
##$TD0= 1
##$TE= 0
##$TE2= 300
##$TE3= 300
##$TEG= 300
##$TL= (0..7)
0 120 120 120 120 120 120 120 
##$TP= (0..7)
150 150 150 150 150 150 150 150 
##$TP07= 0
##$TPNAME0= <>
##$TPNAME1= <>
##$TPNAME2= <>
##$TPNAME3= <>
##$TPNAME4= <>
##$TPNAME5= <>
##$TPNAME6= <>
##$TPNAME7= <>
##$TPOAL= (0..7)
0.5 0.5 0.5 0.5 0.5 0.5 0.5 0.5 
##$TPOFFS= (0..7)
0 0 0 0 0 0 0 0 
##$TUNHIN= 0
##$TUNHOUT= 0
##$TUNXOUT= 0
##$USERA1= <user>
##$USERA2= <user>
##$USERA3= <user>
##$USERA4= <user>
##$USERA5= <user>
##$V9= 5
##$VALIST= <valist>
##$VCLIST= <CCCCCCCCCCCCCCC>
##$VD= 0
##$VDLIST= <DDDDDDDDDDDDDDD>
##$VPLIST= <PPPPPPPPPPPPPPP>
##$VTLIST= <TTTTTTTTTTTTTTT>
##$WBST= 1024
##$WBSW= 4
##$XGAIN= (0..3)
0 0 0 0 
##$XL= 0
##$YL= 0
##$YMAX_a= 78850
##$YMIN_a= -122397
##$ZGOPTNS= <>
##$ZL1= 120
##$ZL2= 120
##$ZL3= 120
##$ZL4= 120
##$ABSF1= 13.98952
##$ABSF2= -4.062329
##$ABSG= 5
##$ABSL= 3
##$ALPHA= 0
##$AQORDER= 0
##$ASSFAC= 0
##$ASSFACI= 0
##$ASSFACX= 0
##$ASSWID= 0
##$AUNMP= <proc_1d>
##$AZFE= 0.1
##$AZFW= 0.1
##$BCFW= 0
##$BC_mod= 2
##$BYTORDP= 0
##$COROFFS= 0
##$CY= -3
##$DATMOD= 1
##$DC= 0
##$DFILT= <>
##$DTYPP= 0
##$F1P= 0
##$F2P= 0
##$FCOR= 1
##$FTSIZE= 16384
##$FT_mod= 6
##$GAMMA= 0
##$GB= 0
##$INTBC= 1
##$INTSCL= 3.70164e-10
##$ISEN= 128
##$LB= 0.24
##$LEV0= 0
##$LPBIN= 0
##$MAXI= 10000
##$MC2= 0
##$MEAN= 0
##$ME_mod= 0
##$MI= 1.114404
##$NCOEF= 0
##$NC_proc= -8
##$NLEV= 6
##$NOISF1= 3.799351
##$NOISF2= 2.8
##$NSP= 0
##$NTH_PI= 0
##$NZP= 0
##$OFFSET= 13.98952
##$PC= 1
##$PHC0= -19103.91
##$PHC1= 7.60078
##$PH_mod= 1
##$PKNL= yes
##$PPARMOD= 0
##$PSCAL= 0
##$PSIGN= 0
##$REVERSE= no
##$SF= 200.130006634157
##$SI= 16384
##$SIGF1= 3
##$SIGF2= 2
##$SINO= 5.538805
##$SIOLD= 16384
##$SREGLST= <1H.CDCl3>
##$SSB= 0
##$STSI= 16384
##$STSR= 0
##$SW_p= 3612.71676300579
##$SYMM= 0
##$S_DEV= 0
##$TDeff= 16384
##$TDoff= 0
##$TI= <>
##$TILT= no
##$TM1= 0
##$TM2= 0
##$TOPLEV= 0
##$USERP1= <user>
##$USERP2= <user>
##$USERP3= <user>
##$USERP4= <user>
##$USERP5= <user>
##$WDW= 1
##$XDIM= 16384
##$YMAX_p= 412024686
##$YMIN_p= -1216989
$$ End of Bruker specific parameters
$$ ---------------------------------
##NTUPLES= NMR SPECTRUM
##VAR_NAME=  FREQUENCY,     SPECTRUM/REAL,   SPECTRUM/IMAG
##SYMBOL=    X,             R,               I
##VAR_TYPE=  INDEPENDENT,   DEPENDENT,       DEPENDENT
##VAR_FORM=  AFFN,          ASDF,            ASDF
##VAR_DIM=   16384,         16384,           16384
##UNITS=     HZ,            ARBITRARY UNITS, ARBITRARY UNITS
##FACTOR=    0.220516191357248, 1,           1
##FIRST=     2799.72274500556, 0,            0
##LAST=      -812.994018000233, 0,           0
##MIN=       -812.994018000233, -1216989,    0
##MAX=       2799.72274500556, 412024686,    0
$$ Real data points
##PAGE= N=1
##DATA TABLE= (X++(R..R)), XYDATA
$$ [...]
7925B35244K04689j57956p3994j0066L518K23700K5447q4420l0958J51977J0705
$$ 235244 439933 281977 207983 197917 201435 425135 450582 366162 335204 487181 497886
7914D97886O2739m08824k4658M06388J65196j8858L77369m87364k6643m7248M76212
$$ 497886 560625 151801 127143 533531 698727 679869 1057238 569874 543231 495983 972195
7903I72195K4471R9675k18293l9643k78268j99421M79756k96867J28592M44950
$$ 972195 996666 1096341 878048 838405 560137 360716 840472 543605 672197 1117147
7893A117147r7323j03619K89640m76317j72005O74382l31692l1138P9235m6237
$$ 1117147 1019824 916205 1205845 729528 557523 1231905 900213 869075 948310 902073
7883I02073M0744k12781j33248j03676R0153k28541l97792M5604K47031K62872
$$ 902073 942817 730036 596788 493112 583265 354724 -43068 2536 249567 512439
7873E12439K52637Q3570k5826L1190J77966k93577L08787K12441J49030j58622
$$ 512439 765076 848646 822820 854010 1031976 738399 1047186 1259627 1408657 1250035
7863A250035j16606k22896P0131J98534P8613k05920J51651m24740n8261K6887
$$ 1250035 1133429 910533 980664 1179198 1257811 1051891 1203542 778802 720541 747428
7853G47428L92758L22862j13823k57779P9420K12109j47673L96561L52875q5365
$$ 747428 1140186 1463048 1349225 1091446 1170866 1382975 1235302 1631863 1984738 1899373
7843A899373j87830j5135j61558M2822k91891l0336K30770n8832J50284J27512
$$ 1899373 1711543 1696408 1534850 1577672 1285781 1255445 1486215 1427383 1577667 1705179
7833A705179N28635J51056o62649l82102J62956K37299K16773J94340j92729j25844
$$ 1705179 2233814 2384870 1722221 1340119 1503075 1740374 1957147 2151487 1958758 1832914
7823A832914J49823q859K83890j55938k90452M35036m53461J1118L70999J02273
$$ 1832914 1982737 1973878 2257768 2101830 1811378 2246414 1792953 1804071 2175070 2277343
7813B277343l1669O1336n629N12230Q0589M75773M27307q25948K69705K40073
$$ 2277343 2245674 2307010 2301381 2813611 2894200 3369973 3797280 2971332 3241037 3481110
7803C481110m8801j35635j1517M67427j33715M5127K62482K33242l1985K16341
$$ 3481110 3432309 3296674 3285157 3752584 3618869 3663996 3926478 4159720 4127735 4344076
7793D344076k5849K89233O12664K95993k70865K74330P58415P19111M88148P21882
$$ 4344076 4318227 4607460 5220124 5516117 5245252 5519582 6277997 6997108 7485256 8207138
7783H207138P54197P16008M43440k14M58080J3872j62504k18760k96335l00164
$$ 8207138 8961335 9677343 10120783 10120569 10578649 10592521 10430017 10211257 9914922 9614758
7773I614758l31147j32809L17477p1059P5209K87197M54840N22909N03620J205024
$$ 9614758 9283611 9150802 9468279 9397220 9472429 9759626 10214466 10737375 11240995 12446019
7763A2446019Q28328R11301J685468J302610J942199K243503K473545K408972
$$ 12446019 13274347 14185648 15871116 17173726 19115925 21359428 23832973 26241945
7755B6241945K348383J581724O10134m24554j388636j724396j806991j569335
$$ 26241945 28590328 30172052 30782186 30357632 28968996 27244600 25437609 23868274
7747B3868274j460921j029551j425611r04902o91316k51987K4148k5845L62861
$$ 23868274 22407353 21377802 19952191 19047289 18355973 18103986 18128134 18102289 18465150
7738A8465150J030532Q41645J251983J560527J758930K937212K642418K844532
$$ 18465150 19495682 20337327 21589310 23149837 24908767 27845979 30488397 33332929
7730C3332929L737659L473018K851241J619464K36444j840776k967773l006939
$$ 33332929 37070588 40543606 43394847 45014311 45250755 43409979 40442206 37435267
7722C7435267l088730l568704l094187k413136j681462j381560j293673j085621
$$ 37435267 34346537 30777833 27683646 25270510 23589048 22207488 20913815 19828194
7714A9828194n24196l61873j73496J53117J43447K63218J200272J635222J778532
$$ 19828194 19303998 18942125 18768629 18921746 19065193 19328411 20528683 22163905 23942437
7705B3942437J854727J917381J968229K096597J316562j32949n12259j465893
$$ 23942437 25797164 27714545 29682774 31779371 33095933 32962984 32450725 30984832
7697C0984832k075639k450191l009427k457310j993503j914211j549020q26544
$$ 30984832 28909193 26459002 23449575 20992265 18998762 17084551 15535531 14708987
7689A4708987j037658j539881o95155m69962n48186k28288J79617k52992l08102
$$ 14708987 13671329 12131448 11436293 10966331 10418145 10189857 10369474 10116482 9808380
7680I808380K15518L43935J64791Q57511L16790J00500K18519q3150m42720p91234
$$ 9808380 10023898 10367833 10532624 11390135 11706925 11807425 12025944 11942794 11500074 10708840
7670A0708840j187020p42614m76778o95402p48510m22810m25697j28277n25236
$$ 10708840 9521820 8779206 8302428 7607026 6858516 6435706 6010009 5881732 5356496
7661E356496n9731l19983j2274k41235n39756l6439L31202j09475j2761n76762
$$ 5356496 5296765 4976782 4964508 4723273 4183517 4147078 4478280 4368805 4356044 3779282
7651C779282k45738R5821k46366m33066j61833l18583q9063j0245k55541K02417
$$ 3779282 3533544 3629365 3382999 2949933 2788100 2469517 2380454 2370209 2114668 2317085
7641B317085R3645j65606J72651K29151k8099J2654m21433k19290K48912j7226
$$ 2317085 2410730 2245124 2417775 2646926 2618827 2631481 2210048 1990758 2239670 2222444
7631B222444k46001j0346k94930k87142L68372R430j27522J2187k4523L18336
$$ 2222444 1976443 1966097 1671167 1384025 1752397 1761827 1634305 1646492 1621969 1940305
7621A940305J50821N3690l31672J69407p6308k2676j29227P8333l43944m7349
$$ 1940305 2091126 2144816 1813144 1982551 1906243 1883567 1754340 1832673 1488729 1441380
7611A441380m0587O5857M82048m43850l00687n0076j42815L66533j7916m3936
$$ 1441380 1400793 1466650 1948698 1504848 1204161 1154085 1011270 1377803 1359887 1315951
7601A315951p3989L2696K41855n1713J51440P242j88915j04786k44329R7359j89696
$$ 1315951 1241962 1274658 1516513 1464800 1616240 1623482 1434567 1329781 1085452 1182811 993115
7590I93115J25300J83767O0687o6284J11752k311j90831J72503K93772k59783
$$ 993115 1118415 1302182 1362869 1296585 1408337 1406026 1215195 1387698 1681470 1421687
7580A421687m54163k80015R5644k12893L40912K53555k08554J66839J07255k20412
$$ 1421687 967524 687509 783153 570260 911172 1164727 956173 1123012 1230267 1009855
7570A009855j63351L12811q6646O9185M298l6336J65458l33216J53450j20962
$$ 1009855 846504 1159315 1072669 1141854 1146152 1109816 1275274 942058 1095508 974546
7560I74546J04277k53963j16578L28675l4482k29950m26680l43712N79920L02955
$$ 974546 1078823 824860 708282 1036957 1002475 772525 345845 2133 582053 885008
7550H85008o2059P3713n311J43326k2058J73780K34556m09219k37535o3295P0779
$$ 885008 822949 896662 891351 1034677 1012619 1186399 1420955 1011736 774201 710906 781685
7539G81685J24033j82278O7092J92149L22348K22588l32063n19202M50985M2933
$$ 781685 905718 723440 790532 982681 1305029 1527617 1195554 676352 1127337 1170270
7529A170270j7695q5823l443k7337K22673k98097K84766O5562q541n7614l12392
$$ 1170270 1152575 1066752 1063309 1035972 1258645 960548 1245314 1310876 1302335 1244721 932329
7518I32329M3289n14692K66649L49859k79672J44530l11235j51367L25354K42301
$$ 932329 975618 460926 727575 1077434 797762 942292 631057 479690 805044 1047345
7508A047345m1897m8943J4405l51661k71771m0519K67190M24070J42200l38259
$$ 1047345 1005448 956505 970910 619249 347478 306959 574149 998219 1140419 802160
7498H02160k87121k31422Q4138P27663M57939j32824m65013k55017Q1498o7951
$$ 802160 515039 283617 367755 1095418 1553357 1420533 955520 700503 782001 714050
7488G14050j4143K87789Q243K5796j6491n29178K69281O7153k58833L45476m3046
$$ 714050 699907 987696 995939 1021735 1005244 476066 745347 812500 553667 899143 856097
7477H56097j6175L03490k23394j54158J05141j24434l28268J53683k25663K27717
$$ 856097 839922 1143412 920018 765860 871001 746567 418299 571982 346319 574036
7467E74036N67026k28934M897j90846K19477R1442m3115k29396J41640j83069
$$ 574036 1141062 912128 917025 726179 945656 1037098 993983 764587 906227 723158
7457G23158j05625J20176L38876o631j87512J0041K6157R0613l7166K36548K4939
$$ 723158 617533 737709 1076585 1069954 882442 892483 918640 1009253 972087 1208635 1233574
7446A233574Q5900N1644l97987j95702n2952J88652J34757K65508k78128n2995
$$ 1233574 1319474 1371118 973131 777429 724477 913129 1047886 1313394 1035266 982271
7436I82271N40184J05109k57697l10822L36419M1854j61407J8012n2524m93k08966
$$ 982271 1522455 1627564 1369867 1059045 1395464 1437318 1275911 1293923 1241399 1240906 1031940
7425A031940K4614K50575J68587k85242M272J23896P1130J92881m02708l0092
$$ 1031940 1056554 1307129 1475716 1190474 1194746 1318642 1389772 1582653 1179945 1149853
7415A149853l0689J25784l862m23118j96157P7243M02731L21798j81621J14092
$$ 1149853 1119164 1244948 1241086 817968 621811 699054 1101785 1423583 1241962 1356054
7405A356054j91817r820M1998L22281L7215k42956O4635m0861k91403L9340O9238
$$ 1356054 1164237 1154417 1196415 1518696 1555911 1312955 1377590 1336729 1045326 1084666 1153904
7394A153904j53270J24803q4284P1607j32347M51872K59466J60870J72541l30999
$$ 1153904 1000634 1125437 1041153 1112760 980413 1432285 1691751 1852621 2025162 1694163
7384A694163k00805l7541J3455K30224J00469N3885k18513l01215O8912J19400
$$ 1694163 1493358 1455817 1469272 1699496 1799965 1853850 1635337 1334122 1403034 1522434
7374A522434M3649M3284k77774m4548L43251L4876j17041l98209J20195K74933
$$ 1522434 1566083 1609367 1331593 1287045 1630296 1665172 1548131 1149922 1270117 1545050
7364A545050j8030P9467P7872j4466J8783p9093q856j55850j5504j23667M04883
$$ 1545050 1527020 1606487 1684359 1669893 1688676 1609583 1600727 1444877 1429373 1305706 1710589
7353A710589j33424j46597M4544J05419j99161N84517m8482K8433j74072j15885
$$ 1710589 1577165 1430568 1475112 1580531 1381370 1965887 1917405 1945838 1771766 1655881
7343A655881m91080n6570l22827N84986J91576j46831L16311k46763k81142l09848
$$ 1655881 1164801 1108231 785404 1370390 1561966 1415135 1731446 1484683 1203541 893693
7333H93693K92203K81827J89397k34565M73305m84569l00205L21603K60272l46541
$$ 893693 1185896 1467723 1657120 1422555 1895860 1411291 1111086 1432689 1692961 1346420
7323A346420p1358J95695j51384J98578L60810j73892N4578l37279Q8199j87050
$$ 1346420 1275062 1470757 1319373 1517951 1878761 1704869 1759447 1422168 1510367 1323317
7313A323317K73443j08635l15999L87460j26926l75572K639N7906K65589K51971
$$ 1323317 1596760 1488125 1172126 1559586 1432660 1057088 1059727 1117633 1383222 1635193
7303A635193j35357J56309J78454L02490j29286j81578k38434N0702j69033K6171
$$ 1635193 1499836 1656145 1834599 2137089 2007803 1826225 1587791 1638493 1469460 1495631
7293A495631j19735l38666L90939K95618j01343r0088o5271q3453J4719k6459
$$ 1495631 1375896 1037230 1428169 1723787 1622444 1532356 1467085 1383632 1398351 1371892
7283A371892M23646K39859K59378j51291l81714j63954Q7216L9929N4444k44642
$$ 1371892 1795538 2035397 2294775 2143484 1761770 1597816 1685032 1724961 1779405 1534763
7273A534763j09195k87725L35340R9471N61789j10957j50098k8534k56654m2487
$$ 1534763 1425568 1137843 1473183 1572654 2134443 2023486 1873388 1844854 1588200 1545713
7263A545713L60569N0073l66471J1015M32905J36875m36699K43546K46239K4506
$$ 1545713 1906282 1956355 1589884 1600899 2033804 2170679 1733980 1977526 2223765 2248271
7253B248271k4623l26802m7230r8270J34352J91411o0852j46273n6657L79678
$$ 2248271 2223648 1896846 1849616 1751346 1885698 2077109 2016257 1869984 1813327 2193005
7243B193005J11104k2291o5994J16527p1895k19280k11072K38230K93548k62477
$$ 2193005 2304109 2281818 2215824 2332351 2260456 2041176 1830104 2068334 2361882 2099405
7233B099405J7271j59960R4573Q7567k08754m03151J60463O2344Q6574K85321
$$ 2099405 2116676 1956716 2051289 2138856 1930102 1526951 1687414 1749758 1836332 2121653
7223B121653j10813r3512L20451Q5996j45384J02216m7255J51856j26199L79967
$$ 2121653 2010840 1917328 2237779 2323775 2178391 2280607 2233352 2385208 2259009 2638976
7213B638976j52644j7405m64751J29975J61826K2458K31185J83165M8640J26198
$$ 2638976 2486332 2468927 2004176 2134151 2295977 2318435 2549620 2732785 2781425 2907623
7203B907623k78844O7964L30686M12056k34181m23386K14986K29486k54420j78349
$$ 2907623 2628779 2696743 3027429 3439485 3205304 2781918 2996904 3226390 2971970 2793621
7193B793621J11731N7367M44539o8769J33666O6976j87677q2238J97831J46393
$$ 2793621 2905352 2962719 3407258 3338489 3472155 3539131 3351454 3269216 3467047 3613440
7183C613440k60904N44707o4590J76624l15076N2604L60009m01963J7540L93645
$$ 3613440 3352536 3897243 3832653 4009277 3694201 3746805 4106814 3704851 3722391 4116036
7173D116036m9621j00226J66382J40563k41117O4627j15518p3654K84089K6254
$$ 4116036 4066415 3966189 4132571 4273134 4032017 4096644 3981126 3907472 4191561 4217815
7163D217815J35821N6729j98344K84807L66936j62172n5004r8799M3591j73382
$$ 4217815 4353636 4410365 4212021 4496828 4863764 4701592 4646588 4547789 4591380 4417998
7153D417998n2112L99013K5179j78738m26472J95600k0639m9442N56638j41285
$$ 4417998 4365886 4764899 4790078 4611340 4184868 4380468 4359829 4310387 4867025 4725740
7143D725740R5493l30490k46792r462M14189K80142L4671K9826k88172l54830
$$ 4725740 4821233 4490743 4243951 4234489 4648678 4928820 4963491 4993317 4705145 4350315
7133D350315K58925K77360k08509m85327k13599J30582K38885K42871k22953l6123
$$ 4350315 4609240 4886600 4678091 4192764 3979165 4109747 4348632 4591503 4368550 4332427
7123D332427j18006L76509o5326l58910J26400L2771J17404k12861K2152n5117
$$ 4332427 4214421 4590930 4525604 4166694 4293094 4325865 4443269 4230408 4252560 4197443
7113D197443L01764j02390p7525k40501j15775L77112N5484k79398J63970P483
$$ 4197443 4499207 4396817 4319292 4078791 3963016 4340128 4395612 4116214 4280184 4287667
7103D287667j8829j58806j32251L2347J50947o0607L29663m11082k32261o7887
$$ 4287667 4268838 4110032 3977781 4010128 4161075 4100468 4430131 4019049 3786788 3718901
7093C718901K48333L3961K19432j3533m11409J09872m99320K98785j08990K12642
$$ 3718901 3967234 4001195 4220627 4207094 3795685 3905557 3406237 3705022 3596032 3808674
7083C808674K5908k0408K10038R7515K53220l89320l07159K91405K56566l11079
$$ 3808674 3834582 3814174 4024212 4121727 4374947 3985627 3678468 3969873 4226439 3915360
7073C915360l6727k0291o8296J48046J40894J63341K86765k62474m20174L3481
$$ 3915360 3878633 3858342 3790046 3938092 4078986 4242327 4529092 4266618 3846444 3879925
7063C879925p5845j27065J25602j83875K7558M10341K77810l11676j33450L85964
$$ 3879925 3804080 3677015 3802617 3618742 3646300 4056641 4334451 4022775 3889325 4275289
7053D275289K35506n9653n2547j72899P0708j41348Q9224j352m67684K35100R3397
$$ 4275289 4510795 4451142 4398595 4225696 4296404 4155056 4244280 4242928 3775244 4010344 4103741
7042D103741K96060J56399k29116P6651J7942n4854j86340L75804J27332p879
$$ 4103741 4399801 4556200 4327084 4403735 4421677 4366823 4180483 4556287 4683619 4675740
7032D675740J90904l45415j15503p3073J15936R5686J21793j48827L52109K17942
$$ 4675740 4866644 4521229 4405726 4332653 4448589 4544275 4666068 4517241 4869350 5087292
7022E087292j07856j60420L16009m10193M61180p406n47531K82745M22113K52131
$$ 5087292 4979436 4819016 5135025 4724832 5186012 5178606 4631075 4913820 5335933 5588064
7012E588064k70187l35823j65228M43440O5452l76338K11471o2960L04489j74610
$$ 5588064 5317877 4982054 4816826 5260266 5325718 4949380 5160851 5097891 5402380 5227770
7002E227770J57306k5276j29723j23932k6318L73983L63825j65439j37920K88288
$$ 5227770 5385076 5359800 5230077 5106145 5079827 5453810 5817635 5652196 5514276 5802564
6992E802564k4309J01736Q8401q1535J84583l2870J7652l6017J75076J65730J00207
$$ 5802564 5778255 5879991 5968392 5886857 6071440 6038570 6056222 6020205 6195281 6361011 6461218
6981F461218K42603k31382M3473j89915J56972j98781n7431K44414K74622k81494
$$ 6461218 6703821 6472439 6515912 6325997 6482969 6284188 6226757 6471171 6745793 6464299
6971F464299K79497L61776Q3600M56268J04078k2430o8161j54168l0222j32972
$$ 6464299 6743796 7105572 7189172 7645440 7749518 7727088 7658927 7504759 7474537 7341565
6961G341565J50653p3569K29258J26601j59443j57406J5297N1980N09696L06208
$$ 7341565 7492218 7418649 7647907 7774508 7615065 7457659 7472956 7524936 8034632 8340840
6951H340840N1340Q4264J16701j37202J25382N90056j4010l2793K79325J82140
$$ 8340840 8392180 8476444 8593145 8455943 8581325 9171381 9157371 9124578 9403903 9586043
6941I586043l84456N97928P4857L57063N80289j81256K31669M16130m21900L8750
$$ 9586043 9201587 9799515 9874372 10231435 10811724 10630468 10862137 11278267 10856367 10895117
6931A0895117L60492m54310O2796M56420M17180o42J27999K31525O07536J59633
$$ 10895117 11255609 10801299 10864095 11320515 11737695 11737053 11865052 12096577 12704113 12863746
6921A2863746J00375M36826K79827N23958P31371L73738L50593R0802j95424l89187
$$ 12863746 12964121 13400947 13680774 14204732 14936103 15309841 15660434 15751236 15555812 15166625
6911A5166625j26351L04505J42326l96353m83129j63529j21525K18937J07210
$$ 15166625 15040274 15344779 15487105 15090752 14607623 14444094 14322569 14541506 14648716
6902A4648716P2775L13608j91544K90709O7562K06026Q25824L32520N77584P92645
$$ 14648716 14721491 15035099 14843555 15134264 15201826 15407852 16233676 16566196 17143780 17936425
6892A7936425K3238J75445J27126j37828N98983P7439K17882N15781L25186K52751
$$ 17936425 17959663 18135108 18262234 18124406 18723389 18800828 19018710 19534491 19859677 20112428
6882B0112428M80953J22708P21046Q93585M50467J506056J102584J380797J973439
$$ 20112428 20593381 20716089 21437135 22330720 22781187 24287243 25389827 26770624 28744063
6873B8744063K400585K575936L524270L986569M445445N121781M453041L145453
$$ 28744063 31144648 33720584 37244854 41231423 45676868 50798649 55251690 58397143
6865E8397143J104002r22606k167440j347207j405348j060770m42114m05253k55473
$$ 58397143 59501145 58578539 56411099 55063892 53658544 52597774 52155660 51750407 51494934
6856E1494934j405258j802878k212834j705910j165211j588634n70077M33167
$$ 51494934 50089676 48286798 46073964 44368054 43202843 41614209 41044132 41477299
6848D1477299J132952J639205J470153K243462L011050M186837N966615O428694
$$ 41477299 42610251 44249456 45719609 47963071 50974121 55160958 61127573 67556267
6840F7556267O556791O864565O550255M191820J027698r25306j092490q26666
$$ 67556267 74113058 80977623 87527878 91719698 92747396 91822090 90729600 89902934
6832H9902934O00026J594362K555608K161081r3179l714749o488446q149114q023486
$$ 89902934 90502960 92097322 94652930 96814011 96720832 93006083 86517637 78368523 70345037
6823G0345037p088007n969778m148700l297818k513995j389299j125709n65207
$$ 70345037 63257030 57287252 53138552 49840734 47326739 45937440 44811731 44246524
6815D4246524m6256M11641J348492J704287J776364K407133K405270J258049O3245
$$ 44246524 44200268 44611909 45960401 47664688 49441052 51848185 54253455 55511504 55574749
6806E5574749O58213R37039J237172K015702K276783K021861J29132j596954m118649
$$ 55574749 56232962 57170001 58407173 60422875 62699658 64721519 64850651 63253697 59135048
6797E9135048n210753n959292n577015m564944l650508k962808k427545j779465
$$ 59135048 53924295 47965003 42387988 37823044 34172536 31209728 28782183 27002718
6789B7002718j859096j285410j296973j397041p48059j094955r50979o07531l53660
$$ 27002718 25143622 23858212 22561239 21164198 20416139 19321184 18370205 17762674 17409014
6780A7409014m29340o01976o15202l98220m70152n28473M0978o88578m47480M0441
$$ 17409014 16979674 16377698 15762496 15364276 14894124 14365651 14406629 13718051 13270571 13311012
6770A3311012k25247m09026m38442m68182k94222k05353p5913L3787J41801l30231
$$ 13311012 13085765 12676739 12238297 11770115 11475893 11270540 11194627 11228414 11370215 11039984
6760A1039984o47129K31770m2316r0508l58360k1779L17354l32282k77234k09620
$$ 11039984 10392855 10624625 10582309 10491801 10133441 10111662 10429016 10096734 9819500 9609880
6750I609880K11870l7056o53662k30010K14589J55112r3544o8092O2971o012m37150
$$ 9609880 9821750 9784694 9131032 8901022 9115611 9270723 9177179 9109087 9172058 9166046 8728896
6739H728896o308k70165k26687M47152J39423p0636l29973j52093j11910m5242
$$ 8728896 8722588 8452423 8225736 8672888 8812311 8741675 8411702 8259609 8147699 8102457
6729H102457m9597K89527M3500m80819Q963K26044J68961l19934j47149K41272
$$ 8102457 8052860 8342387 8385887 7905068 7914031 8140075 8309036 7989102 7841953 8083225
6719H083225L29420l48933j22217k54466j4662K80830k26405L6925o6615O7022
$$ 8083225 8412645 8063712 7941495 7687029 7672367 7953197 7726792 7763717 7697102 7764124
6709G764124L11552r6665l5775Q5840m71630M546k215J82689o6959q3904j39766
$$ 7764124 8075676 7979011 7943236 8029076 7557446 7561992 7559777 7742466 7675507 7591603 7451837
6698G451837l34851K97565j8530p2461J23398K03874q5571k04145M40423l33653
$$ 7451837 7116986 7414551 7396021 7323560 7446958 7650832 7565261 7361116 7801539 7467886
6688G467886j17247k8759R4490N7673j99246k1018L18478r7045K45708m8795l00869
$$ 7467886 7350639 7321880 7416370 7474043 7274797 7253779 7572257 7475212 7720920 7672125 7371256
6677G371256K48725r2819k28697L8945K71003l19036n7574J83356K35701k09768
$$ 7371256 7619981 7527162 7298465 7337410 7608413 7289377 7231803 7415159 7650860 7441092
6667G441092k1709j02488R2333k03698n6080L03248r5206J32497j74513k09649
$$ 7441092 7419383 7316895 7409228 7205530 7149450 7452698 7357492 7489989 7315476 7105827
6657G105827J95447N28516R8600K2479L02322k69603j78665K96081J70147k86709
$$ 7105827 7301274 7829790 7928390 7950869 8253191 7983588 7804923 8101004 8271151 7984442
6647G984442O6054q999Q0796M52819K22555n19723K84528K12109o09486L02844
$$ 7984442 8050496 8041497 8122293 8575112 8797667 8277944 8562472 8774581 8165095 8467939
6637H467939j9404o415L63192k0638J99036l2537K0589q7287O8402L49937J8660
$$ 8467939 8448535 8442120 8805312 8784674 8983710 8951173 8971762 8884475 8952877 9302814 9321474
6626I321474j79517M8111K09450J98242o4893K70738l62911O9250K54287n4153
$$ 9321474 9141957 9190068 9399518 9597760 9532867 9803605 9440694 9509944 9764231 9710078
6616I710078J63415j89149O16930L99719l2956J68962L70519k90508Q2328j60871
$$ 9710078 9873493 9684344 10301274 10700993 10668037 10836999 11207518 10917010 10999338 10838467
6606A0838467K09604K67452L24517l7107J73533p5910J34134L64707k56642M12938
$$ 10838467 11048071 11315523 11640040 11602933 11776466 11700556 11834690 12199397 11942755 12355693
6596A2355693M77972P2311K13248J76176M91687J37892J52510K96184J43538M89128
$$ 12355693 12833665 12905976 13119224 13295400 13787087 13924979 14077489 14373673 14517211 15006339
6586A5006339K38393M86216O73768M78777O44231N64018N52445O57979O12990
$$ 15006339 15244732 15730948 16404716 16883493 17527724 18091742 18644187 19302166 19915156
6577A9915156J064723R15231J120147R82175J954447J665470J877409K233952
$$ 19915156 20979879 21895110 23015257 23997432 25951879 27617349 29494758 31728710
6569C1728710L188517M095701M100335N171109N606157N921645M961459L309290
$$ 31728710 34917227 39012928 43113263 48284372 53890529 59812174 64773633 68082923
6561F8082923N45904j732995k653378k803373j789186j141664o89393n61589n24252
$$ 68082923 68628827 66895832 64242454 61439081 59649895 58508231 57818838 57257249 56732997
6552E6732997j525468k031194j640243j605582j026440j43059N98821Q99485J868729
$$ 56732997 55207529 53176335 51536092 49930510 48904070 48761011 49359832 50259317 52128046
6543E2128046K661516L381375M666150N927731O278158N890389N064178L184642
$$ 52128046 54789562 58170937 62837087 68764818 75042976 80933365 85997543 89182185
6535H9182185R05411o09820r97434j065718p87546j274395q25277l18312k79490
$$ 89182185 90087596 89477776 88480342 87414624 86627078 85352683 84527406 84209094 83929604
6526H3929604o67679j253536k301559m291790n288112n733886n397051m741229
$$ 83929604 83261925 82008389 79706830 75415040 70126928 64393042 58995991 54254762
6518E4254762l763004k704732k346976j327596q64456k23264K26412Q28897J734457
$$ 54254762 50491758 47787026 45440050 44112454 43247998 43024734 43251146 44080043 45814500
6509D5814500J548143J387363P58293N55260N43782K52351Q28437J652193J732168
$$ 45814500 47362643 48750006 49508299 50063559 50607341 50859692 51688129 53340322 55072490
6500E5072490J078560l13163k105385m154327m401574m527150m268352l621040
$$ 55072490 56151050 55837887 53732502 49578175 45176601 40649451 36381099 32760059
6492C2760059l243395k792074j911893j620070j483530j515220o92931p93272
$$ 32760059 29516664 26724590 24812697 23192627 21709097 20193877 19500946 18707674
6484A8707674j006903r71066m77573m20662m65470o06353j015385J26218m49626
$$ 18707674 17700771 16729705 16252132 15831470 15366000 14759647 13744262 13870480 13420854
6475A3420854n98290n26278J60559m97964m37727P7157k55857k06738n21566Q7675
$$ 13420854 12822564 12296286 12456845 11958881 11521154 11598311 11342454 11135716 10614150 10701825
6465A0701825n3771j76974l23089N3474m17294j51735r0990k93165J90139k66657
$$ 10701825 10648054 10471080 10147991 10201465 9784171 9632436 9541446 9248281 9438420 9171763
6455I171763m8048l8765l82173k26519m12853K70691j50395k02113l99139L01750
$$ 9171763 9123715 9084950 8702777 8476258 8063405 8334096 8183701 7981588 7582449 7884199
6445G884199J00734o7230O9165j98735j68333k54333j56256m4709o9535j30483
$$ 7884199 7984933 7917703 7986868 7788133 7619800 7365467 7209211 7164502 7094967 6964484
6435F964484M87608n85401k86592L316j43353J84671J93946m56139m7688O0424
$$ 6964484 7452092 6866691 6580099 6583415 6440062 6624733 6818679 6362540 6314852 6375276
6425F375276k0366k37282K01034J02940m09745k83079K6345N89407K71054o51710
$$ 6375276 6354910 6117628 6318662 6421602 6011857 5728778 5755123 6344530 6615584 5963874
6415E963874J70987k57569q1153K05245l20992P9476j39011n5554o7952l4109
$$ 5963874 6134861 5877292 5796139 6001384 5680392 5759868 5620857 5565303 5497351 5463242
6405E463242M29556k81401M53653n58496N4789M6414k35105k52726K59066R0703
$$ 5463242 5892798 5611397 6065050 5506554 5561343 5607757 5372652 5119926 5378992 5469695
6395E469695n27651m18546K34014r6716J36018M11277P3460o3336j18427R3336
$$ 5469695 4942044 4523498 4757512 4660796 4796814 5208091 5281551 5218215 5099788 5193124
6385E193124L12466J14371j84541M8244l24168J83728k76542j56468l04582m3391
$$ 5193124 5505590 5619961 5435420 5483664 5159496 5343224 5066682 4910214 4605632 4562241
6375D562241J66183K20205K27723k18256m85490K46517q2243P6072j32376J07625
$$ 4562241 4728424 4948629 5176352 4958096 4472606 4719123 4636880 4712952 4580576 4688201
6365D688201p8564N8804K68739j48240l53057P1547L12095J62476n40123N1693
$$ 4688201 4609637 4668441 4937180 4788940 4435883 4507430 4819525 4982001 4441878 4493571
6355D493571K09600L22201o79780N430K71157K27169k77771J4589k40783k53155
$$ 4493571 4703171 5025372 4345592 4351022 4622179 4849348 4571577 4586166 4345383 4092228
6345D092228M0826J9630J25634J34876K87817l62492l50245M6471o7870K44408
$$ 4092228 4133054 4152684 4278318 4413194 4701011 4338519 3988274 4034745 3966875 4211283
6335D211283M77937k57379l20858K73253N52284l1554k68283L1802J55794k10739
$$ 4211283 4689220 4431841 4110983 4384236 4936520 4904966 4636683 4668485 4824279 4613540
6325D613540M5810J94855L58246m89541j74330K89838k69760K35555m8420n4566
$$ 4613540 4659350 4854205 5212451 4722910 4548580 4838418 4568658 4804213 4755793 4701227
6315D701227j23634J47635J76808q6032P5495m36210m1303j98415M29196j41785
$$ 4701227 4577593 4725228 4902036 4816004 4891499 4455289 4413986 4215571 4644767 4502982
6305D502982r7302j69059J38086k54159n370L15730l88424p2086J27948q7942
$$ 4502982 4405680 4236621 4374707 4120548 4115178 4430908 4042484 3970398 4098346 4010404
6295D010404j48190j12601J59542O39600m75770k8183k82739m32967J89528J44358
$$ 4010404 3862214 3749613 3909155 4548755 4072985 4044802 3762063 3329096 3518624 3662982
6285C662982L42329J3619l46378L44098P22263n06054J03950k98132k37413L00770
$$ 3662982 4005311 4018930 3672552 4016650 4738913 4232859 4336809 4038677 3801264 4102034
6275D102034o9149O6440J64420j49660M68089j69497k35280Q982l15596K28606
$$ 4102034 4032885 4099325 4263745 4114085 4582174 4412677 4177397 4186379 3870783 4099389
6265D099389L94898K8466p1654M91385k13096J4021o1540j65443k8781k31460
$$ 4099389 4494287 4522753 4451099 4942484 4729388 4743409 4681869 4516426 4487645 4256185
6255D256185r2338L12975J6011K40033l01292o2872L30690J48764J53131l73450
$$ 4256185 4163847 4476822 4492833 4732866 4431574 4368702 4699392 4848156 5001287 4627837
6245D627837L13204M4432J25149r6964n91465K00070J83149O5373k63536m03462
$$ 4627837 4941041 4985473 5110622 5013658 4422193 4622263 4805412 4870785 4607249 4203787
6235D203787L07248n81458j21203K33048J43554l41970l7820j45050J12393P9729
$$ 4203787 4511035 3929577 3808374 4041422 4184976 3843006 3805186 3660136 3772529 3852258
6225C852258L7878r4008j09755J69735j75167M50263O7942k20532J21789K56062
$$ 3852258 3890136 3796128 3686373 3856108 3680941 4131204 4199146 3978614 4100403 4356465
6215D356465o9703n81664l1937O5281l5925L72649J79753J5760p0438K47554k34324
$$ 4356465 4286762 3705098 3673161 3738442 3702517 4075166 4254919 4270679 4200241 4447795 4213471
6204D213471k29130P1160n3285l11698n2088j01161L73857j61658Q2228j80706
$$ 4213471 3984341 4055501 4002216 3690518 3638430 3537269 3911126 3749468 3831696 3650990
6194C650990m75430K98225O26464L6114j60796l74539J92733R5959l94927O8974
$$ 3650990 3175560 3473785 4100249 4136363 3975567 3601028 3793761 3889720 3494793 3563767
6184C563767K65639m757m20129K29559K11413L38227J83274m55866m06431j42611
$$ 3563767 3829406 3824649 3404520 3634079 3845492 4183719 4366993 3911127 3504696 3362085
6174C362085j3974j53454K84518k52795Q9815P9866k88380J39588p8490J467J92303
$$ 3362085 3348111 3194657 3479175 3226380 3316195 3396061 3107681 3247269 3168779 3170246 3362549
6163C362549L16367n5501J40615K3785J11132m0781K31005j64917p8711K39620
$$ 3362549 3678916 3623415 3764030 3787815 3898947 3858166 4089171 3924254 3845543 4085163
6153D085163m28240q7329j83823K56892o6796n11193K82387L09562n9805l30501
$$ 4085163 3656923 3569594 3385771 3642663 3575867 3064674 3347061 3656623 3596818 3266317
6143C266317j54164K76354L00871J10246J57058m10921K05477k17815J48933L29269
$$ 3266317 3112153 3388507 3689378 3799624 3956682 3545761 3751238 3533423 3682356 4011625
6133D011625j6266k50787j8266M33132M20099N9228n29197K84743j24770k31719
$$ 4011625 3995359 3744572 3726306 4159438 4579537 4638765 4109568 4394311 4269541 4037822
6123D037822K41442k15335j44041O7910J5247l58620j66107P14588R9758p0661
$$ 4037822 4279264 4063929 3919888 3987798 4003045 3644425 3478318 4192906 4292664 4222003
6113D222003L1392J1879K23957J28833l89832J5612j99877l88338j4560r259L7220
$$ 4222003 4253395 4265274 4489231 4618064 4228232 4243844 4043967 3655629 3641069 3631810 3669030
6102C669030K46703j31660k96864O1010J89743n2215j47226O190J74082k81745
$$ 3669030 3915733 3784073 3487209 3548219 3737962 3685747 3538521 3544711 3718793 3437048
6092C437048J66967r6188N84175k95059m97107P00668j88392L43586P394O0063
$$ 3437048 3604015 3507827 4092002 3796943 3299836 4000504 3812112 4155698 4163092 4223155
6082D223155L0632l3723P7267L10151o3264k78573J04320j32775o88295k79177
$$ 4223155 4253787 4220064 4297331 4607482 4544218 4265645 4369965 4237190 3548895 3269718
6072C269718N6380k34905j01898K46131J15623l0604l26425R0232J84698O65319
$$ 3269718 3326098 3091193 2989295 3235426 3351049 3320445 2994020 3084252 3268950 3934269
6062C934269l65736m25801L25622j03145l49234j7831L79699j69584J03366k291
$$ 3934269 3568533 3142732 3468354 3365209 3015975 2998144 3377843 3208259 3311625 3309334
6052C309334K29084P6284j05522J75443k97645k58378M32592k847L85802L93216
$$ 3309334 3538418 3614702 3509180 3684623 3386978 3128600 3561192 3558345 3944147 4337363
6042D337363m23824j35134L92905l13962K90285L76714k48580K11228l50827M4124
$$ 4337363 3913539 3778405 4171310 3857348 4147633 4524347 4275767 4486995 4136168 4180292
6032D180292Q4664K23795K30415N0800j14258J18563j14046l82859K33078J3225
$$ 4180292 4264956 4488751 4719166 4769966 4655708 4774271 4660225 4277366 4510444 4523669
6022D523669L81047k9622m96860L31831n3713K24819O1897j03218n2568m72496
$$ 4523669 4904716 4875094 4378234 4710065 4656352 4881171 4943068 4839850 4787282 4314786
6012D314786L80583J69981l31706O91168j54908k31149r461J15142J28304N0771
$$ 4314786 4695369 4865350 4533644 5224812 5069904 4838755 4829294 4944436 5072740 5123511
6002E123511L59235k70766l5037o02388J40820l23139K344O3965J69943J81606
$$ 5123511 5482746 5211980 5176943 4574555 4715375 4392236 4394580 4458545 4628488 4810094
5992D810094j00133j14570k40135O2626l1517n2309j79199K07110k3069l3579
$$ 4810094 4709961 4595391 4355256 4417882 4386365 4334056 4154857 4361967 4338898 4305319
5982D305319j57819j46783J41543K19641L05334K85164j72086M87073K48576n135
$$ 4305319 4147500 4000717 4142260 4361901 4667235 4952399 4780313 5267386 5515962 5510827
5972E510827K44953K80800K14119n79845q7098k1781k56218l73428j04681k24266
$$ 5510827 5755780 6036580 6250699 5670854 5583756 5561975 5305757 4932329 4827648 4603382
5962D603382k32463n49806M8983L83839p0782m03595k42555m70713j23052K55336
$$ 4603382 4370919 3821113 3870096 4253935 4183153 3779558 3537003 3066290 2943238 3198574
5952C198574J49446L04300J64804K78003p2761k88697J81186N01610k75028k9053
$$ 3198574 3348020 3652320 3817124 4095127 4022366 3733669 3914855 4416465 4141437 4112384
5942D112384J90691K6774J34118k47428k73519k669j83849R4428J24804k53261
$$ 4112384 4303075 4329849 4463967 4216539 3943020 3940351 3756502 3850930 3975734 3722473
5932C722473J70597J23882n21782p8805l38711J09638L44203Q035O0206m09423
$$ 3722473 3893070 4016952 3495170 3416365 3077654 3187292 3531495 3539530 3599736 3190313
5922C190313l04545K42428l14554m7537M31891L9376l9403L5124j37107o3446
$$ 3190313 2885768 3128196 2813642 2766105 3197996 3237372 3197969 3233093 3095986 3032540
5912C032540J73569K68120Q0395n894L97465J02221m12109O4891r5680K59482
$$ 3032540 3206109 3474229 3554624 3548730 3946195 4048416 3636307 3701198 3605518 3865000
5902C865000p3559l33170j93601J39428K76977j23381n4451j60931r2741J95248
$$ 3865000 3791441 3458271 3264670 3404098 3681075 3557694 3503243 3342312 3249571 3444819
5892C444819J86757M0792j99684l85851J39170k1651J24938l75081j19735N11688
$$ 3444819 3631576 3672368 3472684 3086833 3226003 3204352 3329290 2954209 2834474 3346162
5882C346162R3459j28863j45200J29100L44776j33242k57884J34008p2919O1185
$$ 3346162 3439621 3310758 3165558 3294658 3639434 3506192 3248308 3382316 3309397 3370582
5872C370582O767J40273K4388j09209J6938q2824j58779K82069j78785m91460
$$ 3370582 3377349 3517622 3542010 3432801 3449739 3366915 3208136 3490205 3311420 2819960
5862B819960j60988o585j21739L06885L45538q5736M34871J91336n55843j05693
$$ 2819960 2658972 2652387 2530648 2837533 3183071 3097335 3532206 3723542 3167699 3062006
5852C062006K22738O0520L76490o45312J09854J4590J60723k69210k35400j66939
$$ 3062006 3284744 3345264 3721754 3076442 3186296 3200886 3361609 3092399 2856999 2690060
5842B690060k13853L38608j21135m1880l29213Q8195j08726J04544R5054k05679
$$ 2690060 2476207 2814815 2693680 2651800 2322587 2410782 2302056 2406600 2501654 2295975
5832B295975q2037J83593o719Q261l6584j54390K37627K10750J81878l68605L9695
$$ 2295975 2213938 2397531 2390812 2399073 2362489 2208099 2445726 2656476 2838354 2469749 2509444
5821B509444j84112K10185l12056J64809k7112o7871L27176j35200J32704J79463
$$ 2509444 2325332 2535517 2223461 2388270 2361158 2293287 2620463 2485263 2617967 2797430
5811B797430p9789l67482j53315J23106R1547K6311j28988J31491J97766m6823
$$ 2797430 2717641 2350159 2196844 2319950 2411497 2437808 2308820 2440311 2638077 2591254
5801B591254K88471o9541o8241p5250k10111p6329J87704o7787n2787L5600K16310
$$ 2591254 2879725 2810184 2741943 2666693 2456582 2380253 2567957 2500170 2447383 2482983 2699293
5790B699293j37460J26088p1611k83082J09764L4402K50348k22708l5139M12P563
$$ 2699293 2561833 2687921 2616310 2333228 2442992 2477394 2727742 2505034 2469895 2470307 2477870
5779B477870j22680L3097k0558j88976J10884l88956R5859K90519K61744j51629
$$ 2477870 2355190 2388287 2367729 2178753 2289637 1900681 1996540 2287059 2548803 2397174
5769B397174J95719R1272k76932K68488L98159k54844j23301J14005K46761k52750
$$ 2397174 2592893 2684165 2407233 2675721 3073880 2819036 2695735 2809740 3056501 2803751
5759B803751J38286J46517K3877k6570l6716J57586N0663k91186l04837K67946
$$ 2803751 2942037 3088554 3112431 3085861 3049145 3206731 3257394 2966208 2661371 2929317
5749B929317K15213j07812m69075J27362K54535k3129L3938k61890J00029J60782
$$ 2929317 3144530 3036718 2567643 2695005 2949540 2926411 2960349 2698459 2798488 2959270
5739B959270J49281r2047P7154J3179P5364n5236M4648k18038J42317P65453k90053
$$ 2959270 3108551 3016504 3093658 3106837 3182201 3126965 3171613 2953575 3095892 3861345 3571292
5728C571292j05693K7669l38689j15400P4537Q2715J02685K28816L5095o04406
$$ 3571292 3465599 3493268 3154579 3039179 3113716 3196431 3299116 3527932 3563027 2958621
5718B958621P76010J62348k21536R8485Q6226J98820J9376j3529q9301k43237
$$ 2958621 3734631 3896979 3675443 3773928 3860154 4058974 4078350 4064821 3975520 3732283
5708C732283J37830o6050J65301J70597r9887M6603r3598K72762l31734K98399
$$ 3732283 3870113 3804063 3969364 4139961 4040074 4086677 3993079 4265841 3934107 4232506
5698D232506L71285m82306J96164j77285n274M46911m9096J39026N8655M224k67586
$$ 4232506 4603791 4121485 4317649 4140364 4135090 4582001 4532905 4671931 4730586 4734810 4467224
5687D467224R0911J2732r2046P28069M5800o4681M39200N46569k17569k98953
$$ 4467224 4558135 4570867 4478821 5206890 5252690 5188009 5627209 6173778 5956209 5657256
5677E657256N89853j62054n3660l162J88811L31106K58671N09654k23661J22622
$$ 5657256 6247109 6085055 6031395 6028233 6217044 6548150 6806821 7316475 7092814 7215436
5667G215436J60114j0402K53273M48345K13505J6313J89228M58791K83374K2574
$$ 7215436 7375550 7365148 7618421 8066766 8280271 8296584 8485812 8944603 9227977 9250551
5657I250551K32038o17235L65800M31592J63251L23139J90460L94157K46896J76637
$$ 9250551 9482589 8865354 9231154 9662746 9825997 10149136 10339596 10733753 10980649 11157286
5647A1157286l18704R1468N69694O57808N23019L73864J28493N57971M41373O06970
$$ 11157286 10838582 10930050 11499744 12157552 12680571 13054435 13182928 13740899 14182272 14789242
5637A4789242o0400M34491Q01804L62366P76000P97627N61909P29189O63393N84476
$$ 14789242 14728842 15163333 15965137 16327503 17103503 17901130 18463039 19192228 19855621 20440097
5627B0440097R35427J195129J227982R02165J055839J181498J604867J347399
$$ 20440097 21375524 22570653 23798635 24700800 25756639 26938137 28543004 29890403
5619B9890403J319230J659244K014226J707576J782198K075003K300083K178185
$$ 29890403 31209633 32868877 34883103 36590679 38372877 40447880 42747963 44926148
5611D4926148K502029K745776K713454K293094K974987L088648K892247L173741
$$ 44926148 47428177 50173953 52887407 55180501 58155488 61244136 64136383 67310124
5603F7310124L154087L125437L333895L970156L518499L440965L851297L637775
$$ 67310124 70464211 73589648 76923543 80893699 84412198 87853163 91704460 95342235
5595I5342235L419387L415079K737083L020707L339853K877076K810706K352589
$$ 95342235 98761622 102176701 104913784 107934491 111274344 114151420 116962126 119314715
5587A19314715J938470K473181K465831K183502K188524J654847J612962J236871
$$ 119314715 121253185 123726366 126192197 128375699 130564223 132219070 133832032 135068903
5579A35068903R73228M66417l10837l97704m87905j340950j153007j118966j733913
$$ 135068903 136042131 136508548 136197711 135800007 135312102 133971152 132818145 131699179 129965266
5570A29965266j816289j625921j550968j987845j878277k805871k487830k980978
$$ 129965266 128148977 126523056 124972088 122984243 121105966 118300095 115812265 112831287
5562A12831287l273159l521739l502060l722733l752238l380537l270604l324068
$$ 112831287 109558128 106036389 102534329 98811596 95059358 91678821 88408217 85084149
5554H5084149k976371l463815l240800l147610k951288l198162l344090l037267
$$ 85084149 82107778 78643963 75403163 72255553 69304265 66106103 62762013 59724746
5546E9724746l194194k508631k703168l112256k560887k516047j997003k087458
$$ 59724746 56530552 54021921 51318753 48206497 45645610 43129563 41132560 39045102
5538C9045102k009756k264748j791721j242800k125120j013552j286881j440023
$$ 39045102 37035346 34770598 32978877 31736077 29610957 28597405 27310524 25870501
5530B5870501j290168j154982k40654p51516j079825j130883l84956k7803J10413
$$ 25870501 24580333 23425351 23184697 22433181 21353356 20222473 19837517 19809714 19920127
5521A9920127J91184k3362N95242K55102J55558p13263j475979j711729j368520
$$ 19920127 20111311 20087949 20683191 20938293 21093851 20380588 18904609 17192880 15824360
5512A5824360j298741j174961q35432k64074q12457m88834n38208q8013n00524
$$ 15824360 14525619 13350658 12515226 12251152 11438695 10949861 10411653 10323640 9823116
5503I823116j68951n27043k18151q4134l01811Q4366P8083n02389m79669R3393
$$ 9823116 9654165 9127122 8908971 8824837 8523026 8607392 8685475 8183086 7703417 7796810
5493G796810P6060k52290k6982j36384l02925o3398j06073J25184j41444k08815
$$ 7796810 7872870 7620580 7593598 7457214 7154289 7090891 6984818 7110002 6968558 6759743
5483F759743k56034n6973k8102K21878K54446l07140l68685l32937K17405j72997
$$ 6759743 6503709 6446736 6418634 6640512 6894958 6587818 6219133 5886196 6103601 5930604
5473E930604k54950N15394k26209j2703L6565M96569m5987m52140L04043l60215
$$ 5930604 5675654 6191048 5964839 5952136 5988701 6485270 6439283 5987143 6291186 5930971
5463E930971k76477q1033J48807N8269j48955K6238j21929p8079j10256J71240
$$ 5930971 5654494 5573461 5722268 5780537 5631582 5657820 5535891 5457812 5347556 5518796
5453E518796k83041M89394J204n53945j15776k73713L18296K174K64719l56050
$$ 5518796 5235755 5725149 5726353 5172408 5056632 4782919 5101215 5103389 5368108 5012058
5443E012058K8982j9561J65159J33101k48842N3505m79014J77092p1303o126L47437
$$ 5012058 5041040 5021479 5186638 5319739 5070897 5124402 4645388 4822480 4751177 4745051 5092488
5432E092488L92460j67626O1777l81925m87342J63501K30949P3343j93231l5415
$$ 5092488 5484948 5317322 5379099 4997174 4509832 4673333 4904282 4977625 4784394 4748979
5422D748979P5242j24074K17532k59816j33306N2456j8914k21333R3400M62691
$$ 4748979 4824221 4700147 4917679 4657863 4524557 4577013 4558099 4336766 4430166 4892857
5412D892857k33859m1905o1012J22052j73253k28444q1115m8892L67145l83035
$$ 4892857 4658998 4617093 4556081 4678133 4504880 4276436 4195321 4146429 4513574 4130539
5402D130539J1854M68861K16215L19235j18546R2200K4551m06822l5524L3864
$$ 4130539 4142393 4611254 4827469 5146704 5028158 5120358 5144909 4738087 4702563 4736427
5392D736427J1602j99717J81878m35175K64291K19545L63786J27530p5481j72824
$$ 4736427 4748029 4548312 4730190 4295015 4559306 4778851 5142637 5270167 5194686 5021862
5382E021862N09133k06799o5013L21650N3098J72792L55501K25176k87555j2545
$$ 5021862 5530995 5324196 5259183 5580833 5633931 5806723 6162224 6387400 6099845 6087300
5372F087300j97808K83262N04290K51107k21238J80251k22284r7895R1507M1992
$$ 6087300 5889492 6172754 6677044 6928151 6706913 6887164 6664880 6566985 6658492 6700484
5362F700484K40120K75961J02834k71658j11451j68418J23928k34851o3242r0685
$$ 6700484 6940604 7216565 7319399 7047741 6936290 6767872 6891800 6656949 6593707 6503022
5352F503022j56993j10170J06043m02959J10573M17324k67306O10236k15359m72905
$$ 6503022 6346029 6235859 6341902 5938943 6049516 6466840 6199534 6809770 6594411 6121506
5342F121506J86735K66185j87063J7602L27515M80920j79805m83830N3038N77937
$$ 6121506 6308241 6574426 6387363 6404965 6732480 7213400 7033595 6549765 6602803 7180740
5332G180740q8778j25647J90590P0213J43054K25902l5382K50449Q5640j84480
$$ 7180740 7091962 6966315 7156905 7227118 7370172 7596074 7560692 7811141 7896781 7712301
5322G712301J05824M00459j15158J36595k37236J68569M08754K28484j57862K26144
$$ 7712301 7818125 8218584 8103426 8240021 8002785 8171354 8580108 8808592 8650730 8876874
5312H876874J93106r4248J42624K91210l0596r0423K52227O3323K89833L07238
$$ 8876874 9069980 8975732 9118356 9409566 9378970 9288547 9540774 9604097 9893930 10201168
5302A0201168m84535J9235L16833n0940L42362N38874R7773K62R0423L73646P4129
$$ 10201168 9716633 9735868 10052701 10001761 10344123 10882997 10980770 10981032 11071455 11445101 11519230
5291A1519230J5301N06121L66662n9347M92825L06291K81208j59745J55734N11645
$$ 11519230 11534531 12040652 12407314 12347967 12840792 13147083 13428291 13268546 13424280 13935925
5281A3935925L80130O02838N8495K86615L32934K96106M23375L84512Q20510L75462
$$ 13935925 14316055 14918893 14977388 15264003 15596937 15893043 16316418 16700930 17521440 17896902
5271A7896902O94672M29839N48269L52498M61395P72149N97966P55841P21664
$$ 17896902 18591574 19021413 19569682 19922180 20383575 21155724 21753690 22509531 23231195
5262B3231195N61396P64578J093652J039367R23511J422875J629159J259522J626840
$$ 23231195 23792591 24557169 25650821 26690188 27613699 29036574 30665733 31925255 33552095
5253C3552095J492479J829543J442450J677852J052204J360108J420346J407472
$$ 33552095 35044574 36874117 38316567 39994419 41046623 42406731 43827077 45234549
5245D5234549J677452J580582J185397R76744J306514J218981J058734J663738
$$ 45234549 46912001 48492583 49677980 50654724 51961238 53180219 54238953 55902691
5237E5902691R87769J259602J255857P31315l1205Q2570J21212m09750J31392
$$ 55902691 56890460 58150062 59405919 60137234 60106029 60188599 60309811 59900061 60031453
5228F0031453K9493m38580m1615L0226J30281r0405J60796K04031j8268R1154
$$ 60031453 60060946 59622366 59580751 59610977 59741258 59650853 59811649 60015680 59997412 60088566
5218F0088566J08832q3607j35182j59751L19980J08349J97013M82445Q48563R66299
$$ 60088566 60197398 60113791 59978609 59818858 60138838 60247187 60444200 60926645 61775208 62741507
5208F2741507J464327J924747K159465K809584K206589K884056L399054L069610
$$ 62741507 64205834 66130581 68290046 71099630 73306219 76190275 79589329 82658939
5200H2658939M265285M298684M701573M885506M803939N677160N325512N225715
$$ 82658939 86924224 91222908 95924481 100809987 105613926 111291086 116616598 121842313
5192A21842313N535958M662624M461274M658394M924782M968721M907128M700620
$$ 121842313 127378271 132040895 136502169 141160563 146085345 151054066 155961194 160661814
5184A60661814M644117M549332M529454M105448L384257K237548J765916J025231
$$ 160661814 165305931 169855263 174384717 178490165 181874422 184111970 185877886 186903117
5176A86903117R5933k69630J1200n88896p38662q02559n11219o40273q03268l73692
$$ 186903117 186999050 186729420 186740620 186151724 185413062 184610503 184099284 183459011 182655743 182282051
5166A82282051J56118P60870L4208M48672L29306L83846R38793L97769P25238
$$ 182282051 182438169 183199039 183233247 183681919 184011225 184395071 185333864 185731633 186456871
5157A86456871N54641J056012J137875O82269Q35018J132914J085156M99813N88073
$$ 186456871 187011512 188067524 189205399 189887668 190722686 191855600 192940756 193440569 194028642
5148A94028642J418970J607460J134723J341897J063289P55758J48281k57179
$$ 194028642 195447612 197055072 198189795 199531692 200594981 201350739 201499020 201241841
5140B01241841j405724j777732j846931k754402l611589l135565m088579m578810
$$ 201241841 199836117 198058385 196211454 193457052 189845463 186709898 182621319 178042509
5132A78042509m678831m875670m531445m074532m005950l790999l737113l421185
$$ 178042509 173363678 168488008 163956563 159882031 155876081 152085082 148347969 144926784
5124A44926784l882790l778252m561508l954947l793155l399033l357164k900187
$$ 144926784 141043994 137265742 132704234 128749287 124956132 121557099 118199935 115299748
5116A15299748k597116j752422j669240q66982M4592M23155Q27657J524000J984440
$$ 115299748 112702632 110950210 109280970 108413988 108458580 108881735 109709392 111233392 113217832
5107A13217832K928474L283902M138956N015854N567021O916240P541293Q593322
$$ 113217832 116146306 119430208 123569164 128585018 134152039 141068279 148609572 157202894
5099A57202894R587404J1312501J3357288J4809680J7161425J9590611K1314457
$$ 157202894 166790298 178102799 191460087 206269767 223431192 243021803 264336260
5092B64336260K3111159K4320452K3728367K1822042J9267480J5539989J0597146
$$ 264336260 287447419 311767871 335496238 357318280 376585760 392125749 402722895
5085D02722895O618972K682819o64789k157589l076459l316225k971225j800800
$$ 402722895 409341867 412024686 411359897 409202308 406125849 402809624 399838399 398037599
5077C98037599r64740j182987j736196l805909o594816j0387992j4245062j7825544
$$ 398037599 397072859 395889872 394153676 390347767 383752951 373364959 359119897 341294353
5069C41294353k1548316k3583427k4112761k4369889k3355176k1505943j9591826
$$ 341294353 319746037 296162610 272049849 247679960 224324784 202818841 183227015
5062A83227015j6467645j4971702j3147616j1304945r658789q925898q226423
$$ 183227015 166759370 151787668 138640052 127335107 117676318 108750420 100523997
5055A00523997o734602n895773o057547m860976m306307l659152l586164l389298
$$ 100523997 93789395 87893622 81836075 76975099 72668792 69009640 65423476 62034178
5047F2034178k944701k887146k719647k335947k007706j787178k272981j988703
$$ 62034178 59089477 56202331 53482684 51146737 49139031 47351853 45078872 43090169
5039D3090169j402792j595111j640701j119894j420255j303605j353580j154440
$$ 43090169 41687377 40092266 38451565 37331671 35911416 34607811 33254231 32099791
5031C2099791j291936j093850p24627l10047j482037j217222j149333n90182m72133
$$ 32099791 30807855 29714005 28989378 28679331 27197294 25980072 24830739 24240557 23768424
5022B3768424j055902o95367n49027o29083p93936p63638m1369k36733o58849
$$ 23768424 22712522 22017155 21468128 20839045 20045109 19281471 19240102 19003369 18344520
5013A8344520o59964o13309n85785m14820o34696k89872m28236p20612j38518
$$ 18344520 17684556 17071247 16485462 16070642 15435946 15146074 14717838 13997226 13858708
5004A3858708k53418j86747k91087j43281k2700k47103J36042m81918l46208K2446
$$ 13858708 13605290 13418543 13127456 12984175 12961475 12714372 12850414 12368496 12022288 12044734
4994A2044734m7765m98737o39597k21344o146j95487l64836R8901k59085l91631
$$ 12044734 11996969 11498232 10858635 10637291 10631145 10435658 10070822 10169723 9910638 9519007
4984I519007k91102k57615l63757j49711J57310j94995m50106K06327j71220k62602
$$ 9519007 9227905 8970290 8606533 8456822 8614132 8419137 7969031 8175358 8004138 7741536
4974G741536m0496l71593j99414K20598l35006j79678l7578q5294j2006j16175
$$ 7741536 7701040 7329447 7130033 7350631 7015625 6835947 6798369 6713075 6701069 6584894
4964F584894n50393j46632K3827J06654K53645j41545j60100O9727k54801O4149
$$ 6584894 6034501 5887869 5911696 6018350 6271995 6130450 5970350 6040077 5785276 5849425
4954E849425l52060k4829k42974l31223J0794M56023q1202r4633k75719p8911
$$ 5849425 5497365 5472536 5229562 4898339 4909133 5365156 5283954 5189321 4913602 4834691
4944D834691J2154j65372m10660p3534O8451j1024J76639m60363k17408L12561
$$ 4834691 4846845 4681473 4270813 4197279 4265730 4254706 4431345 3970982 3753574 4066135
4934D066135N4221j71865P9489J63057j47136j79408k14366j08781K99726N3146
$$ 4066135 4120356 3948491 4027980 4191037 4043901 3864493 3650127 3541346 3841072 3894218
4924C894218J40473N6827j70675l5206J03958j77935j41223J06163n04834L5241
$$ 3894218 4034691 4091518 3920843 3885637 3989595 3811660 3670437 3776600 3271766 3307007
4914C307007j34453J82595l80653l18421L65034j11161P0319j1078Q6535j55584
$$ 3307007 3172554 3355149 2974496 2656075 3021109 2909948 2980267 2969189 3055724 2900140
4904B900140K16775o9439O0274K22j56172j35294K73337j69004k41363K60907
$$ 2900140 3116915 3047476 3107750 3107972 2951800 2816506 3089843 2920839 2679476 2940383
4894B940383N4385J64993J06300j43979l74658K55976n10287l21830K36881N52813
$$ 2940383 2994768 3159761 3266061 3122082 2747424 3003400 2493113 2171283 2408164 2960977
4884B960977J3213m06764m93066K32968J69657M5985J9997o25115J75309K43476
$$ 2960977 2974190 2567426 2074360 2307328 2476985 2522970 2542967 1917852 2093161 2336637
4874B336637l4587j48577K56748j36164J57082J85499q3993j11835k44728L15846
$$ 2336637 2302050 2153473 2410221 2274057 2431139 2616638 2532645 2420810 2176082 2491928
4864B491928Q493j74718k54003O14659j26473k07754J33448J12299k66309q6957
$$ 2491928 2500421 2325703 2071700 2686359 2559886 2352132 2485580 2597879 2331570 2244613
4854B244613O5323m07792M6682L31674k56821j03089K38353k81129J16970n58822
$$ 2244613 2309936 1902144 1948826 2280500 2023679 1920590 2158943 1877814 1994784 1435962
4844A435962K88154N1274p9065l6852K13201R9021N625l08082J21662K90925N03440
$$ 1435962 1724116 1775390 1696325 1659473 1872674 1971695 1977320 1669238 1790900 2081825 2585265
4833B585265j50984o9933k58230j44310J53282J21939k62163J38615j42365J03890
$$ 2585265 2434281 2364348 2106118 1961808 2115090 2237029 1974866 2113481 1971116 2075006
4823B075006j62095k02030q7046k7723J71500k97217m08141K49096L24970L58050
$$ 2075006 1912911 1710881 1623835 1596112 1767612 1470395 1062254 1311350 1636320 1994370
4813A994370L38568m07374K7782j7353K90621K826M6154J86957J117N05605k13739
$$ 1994370 2332938 1925564 1953346 1935993 2226614 2229440 2275594 2462551 2463668 2969273 2755534
4802B755534K31216K45151k90165m70425p721L78849j92233N8242Q00j61779l82830
$$ 2755534 2986750 3231901 2941736 2471311 2463590 2842439 2650206 2708448 2709248 2547469 2164639
4791B164639K86767J81113j37933Q2916J24030J13534J524j63624n32650J50R4229
$$ 2164639 2451406 2632519 2494586 2577502 2701532 2815066 2816590 2652966 2120316 2120466 2214695
4780B214695K33662q052M4916L1841n85743J66540q3431K59145j07478q24647
$$ 2214695 2448357 2440305 2485221 2517062 1931319 2097859 2014428 2273573 2166095 1341448
4770A341448m50329K57590M87021P8244n82740K0258m6173j52899m27114L35769
$$ 1341448 891119 1148709 1635730 1713974 1131234 1151492 1105319 952420 525306 861075
4760H61075j45273k003n51862K47343K46265K10033m78209l34998j01179K76110
$$ 861075 715802 713799 161937 409280 655545 865578 387369 52371 -48808 227302
4750B27302K39079l731L53646m67488K27347k54260R0493j59420o8789P6284M4583
$$ 227302 466381 462650 816296 348808 576155 321895 412388 252968 184179 260463 305046
4739C05046K1671k49049j41351L39069K69783l29514j06317L52772o45245J41517
$$ 305046 326717 77668 -63683 275386 545169 215655 109338 462110 -183135 -41618
4729d1618M89881l80480J67657l88002K7060L67834m59293J47800K50383J57632
$$ -41618 448263 67783 235440 -152562 -125502 242332 -216961 -69161 181222 338854
4719C38854j35134o7765J78881J33300j97461l68568k1544J36135J93105l8103
$$ 338854 203720 135955 314836 448136 250675 -117893 -139437 -3302 189803 151700
4709A51700k76724K67536j00650k49920l5416q5546L61920L38666K563N3259j60363
$$ 151700 -125024 142512 41862 -208058 -243474 -329020 32900 371566 374129 427388 267025
4698B67025m12030M8754M79312K1150J23994o2644k94332j38830k95413p7526
$$ 267025 -145005 -96251 383061 404211 528205 465561 171229 32399 -263014 -340540
4688c40540J99828j04161N2112M65666R364m6526L54778L7484o3526k35880N5085
$$ -340540 -140712 -244873 -192761 272905 282269 235743 590521 628005 564479 328599 383684
4677C83684M7622n06179J16268K38699M0766m60618J00096K99135K4396L764K89017
$$ 383684 431306 -74873 41395 280094 320860 -139758 -39662 259473 283869 287633 576650
4666E76650m72622K48918J97514p1574J98301J10843L50534J81509j99250N11686
$$ 576650 104028 352946 550460 478886 677187 788030 1138564 1320073 1120823 1632509
4656A632509K96730l49625k2403p3046K82076m16290j64123l225k55050j22713
$$ 1632509 1929239 1579614 1557211 1484165 1766241 1349951 1185828 1182603 927553 804840
4646H04840l09313r5925K15352j75455j68239J62524J49420k60206n03521M74701
$$ 804840 495527 399602 614954 439499 271260 433784 583204 322998 -180523 294178
4636B94178R2199J39908K97009j54300R5775J11814K84663M14876J05806K51370
$$ 294178 386377 526285 823294 668994 764769 876583 1161246 1576122 1681928 1933298
4626A933298L44932K37155O00168N12608J8857m0896l15442q96086j95681n42680
$$ 1933298 2278230 2515385 3115553 3628161 3647018 3606122 3290680 2394594 2198913 1656233
4616A656233k08226l94200j09230j41553k53367o0364J72622J93076l1051J82779
$$ 1656233 1448007 1053807 944577 803024 549657 489293 661915 854991 823940 1006719
4606A006719m3746o37906j16239K32060k13499N32258J71327o28514N9579K79733
$$ 1006719 962973 325067 208828 440888 227389 759647 930974 302460 362039 641772
4596F41772l3149k92073L37543M79913K09379K5280j43500L68880J6611p69130
$$ 641772 608623 316550 654093 1134006 1343385 1368665 1225165 1594045 1610656 841526
4586H41526J71928o0319M52539l95933j94820k59891k37393l5631k9470k70001
$$ 841526 1013454 953135 1405674 1009741 814921 555030 317637 282006 252536 -17465
4576a7465j07378L51259J87726J58236j37420r3116j35647L0233m17161k478k86819
$$ -17465 -124843 226416 414142 572378 434958 341842 206195 236428 -180733 -183211 -470030
4565d70030K41567K7083K16467J53025J96617M24753m00639m20675J31552r6352
$$ -470030 -228463 -201380 15087 168112 364729 789482 388843 -31832 99720 3368
4555C368L1727l8979K71354p2858k89319K32334M34850N7316m29564k57673J54277
$$ 3368 35095 -3884 267470 194612 -94707 137627 572477 629793 200229 -57444 96833
4544I6833k10330L37300K41635m46254K51860L11573K4821j2858n24227Q4770
$$ 96833 -113497 223803 465438 19184 271044 582617 607438 594580 70353 155123
4534A55123J67264j82298j30690J88424j64554N7844P0122k4436k00060L5691
$$ 155123 322387 140089 9399 197823 33269 91113 161235 136799 -63261 -27570
4524b7570J5313k74300L85821K039o61795R4888L94502M3099Q5525M04130K8337
$$ -27570 -12257 -286557 99264 101303 -560492 -465604 -71102 -28003 57522 461652 489989
4513D89989l29213J82774n7136l13126L53710K27983m16124p0162J51683L039
$$ 489989 160776 343550 286414 -26712 326998 554981 138857 68695 220378 223417
4503B23417j12160j38363J85560n82446K20978J08200p2051k40958K61306K17600
$$ 223417 111257 -27106 158454 -423992 -203014 -94814 -166865 -407823 -146517 71083
4493G1083l93203L83479j25588K58985o5699r1190O9809L552N8793K50051J85023
$$ 71083 -322120 61359 -64229 194756 129057 37867 107676 111228 170021 420072 605095
4482F05095m69723k53585K02309L6296K06914j97643J11612l90079j86641L60404
$$ 605095 135372 -118213 84096 120392 327306 129663 241275 -148804 -335445 24959
4472B4959k5406N3150L88300K3715r1595Q4517o47009j15372M16319J51202k5336
$$ 24959 -447 52703 441003 464718 373123 457640 -189369 -304741 111578 262780 237444
4461B37444J81333J38417j62678j40721m5182J99305o2559k8891j50295j26627
$$ 237444 418777 557194 394516 253795 208613 407918 345359 316468 166173 39546
4451C9546n5936L84014R0547o5751n3608j59801P35238l9552p41028j96525L01224
$$ 39546 -16390 367624 458171 392420 338812 179011 914249 874697 133669 -62856 238368
4440B38368m4004q8346j9677l62002L08881j09454R1322k45207q9111L29933O4241
$$ 238368 194364 106018 86341 -275661 33220 -76234 15088 -230119 -319230 10703 74944
4429G4944n6342K75247J15782k73732l89208L17078j94574P0809r006j64670k61909
$$ 74944 18602 293849 409631 135899 -253309 63769 -130805 -59996 -69002 -233672 -495581
4418d95581k1488K57398K90615k04307N5274j37877j13673J11137o82144M74858
$$ -495581 -517069 -259671 30944 -173363 -118089 -255966 -369639 -258502 -940646 -465788
4408d65788M0141j41379J29951r3540j08617R3719L06454j67522j7843L03074
$$ -465788 -425647 -567026 -437075 -530615 -639232 -545513 -239059 -406581 -424424 -121350
4398a21350n1140j04989j67739L58288j42288k9114o4602q4345j30003K48866
$$ -121350 -172490 -277479 -445218 -86930 -229218 -258332 -322934 -407279 -537282 -288416
4388b88416J3447J35186L84195m21390l65653L71480m4424j00362j35238k40924
$$ -288416 -274969 -139783 244412 -176978 -542631 -171151 -215575 -315937 -451175 -692099
4378f92099L03399R9927J35628J4802L1134l44697Q8167J25603m623j5713k08421
$$ -692099 -388700 -288773 -153145 -138343 -107209 -451906 -363739 -238136 -242759 -258472 -466893
4367d66893K8869K42587M86964J53695m35850l37761J19493K59889K49839l50319
$$ -466893 -438024 -195437 291527 445222 9372 -328389 -208896 50993 300832 -49487
4357d9487L27342j36545j86146L12247k44221j52447j44767P2847J94433l08419
$$ -49487 277855 141310 -44836 267411 23190 -129257 -274024 -201177 -6744 -315163
4347c15163K68137l0515j67123j92785q5885J18646K93270j85633L26025N8094
$$ -315163 -47026 -77541 -244664 -437449 -523334 -404688 -111418 -297051 28974 87068
4337H7068J08461m2665k66014j02367j74060J52064j38435L1238J70857l88226
$$ 87068 195529 152864 -113150 -215517 -389577 -237513 -375948 -344710 -173853 -562079
4327e62079J34052K12980J18221K07169j59858m31606k14117k271J89893K11237
$$ -562079 -428027 -215047 -96826 110343 -49515 -481121 -695238 -697509 -507616 -296379
4317b96379J31474l7582n5535K08076J60474p34433j88499N32915R4801L67568
$$ -296379 -164905 -202487 -258022 -49946 110528 -623905 -812404 -279489 -184688 182880
4307A82880j42490J13350q3460j19290L9330J31497n12619J23516j65297O752
$$ 182880 40390 153740 70280 -49010 -9680 121817 -390802 -267286 -432583 -425831
4297d25831M9127J82447r782k68387j20838K09258N24468J55479K64221k56185
$$ -425831 -376704 -194257 -204039 -472426 -593264 -384006 140462 295941 560162 303977
4287C03977j99198o284n45488p9294J82951R9215k38071M91166j48304L36044
$$ 303977 104779 98495 -446993 -526287 -343336 -244121 -482192 8974 -139330 196714
4277A96714k03035j12092L43262q9754L0498N6235k43047k99959K98951J6408
$$ 196714 -6321 -118413 224849 135095 165593 221828 -21219 -321178 -22227 -5819
4267e819j16896n6691O2839K03461j10256k44788l07071L29527J54125k90015
$$ -5819 -122715 -179406 -116567 86894 -23362 -268150 -575221 -245694 -91569 -381584
4257c81584r211L57736M75119m12686j05953j23758q358j10725K47239j76728
$$ -381584 -390795 -33059 442060 29374 -76579 -200337 -208695 -319420 -72181 -248909
4247b48909k12786Q6820q5038J75320M16455r8108j77293l67112K87927M29652
$$ -248909 -461695 -374875 -459913 -284593 131862 33754 -143539 -510651 -222724 206928
4237B06928n38988k35631M42985L29672j70719l2906J65889N8692J39327l31843
$$ 206928 -332060 -567691 -124706 204966 34247 1341 167230 225922 365249 33406
4227C3406k36219J18946o4271K7273k66138j5960Q4358J95624p3303k3054m4643
$$ 33406 -202813 -83867 -148138 -120865 -387003 -402963 -318605 -122981 -196284 -219338 -263981
4216b63981L01345J9852j4531J99401k04583R0276q3025K24339k12564m4632k99005
$$ -263981 37364 57216 42685 242086 37503 127779 44754 269093 56529 11897 -287108
4205b87108J19198K29096J31986m78365J45555L59977m70246R6576K23118l74432
$$ -287108 -167910 61186 193172 -285193 -139638 220339 -249907 -153331 69787 -304645
4195c04645j19123K05103m6590K58250l14081l44895k81357L24841M12126Q9539
$$ -304645 -423768 -218665 -265255 -7005 -321086 -665981 -947338 -622497 -210371 -120832
4185a20832k6049k71660K45422R7990R6024j42671m010n283O49057Q5660n83728
$$ -120832 -146881 -418541 -173119 -75129 20895 -121776 -125786 -131069 517988 603648 19920
4174A9920k05515J24081q3678j36632M1741j4910l10843p9154J21855K2493R8500
$$ 19920 -185595 -61514 -145192 -281824 -240083 -254993 -565836 -644990 -523135 -500642 -402142
4163d02142n7233q0176j18810M79951l28602l1331p5411m9286n7537L58843K45632
$$ -402142 -459375 -539551 -658361 -178410 -507012 -538343 -613754 -663040 -720577 -361734 -116102
4152a16102j67396K9938J61660l10706J94059J29136j5176J36358m94046O8004
$$ -116102 -283498 -253560 -91900 -402606 -208547 -79411 -94587 41771 -452275 -384271
4142c84271M12051N1863L5016J08330l32293K5388L71719K66814j43879m37577
$$ -384271 27780 79643 114659 222989 -109304 -83916 287803 554617 410738 -26839
4132b6839o4652j61636l77826K94796K65651r8284O8586K77469j23827l02037
$$ -26839 -91491 -253127 -630953 -336157 -70506 -168790 -100204 177265 53438 -248599
4122b48599m18937r616L45793p7654R5951L26778j70690K22810J11630k57126
$$ -248599 -667536 -677152 -331359 -409013 -313062 13716 -156974 65836 177466 -79660
4112g9660J85743K8902Q0135k38342k21553l02052N17141K51707p24481l24204
$$ -79660 106083 134985 215120 -23222 -244775 -546827 -29686 222021 -502460 -826664
4102h26664O14093J96913k1855j15141j52580q2443k0328L01337P8319j40761
$$ -826664 -212571 -15658 -37513 -152654 -305234 -387677 -408005 -106668 -28349 -169110
4092a69110l77678K28412L273L11549P8885L0308l4706k27408p3348j54203K5043
$$ -169110 -546788 -318376 -315103 -3554 75331 105639 70933 -156475 -229823 -384026 -358983
4081c58983K93453N5470r0252J02966R6268j40970N7211L90635J26173n906m24032
$$ -358983 -65530 -10060 -100312 2654 98922 -42048 15163 405798 531971 526065 102033
4070A02033K02912K10655m00503j49824J20858j27845M05312m8820o75734k20952
$$ 102033 304945 515600 115097 -34727 86131 -41714 363598 314778 -360956 -581908
4060e81908M39210P0361J84508M8865n42089L20882J31754r3530p2264M538k49741
$$ -581908 -142698 -72337 112171 161036 -381053 -60171 71583 -21947 -94211 -89673 -339414
4049c39414L27028J8841k12166m1235p3080K0633q9252k0386q3103N24387J0502
$$ -339414 -12386 6455 -205711 -246946 -320026 -299393 -388645 -409031 -492134 32253 42755
4038D2755n28344M33707J16344p5336j0205L50980n4683o37345j3661L71848K23308
$$ 42755 -485589 -51882 64462 -10874 -21079 329901 275218 -362127 -375788 -3940 219368
4027B19368k14006n4833o4433n5447o7178N9471M6594M7393j44854k58212K73455
$$ 219368 5362 -49471 -113904 -169351 -236529 -177058 -130464 -83071 -227925 -486137 -212682
4016b12682N25362j16114m3819K12239m42895q1794L30375O7055M9283m8201J09292
$$ -212682 312680 196566 152747 364986 -77909 -159703 170672 237727 287010 238809 348101
4005C48101J85986l43003m06099K05187K56078k60948K9789j68726J4186K99172
$$ 348101 534087 191084 -215015 -9828 246250 -14698 15091 -153635 -139449 159723
3995A59723J06459o8213R2059m6020L5864q270j79324L58735J6546J04274j76645
$$ 159723 266182 197969 290028 244008 279872 271602 92278 451013 467559 571833 395188
3984C95188k31234O6105j37535J7641L5756l44178K05139K54038m1872p0178J55867
$$ 395188 163954 230059 92524 110165 145921 -198257 6882 260920 219048 148870 304737
3973C04737r7597M3507r0971L8057Q1655l46154K16416M35980O2192p2121m02276
$$ 304737 207140 250647 159676 197733 279388 -66766 149650 585630 647822 575701 173425
3962A73425R3258n5969j96483L38427j8148N02872n1180P9486L83981l29323j57062
$$ 173425 266683 210714 14231 352658 334510 837382 786202 865688 1249669 920346 763284
3951G63284q3002n3219J77314k82343k85752M4554L07908k87314M59060j99109
$$ 763284 680282 627063 804377 522034 236282 280836 588744 301430 760490 561381
3941E61381n65652J42786l188k20715J18843K16761K7238M1670p9489J37576k58071
$$ 561381 -4271 138515 135327 -85388 33455 250216 277454 319124 239635 377211 119140
3930A19140Q8685J92971J4014k95488m572M7052L11376J04916j31553J00998N4665
$$ 119140 207825 400796 414810 119322 114750 161802 473178 578094 446541 547539 602204
3919F02204j95888q2812o7868K04852R9247R6278J93980j17920k35327n00225
$$ 602204 406316 323504 255636 460488 559735 656013 849993 732073 496746 -3479
3909c479k10989K63092K7560N47892k95522j23019R3511l7726K66501j79721p5076
$$ -3479 -214468 48624 76184 624076 328554 205535 299046 261320 527821 348100 273024
3898B73024m9616l37137j41658O69464k37607J27245K13607M41514r9892o41870
$$ 273024 223408 -113729 -255387 414077 176470 303715 517322 958836 858944 217074
3888B17074n7101K03634o30932q7325M90413L64542J65877q9144k42107J41571
$$ 217074 159973 363607 -267325 -354650 135763 500305 666182 577038 334931 476502
3878D76502K98511l42606n8600j80898j36278M29516K47966J49203K2358k29406
$$ 476502 775013 432407 373807 192909 56631 486147 734113 883316 905674 676268
3868F76268n1769k38560j7476O5628M19966j07555m53275k00233J1015K84407
$$ 676268 624499 385939 368463 434091 854057 746502 293227 92994 104009 388416
3858C88416N6537J67720j11890m32330J79392J55965P6530n03185K29935R6927
$$ 388416 444953 612673 500783 68453 247845 403810 480340 -22845 207090 304017
3848C04017m01872K12645L25773O9018K5150J23802k88114K4755M3949l90251
$$ 304017 -97855 114790 440563 509581 534731 658533 370419 395174 439123 48872
3838D8872N14238K40501L2453l2624j4120j91599K73756J52754l62205J90682
$$ 48872 563110 803611 836064 803440 789320 597721 871477 1024231 662026 852708
3828H52708K2494m1617J5881K39192L8348m28132L20050J86900m22535K69176
$$ 852708 875202 833585 849466 1088658 1127006 698874 1018924 1205824 783289 1052465
3818A052465J10396k36604j89154L4563J64234j17938l2836n3346o2223J68853
$$ 1052465 1162861 926257 737103 771666 935900 817962 785126 731780 669557 838410
3808H38410m7704K06198n232J21303m4549K35905m31904J51588K05342K2176l37115
$$ 838410 790706 996904 991672 1112975 1068426 1304331 872427 1024015 1229357 1251533 914418
3797I14418L16887k08740j4892L01680l1736K61696M30195p42053L22774M41867
$$ 914418 1231305 1022565 1007673 1309353 1277617 1539313 1969508 1227455 1550229 1992096
3787A992096j48351R0185k32187O9994K88610r493j07862l48288k13600L27400
$$ 1992096 1843745 1933930 1701743 1771737 2060347 2050854 1942992 1594704 1381104 1708504
3777A708504J03738L02140J4249p3910J07858k39635J74957M89434M7082K24663
$$ 1708504 1812242 2114382 2128631 2054721 2162579 1922944 2097901 2587335 2634417 2859080
3767B859080k22105p2367O3050R9377K06804K47405J90614M47899p5539J14830
$$ 2859080 2636975 2564608 2627658 2727035 2933839 3181244 3371858 3819757 3744218 3859048
3757C859048k65714j23967J6243J00746Q4613M25296k90181J79514n0448L40672
$$ 3859048 3593334 3469367 3485610 3586356 3670969 4096265 3806084 3985598 3935150 4275822
3747D275822J56635j38145j86082L66071J1641R9183P42450k93548J4932J61602
$$ 4275822 4432457 4294312 4108230 4474301 4485942 4585125 5327575 5034027 5048959 5210561
3737E210561l54397N61507R5676n1447L26854K31702k22038J13978K22528M84065
$$ 5210561 4856164 5417671 5513347 5461900 5788754 6020456 5798418 5912396 6134924 6618989
3727F618989N43848J48866J4978j17724K64719N23574K78035N89049N65588N18107
$$ 6618989 7162837 7311703 7326681 7208957 7473676 7997250 8275285 8864334 9429922 9948029
3717I948029O05680K03831P800R92710Q11437O82650J373641O27409K79703J112669
$$ 9948029 10553709 10757540 10765340 11758050 12569487 13252137 14625778 15253187 15532890 16645559
3707A6645559J244215J265440J374292J797261J921307K413327J965305J524030
$$ 16645559 17889774 19155214 20529506 22326767 24248074 26661401 28626706 30150736
3699C0150736K354511K922321L592276N025561O598266Q997506J1256141J4403957
$$ 30150736 32505247 35427568 39019844 44045405 50643671 59641177 70897318 85301275
3691H5301275J8381750K5060696K7339581K2497327J2340983j4048183k8917582
$$ 85301275 103683025 128743721 156083302 178580629 190921612 176873429 147955847
3684A47955847k7918275k3544072j8987273j3137794r543424p020341n447656
$$ 147955847 120037572 96493500 77506227 64368433 54825009 47804668 42357012
3677D2357012m598595l394667k070704k142633j836687j816253j462521k644208
$$ 42357012 37758417 34363750 32293046 30150413 28313726 26497473 25034952 22390744
3669B2390744j935266j761781j553681j172490p73929j164958r23558l11935j215572
$$ 22390744 20455478 18693697 17140016 15967526 15193597 14028639 13105081 12793146 11577574
3660A1577574k65183n64356n22979n97177l73394l98022k62421m88528o42646
$$ 11577574 11312391 10748035 10225056 9627879 9254485 8856463 8594042 8105514 7462868
3651G462868n67056j47234L39431l99312J5823k39578q29464O9612n72120j25095
$$ 7462868 6895812 6748578 7088009 6688697 6704520 6464942 5635478 5705090 5132970 5007875
3641E007875J21239n23445m29101N57559m48650o62550l44504M93361o5029k47767
$$ 5007875 5129114 4605669 4176568 4734127 4285477 3622927 3278423 3771784 3706755 3458988
3631C458988k59693R289l01360j74241Q8199m848K30141q5730l08620R6577l07677
$$ 3458988 3199295 3208584 2907224 2732983 2821182 2816334 3046475 2960745 2652125 2748702 2441025
3620B441025m16092M31024P3959l88842P5600J04638l94345m8242j44220J83325
$$ 2441025 2024933 2455957 2529916 2141074 2216674 2321312 1926967 1878725 1734505 1917830
3610A917830j29269k22742L65076K34304k64439k31855j21P8241j26024j15382
$$ 1917830 1788561 1565819 1930895 2165199 1900760 1668905 1668784 1747025 1621001 1505619
3600A505619j71644J23890p8805j52290J31812k06743j75694J72631L49282p72150
$$ 1505619 1333975 1457865 1379060 1226770 1358582 1151839 976145 1148776 1498058 725908
3590G25908o2068M69232j13084l20832L24686J22977J15954K11052l83142J05600
$$ 725908 663840 1133072 1019988 699156 1023842 1146819 1262773 1473825 1090683 1196283
3580A196283m04609k34762J18914j91443j01255J27224M80348k76944l59073P7152
$$ 1196283 791674 556912 675826 484383 383128 510352 990700 713756 354683 431835
3570D31835O01555j15458j32730k1938L4922o4257k14252n9084L99350K08458
$$ 431835 1033390 917932 785202 763264 798186 733929 519677 460593 859943 1068401
3560A068401K0535n72491k93558K03734q1316n9976j0263M4198m8552K11781K15914
$$ 1068401 1088936 516445 222887 426621 345305 285329 275066 319264 270712 482493 698407
3549F98407m32155M3532l53571m9536L70514J01109J8937k61476J04852n03895
$$ 698407 266252 309784 -43787 -93323 277191 378300 397237 135761 240613 -263282
3539b63282J44536M52531L99507k04380r9095l2084M9183N3843k24140L07056
$$ -263282 -118746 333785 733292 528912 429817 397733 446916 500759 276619 583675
3529E83675k46921j48443n984k71628N5261M02099L64754k64521j86477K955L58020
$$ 583675 336754 188311 182327 -89301 -34040 368059 732813 468292 281815 284770 642790
3518F42790j06882l87489L8690Q6531J92824j70254p4654J4012J66346P41897
$$ 642790 535908 148419 187109 273640 466464 296210 221556 235568 401914 1143811
3508A143811n86486j84308j44969k05374k02705M25984O599k64657j86129R4674
$$ 1143811 557325 373017 228048 22674 -180031 245953 252552 -12105 -198234 -103560
3498a03560M97660J65130l36500l79482L67740P0650j59786K86795J75353j54061
$$ -103560 394100 559230 222730 -156752 210988 281638 121852 408647 584000 429939
3488D29939j24230j04422l90145j93020O26028l27806R8318J05816Q0297l58729
$$ 429939 305709 201287 -188858 -381878 244150 -83656 14662 120478 200775 -157954
3478a57954J49957L31305J71835j10959j55169P5653k65778K43057k0977j02119
$$ -157954 -7997 323308 495143 384184 229015 304668 38890 281947 260970 158851
3468A58851L3544P5963n98474N1061L36817M65421m87159K9623L37224j22742
$$ 158851 192395 268358 -330116 -279055 57762 523183 36024 65647 402871 280129
3458B80129k22130L585l51776J20486J11043k04197O584K09311K3125K68330j11511
$$ 280129 57999 61584 -290192 -169706 -58663 -262860 -256276 -46965 -23840 244490 132979
3447A32979N7138N9104L24649J29017k64770L9106l77562l41649l8249L40111
$$ 132979 190117 249221 573870 702887 438117 477223 99661 -241988 -280237 59874
3437E9874J76369J02997l66858j58424R4309K44652j64326j16501O2183l39679
$$ 59874 236243 339240 -27618 -186042 -91733 152919 -11407 -127908 -65725 -405404
3427d05404M48949L81250K14798M10066m12815K82390l99711J50704K01787L8431
$$ -405404 43545 424795 639593 1049659 636844 919234 519523 670227 872014 910445
3417I10445J50n044l36791K61213j96343P341k66324k15801L6372N8668m6732
$$ 910445 910595 905551 568760 829973 633630 640971 374647 158846 195218 253886 207154
3406B07154J80423k35511r713O7000k79388P9559J60691j80041q6201L84090N6455
$$ 207154 387577 152066 142353 209353 -70035 9524 170215 -9826 -96027 288063 344518
3395C44518q6618q2380J0334k30170L87648j33002l76127j09636J84766j0017
$$ 344518 257900 175520 185854 -44316 343332 210330 -165797 -275433 -90667 -100684
3385a00684M5460o1500K35986j00000j52800K77187p02631j4478N81564J45201
$$ -100684 -55224 -116724 119262 19262 -133538 143649 -558982 -573460 8104 153305
3375A53305J09262R7371K36232k89245k61891k28244j32656K08582J79939P5571
$$ 153305 262567 359938 596170 306925 45034 -183210 -315866 -107284 72655 148226
3365A48226k60077J271J41565p716J62572k31244k81131J23012N19544J54220
$$ 148226 -111851 -110580 30985 23269 185841 -45403 -326534 -203522 316022 470242
3355D70242n65109k55939j12145J46120Q43073k10153m95990k348j39845k00003
$$ 470242 -94867 -350806 -462951 -316831 526242 316089 -179901 -182249 -322094 -522097
3345e22097K35244J65667K32963j53489K15054j67806r6642O6009j0906N5415
$$ -522097 -286853 -121186 111777 -41712 173342 5536 -91106 -25097 -36003 19412
3335A9412k14049K57147K45042j97339j60973O7252L77006J29777m89241j41572
$$ 19412 -194637 62510 307552 110213 -50760 16492 393498 523275 34034 -107538
3325a07538r5431l74003O4547M38618J79852m67515k48290M74897K59852J70901
$$ -107538 -202969 -576972 -512425 -73807 106045 -361470 -609760 -134863 124989 295890
3315B95890l17118j36244Q8915k9148k9604K80086j38331L3438n6878K25290N4000
$$ 295890 -21228 -157472 -68557 -97705 -127309 152777 14446 47884 -8994 216296 270296
3304B70296k8658k72871j44124P9868J95164l30459n9053K296P63616k57354m95876
$$ 270296 241638 -31233 -175357 -95489 99675 -230784 -289837 -287541 476075 218721 -277155
3293b77155J54927L92036l38901j76968J4337J32653K68134m40305K40974k0951
$$ -277155 -122228 269808 -69093 -246061 -231724 -99071 169063 -271242 -30268 -51219
3283e1219R0681n97832J23242K11085L0564L30364K60849j58555k8222m55106
$$ -51219 39462 -558370 -435128 -224043 -193479 136885 397734 239179 210957 -244149
3273b44149J0482K14633K53590K18603o0827j05112j92069j80323K96831K02964
$$ -244149 -233667 -19034 234556 453159 392332 287220 95151 -85172 211659 414623
3263D14623R7449n60257j3912k36012n27379k334O27020J38161k73527p6919r5277
$$ 414623 512072 -48185 -62097 -298109 -825488 -827822 -200802 -62641 -336168 -413087 -508364
3252e08364M19863j38847J80480j85633Q2472l4104q4919K64029k74982Q4613
$$ -508364 -88501 -227348 -46868 -232501 -150029 -184133 -269052 -5023 -280005 -195392
3242a95392k25280L61433o8170m6288J06448R2193k61820K04001K50125p4913
$$ -195392 -420672 -59239 -127409 -173697 -67249 24944 -236876 -32875 217250 142337
3232A42337k27102p2135K24060n67914j25599K01251Q7824L14940J2929J3735
$$ 142337 -84765 -156900 67160 -500754 -626353 -425102 -337278 -22338 -9409 4326
3222D326j13719r1489J43135J25069J90232j91329q0842J61269Q248j6575j7535
$$ 4326 -109393 -200882 -57747 67322 257554 66225 -14617 146652 154900 138325 120790
3211A20790o00939K75004L75635o2826m33788N945L97251j54890j30467l64082
$$ 120790 -480149 -205145 170490 107664 -326124 -320179 77072 -77818 -208285 -572367
3201e72367L9328K34484n4241j32417K25255j3563J52555O2989m7597q2741l08499
$$ -572367 -533039 -298555 -352796 -485213 -259958 -273521 -120966 -57977 -105574 -188315 -496814
3190d96814M61351J73970L78076J73777k63544n31802p4734Q4630J764j27236
$$ -496814 -35463 138507 516583 690360 426816 -104986 -179720 -95090 -93326 -220562
3180b20562M755j86372K93391k34m8515j60067k45589K02920M67176N8037k38063
$$ -220562 -215807 -402179 -108788 -109022 -157537 -317604 -563193 -360273 106903 164940 -73123
3169g3123R714j32038J24656k61364L97720L50453n31027k98981M78112l97046
$$ -73123 -63409 -195447 -70791 -332155 65565 416018 -115009 -413990 64122 -332924
3159c32924k46408L58996l18619J00576L01186K17811j58708K72007j29116j54701
$$ -332924 -579332 -220336 -538955 -438379 -137193 80618 -78090 193917 64801 -89900
3149h9900k8798q2311M7295j45446K04461J90331j5211l20379k5851N21255j19717
$$ -89900 -118698 -201009 -153714 -299160 -94699 95632 80421 -239958 -265809 255446 135729
3138A35729k05512J35172k48249J16200K76093J00772l56566Q0171L35762j03228
$$ 135729 -69783 65389 -182860 -66660 209433 310205 -46361 33810 369572 266344
3128B66344n9636l34266n4367J2134K04526J64670J7445J2321l7173M055q331
$$ 266344 206708 -127558 -181925 -169791 34735 199405 216850 229171 191998 196053 187722
3117A87722j52461J78267j48760K23513J50823k79265m94830j4214M13750Q0290
$$ 187722 35261 213528 64768 288281 439104 159839 -334991 -349205 64545 144835
3107A44835N7077L9842k57304k33881q7238K13463k07391k45130M7469l5480O13410
$$ 144835 201912 241754 -15550 -249431 -336669 -123206 -330597 -575727 -528258 -563738 49672
3096D9672J27457j63503J33502J76227k58452m24941K13097J97171m1099J8850
$$ 49672 177129 13626 147128 323355 64903 -360038 -146941 50230 9131 27981
3086B7981k48022J93683J34235j57107k889Q3064k10747k54650l6688N1010K34302
$$ 27981 -220041 -26358 107877 -49230 -52119 30945 -179802 -434452 -471140 -420130 -185828
3075a85828J37949k8651J33591k3680N3770m06736J69946N25592j47101l72508
$$ -185828 -47879 -76530 57061 33381 87151 -319585 -149639 375953 228852 -143656
3065a43656P821J68645j27373M48938N3551m45657L71670j8138l38008m95306
$$ -143656 -135835 32810 -94563 354375 407926 -37731 333939 315801 -22207 -517513
3055e17513M12035J37201o9756o30513k5348R15621k06290l95892L10558l20266
$$ -517513 -105478 31723 -38033 -668546 -693894 221727 15437 -380455 -69897 -390163
3045c90163L37845J0484m9955J17993l04759N1597J44509Q4695j30259q5412j5520
$$ -390163 -52318 -41834 -91789 26204 -278555 -226958 -82449 2246 -128013 -213425 -228945
3034b28945Q1775K02376k66906R4147k72300k0681J74498K6327O15867k94765
$$ -228945 -147170 55206 -211700 -117553 -389853 -410534 -236036 -209709 406158 111393
3024A11393l79493L32203M04873m01638l33L00891k98751K68612Q9710k99774
$$ 111393 -268100 64103 468976 67338 67005 367896 69145 337757 427467 127693
3014A27693k98411L51132K95285n89099k03953J95823j29610q8111L06894j9405
$$ 127693 -170718 180414 475699 -113400 -317353 -121530 -251140 -339251 -32357 -51762
3004e1762P552J84733k26241J6482J83718k67002K71110m07886m54846L86684
$$ -51762 -44210 140523 -85718 -69236 114482 -152520 118590 -289296 -744142 -357458
2994c57458J74411m22151L87755j2088K15684N9611L360L05946J27814n17971
$$ -357458 -183047 -605198 -217443 -229531 -13847 45764 49124 355070 482884 -35087
2984c5087k59948j95214J69703K65272l11443k15335j0176N43151K665J64104
$$ -35087 -295035 -490249 -320546 -55274 -366717 -582052 -592228 -49077 -46412 117692
2974A17692N1284k69470l2032n6053K36273J30425r192j99491J86865J53525J07182
$$ 117692 168976 -100494 -132526 -188579 47694 178119 168927 -30564 156301 309826 417008
2963D17008k13626N250k90229N9513j20829r7744R2436M87581j81897k13599r3346
$$ 417008 203382 208632 -81597 -22084 -142913 -240657 -148221 339360 157463 -56136 -149482
2952a49482j84274K38265K63427k59358m6366l930J8011J44136l27929M18294
$$ -149482 -333756 -95491 167936 -91422 -137788 -141718 -123707 20429 -307500 110794
2942A10794k41765P3627L41561q3711k63899Q1075j93074j55951N56234m7186
$$ 110794 -130971 -57344 284217 200506 -63393 17682 -175392 -331343 224891 177705
2932A77705l00543M73253k2568m05750n0204k02949k46980K82709J00724K8999
$$ 177705 -122838 350415 327847 -77903 -128107 -331056 -578036 -295327 -194603 -165604
2922a65604l18716k18877K76917q1300m7927M52225R8182j76705m51405J4380
$$ -165604 -484320 -703197 -426280 -507580 -555507 -103282 -5100 -181805 -633210 -618830
2912f18830K34722K5842P5064Q8764J68437L1839k65263l5126J78297L03806L7707
$$ -618830 -384108 -358266 -283202 -194438 -26001 5838 -259425 -294551 -116254 187552 225259
2901B25259k67779l9311k23054m8463l694o3237O283K74155N6883k05107J75012
$$ 225259 -42520 -81831 -304885 -353348 -357042 -420279 -413996 -139841 -82958 -288065 -113053
2890a13053j01303L09397P7942j862J13396j74001J01362L28980k70857j91568
$$ -113053 -214356 95041 172983 171121 284517 110516 211878 540858 270001 78433
2880G8433m91533k71479P67223m04893l1276L24262M39311j86421j03257M48503
$$ 78433 -413100 -684579 82644 -322249 -353525 -29263 410048 223627 120370 568873
2870E68873P4381k31357n17161Q4508M31612k38509n17513M61246K46559k27551
$$ 568873 643254 411897 -105264 -20756 410856 172347 -345166 116080 362639 135088
2860A35088j26151K79180m72295l06341M67284P54778l50516k25362Q1821n17319
$$ 135088 8937 288117 -184178 -490519 -23235 731543 381027 155665 237486 -279833
2850b79833m9355K52083k99641N8172J44128M8253j12791Q01472M5368m01710
$$ -279833 -329188 -77105 -376746 -318574 -174446 -126193 -238984 562488 607856 206146
2840B06146J36959l634m07925k8787N01953N5174k14417o4899l44726K8168k02711
$$ 206146 343105 339471 -68454 -97241 404712 459886 245469 180570 -164156 -135988 -338699
2829c38699L12485K02127j25607k496j94684J28188p758r5681l97944L87442K66888
$$ -338699 -26214 175913 50306 47810 -146874 -18686 -26444 -122125 -520069 -132627 134261
2818A34261k77942p328M53831k97808p90k42287L27700k62910N27491J13434N2029
$$ 134261 -143681 -151009 302822 5014 4224 -238063 89637 -173273 354218 467652 519681
2807E19681m30810j65114k95235J06991O08254j39132p6225k5637j58595j33741
$$ 519681 88871 -76243 -371478 -264487 343767 204635 128410 102773 -55822 -189563
2797a89563R8160j51666J53493O0307p2023k58128M4061K15849j73042N21175
$$ -189563 -91403 -243069 -89576 -29269 -101292 -359420 -315359 -99510 -272552 248623
2787B48623K8388m63019L36562K03987k61148K38542L29748m20878R9655m24178
$$ 248623 277011 -186008 150554 354541 93393 331935 661683 240805 340460 -83718
2777h3718l17436L63847q9664j46748J36036j69969K30515J19080L763Q7759j91053
$$ -83718 -401154 -37307 -126971 -273719 -137683 -307652 -77137 41943 45706 133465 -57588
2766e7588K039j52430J21384L84732n0486k21659r0399P2520J68287l53553j85905
$$ -57588 -55549 -207979 -86595 298137 247651 25992 -64407 8113 176400 -177153 -363058
2755c63058K90957n1482K580K64040K89592k56206j69005j17031J983K13890n6146
$$ -363058 -72101 -123583 -121003 143037 432629 176423 7418 -109613 -107630 106260 50114
2744E0114l13552p8161K37679k14531j36747R4175O1009J93043L09667J2109j08928
$$ 50114 -263438 -341599 -103920 -318451 -455198 -361023 -300014 -106971 202696 214805 105877
2733A05877n02397N7127N01301r7630M3404q4375k70980L92844L59895l3235q40656
$$ 105877 -396520 -339393 161908 64278 107682 23307 -247673 145171 505066 471831 -368825
2722c68825r0949M54203K55188K58313n06203J88688r0333M58001l87626l14381
$$ -368825 -459774 -5571 249617 507930 1727 190415 100082 558083 170457 -143924
2712a43924M46763m1426k01810k34701N23685l75320k67233N04145R7152j70202
$$ -143924 302839 261413 59603 -175098 348587 -26733 -293966 210179 307331 137129
2702A37129l76880M39028k92681L1958j72458p3846K84163j0996k8493L66720
$$ 137129 -239751 199277 -93404 -61446 -233904 -307750 -23587 -34583 -63076 303644
2692C03644l71849J22041J38845j08166j30076k57261M53301j93888k88571l24114
$$ 303644 -68205 53836 192681 84515 -45561 -302822 150479 -43409 -331980 -656094
2682f56094k0906L14302M7151K46486L76769r7327j12744L3900K08961o03019
$$ -656094 -677000 -362698 -315547 -69061 307708 210381 97637 131537 340498 -262521
2672b62521J08121K61550L37298J53386l31952k83910L94895n1067k32501J51514
$$ -262521 -154400 107150 444448 597834 265882 -18028 376867 325800 93299 244813
2662B44813J57930l70375p2993r7957J77659J70386P1452K88525N8989l61394
$$ 244813 402743 32368 -40625 -138582 39077 209463 280915 569440 628429 267035
2652B67035j89938l09906L74575J01317j72675k33788n1169M12904k8191l18715
$$ 267035 77097 -232809 141766 243083 70408 -163380 -214549 198355 170164 -148551
2642a48551m19202J18696J79767k10378J98125N35151l19557k53794K24381J64299
$$ -148551 -567753 -449057 -269290 -479668 -281543 253608 -65949 -319743 -95362 68937
2632F8937K14059j28066j57550M17076j10205n33344k07580J14422L03807k68604
$$ 68937 282996 154930 -2620 414456 304251 -229093 -436673 -322251 -18444 -287048
2622b87048m20795L51860m7569J89754L279m7809O7587L13805j38640J19411l18997
$$ -287048 -707843 -355983 -403552 -213798 -210519 -258328 -190741 123064 -15576 103835 -215162
2611b15162L42640k50896j8677o3052K59891k18374j10289N61595j08868k58853
$$ -215162 127478 -123418 -142095 -205147 54744 -163630 -273919 287676 178808 -80045
2601h0045j12783N6475J45506Q7116L8152k67817m511k541J66850K6146k48920
$$ -80045 -192828 -136353 9153 96269 134421 -133396 -137907 -140448 26402 52548 -196372
2590a96372J6677k69278N46244l48817l08235j69081N38304k49203M4549N65450
$$ -196372 -179695 -448973 97271 -251546 -559781 -728862 -190558 -439761 -395212 170238
2580A70238J36438L08965l09689m74430K7700j71113N65667j41614l40642J55967
$$ 170238 306676 615641 305952 -168478 -140778 -311891 253776 112162 -228480 -72513
2570g2513J79678n21424m6190N97626L3348m47344m7540N53859k7378j69613M7904
$$ -72513 107165 -414259 -460449 137177 170525 -276819 -324359 229500 202122 32509 80413
2559H0413j33041j0430m3380j78485K68559J49269n38858P3575K4579J5811J23944
$$ 80413 -52628 -63058 -106438 -284923 -16364 132905 -405953 -332378 -307799 -291988 -168044
2548a68044l43761j59301L42759N43925m5681m62719L22942M59387m38982m17309
$$ -168044 -511805 -671106 -328347 215578 169897 -292822 30120 489507 50525 -366784
2538c66784k85599M14008J3733Q6686K44035M6031j69246M9015k15502j06412
$$ -366784 -652383 -238375 -224642 -137956 106079 152110 -17136 31879 -183623 -290035
2528b90035J9943L25056K08139l01711j01601m8488o2896K60297L58822j77437
$$ -290035 -270092 54964 263103 -38608 -140209 -188697 -251593 8704 367526 190089
2518A90089k75523j9564l33151K29080P9979L0624N8703J66923j37138l40027
$$ 190089 -85434 -104998 -438149 -209069 -129090 -98466 -39763 127160 -9978 -350005
2508c50005K62115Q6121L1044K99094j75246j47511k14267l82352L88182K22823
$$ -350005 -87890 -1769 29275 328369 153123 5612 -208655 -591007 -202825 19998
2498A9998l09030O8423r9669J62462L30937L1668j45598j61494K70140p6023J83303
$$ 19998 -289032 -220609 -320278 -157816 173121 204789 59191 -102303 167837 91814 275117
2487B75117J0666m29284J37951Q6835j10222L96586k3815k11007j71199J92990
$$ 275117 285783 -143501 -5550 81285 -28937 367649 343834 132827 -38372 154618
2477A54618l39620J52532L64060j7127M302J42183k4428m98849j64807j85622
$$ 154618 -185002 -32470 331590 314463 318765 460948 436520 -62329 -227136 -412758
2467d12758L48686J66855m11606L79495q0640m9041J22769l9854k20031L88188
$$ -412758 -64072 102783 -308823 70672 -9968 -59009 63760 23906 -196125 192063
2457A92063l6315j57513L5658l2433R9198l56086J40678K2505r5948J91406L52290
$$ 192063 155748 -1765 33893 1460 100658 -255428 -114750 -92245 -188193 3213 355503
2446C55503L0486j86111m56986R1028N49059k10030K7094r3248m05846j50329
$$ 355503 385989 199878 -257108 -166080 382979 172949 200043 106795 -299051 -449380
2436d49380k37612J66162L53345j82612J85645N5570K33496K1916m9584l1409
$$ -449380 -686992 -520830 -167485 -350097 -164452 -108882 124614 146530 96946 65537
2426F5537L93103Q8104o7183m16586J1806J91604J18762R588n69880K97905K46090
$$ 65537 458640 546744 479561 62975 74781 266385 385147 394735 -175145 122760 368850
2415C68850r1442m69036L16696L44720j55431m02565J88382k65732m0485Q4302
$$ 368850 277408 -191628 125068 469788 314357 -88208 100174 -165558 -206043 -121741
2405a21741J84973j66400J24893k96675j88399o3618O05689K14098o84071L18390
$$ -121741 63232 -103168 21725 -274950 -463349 -526967 78722 292820 -391251 -72861
2395g2861N1968n18406J03502N2207j30590K51276j95975K42880L01418Q8342
$$ -72861 -20893 -539299 -435797 -383590 -514180 -262904 -458879 -215999 85419 173761
2385A73761k11132l66493M36161J42538R1941k32993l36501L20823K26950N0712
$$ 173761 -37371 -403864 32297 174835 266776 33783 -302718 18105 245055 295767
2375B95767j54000j38607k48342Q0260K6275K40666J28585L35252J90014o09088
$$ 295767 141767 3160 -245182 -164922 -138647 102019 230604 565856 755870 146782
2365A46782j47122J3781k35629O2316K32461O2172J06508k99730O4156O4439l99932
$$ 146782 -340 13441 -222188 -159872 72589 134761 241269 -58461 5695 70134 -329798
2354c29798k58090m4406J84760L01482l0450j29686l4927L11900J26403M6636
$$ -329798 -587888 -632294 -447534 -146052 -176502 -306188 -341115 -29215 97188 143824
2344A43824K97357l43889K63391K89000k49406o2198k58804L6503p549j27655
$$ 143824 441181 97292 360683 649683 400277 338079 79275 115778 108229 -19426
2334a9426j86811J55381L26315k40741j09019K15117j90052J8214j06432k9049
$$ -19426 -206237 -50856 275459 34718 -74301 140816 -49236 -31022 -137454 -166503
2324a66503J02560L112J84908k90186K28334M35570r7504j83318j17230k82729
$$ -166503 -63943 -60831 124077 -166109 62225 497795 400291 216973 99743 -182986
2314a82986J45082m561L83066J9966m28403l87975L46203K45714j14985l28203
$$ -182986 -37904 -42465 340601 360567 -67836 -455811 -109608 136106 21121 -307082
2304c07082J56673M88466r3081N0968K94797R5317o03269j26829K84690j522K96277
$$ -307082 -150409 338057 244976 295944 590741 686058 82789 -44040 240650 239128 535405
2293E35405J1787p3323j96883k9440j54827J41665k51983K10674J93183l91466
$$ 535405 547192 473869 276986 247546 92719 234384 -17599 193075 386258 -5208
2283e208K92407P1973j79373J43317L15439O9622l28366m0503k43709j15933K38276
$$ -5208 287199 359172 179799 323116 638555 708177 379811 339308 95599 -20334 217942
2272B17942j59982l40804K56878J5634m82999J65778K92189k02899R1847j79016
$$ 217942 57960 -282844 -25966 -10332 -493331 -327553 -35364 -238263 -146416 -325432
2262c25432K23994K21955k27692j62851M95571K7467N3917j9016m84086q3783
$$ -325432 -101438 120517 -107175 -270026 225545 253012 306929 287913 -196173 -279956
2252b79956l48730M45411K3892M42750N4127l90798m30256L57698l52564K04073
$$ -279956 -628686 -183275 -159383 283367 337494 -53304 -483560 -125862 -478426 -274353
2242b74353J31555K5294j3556p6729N7149j6292Q4012n9491j44931J7510L37181
$$ -274353 -142798 -117504 -131060 -207789 -150640 -166932 -82920 -142411 -287342 -269832 67349
2231F7349j46350Q3824L53512K97487k47074k35579J16386j39561j02723j52543
$$ 67349 -79001 4823 358335 655822 408748 173169 289555 149994 47271 -105272
2221a05272M46362j35008k63738N3951J7828m17024N0957K30918M2031J74919
$$ -105272 341090 206082 -57656 -3705 14123 -402901 -351944 -121026 -78995 95924
2211I5924k16175j18439O5493J81348j08550J78662J15216l4058k61944k13707
$$ 95924 -120251 -238690 -173197 8151 -100399 78263 193479 159421 -102523 -316230
2201c16230J12150J65772j63525L64061M07549j55394m53495N6036P7849K21862
$$ -316230 -204080 -38308 -201833 162228 569777 414383 -39112 16924 94773 316635
2191C16635M0119l92518P3391k18578J59455O3493l72025q3997l1407K34862k6570
$$ 316635 356754 -35764 37627 -180951 -21496 41997 -330028 -414025 -445432 -210570 -237140
2180b37140p2590J56911K18619L08026m9811k55813J85972R1528j378j46197J47344
$$ -237140 -309730 -152819 65800 373826 324015 68202 254174 345702 344324 198127 345471
2169C45471k95483k89689R4882K79061l35179R2696M47789k11032K82457k04376
$$ 345471 49988 -239701 -144819 134242 -200937 -108241 339548 128516 410973 206597
2159B06597l21450k50690J59763k61519L61378j06248J81296j67141L3417J22781
$$ 206597 -114853 -365543 -205780 -467299 -105921 -212169 -30873 -198014 -164597 -41816
2149d1816j16147P3535j46473K65704j15020p1773l42564K25600J85834R1439
$$ -41816 -157963 -84428 -230901 34803 -80217 -151990 -494554 -268954 -83120 8319
2139H319o2589n8610J24998j89044J50365p4030j03341J49117J4538J01779j746
$$ 8319 -54270 -112880 12118 -176926 -26561 -100591 -203932 -54815 -40277 61502 59756
2128E9756m29957L25718N69508l92387K26822j05845l01864k03904J01246K62418
$$ 59756 -370201 -44483 525025 132638 359460 253615 -48249 -252153 -150907 111511
2118A11511k38620J47590K75673k78356J4093k02878K29139K6345J40936Q5671
$$ 111511 -127109 20481 296154 17798 31891 -170987 58152 84497 225433 311104
2108C11104l58017j65651L53312J94939k13038K35700K11402l16989p1605l96846
$$ 311104 -46913 -212564 140748 335687 122649 358349 569751 252762 181157 -215689
2098b15689o3776L141J01040k771M65234J54664k66614P4280m26212q8631m4898
$$ -215689 -279465 -276324 -175284 -178055 287179 441843 175229 249509 -176703 -265334 -310232
$$ [...]
##END NTUPLES=NMR SPECTRUM
##END=
