##TITLE=1H_TG-2371-B
 CDCl3
 8 sc, 
 15.2.2023
##JCAMPDX= 6.0         $$ Bruker NMR JCAMP-DX V2.0
##DATA TYPE= NMR SPECTRUM
##DATA CLASS= NTUPLES
##ORIGIN= UXNMR, Bruker Analytische Messtechnik GmbH
##OWNER= root
$$ XWIN-NMR		Version 3.5
$$ Wed Feb 15 14:09:34 2023 Russian Standard Time (UT+4h)  she@DPX200
##.OBSERVE FREQUENCY= 200.13135
##.OBSERVE NUCLEUS= ^1H
##.ACQUISITION MODE= SIMULTANEOUS
##.ACQUISITION SCHEME= undefined
##.AVERAGES= 8
##.DIGITISER RES= 18
##SPECTROMETER/DATA SYSTEM= spect
##.PULSE SEQUENCE= zg30
##.SOLVENT NAME= CDCl3
##.SHIFT REFERENCE= (INTERNAL, CDCl3, 0, 15.7425)
##AUDIT TRAIL= $$ (NUMBER, WHEN, WHO, WHERE, WHAT)
$$ ##TITLE= Audit trail, XWIN-NMR		Version 3.5
$$ ##JCAMPDX= 5.01
$$ ##ORIGIN= Bruker BioSpin GmbH
$$ ##OWNER= she
$$ F:/spectra/data/she/nmr/H-F/1/pdata/1/auditp.txt
$$ ##AUDIT TRAIL=  $$ (NUMBER, WHEN, WHO, WHERE, WHAT)
(   1,<2023-02-15 14:08:21.85 +0400>,<she>,<DPX200>,
      <created by zg, POWCHK disabled, PULCHK disabled
       configuration hash MD5:
       00 E9 B6 7A A2 85 ED C7 34 08 36 98 17 FE 4E 26
       data hash MD5: 16K
       38 89 BF E8 2D AF 19 FD D1 65 53 54 FC 68 20 50>)
(   2,<2023-02-15 14:08:23.93 +0400>,<she>,<DPX200>,
      <Start of raw data processing
       efp BC_mod = 2 LB = 0.24 FT_mod = 6 PKNL = 1 PHC0 = -19107.52 PHC1 = 8.60078 SI = 16K 
       data hash MD5: 16K
       4A 99 71 A5 72 DB 1C E5 5E 4B 8C A5 D6 AC A3 B2>)
(   3,<2023-02-15 14:08:44.00 +0400>,<she>,<DPX200>,
      <pk PHC0 = -1.431016 PHC1 = 1.6 
       data hash MD5: 16K
       E5 2B 3E 01 40 C2 C1 6D DF 91 81 82 A0 46 F8 A6>)
(   4,<2023-02-15 14:08:47.65 +0400>,<she>,<DPX200>,
      <abs ABSG = 5 
       data hash MD5: 16K
       77 D5 3D ED 85 59 90 C4 01 4F 61 70 5F 7D 37 13>)
$$ ##END=
$$ 
$$ hash MD5
$$ 6F 04 28 53 64 17 27 92 B0 FD 20 B1 83 EB 5F D2
##$RELAX= 
##$RELAX= 
##$RELAX= 
##$RELAX= 
##$RELAX= 
##$RELAX= 
$$ Bruker specific parameters
$$ --------------------------
##$DU= <F:/spectra>
##$EXPNO= 1
##$NAME= <H-F>
##$PROCNO= 1
##$TYPE= <nmr>
##$USER= <she>
##$AMP= (0..31)
100 100 100 100 100 100 100 100 100 100 100 100 100 100 100 100 100 100 
100 100 100 100 100 100 100 100 100 100 100 100 100 100 
##$AQSEQ= 0
##$AQ_mod= 1
##$AUNM= <au_zg>
##$AUTOPOS= <>
##$BF1= 200.13
##$BF2= 200.13
##$BF3= 200.13
##$BF4= 200.13
##$BF5= 200.13
##$BF6= 200.13
##$BF7= 200.13
##$BF8= 200.13
##$BYTORDA= 1
##$CFDGTYP= 0
##$CFRGTYP= 5
##$CHEMSTR= <none>
##$CNST= (0..31)
1 1 145 1 1 1 1 1 1 1 1 1 1 1 1 1 1 1 1 1 1 1 1 1 1 1 1 1 1 1 1 1 
##$CPDPRG= <>
##$CPDPRG1= <>
##$CPDPRG2= <>
##$CPDPRG3= <>
##$CPDPRG4= <mlev>
##$CPDPRG5= <mlev>
##$CPDPRG6= <mlev>
##$CPDPRG7= <mlev>
##$CPDPRG8= <mlev>
##$CPDPRGB= <>
##$CPDPRGT= <>
##$D= (0..31)
0 1.2 0 0 0 0 0 0 0 0.06 0 0.03 0 0 0 0 0.0002 0 0 0 0 0 0 0 0 0 0 0 0 
0 0 0 
##$DATE= 1676455701
##$DBL= (0..7)
120 120 120 120 120 120 120 120 
##$DBP= (0..7)
150 150 150 150 150 150 150 150 
##$DBP07= 0
##$DBPNAM0= <>
##$DBPNAM1= <>
##$DBPNAM2= <>
##$DBPNAM3= <>
##$DBPNAM4= <>
$$ [...]
##$SUBNAM3= <"">
##$SUBNAM4= <"">
##$SUBNAM5= <"">
##$SUBNAM6= <"">
##$SUBNAM7= <"">
##$SUBNAM8= <"">
##$SUBNAM9= <"">
##$SW= 18.05172834244
##$SWIBOX= (0..15)
0 0 2 0 0 0 0 0 0 0 0 0 0 0 0 0 
##$SW_h= 3612.71676300578
##$TD= 16384
##$TD0= 1
##$TE= 0
##$TE2= 300
##$TE3= 300
##$TEG= 300
##$TL= (0..7)
0 120 120 120 120 120 120 120 
##$TP= (0..7)
150 150 150 150 150 150 150 150 
##$TP07= 0
##$TPNAME0= <>
##$TPNAME1= <>
##$TPNAME2= <>
##$TPNAME3= <>
##$TPNAME4= <>
##$TPNAME5= <>
##$TPNAME6= <>
##$TPNAME7= <>
##$TPOAL= (0..7)
0.5 0.5 0.5 0.5 0.5 0.5 0.5 0.5 
##$TPOFFS= (0..7)
0 0 0 0 0 0 0 0 
##$TUNHIN= 0
##$TUNHOUT= 0
##$TUNXOUT= 0
##$USERA1= <user>
##$USERA2= <user>
##$USERA3= <user>
##$USERA4= <user>
##$USERA5= <user>
##$V9= 5
##$VALIST= <valist>
##$VCLIST= <CCCCCCCCCCCCCCC>
##$VD= 0
##$VDLIST= <DDDDDDDDDDDDDDD>
##$VPLIST= <PPPPPPPPPPPPPPP>
##$VTLIST= <TTTTTTTTTTTTTTT>
##$WBST= 1024
##$WBSW= 4
##$XGAIN= (0..3)
0 0 0 0 
##$XL= 0
##$YL= 0
##$YMAX_a= 138214
##$YMIN_a= -241484
##$ZGOPTNS= <>
##$ZL1= 120
##$ZL2= 120
##$ZL3= 120
##$ZL4= 120
##$ABSF1= 15.76782
##$ABSF2= -2.284029
##$ABSG= 5
##$ABSL= 3
##$ALPHA= 0
##$AQORDER= 0
##$ASSFAC= 0
##$ASSFACI= 0
##$ASSFACX= 0
##$ASSWID= 0
##$AUNMP= <proc_1d>
##$AZFE= 0.1
##$AZFW= 0.1
##$BCFW= 0
##$BC_mod= 2
##$BYTORDP= 0
##$COROFFS= 0
##$CY= -3
##$DATMOD= 1
##$DC= 0
##$DFILT= <>
##$DTYPP= 0
##$F1P= 0
##$F2P= 0
##$FCOR= 1
##$FTSIZE= 16384
##$FT_mod= 6
##$GAMMA= 0
##$GB= 0
##$INTBC= 1
##$INTSCL= 3.70164e-10
##$ISEN= 128
##$LB= 0.24
##$LEV0= 0
##$LPBIN= 0
##$MAXI= 10000
##$MC2= 0
##$MEAN= 0
##$ME_mod= 0
##$MI= 1.114404
##$NCOEF= 0
##$NC_proc= -7
##$NLEV= 6
##$NOISF1= 3.799351
##$NOISF2= 2.8
##$NSP= 0
##$NTH_PI= 0
##$NZP= 0
##$OFFSET= 15.74248
##$PC= 1
##$PHC0= -19108.95
##$PHC1= 10.20078
##$PH_mod= 1
##$PKNL= yes
##$PPARMOD= 0
##$PSCAL= 0
##$PSIGN= 0
##$REVERSE= no
##$SF= 200.130005814824
##$SI= 16384
##$SIGF1= 3
##$SIGF2= 2
##$SINO= 5.538805
##$SIOLD= 16384
##$SREGLST= <1H.CDCl3>
##$SSB= 0
##$STSI= 16384
##$STSR= 0
##$SW_p= 3612.71676300578
##$SYMM= 0
##$S_DEV= 0
##$TDeff= 16384
##$TDoff= 0
##$TI= <>
##$TILT= no
##$TM1= 0
##$TM2= 0
##$TOPLEV= 0
##$USERP1= <user>
##$USERP2= <user>
##$USERP3= <user>
##$USERP4= <user>
##$USERP5= <user>
##$WDW= 1
##$XDIM= 16384
##$YMAX_p= 411704138
##$YMIN_p= -1107618
$$ End of Bruker specific parameters
$$ ---------------------------------
##NTUPLES= NMR SPECTRUM
##VAR_NAME=  FREQUENCY,     SPECTRUM/REAL,   SPECTRUM/IMAG
##SYMBOL=    X,             R,               I
##VAR_TYPE=  INDEPENDENT,   DEPENDENT,       DEPENDENT
##VAR_FORM=  AFFN,          ASDF,            ASDF
##VAR_DIM=   16384,         16384,           16384
##UNITS=     HZ,            ARBITRARY UNITS, ARBITRARY UNITS
##FACTOR=    0.220516191357247, 1,           1
##FIRST=     3150.54266957892, 0,            0
##LAST=      -462.174093426859, 0,           0
##MIN=       -462.174093426859, -1107618,    0
##MAX=       3150.54266957892, 411704138,    0
$$ Real data points
##PAGE= N=1
##DATA TABLE= (X++(R..R)), XYDATA
$$ [...]
$$ plain form
6397 381150 431735 373298 344177 417319 516809 507899 475753 353750 191678 239945 533787
6386 533787 458253 332656 288110 416671 345745 379057 383365 339385 398265 475963 462399
6375 462399 560922 638467 595630 430162 372272 356084 366801 287823 541207 474172 507786
6364 507786 371185 320996 576271 665084 699130 797560 542905 356823 495862 616529
6354 616529 744275 556024 613244 591563 354117 532295 622201 562054 574061 703258 780719
6343 780719 461221 499378 530977 715238 712860 645859 709448 797381 794425 698883 813332
6332 813332 754140 600970 534524 623517 756868 753777 680344 833101 762251 735393 744148
6321 744148 845296 1205544 1075460 1091318 923552 811686 655985 761972 580611 724573
$$ packed form
6397C81150N0585n8437k9121P3142R9490q910l2146j22003j62072M8267K93842
6386E33787p5534j25597m4546J28561p0926L3312M308m3980N8880P7698j3564
6375D62399R8523P7545m2837j65468n7890j6188J0717p8978K53384o7035L3614
6364E07786j36601n0189K55275Q8813L4046R8430k54655j86082J39039J20667
6354F16529J27746j88251N7220k1681k37446J78178Q9906o0147J2007J29197P7461
6343G80719l19498L8157L1599J84261k378o7001O3589Q7933k956r5542J14449
6332H13332n9192j53170o6446Q8993J33351l091p3433J52757p0850k6858Q755
6321G44148J01148L60248j30084J5858j67766j11866j55701J05987j81361J43962
$$ plain form
6311 724573 984378 1091901 826327 761724 529541 606348 685223 804612 886991 762756
6301 762756 869462 853033 905287 864572 1047113 1001274 982323 936257 903796 687340 719721
6290 719721 878321 903741 963083 831874 1063709 1015975 887053 943403 853944 907876 989938
6279 989938 1021551 1125302 1148142 908702 858530 1109784 1308899 1150741 1346673 1218093
6269 1218093 1139571 1178043 1212228 1267436 1159127 1175066 1291732 1225471 1114721 1126299 962452
6258 962452 1041559 1101249 1077907 1354631 1532920 1671123 1649346 1704759 1850801 1816785 1709228
6247 1709228 1805266 1854779 1860025 1715493 1722848 1852478 1618113 1796023 2028641 1974325 1999509
6236 1999509 2041993 2021342 2007298 2090125 2185318 2219344 2405171 2472099 2381716 2362830 2583540
$$ packed form
6311G24573K59805J07523k65574o4603k32183P6807P8875J19389Q2379j24235
6301G62756J06706j6429N2254m0715J82541m5839j8951m6066l2461k16456L2381
6290G19721J58600K5420N9342j31209K31835m7734j28922N6350q9459N3932Q2062
6279I89938L1613J03751K2840k39440n0172K51254J99115j58158J95932j28580
6269A218093p8522L8472L4185N5208j08309J5939J16666o6261j10750J1578j63847
6258I62452P9107N9690k3342K76724J78289J38203k1777N5413J46042l4016j07557
6247A709228R6038M9513N246j44532P355J29630k34365J77910K32618n4316K5184
6236A999509M2484k0651j4044Q2827R5193L4026J85827O6928r0383j8886K20710
$$ plain form
6225 2583540 2622658 2619680 2782640 2864822 2956902 2971823 3138838 3127105 3143316 3155769 3426788
6214 3426788 3520264 3691693 3808744 3821460 3954030 3991883 4022113 4102134 4097011 4273157 4540024
6203 4540024 4943742 5136646 5148207 5529007 5812945 5988748 6617481 6997949 7659737 8161320
6193 8161320 8938741 9561747 10029931 10584122 10905621 11227437 11206702 10998877 10786542 10602937
6183 10602937 10401163 10375656 10557153 10500322 10504054 10935817 11061576 11639809 11964972 12597201
6173 12597201 13427847 14145905 15308199 16484418 17866337 19594689 21658047 23976638
6165 23976638 26075362 28208303 29836186 30635327 30669705 30044397 28727618 27168629 25591786
6156 25591786 24067549 22603618 21712543 20781240 20051609 19732760 19623722 19779761 20342411
$$ packed form
6225B583540L9118k978J62960Q2182R2080J4921J67015j1733J6211J2453K71019
6214C426788R3476J71429J17051J2716J32570L7853L0230Q0021n123J76146K66867
6203D540024M03718J92904J1561L80800K83938J75803O28733L80468O61788N01583
6193H161320P77421O23006M68184N54191L21499L21816k0735k07825k12335j83605
6183A0602937k01774k5507J81497n6831L732M31763J25759N78233L25163O32229
6173A2597201Q30646P18058J162294J176219J381919J728352K063358K318591
6165B3976638K098724K132941J627883P99141L4378o25308j316779j558989j576843
6156B5591786j524237j463931q91075r31303p29631l18849j09038J56039N62650
$$ plain form
6147 20342411 20921375 21887248 23010949 24411966 26308257 28325636 30895105 33718489
6139 33718489 37063663 40232029 42714214 44450040 44934959 44293700 42565734 39829275
6131 39829275 36839141 33636801 30835873 28348861 26198895 24321100 22906074 21843295
6123 21843295 21196828 20747702 20326293 20536428 20825253 21335241 21784783 22614592 23978895
6114 23978895 25527013 27272697 29178542 31064533 32463566 32986487 32933833 32048930 30322562
6105 30322562 27893701 25465464 22978450 20830765 18931613 17253728 15860347 14797910
6097 14797910 14140389 13153284 12737932 12175343 11752581 11565686 11428610 11344562 11170943 11235938
6087 11235938 11291436 11690642 11823900 12127848 12446567 12435474 12150960 11451386 10837351 10043436
$$ packed form
6147B0342411N78964R65873J123701J401017J896291K017379K569469K823384
6139C3718489L345174L168366K482185J735826M84919o41259j727966k736459
6131C9829275k990134l202340k800928k487012k149966j877795j415026j062779
6123B1843295o46467m49126m21409K10135K88825N09988M49542Q29809J364303
6114B3978895J548118J745684J905845J885991J399033N22921n2654q84903j726368
6105C0322562k428861k428237k487014k147685j899152j677885j393381j062437
6097A4797910o57521r87105m15352n62589m22762j86895j37076q4048j73619O4995
6087A1235938N5498L99206J33258L03948L18719j1093k84514o99574o14035p93915
$$ plain form
6077 10043436 9241186 8355427 7684529 7395927 6935498 6492394 6064326 5721803 5601436
6068 5601436 5238158 5110609 5001581 4852617 4534657 4256220 4151141 3985660 3885003 3793869
6058 3793869 3751630 3745866 3457030 3519583 3407842 3388617 3317663 3093540 3001607 2986143 3046628
6047 3046628 2970503 3018517 2750766 2674682 2665796 2944626 2896971 2634325 2681683 2575525 2459798
6036 2459798 2389761 2323835 2445458 2407635 2321031 2393383 2494805 2376321 2334538 2337045 2214697
6025 2214697 2059564 1894789 1912658 1869175 1907870 1974674 1975096 1928232 2003914 1989663 2118057
6014 2118057 1982282 1793676 1935666 1971330 1822280 2008242 2099827 2018708 2018409 1920650 1878434
6003 1878434 1666372 1656310 1610349 1667832 1674220 1909899 1880032 1797711 1816615 1615447 1550368
$$ packed form
6077A0043436q02250q85759o70898k88602m60429m43104m28068l42523j20367
6068E601436l63278j27549j09028j48964l17960k78437j05079j65481j00657r1134
6058C793869m2239n764k88836O2553j11741j9225p0954k24123r1933j5464O0485
6047C046628p6125M8014k67751p6084q886K78830m7655k62646M7358j06158j15727
6036B459798p0037o5926J21623l7823q6604P2352J01422j18484m1783K507j22348
6025B214697j55133j64775J7869m3483L8695O6804M22m6864P5682j4251J28394
6014B118057j35775j88606J41990L5664j49050J85962R1585q1119k99r7759m2216
6003A878434k12062j0062m5961N7483O388K35679k9867q2321J8904k01168o5079
$$ plain form
5992 1550368 1645820 1632269 1588565 1717265 1623475 1767490 1834417 1686318 1386689 1549287
5982 1549287 1587228 1639095 1488992 1599143 1507779 1449845 1605223 1600601 1499030 1519219 1572728
5971 1572728 1307613 1448417 1449207 1613395 1727872 1707411 1585116 1772687 1725654 1752125 1562271
5960 1562271 1521505 1664619 1398289 1251771 1324613 1521566 1420321 1557726 1713295 1589303
5950 1589303 1501169 1662225 1614789 1424076 1490152 1461554 1580375 1674969 1433433 1523775 1637877
5939 1637877 1519100 1660619 1859596 1652520 1761520 1765418 1721717 1712302 1537319 1652958
5929 1652958 1731819 1640242 1750319 1739805 1660519 1564791 1546999 1340958 1454993 1509562 1408914
5918 1408914 1549052 1668185 1839546 1764109 1704624 1654097 1686046 1769540 1806966 1626344 1865533
$$ packed form
5992A550368R5452j3551m3704J28700r3790J44015O6927j48099k99629J62598
5982A549287L7941N1867j50103J10151r1364n7934J55378m622j01571K0189N3509
5971A572728k65115J40804P90J64188J14477k0461j22295J87571m7033K6471j89854
5960A562271m0766J43114k66330j46518P2842J96953j01245J37405J55569j23992
5950A589303q8134J61056m7436j90713O6076k8598J18821R4594k41536R0342J14102
5939A637877j18777J41519J98977k07076J09000L898m3701r415j74983J15639
5929A652958P8861r1577J10077j0514p9286r5728j7792k06041J14035N4569j00648
5918A408914J40138J19133J71361p5437n9485n0527L1949Q3494L7426j80622K39189
$$ plain form
5907 1865533 1745072 1752747 1733350 1774914 1873498 1738226 1680554 1769105 1828351 1788080 1814604
5896 1814604 1662208 1669248 1845850 1985114 1897126 1795571 1738718 1756583 1721661 1714577 1914329
5885 1914329 1882811 1799911 1882302 1930176 1744339 1908406 1910458 2013332 1968379 1870598 2030296
5874 2030296 2033969 1970767 1988357 1857148 1639783 1736533 1849397 1895641 1863799 1804201 2031072
5863 2031072 2115545 1937043 2086324 2128101 2289148 2274588 2278748 2276827 2184108 2116792 2114036
5852 2114036 2169347 2182666 2123236 1958234 2055045 2095869 2251809 2305117 2281501 2293107 2311269
5841 2311269 2326997 2232963 2210391 2460191 2431138 2458891 2434961 2316730 2461861 2306625 2228143
5830 2228143 2206473 2213981 2003722 1820930 2064713 2171682 2244589 2478697 2408444 2494592 2495075
$$ packed form
5907A865533j20461P675j9397M1564R8584j35272n7672Q8551N9246m0271K6524
5896A814604j52396P040J76602J39264q7988j01555n6853J7865l4922p084J99752
5885A914329l1518q2900Q2391M7874j85837J64067K052J02874m4953r7781J59698
5874B030296L673o3202J7590j31209k17365R6750J12864M6244l1842n9598K26871
5863B031072Q4473j78502J49281M1777J61047j4560M160j921r2719o7316k756
5852B114036N5311J3319n9430j65002R6811M0824J55940N3308k3616J1606J8162
5841B311269J5728r4034k2572K49800k9053K7753k3930j18231J45131j55236p8482
5830B228143k1670P508k10259j82792K43783J06969P2907K34108p0253Q6148M83
$$ plain form
5819 2495075 2397232 2563761 2500096 2416265 2391358 2537653 2503487 2466354 2597898 2480811 2405110
5808 2405110 2571738 2624166 2463388 2331184 2619880 2865015 2842900 2701476 2709373 2811253
5798 2811253 2775181 2847802 2754325 2684199 2734376 2899626 2701579 2715354 2589299 2739707 2865572
5787 2865572 3056410 2977476 2860407 2734066 2757697 2956169 3050720 2881263 2942125 2893131
5777 2893131 2763907 3264915 3162828 2887339 2928114 2912967 2943627 2944644 3039436 3052568 2874334
5766 2874334 3155261 3338612 3093936 3082743 3118445 2839917 2905280 2987406 3110689 3166172
5756 3166172 3304829 3341769 3440031 3405684 3213998 3100577 3003345 3210491 3440968 3466518
5746 3466518 3197577 3210499 3313577 3284862 3333732 3447908 3625161 3439629 3438708 3665282 3672198
$$ packed form
5819B495075r7843J66529o3665q3831k4907J46295l4166l7133J31544j17087p5701
5808B405110J66628N2428j60778j32204K88696K45135k2115j41424P897J01880
5798B811253l6072P2621r3477p0126N0177J65250j98047J3775j26055J50408J25865
5787B865572J90838p8934j17069j26341K3631J98472R4551j69457O0862m8994
5777B893131j29224N01008j02087k75489M0775j5147L0660J017R4792J3132j78234
5766B874334K80927J83351k44676j1193L5702k78528O5363Q2126J23283N5483
5756C166172J38657L6940R8262l4347j91686j13421r7232K07146K30477K5550
5746C466518k68941J2922J03078k8715M8870J14176J77253j85532r21K26574O916
$$ plain form
5735 3672198 3692751 3546558 3540326 3699744 3539517 3438178 3539808 3678927 3575444 3707294
5725 3707294 3868674 3780948 3658946 3734608 3803952 3957118 3757369 3771781 3712125 3585442
5715 3585442 3686776 3788289 3753728 3828600 3884135 3731714 3872272 3860292 4015733 3893614
5705 3893614 3798998 3872393 3967457 4017577 4164710 4020055 4067817 4266489 4334186 4292039 4252060
5694 4252060 4257264 4228174 4293274 4191225 4125898 4235298 4358298 4333882 4198120 4208512 4360181
5683 4360181 4522165 4525938 4285040 4229935 4524129 4496973 4595160 4660029 4496625 4641495 4578357
5672 4578357 4642710 4879625 4860432 4882710 4767971 4781994 5171981 4863138 4823442 5088198
5662 5088198 4986563 5067284 4858631 5038397 5119290 4990747 4844950 4900710 5105129 4981087
$$ packed form
5735C672198K0553j46193o232J59418j60227j01339J01630J39119j03483J31850
5725C707294J61380q7726j22002P5662O9344J53166j99749J4412n9656j26683
5715C585442J01334J01513l4561P4872N5535j52421J40558j1980J55441j22119
5705C893614r4616P3395R5064N0120J47133j44655M7762J98672O7697m2147l9979
5694D252060N204k9090O5100j02049o5327J09400J23000k4416j35762J0392J51669
5683D360181J61984L773k40898n5105K94194k7156R8187O4869j63404J44870o3138
5672D578357O4353K36915j9193K2278j14739J4023L89987l08843l9696K64756
5662E088198j01635Q0721k08653J79766Q0893j28543j45797N5760K04419j24042
$$ plain form
5652 4981087 5126285 5098703 5290651 5316747 5542193 5448678 5227611 5602882 5727814 5663138
5642 5663138 5741080 5542625 5570514 5558214 5650316 5797905 5731275 5591643 5740872 5898091
5632 5898091 5972926 5813454 5826909 5833760 5741179 5929293 6009268 6155554 5957198 5902931 5978544
5621 5978544 6067576 6110739 6172309 6433548 6448560 6344002 6223298 6512715 6761308 6699664
5611 6699664 6906796 6903264 6712827 6801570 6733388 6823296 6974691 6902719 7185929 7298768 7381506
5600 7381506 7121166 7142891 7141872 7350079 7355334 7373827 7518008 7454927 7495285 7414772 7493581
5589 7493581 7628873 7463447 7796187 7888336 7896553 7889437 7723637 7994670 7968643 8027999 8033541
5578 8033541 8112943 8182087 7973105 8034853 8400870 8585158 8490202 8593447 8515135 8322504
$$ packed form
5652D981087J45198k7582J91948K6096K25446r3515k21067L75271J24932o4676
5642E663138P7942j98455K7889j2300R2102J47589o6630j39632J49229J57219
5632E898091P4835j59472J3455O851r2581J88114P9975J46286j98356n4267P5613
5621E978544Q9032M3163O1570K61239J5012j04558j20704K89417K48593o1644
5611F699664K07132l532j90437Q8743o8182Q9908J51395p1972K83210J12839Q2738
5600G381506k60340K1725j019K08207N255J8493J44181o3081M0358q0513P8809
5589G493581J35292j65426L32740R2149Q217p116j65800K71033k6027N9356N542
5578H033541P9402O9144k08982O1748L66017J84288r4956J03245p8312j92631
$$ plain form
5568 8322504 8386522 8617818 8766192 8668561 8778349 8858127 8934765 8881378 8757529 8524217
5558 8524217 8284624 8387473 8526169 8673129 8918762 9093292 9198962 8899751 8839332 9109462
5548 9109462 8854023 8731154 8950171 9102919 9129946 9159886 9004349 9226026 9279914 9241026
5538 9241026 9145454 9196475 9161002 9147063 9238878 9008898 9162652 9195618 9400972 9206088 9310387
5527 9310387 9445846 9348746 9299863 9256347 9495626 9549081 9378841 9264848 9355222 9361212 9186901
5516 9186901 9220159 9354893 9452598 9296876 9228376 9305909 9244212 9339879 9305960 9263664 9246458
5505 9246458 9098693 9063529 9165055 9388446 9265789 9141866 9325607 9404679 9358010 9348448
5495 9348448 9475237 9331923 9381387 9545807 9600434 9536394 9378979 9398051 9506336 9465512
$$ packed form
5568H322504O4018K31296J48374r7631J09788P9778P6638n3387j23849k33312
5558H524217k39593J02849J38696J46960K45633J74530J05670k99211o0419K70130
5548I109462k55439j22869K19017J52748K7027K9940j55537K21677N3888l8888
5538I241026r5572N1021l5473j3939R1815k29980J53754L2966K05354j94884J04299
5527I310387J35459r7100m8883m3516K39279N3455j70240j13993R0374N990j74311
5516I186901L3258J34734R7705j55722o8500P7533o1697R5667l3919m2296j7206
5505I246458j47765l5164J01526K23391j22657j23923J83741P9072m6669r562
5495I348448J26789j43314M9464J64420N4627o4040j57415J9072J08285m0824
$$ plain form
5485 9465512 9584882 9424637 9389971 9383023 9352624 9410168 9312871 9466444 9355032 9346796 9393963
5474 9393963 9357166 9343610 9323097 9345659 9397813 9422610 9442406 9596357 9758372 9813525 9957949
5463 9957949 9925671 9642907 9416216 9534764 9819083 9718797 9466859 9493380 9662915 9697287
5453 9697287 9631497 9782818 9581984 9453295 9603028 9571665 9440801 9550833 9488657 9400462
5443 9400462 9399597 9410284 9486377 9553999 9595668 9612095 9903092 9909901 9718740 9423609 9376705
5432 9376705 9325853 9329961 9334920 9382865 9499297 9332113 9345833 9464170 9441331 9333031 9423537
5421 9423537 9489128 9380290 9323499 9411856 9422025 9346764 9521250 9388425 9205973 9346305
5411 9346305 9401520 9447343 9450481 9408206 9298696 9482000 9366945 9565907 9605313 9573678 9705098
$$ packed form
5485I465512J19370j60245l4666o948l0399N7544r7297J53573j11412q236M7167
5474I393963l6797j3556k0513K2562N2154K4797J9796J53951J62015N5153J44424
5463I957949l2278k82764k26691J18548K84319j00286k51938K6521J69535L4372
5453I697287o5790J51321k00834j28689J49733l1363j30864J10032o2176q8195
5443I400462q65J0687P6093O7622M1669J6427K90997O809j91161k95131m6904
5432I376705n0852M108M959M7945J16432j67184J3720J18337k2839j08300R0506
5421I423537O5591j08838n6791Q8357J0169p5261J74486j32825j82452J40332
5411I346305N5215M5823L138m2275j09510J83304j15055J98962L9406l1635J31420
$$ plain form
5400 9705098 9694316 9337682 9311748 9431920 9282610 9385861 9507275 9634216 9547021 9536149
5390 9536149 9349656 9548150 9593567 9548973 9529022 9652147 9577739 9400419 9376338 9522633
5380 9522633 9495068 9384417 9417139 9617968 9598093 9560752 9568343 9341818 9268853 9456111 9414870
5369 9414870 9493698 9451105 9373952 9486078 9529342 9459689 9628550 9582808 9689746 9646087 9590130
5358 9590130 9714119 9773534 10023468 9987658 9924233 9747535 9755822 9906388 9992227 9983464 10042868
5347 10042868 9967121 10064682 10386139 10641068 10604008 10823112 10853550 10907239 10895138 10889855 11069919
5336 11069919 11204962 11128138 11117631 11164060 11432715 11385908 11406004 11578888 11745781 11862771
5326 11862771 11866226 11905784 11896274 12198489 12522696 12569342 12599104 12913028 13197677 13217986 13172729
$$ packed form
5400I705098j0782l56634k5934J20172j49310J03251J21414J26941q7195j0872
5390I536149j86493J98494M5417m4594j9951J23125p4408j77320k4081J46295
5380I522633k7565j10651L2722K00829j9875l7341P591k26525p2965J87258m1241
5369I414870P8828m2593p7153J12126M3264o9653J68861m5742J06938m3659n5957
5358I590130J23989N9415K49934l5810o3425j76698Q287J50566Q5839q763N9404
5347A0042868p5747R7561L21457K54929l7060K19104L0438N3689j2101n283J80064
5336A1069919J35043p6824j0507M6429K68655m6807K0096J72884J66893J16990
5326A1862771L455L9558r510L02215L24207M6646K9762L13924K84649K0309m5257
$$ plain form
5315 13172729 13369649 13703130 13759262 13694214 13974844 13950436 13882759 13879911 14103717 14469406
5305 14469406 14534850 14523897 14791514 15386675 15856435 16152546 16619455 16762583 17051946 17611268
5295 17611268 18013832 18427667 18974515 19476214 19847257 20356915 20886795 21453223 22260136
5286 22260136 22976464 23768074 24893805 26109670 27709014 29550571 31727466 34342362
5278 34342362 37470438 40974091 44944234 49362178 53127736 56062884 57426381 57181264
5270 57181264 56100694 54940244 53802745 52998194 52596192 52304829 51563117 50413545 48891374
5261 48891374 46957157 45515339 44317053 43604816 43227352 43682512 44561592 45728926 47168777
5252 47168777 49524677 52610216 56218431 60940168 66348333 72408407 78825161 84322331
$$ packed form
5315A3172729J96920L33481N6132o5048K80630k4408o7677k848K23806L65689
5305A4469406O5444j0953K67617N95161M69760K96111M66909J43128K89363N59322
5295A7611268M02564M13835N46848N01699L71043N09658N29880N66428Q06913
5286B2260136P16328P91610J125731J215865J599344J841557K176895K614896
5278C4342362L128076L503653L970143M417944L765558K935148J363497k45117
5270E7181264j080570j160450j137499q04551m02002k91363p41712j149572j522171
5261D8891374j934217j441818j198286p12237l77464M55160Q79080J167334J439851
5252D7168777K355900L085539L608215M721737N408165O060074O416754N497170
$$ plain form
5244 84322331 87985585 89728296 90008215 89464864 89286892 89599602 90845393 92710967 93836583
5235 93836583 93117003 90162985 85170419 78777640 72248450 65999305 60534955 56050901
5227 56050901 52513740 49543757 47472250 46077423 45180001 44631878 44641159 45419601 46856045
5218 46856045 48457457 50419122 52361983 53750740 54539190 55048223 55490848 56549260 58044794
5209 58044794 59871420 61455968 61717230 60391686 57124411 52917540 48324420 43628755
5201 43628755 39142301 35220240 32215353 29318047 27028216 25120809 23198392 21899046
5193 21899046 20782056 19656543 18746761 17637574 16914111 16215982 15662513 15013798 14257191
5184 14257191 14019597 13693819 13192790 12545715 12262332 11862401 11671024 11219223 10934178
$$ packed form
5244H4322331L663254J742711K79919n43351j77972L12710J245791J865574J125616
5235I3836583p19580k954018m992566o392779o529190o249145n464350m484054
5227E6050901l537161k969983k071507j394827q97422n48123R281P78442J436444
5218D6856045J601412J961665J942861J388757P88450N09033M42625J058412J495534
5209E8044794J826626J584548K61262j325544l267275m206871m593120m695665
5201D3628755m486454l922061l004887k897306k289831j907407j922417j299346
5193B1899046j116990j125513r09782j109187p23463o98129n53469o48715p56607
5184A4257191k37594l25778n01029o47075k83383l99931j91377m51801k85045
$$ plain form
5175 10934178 10808640 10584622 10243066 9865977 9639235 9323919 9261270 9081936 8826823 8664470
5165 8664470 8376171 8182700 8016910 7880594 7714009 7686820 7695076 7567483 7397844 7339319
5155 7339319 7047093 6764394 6586983 6504326 6642407 6575486 6508908 6586787 6488556 6277451
5145 6277451 6239598 6204212 6020381 5896115 6004019 5978840 6068917 5907127 5715835 5470888
5135 5470888 5430519 5469157 5424554 5385419 5272938 5164707 5209538 5211564 5063435 5042591 5015361
5124 5015361 4840854 4690065 4752864 4753431 5031941 4803034 4669762 4848846 4693991 4595949
5114 4595949 4659648 4664614 4593046 4593317 4518180 4423948 4436834 4487612 4634407 4604484 4712658 4765773
5102 4765773 4702870 4605471 4514118 4692997 4587859 4392695 4369609 4479556 4457915 4433071 4317620
$$ packed form
5175A0934178j25538k24018l41556l77089k26742l15316o2649j79334k55113j62353
5165H664470k88299j93471j65790j36316j66585k7189Q256j27593j69639n8525
5155G339319k92226k82699j77411q2657J38081o6921o6578P7879r8231k11105
5145F277451l7853l5386j83831j24266J07904k5179R0077j61790j91292k44947
5135E470888m0369L8638m4603l9135j12481j08231M4831K026j48129k0844k7230
5124E015361j74507j50789O2799N67K78510k28907j33272J79084j54855r8042
5114D595949O3699M966p1568K71p5137r4232J2886N0778J46795k9923J08174N3115
5102D765773o2903r7399r1353J78879j05138j95164k3086J09947k1641k4844j15451
$$ plain form
5091 4317620 4556082 4482182 4159769 4104593 4089485 4208993 4182297 4266178 4096015 3999685 4163258
5080 4163258 4229988 4366658 4429406 4265714 4122695 4262702 4513650 4346261 4351030 4697542
5070 4697542 4785863 4687873 4791853 4935313 4844907 4847843 4822640 4743663 4852462 4854605 4955697
5059 4955697 4930819 5054426 5085590 5178693 5111617 5299433 5517848 5353861 5374402 5220754
5049 5220754 5630895 5500132 5526891 5719966 5975192 5900597 6015076 6147941 6268831 6414878
5039 6414878 6456240 6465893 6624926 6724092 6983968 7403843 7444893 7355768 7297924 7621529 7589516
5028 7589516 7461756 7557988 7945272 8063066 8387833 8676905 8787550 8892236 9040141 9261547
5018 9261547 9886594 9943171 9988651 10386880 10969725 11315336 11545094 11863205 12357434 12721695
$$ packed form
5091D317620K38462p3900l22413n5176j5108J19508k6696Q3881j70163r6330J63573
5080D163258O6730J36670O2748j63692j43019J40007K50948j67389M769L46512
5070D697542Q8321r7990J03980J43460r0406K936k5203p8977J08799K143J01092
5059D955697k4878J23607L1164R3103o7076J87816K18415j63987K0541j53648
5049E220754M10141j30763K6759J93075K55226p4595J14479J32865J20890J46047
5039F414878M1362R653J59033R9166K59876M19875M1050q9125n7844L23605l2013
5028G589516j27760R6232L87284J17794L24767K89072J10645J04686J47905K21406
5018I261547O25047N6577M5480L98229N82845L45611K29758L18111M94229L64261
$$ plain form
5008 12721695 13233685 13684706 13954050 14684330 15169527 15599284 16335874 17081652 17596052
4999 17596052 18556999 19677431 20744496 21990582 23452379 25080165 26981984 29348901
4991 29348901 31930245 34972251 38529694 42757452 47543654 52597704 57668454 61517552
4983 61517552 63745276 63883041 62566083 60866818 59208276 58012757 57177291 56474042 55624700
4974 55624700 54361264 52812536 51363294 49967674 48792999 48235423 48466876 49118127 50516623
4965 50516623 52323202 54729862 58165919 62672715 67884797 73029705 78522672 82657074
4957 82657074 84892502 85644721 85613750 85065109 84113299 83043015 82167680 81447350 81003016
4948 81003016 80388420 79585749 77864075 75300905 71562487 66906070 61978388 57225002
$$ packed form
5008A2721695N11990M51021K69344P30280M85197M29757P36590P45778N14400
4999A7596052R60947J120432J067065J246086J461797J627786J901819K366917
4991B9348901K581344L042006L557443M227758M786202N054050N070750L849098
4983F1517552K227724J37765j316958j699265j658542j195519q35466p03249q49342
4974E5624700j263436j548728j449242j395620j174675n57576K31453O51251J398496
4965E0516623J806579K406660L436057M506796N212082N144908N492967M134402
4957H2657074K235428P52219l0971n48641r51810j070284q75335p20330m44334
4948H1003016o14596q02671j721674k563170l738418m656417m927682m753386
$$ plain form
4940 57225002 52989157 49551892 46770714 44537052 43194693 42461125 41848692 41812181 42674828
4931 42674828 43490123 44419927 45366798 46325319 47067690 47333786 47649604 48319625 49390910
4922 49390910 50697740 51247297 50831031 48904292 45653118 41810857 37771795 34006756
4914 34006756 30676153 27683403 25183852 23385996 21593192 20016296 18900683 17733695
4906 17733695 16689279 15786133 15152758 14445605 13530388 12772338 12377354 11855177 11402441
4897 11402441 11146783 10808587 10347110 10042960 9785320 9557004 9225724 8885305 8642338
4888 8642338 8377703 8119245 7752786 7635760 7500097 7152237 7091271 6862729 6701433 6760289
4878 6760289 6567611 6148468 6204534 5958629 5882534 5886165 5824297 5832280 5558570 5406824 5117153
$$ packed form
4940E7225002m235845l437265k781178k233662j342359p33568o12433l6511Q62647
4931D2674828Q15295R29804R46871R58521P42371K66096L15818O70021J071285
4922D9390910J306830N49557m16266j926739l251174l842261m039062l765039
4914C4006756l330603k992750k499551j797856j792804j576896j115613j166988
4906A7733695j044416r03146o33375p07153r15217p58050l94984n22177m52736
4897A1402441k55658l38196m61477l04150k57640k28316l31280l40419k42967
4888H642338k64635k58458l66459j17026j35663l47860o0966k28542j61296N8856
4878F760289j92678m19143N6066k45905p6095L631o1868P983k73710j51746k89671
$$ plain form
4867 5117153 5086516 4939208 4764805 4801070 4616020 4379957 4301137 4352740 4377954 4310040 4195852
4856 4195852 4117232 4033972 3896149 3806744 3979049 3879310 3718598 3610038 3472825 3436302
4846 3436302 3296794 3169005 3300171 3327137 3329140 3275378 3177222 3301456 3026081 2992650 2983553
4835 2983553 2885413 2915736 2919506 2861140 2748748 2520975 2520297 2602427 2481424 2516041 2591631
4824 2591631 2541499 2568345 2369959 2317340 2330821 2356618 2342696 2081896 2199389 2262537 2293353
4813 2293353 2061403 2245031 2170706 2100576 2279728 2187151 2189673 2255701 2175424 2039491 2031729
4802 2031729 1985314 2055944 2159276 2015878 2073335 2092677 1800941 1785345 1818824 1667895 1555316
4791 1555316 1758961 1851514 1898639 1797765 1935356 1736789 1782398 1874643 1995752 2048004
$$ packed form
4867E117153l0637j47308j74403L6265j85050k36063p8820N1603K5214o7914j14188
4856D195852p8620q3260j37823q9405J72305r9739j60712j08560j37213l6523
4846C436302j39508j27789J31166K6966K003n3762r8156J24234k75375l3431r097
4835B983553r8140L0323L770n8366j12392k27773o78Q2130j21003L4617P5590
4824B591631n0132K6846j98386n2619J3481K5797j3922k60800J17493O3148L0816
4813B293353k31950J83628p4325p0130J79152r2577K522O6028q0277j35933p762
4802B031729m6415P0630J03332j43398N7457J9342k91736j5596L3479j50929j12579
4791A555316K03645R2553M7125j00874J37591j98567M5609R2245J21109N2252
$$ plain form
4781 2048004 1914644 1794531 1666516 1627394 1480558 1487967 1486990 1683395 1908199 1850917 1648768
4770 1648768 1543232 1631235 1683217 1664744 1604004 1681966 1678202 1664796 1453334 1502434 1599022
4759 1599022 1502124 1595025 1680355 1508277 1317586 1425471 1534032 1466043 1728459 1665837
4749 1665837 1490676 1319636 1363321 1489136 1445223 1474934 1432021 1564587 1506372 1322597
4739 1322597 1358547 1425105 1503601 1489808 1390405 1615477 1628462 1555714 1834715 1811019 1667980
4728 1667980 1673092 1473126 1469356 1663694 1833070 1623975 1329901 1416902 1384463 1513452 1591732
4717 1591732 1451340 1407037 1439993 1360035 1357942 1531750 1433344 1501499 1551248 1361091 1301836
4706 1301836 1390096 1314112 1412474 1358669 1613498 1626005 1497262 1425652 1424739 1443255 1423934
$$ packed form
4781B048004j33360j20113j28015l9122j46836P409r77J96405K24804n7282k02149
4770A648768j05536Q8003N1982j8473o0740P7962l764j3406k11462M9100R6588
4759A599022r6898R2901Q5330j72078j90691J07885J08561o7989K62416o2622
4749A665837j75161j71040M3685J25815m3913K9711m2913J32566n8215j83775
4739A322597L5950O6558P8496j3793r9403K25072J2985p2748K79001k3696j43039
4728A667980N112j99966l770J94338J69376k09095k94074Q7001l2439J28989P8280
4717A591732j40392m4303L2956p9958k093J73808r8406O8155M9749j90157n9255
4706A301836Q8260p5984R8362n3805K54829J2507j28743p1610r13J8516j9321
$$ plain form
4695 1423934 1395838 1342803 1260186 1307905 1250935 1220969 1272946 1338337 1367820 1363215 1371625 1316553
4683 1316553 1213165 1403901 1582500 1536935 1430830 1295294 1369995 1379535 1468957 1574977
4673 1574977 1456176 1500082 1660028 1719984 1660208 1760469 1846784 1782058 1641402 1815257
4663 1815257 1893627 1682449 1707802 1446682 1508849 1632983 1596757 1589433 1639358 1713885 1588852
4652 1588852 1591501 1526629 1390240 1541210 1480298 1421236 1565117 1721823 1480275 1350130
4642 1350130 1534239 1434405 1388069 1406819 1602464 1548516 1520082 1541033 1653419 1585435 1399316
4631 1399316 1357180 1335720 1398153 1520351 1498205 1302292 1162690 1071981 1034115 1186802 1322827
4620 1322827 1269028 927825 898595 1282465 1297972 1129612 930978 1075183 1136432 1277853
$$ packed form
4695A423934k8096n3035q2617M7719n6970k9966N1977O5391K9483m605Q410n5072
4683A316553j03388J90736J78599m5565j06105j35536P4701R540Q9422J06020
4673A574977j18801M3906J59946N9956n9776J00261Q6315o4726j40656J73855
4663A815257P8370k11178K5353k61120O2167J24134l6226p324M9925P4527j25033
4652A588852K649o4872j36389J50970o0912n9062J43881J56706k41548j30145
4642A350130J84109r9834m6336J8750J95645n3948k8434K0951J12386o7984j86119
4631A399316m2136k1460O2433J22198k2146j95913j39602r0709l7866J52687J36025
4620A322827n3799l41203k9230L83870J5507j68360j98634J44205O1249J41421
$$ plain form
4610 1277853 1343813 1209819 1210985 1294894 1226183 1239630 1191530 1187033 1265954 1105935 1219698
4599 1219698 1253015 1271272 1264709 1115957 1256856 1150771 1157102 1289477 1317460 1159390 1353690
4588 1353690 1455531 1212443 1089516 1331917 1373480 1367203 1403106 1188040 1166237 1385380
4578 1385380 1484928 1317940 1273864 1446720 1407388 1482134 1372423 1209813 1129838 1094268 1168739
4567 1168739 1325043 1316617 1090664 1079325 1265065 1407668 1179268 1106223 1179231 1258433 1281946
4556 1281946 1205915 1047537 1134169 1102262 1168537 1240405 1314647 1321382 1404849 1347370 1351942 1245899
4544 1245899 1146436 1335122 1433756 1616229 1697781 1769151 1723812 1753305 1969563 1841026 1777947
4533 1777947 1526853 1645780 1698978 1320677 1503986 1617819 1777239 1536999 1462365 1655627
$$ packed form
4610A277853O5960j33994J166Q3909o8711J3447m8100m497P8921j60019J13763
4599A219698L3317J8257o563j48752J40899j06085O331J32375K7983j58070J94300
4588A353690J01841k43088j22927K42401M1563o277L5903k15066k1803K19143
4578A385380R9548j66988m4076J72856l9332P4746j09711j62610p9975l5570P4471
4567A168739J56304q426k25953j1339J85740J42603k28400p3045P3008P9202K3513
4556A281946p6031j58378Q6632l1907O6275P1868P4242O735Q3467n7479M572j06043
4544A245899r9463J88686R8634J82473Q1552P1370m5339K9493K16258j28537o3079
4533A777947k51094J18927N3198l78301J83309J13833J59420k40240p4634J93262
$$ plain form
4523 1655627 1737293 1766820 1872331 1806893 1796507 1804876 1670427 1531462 1231919 1376333 1638003
4512 1638003 1610794 1617791 1566623 1610569 1568984 1375790 1439882 1445224 1506072 1410057 1368654 1370824
4500 1370824 1438243 1221361 1142406 1329444 1213474 1376805 1491440 1669675 1531605 1628111
4490 1628111 1621328 1747378 1568088 1507413 1583564 1565463 1474130 1292441 1204509 1130223 1419859
4479 1419859 1374823 1140613 1335271 1410900 1494681 1526497 1351544 1454349 1300185 1465681
4469 1465681 1518029 1456151 1532822 1493000 1284099 1312996 1173117 1189046 1152815 1145374 1322372
4458 1322372 1336324 1535209 1811399 1678865 1634555 1598388 1544185 1499490 1603627 1805381
4448 1805381 1874195 1856291 2021505 2026543 2112738 1874554 1566482 1911529 1883530 1742431 1695581
$$ packed form
4523A655627Q1666K9527J05511o5438j0386Q369j34449j38965k99543J44414K61670
4512A638003k7209O997n1168M3946m1585j93194O4092N342O0848r6015m1403K170
4500A370824O7419k16882p8955J87038j15970J63331J14635J78235j38070R6506
4490A628111o783J26050j79290o0675P6151j8101r1333j81689q7932p4286K89636
4479A419859m5036k34210J94658P5629Q3781L1816j74953J02805j54164J65496
4469A465681N2348o1878P6671l9822k08901K8897j39879J5929l6231p441J76998
4458A322372J3952J98885K76190j32534m4310l6167n4203m4695J04137K01754
4448A805381O8814j7904J65214N038Q6195k38184l08072L45047k7999j41099m6850
$$ plain form
4437 1695581 1369680 1464173 1630719 1461521 1315054 1305300 1354561 1314057 1428265 1533902
4427 1533902 1429875 1477240 1475691 1422902 1392722 1614077 1659617 1512818 1511143 1682857 1522426
4416 1522426 1732664 1918085 1943032 2066187 2118121 2277894 2258870 2200867 2062479 2281141
4406 2281141 2246777 2048886 1961863 1946028 1929232 1674404 1743339 1910528 1974721 1739253 1780902
4395 1780902 1816673 1709774 1647879 1577056 1797337 1574620 1546825 1536715 1767012 1560107
4385 1560107 1563977 1462727 1732976 1788539 1810383 1706666 1660016 1804371 1654047 1723386 1734246
4374 1734246 1568772 1451642 1538189 1424439 1334895 1483804 1545874 1425167 1434641 1527757 1574949
4363 1574949 1473745 1458846 1627994 1606042 1627531 1776524 1527589 1499352 1625497 1634352 1521577
$$ packed form
4437A695581l25901R4493J66546j69198j46467r754M9261m0504J14208J05637
4427A533902j04027M7365j549n2789l0180K21355M5540j46799j675J71714j60431
4416A522426K10238J85421K4947J23155N1934J59773j9024n8003j38388K18662
4406B281141l4364j97891q7023j5835j6796k54828O8935J67189O4193k35468M1649
4395A780902L5771j06899o1895p0823K20281k22717k7795j0110K30297k06905
4385A560107L870j01250K70249N5563K1844j03717m6650J44355j50324O9339J0860
4374A734246j65474j17130Q6547j13750q9544J48909O2070j20707R474R3116M7192
4363A574949j01204j4899J69148k1952K1489J48993k48935k8237J26145Q855j12775
$$ plain form
4352 1521577 1413884 1459353 1411570 1478272 1435624 1470152 1378371 1605354 1558193 1251630 1303329
4341 1303329 1243726 1386269 1428385 1451682 1433648 1341953 1255370 1228854 1256993 1387900 1468628
4330 1468628 1448212 1433922 1507951 1553893 1383313 1326998 1271708 1124571 1156791 1130124 1283344
4319 1283344 1350701 1591177 1532658 1365726 1272500 1162822 1244079 1368714 1429235 1347367 1392902
4308 1392902 1350504 1278751 1390456 1594642 1649778 1395726 1361594 1644411 1604083 1638581 1744864
4297 1744864 1632138 1760017 1730479 1775819 1868007 1825579 1678500 1639968 1765533 1687929 1811807
4286 1811807 1687864 1627286 1610174 1544374 1565798 1580694 1652781 1642275 1556261 1819257 1719650
4275 1719650 1486959 1519002 1532022 1753954 1412438 1426429 1421713 1292409 1337097 1370947 1631459
$$ packed form
4352A521577j07693M5469m7783O6702m2648L4528r1781K26983m7161l06563N1699
4341A303329n9603J42543M2116K3297j8034r1695q6583k6516K8139J30907Q0728
4330A468628k0416j4290P4029M5942j70580n6315n5290j47137L2220k6667J53220
4319A283344O7357K40476n8519j66932r3226j09678Q1257J24635O0521q1868M5535
4308A392902m2398p1753J11705K04186N5136k54052l4132K82817m0328L4498J06283
4297A744864j12726J27879k9538M5340R2188m2428j47079l8532J25565p7604J23878
4286A811807j23943o0578j7112o5800K1424J4896P2087j0506q6014K62996r9607
4275A719650k32691L2043J3020K21932l41516J3991m716j29304M4688L3850K60512
$$ plain form
4264 1631459 1593148 1263743 1313146 1507609 1186923 1109724 1172515 1277024 1218967 1307138 1287845
4253 1287845 1220374 1066754 1193059 1029134 740183 821438 990061 1125316 1082178 1100981
4243 1100981 1027323 975224 1079265 1221575 929096 852962 1099870 1085496 1037642 1119270 929920
4232 929920 1012322 1195415 1164867 1265363 1320181 1133412 986336 1153438 1139864 1040336 1080729
4221 1080729 1073044 1023571 886509 811729 969203 1241919 1101089 1160880 1138807 1043303 990425
4210 990425 1256019 1202134 1046021 974841 1083276 1095835 940840 1071014 1202651 1088399
4200 1088399 1061787 1051549 1086550 1032921 1371102 1098717 1029928 1146270 1183469 1145639 983519
4189 983519 1092650 1198974 1224910 1307902 1261353 1068465 1221835 1257097 1300250 1385119 1254385
$$ packed form
4264A631459l8311l29405M9403J94463l20686p7199O2791J04509n8057Q8171j9293
4253A287845o7471j53620J26305j63925k88951Q1255J68623J35255m3138J8803
4243A100981p3658n2099J04041J42310k92479p6134K46908j4374m7854Q1628j89350
4232I29920Q2402J83093l0548J00496N4818j86769j47076J67102j3574r9528M0393
4221A080729p685m9473j37062p4780J57474K72716j40830N9791k2073r5504n2878
4210I90425K65594n3885j56113p1180J08435J2559j54995J30174J31637j14252
4200A088399k6612j0238L5001n3629L38181k72385o8789J16342L7199l7830j62120
4189I83519J09131J06324K5936Q2992m6549j92888J53370L5262M3153Q4869j30734
$$ plain form
4178 1254385 1032149 1293055 1254821 1367902 1310835 1321224 1502765 1727446 1839096 1575623
4168 1575623 1681735 1643054 1680061 1744262 1505706 1633589 1483084 1518725 1740589 1796559
4158 1796559 1727765 1837247 1675084 1594656 1350737 1445022 1572803 1815671 1628929 1791641
4148 1791641 1870494 1584582 1660062 1751237 1740672 1848029 2025718 2047681 1989920 2060449 2115777
4137 2115777 2022017 2160381 2174078 2103525 2008212 2184615 2361541 2254030 2355112 2374714
4127 2374714 2434277 2464701 2218034 2276328 2411284 2576711 2775334 2890150 2746062 2645565
4117 2645565 2574180 2688011 2550659 2498955 2605720 2805707 2923548 2796773 2807181 2773236
4107 2773236 2912900 2909977 3113830 3249565 3103123 3326113 3588971 3737554 3592609 3561977
$$ packed form
4178A254385k22236K60906l8234J13081n7067J0389J81541K24681J11650k63473
4168A575623J06112l8681L7007O4201k38556J27883j50505L5641K21864N5970
4158A796559o8794J09482j62163q0428k43919R4285J27781K42868j86742J62712
4148A791641P8853k85912P5480R1175j0565J07357J77689K1963n7761P0529N5328
4137B115777r3760J38364J3697p0553r5313J76403J76926j07511J01082J9602
4127B374714N9563L0424k46667N8294J34956J65427J98623J14816j44088j00497
4117B645565p1385J13831j37352n1704J06765J99987J17841j26775J0408l3945
4107B773236J39664k923K03853J35735j46442K22990K62858J48583j44945l0632
$$ plain form
4097 3561977 3603933 3692336 3603681 3735707 3998318 4079978 3976725 4308635 4462525 4447093
4087 4447093 4608926 4628255 4673811 4906919 4917312 5167915 5188439 5422794 5507726 5566511 5804439
4076 5804439 5900781 6211941 6162299 6450265 6800938 6893264 6907257 7084927 7231548 7639770
4066 7639770 7928791 7995751 8298697 8483407 8625422 8910112 9040032 9371420 9535232 9991134
4056 9991134 10256036 10504707 10705785 11013629 11596869 12084024 12512433 13002972 13316269 13730336
4046 13730336 14142089 14612944 15299557 15879543 16461595 17281532 18070971 18760876 19533304
4037 19533304 20458564 21439542 22364025 23284455 24550946 25926887 27211356 28563038 29923774
4028 29923774 31520206 33382340 35130975 37167420 38996932 40956858 43578555 45846785
$$ packed form
4097C561977M1956Q8403q8655J32026K62611Q1660j03253L31910J53890j5432
4087D447093J61833J9329M5556K33108J0393K50603K0524K34355Q4932N8785K37928
4076E804439R6342L11160m9642K87966L50673R2326J3993J77670J46621M08222
4066G639770K89021O6960L02946J84710J42015K84690J29920L31388J63812M55902
4056I991134K64902K48671K01078L07844N83240M87155M28409M90539L13297M14067
4046A3730336M11753M70855O86613N79986N82052Q19937P89439O89905P72428
4037A9533304R25260R80978R24483R20430J266491J375941J284469J351682J360736
4028B9923774J596432J862134J748635K036445J829512J959926K621697K268230
$$ plain form
4020 45846785 48184273 50874360 53457337 55968892 59054880 62021200 64838223 67860333
4012 67860333 71118444 74305911 77638481 81072737 84642598 88019799 91399868 95001009
4004 95001009 98463230 101903314 105144017 108127113 110827741 113618490 116297482 118702298
3996 118702298 121042031 123303018 125542266 127561102 129539027 131027259 132271354 133311555
3988 133311555 134088702 134326892 134300222 133828312 133260400 132144313 131002563 129568897 128119469
3979 128119469 126581205 124476103 122577354 120615958 118280437 115835379 112892473 109769053
3971 109769053 106285620 102891574 99369475 95860752 92341843 88673115 85224811 82086953
3963 82086953 79071538 75557802 72468542 69475301 66372592 63360643 60430706 57434063
$$ packed form
4020D5846785K337488K690087K582977K511555L085988K966320K817023L022110
4012F7860333L258111L187467L332570L434256L569861L377201L380069L601141
4004I5001009L462221L440084L240703K983096K700628K790749K678992K404816
3996A18702298K339733K260987K239248K018836J977925J488232J244095J040201
3988A33311555P77147K38190k6670m71910n67912j116087j141750j433666j449428
3979A28119469j538264k105102j898749j961396k335521k445058k942906l123420
3971A09769053l483433l394046l522099l508723l518909l668728l448304l137858
3963H2086953l015415l513736l089260k993241l102709l011949k929937k996643
$$ plain form
3955 57434063 54413397 51524259 49065991 46371278 43723957 41394756 39349527 37127966
3947 37127966 35243806 33413358 31756810 30311940 28895454 27280659 25985207 24963856
3939 24963856 23602994 22686970 21810431 21148942 20552963 19810989 19322527 18726752 18387596
3930 18387596 18556609 18955008 19066882 19256703 19158022 18127306 16836152 15597243 14415996
3921 14415996 13683535 13076760 12306713 11584646 10953359 10476998 10155592 9911348 9675119
3912 9675119 9504891 9140359 8826596 8637880 8311835 8102262 7974240 7708921 7476079 7560131
3902 7560131 7468118 7483168 7087900 6768244 6738479 6325716 6326821 6439883 6196305 6172141 6054690
3891 6054690 6139467 5975228 5798375 5653195 5383225 5384577 5558773 5390200 5322628 5341005
$$ packed form
3955E7434063l020666k889138k458268k694713k647321k329201k045229k221561
3947C7127966j884160j830448j656548j444870j416486j614795j295452j021351
3939B4963856j360862r16024q76539o61489n95979p41974m88462n95775l39156
3930A8387596J69013L98399J11874J89821r8681j030716j291154j238909j181247
3921A4415996p32461o06775p70047p22067o31287m76361l21406k44244k36229
3912I675119j70228l64532l13763j88716l26045k09573j28022k65319k32842Q4052
3902G560131r2013J5050l95268l19656k9765m12763J105J13062k43578k4164j17451
3891F054690Q4777j64239j76853j45180k69970J352J74196j68573o7572J8377
$$ plain form
3881 5341005 5308888 5073286 5191207 5175339 4813643 4880901 4957290 4844781 4813640 4929727
3871 4929727 4854552 4646017 4679773 4645908 4609768 4606008 4260336 4088150 4069782 4324066 4270052
3860 4270052 4149176 4116023 4398158 4483143 4198714 3982412 3974667 4031529 4132686 4020390
3850 4020390 4115101 3881395 3808668 3852639 3678291 3499692 3693991 4036650 4007598 3981974
3840 3981974 3978026 4011141 4010504 3944708 3737248 3672139 3675048 3403704 3438726 3736963 3744104 3570415
3828 3570415 3496241 3484022 3451539 3687015 3921691 3803632 3430496 3563491 3513657 3281079
3818 3281079 3436381 3497992 3255347 3142039 3239903 3306414 3445433 3362121 3361469 3287605 3408113
3807 3408113 3577662 3472273 3486339 3591481 3441026 3603059 3495233 3559877 3720789 3778768
$$ packed form
3881E341005l2117k35602J17921j5868l61696O7258P6389j12509l1141J16087
3871D929727p5175k08535L3756l3865l6140l760l45672j72186j8368K54284n4014
3860D270052j20876l3153K82135Q4985k84429k16302p745N6862J01157j12296
3850D020390R4711k33706p2727M3971j74348j78599J94299L42659k9052k5624
3840C981974l948L3115o37o5796k07460o5109K909k71344L5022K98237P141j73689
3828C570415p4174j2219l2483K35476K34676j18059l73136J32995m9834k32578
3818C281079J55302O1611k42645j13308R7864O6511J39019q3312o52p3864J20508
3807C408113J69549j05389J4066J05142j50455J62033j07826O4644J60912N7979
$$ plain form
3797 3778768 3900934 3972979 4090942 3867058 3962897 4188343 4324052 4539274 4591171 4438682
3787 4438682 4469611 4594276 4752428 4810239 4999067 5200229 5265997 5215144 5196966 5203465 5185772
3776 5185772 5039469 5059769 5091477 5236155 5293097 5329634 5399233 5287856 5232645 5226554 5233751
3765 5233751 5123650 5076379 5012704 4915358 4804380 4875945 4778753 4883385 5055410 5039122 4832177
3754 4832177 4822962 4702247 4596220 4770315 4792325 4704351 4992847 4995671 4854404 4955353 5044896
3743 5044896 5267252 5391845 5220629 5367989 5408965 5509707 5528039 5578846 5643236 5780248
3733 5780248 5935249 5876893 6293895 6211185 6160488 6420253 6712703 6523042 6616683 6838624
3723 6838624 6913779 6905325 6996913 7087284 7373275 7600419 7737007 7803479 7878596 8009104 8169152
$$ packed form
3797C778768J22166P2045J17963k23884R5839K25446J35709K15222N1897j52489
3787D438682L0929J24665J58152N7811J88828K01162O5768n0853j8178O499j7693
3776E185772j46303K0300L1708J44678N6942L6537O9599j11377n5211o091P197
3765E233751j10101m7271o3675r7346j10978P1565r7192J04632J72025j6288k06945
3754D832177r215j20715j06027J74095K2010q7974K88496K824j41267J00949Q9543
3743E044896K22356J24593j71216J47360M0976J00742J8332N0807O4390J37012
3733E780248J55001n8356M17002q2710n0697K59765K92450j89661R3641K21941
3723F838624P5155q454R1588R0371K85991K27144J36588O6472P5117J30508J60048
$$ plain form
3712 8169152 8184686 8369015 8687426 8634628 8871483 9160398 9268971 9327081 9471067 9643436
3702 9643436 9786502 9931532 10093100 10433472 10708275 10807102 10912253 11299060 11446508 11571638
3692 11571638 11748423 12120082 12513542 12765475 12947724 13196769 13531752 13832765 14221046
3683 14221046 14645277 14863428 15186711 15594177 15805737 16307133 16969720 17632463 18035148
3674 18035148 18576925 19508927 20056115 20542003 21442031 22431134 23406435 24243573 25355297
3665 25355297 26545682 27788057 29299680 30787962 32137760 33925429 35619745 37151002
3657 37151002 38676217 40089615 41342231 42894023 44584092 45833508 47059297 48261103
3649 48261103 49560003 50901551 52102184 53384921 54437137 55303774 56056952 56718185 57085995
$$ packed form
3712H169152J5534J84329L18411n2798K36855K88915J08573N8110J43986J72369
3702I643436J43066J45030J61568L40372K74803R8827J05151L86807J47448J25130
3692A1571638J76785L71659L93460K51933J82249K49045L34983L01013L88281
3683A4221046M24231K18151L23283M07466K11560N01396O62587O62743M02685
3674A8035148N41777R32002N47188M85888R00028R89103R75301Q37138J111724
3665B5355297J190385J242375J511623J488282J349798J787669J694316J531257
3657C7151002J525215J413398J252616J551792J690069J249416J225789J201806
3649D8261103J298900J341548J200633J282737J052216Q66637P53178O61233L67810
$$ plain form
3640 57085995 57488368 57590086 57545102 57252552 57079503 56773233 56534720 56482630 56300506 56085665
3630 56085665 55952563 56160734 56102314 55898715 55638225 55947102 56121010 56371746 56610506 56876039
3620 56876039 57170070 58118735 59232006 60338449 61930703 63393883 65434379 68079307
3612 68079307 70524246 73628085 76876371 80400752 84384674 89020688 93567055 98443067
3604 98443067 103659646 108684605 113853712 118783706 123897613 128738484 133479569 138245956
3596 138245956 142954309 147541895 152310009 156914254 161451832 165643697 169540694 173251213
3588 173251213 176202947 178702710 180591838 181767369 182205168 182286422 182025164 181176295 180645624
3579 180645624 179957398 179299378 178825761 178301870 177899173 177759901 177634126 177752042 177921794
$$ packed form
3640E7085995M02373J01718m4984k92550j73049l06270k38513n2090j82124k14841
3630E6085665j33102K08171n8420k03599k60490L08877J73908K50736K38760K65533
3620E6876039K94031R48665J113271J106443J592254J463180K040496K644928
3612F8079307K444939L103839L248286L524381L983922M636014M546367M876012
3604I8443067N216579N024959N169107M929994N113907M840871M741085M766387
3596A38245956M708353M587586M768114M604245M537578M191865L896997L710519
3588A73251213K951734K499763J889128J175531M37799Q1254k61258q48869n30671
3579A80645624o88226o58020m73617n23891m02697j39272j25775J17916J69752
$$ plain form
3570 177921794 178233689 178479946 178731957 179223181 180009856 180752538 181427485 181994769 182638925
3561 182638925 183253736 183951457 184866083 185987961 187352057 188772261 190359177 191898668
3553 191898668 193421772 194795241 195496881 195825672 195627280 194890408 193588092 191748869 189587441
3544 189587441 186772268 183779535 180521266 176898516 173137272 169360124 165598691 162207372
3536 162207372 159231583 155981068 152762835 149681239 146544108 143438536 140198131 137080719
3528 137080719 134010446 131241171 128738663 126434631 124885302 124052908 123829228 123777327 124681535
3519 124681535 126144530 128252944 131384645 135120484 139662115 144872126 151344488 158876539
3511 158876539 167415610 177209937 188700212 201188979 215445950 231641477 249434337
$$ packed form
3570A77921794L11895K46257K52011M91224P86675P42682O74947N67284O44156
3561A82638925O14811O97721R14626J121878J364096J420204J586916J539491
3553A91898668J523104J373469P01640L28791j98392p36872j302316j839223k161428
3544A89587441k815173k992733l258269l622750l761244l777148l761433l391319
3536A62207372k975789l250515l218233l081596l137131l105572l240405l117412
3528A37080719l070273k769275k502508k304032j549329q32394k23680n1901R04208
3519A24681535J462995K108414L131701L735839M541631N210011O472362P532051
3511A58876539Q539071R794327J1490275J2488767J4256971J6195527J7792860
$$ plain form
3504 249434337 269114837 290103837 311816305 333742708 354106768 371978534 386947614
3497 386947614 398281447 405862817 410236946 411704138 410942887 409318208 407348456 405390387
3489 405390387 403895968 402500344 400930290 398400479 394226155 387435255 377364920 363873182
3481 363873182 347006764 327664457 306315144 284051584 261735099 239723902 219124107
3474 219124107 200775963 183958234 168676114 154995729 142936070 132384064 123186734
3467 123186734 114765587 106854385 99944729 93730155 87986124 83002645 78314857 74030369
3459 74030369 70235773 66726307 63476352 60457030 57639203 54967464 52561579 50392188
3451 50392188 48461350 46466697 44631314 42909616 41456988 39910606 38400292 37172110
$$ packed form
3504B49434337J9680500K0989000K1712468K1926403K0364060J7871766J4969080
3497C86947614J1333833P581370M374129J467192p61251j624679j969752j958069
3489D05390387j494419j395624j570054k529811m174324o790900j0070335j3491738
3481C63873182j6866418j9342307k1349313k2263560k2316485k2011197k0599795
3474B19124107j8348144j6817729j5282120j3680385j2059659j0552006r197330
3467A23186734q421147p911202o909656o214574n744031m983479m687788m284488
3459G4030369l794596l509466l249955l019322k817827k671739k405885k169391
3451E0392188j930838j994653j835383j721698j452628j546382j510314j228182
$$ plain form
3443 37172110 35908945 34878019 33910016 32877255 31801139 30782931 30284713 29353534 28538954
3434 28538954 27622093 26649970 26196802 25807112 25265504 24596938 24128023 23635925 23016980
3425 23016980 22466648 21856316 21364071 20838115 20317333 19835879 19540626 19090809 18717323
3416 18717323 18554113 18128249 17591367 17194291 16951436 16458221 16082541 15880493 15551826
3407 15551826 15115694 14734033 14420085 14271552 13986017 13817380 13378169 13005388 12880809
3398 12880809 12760648 12471343 12106652 11960452 11553531 11525436 11325358 10927460 10742151 10562610
3388 10562610 10337807 9980189 9745893 9685734 9641325 9474289 9500244 9175524 9036810 8926846
3378 8926846 8756032 8543847 8582424 8271468 8286897 8165666 8017655 8029656 7936554 7765938
$$ packed form
3443C7172110j263165j030926r68003j032761j076116j018208m98218r31179q14580
3434B8538954r16861r72123m53168l89690n41608o68566m68915m92098o18945
3425B3016980n50332o10332m92245n25956n20782m81454k95253m49817l73486
3416A8717323j63210m25864n36882l97076k42855m93215l75680k02048l28667
3407A5551826m36132l81661l13948j48533k85535j68637m39211l72781j24579
3398A2880809j20161k89305l64691j46200m06921k8095k00078l97898j85309j79541
3388A0562610k24803l57618k34296o0159m4409j67036K5955l24720j38714j09964
3378H926846j70814k12185L8577l10956J5429j21231j48011J2001r3102j70616
$$ plain form
3368 7765938 7456380 7318737 7336992 7341600 7204636 6951311 7052875 7136310 7080243 6949337
3358 6949337 6959484 6544134 6567718 6533725 6508564 6281178 6081004 6307793 6146055 6045627
3348 6045627 5662293 5673033 5490126 5456050 5471272 5357558 5222821 5119679 5099707 5116479
3338 5116479 4946922 4949288 4805262 4997245 5083371 4963112 4731105 4716336 4817279 4724202
3328 4724202 4573015 4659161 4528784 4495683 4533161 4584130 4680926 4735059 4595297 4417021 4355590
3317 4355590 4418103 4392921 4280249 4544695 4658925 4517514 4706892 4526309 4407853 4382287
3307 4382287 4464604 4505900 4527420 4602802 4573341 4510258 4414277 4489084 4231566 4110373 4130901
3296 4130901 4110456 4241689 4248901 4101458 3987367 3943505 4052320 3914105 3994894 3991511 3942457
$$ packed form
3368G765938l09558j37643J8255M608j36964k53325J01564Q3435n6067j30906
3358F949337J0147m15350K3584l3993k5161k27386k00174K26789j61738j00428
3348F045627l83334J0740j82907l4076J5222j13714j34737j03142j9972J6772
3338E116479j69557K366j44026J91983Q6126j20259k32007j4769J00943r3077
3328D724202j51187Q6146j30377l3101L7478N0969R6796N4133j39762j78276o1431
3317D355590O2513k5182j12672K64446J14230j41411J89378j80583j18456k5566
3307D382287Q2317M1296K1520P5382k9461o3083r5981P4807k57518j21193K0528
3296D130901k0445J31233P212j47443j14091m3862J08815j38215Q0789l383m9054
$$ plain form
3285 3942457 3851139 3954575 3925459 3769383 3819188 3748731 3834693 3699691 3508068 3639391
3275 3639391 3516279 3423377 3556341 3659815 3711357 3502985 3428837 3669862 3665879 3654041 3670510
3264 3670510 3706087 3702685 3646293 3577969 3738670 3794343 3789085 3861833 3705561 3673289 3586174
3253 3586174 3567723 3459745 3515553 3593634 3601533 3656546 3779370 3714518 3519776 3631653 3658415
3242 3658415 3549580 3503746 3626132 3610598 3563820 3605631 3667070 3994742 4032854 3797219 3756682
3231 3756682 3883834 3952492 3798238 3852072 3946484 3816145 3646999 3601996 3559365 3353448
3221 3353448 3298882 3407823 3614828 3823724 3929374 3930497 3942210 4138247 4299334 4429487
3211 4429487 4482426 4509537 4547442 4535301 4521559 4540542 4572864 4344624 4134421 3871640 3785321
$$ packed form
3285C942457r1318J03436k9116j56076M9805p0457Q5962j35002j91623J31323
3275C639391j23112r2902J32964J03474N1542k08372p4148K41025l983j1838J6469
3264C670510L5577l402n6392o8324J60701N5673n258P2748j56272l2272q7115
3253C586174j8451j07978N5808P8081P899N5013J22824o4852j94742J11877K6762
3242C658415j08835m5834J22386j5534m6778M1811O1439L27672L8112k35635m0537
3231C756682J27152O8658j54254N3834R4412j30339j69146m5003m2631k05917
3221C353448n4566J08941K07005K08896J05650J123J1713J96037J61087J30153
3211D429487N2939K7111L7905j2141j3742J8983L2322k28240k10203k62781q6319
$$ plain form
3200 3785321 4001347 3866108 3929864 3787892 4052302 3771158 3646510 3530671 3603374 3495622
3190 3495622 3351337 3395624 3216669 3175930 2986009 2948101 2970835 3073416 2968982 2794896
3180 2794896 2673714 2485119 2349383 2107874 1961844 1888528 1702996 1719809 1690910 1721063
3170 1721063 1590965 1574557 1504741 1416375 1378566 1582942 1282444 1255823 1329527 1313881 1185852
3159 1185852 1024080 1234298 1322554 1478189 1409483 1324196 1196781 1103753 1187382 1244926 1260296
3148 1260296 1141504 1260673 1039158 1081892 1203357 1053400 1157437 1182977 996999 1073166
3138 1073166 1069598 1184390 1020940 1129124 1055902 1020310 1137503 1192743 1180689 1104732 1098023
3127 1098023 1183027 1008985 940482 873586 971419 1093481 1131983 1114915 942460 914851 740402
$$ packed form
3200C785321K16026j35239O3756j41972K64410k81144j24648j15839P2703j07752
3190C495622j44285M4287j78955m0739j89921l7908K2734J02581j04434j74086
3180B794896j21182j88595j35736k41509j46030p3316j85532J6813k8899L0153
3170A721063j30098j6408o9816q8366l7809K04376l00498k6621P3704j5646j28029
3159A185852j61772K10218Q8256J55635o8706q5287j27415r3028Q3629N7544J5370
3148A260296j18792J19169k21515M2734J21465j49957J04037K5540j85978P6167
3138A073166l568J14792j63450J08184p3222l5592J17193N5240j2054p5957o709
3127A098023Q5004j74042o8503o6896R7833J22062L8502j7068j72455k7609j74449
$$ plain form
3116 740402 938023 1134955 978320 1163628 1274222 805680 1015594 1113930 1013900 744089
3106 744089 771453 802536 940871 939334 933169 981700 902214 911817 925833 1008866 993043 1044229
3094 1044229 954501 861344 1006693 743318 725945 805961 816677 944665 907150 830550 1056521
3083 1056521 855425 682183 668386 809136 908357 714903 908365 836580 1109700 1086982
3073 1086982 893719 833175 901799 944559 892056 1040820 1005186 1051675 918366 1100835 1181408
3062 1181408 1136446 1046909 1008739 1085048 1050075 782494 835641 926910 825418 861042 727925
3051 727925 838655 552089 575454 811450 809761 624890 478634 489765 428226 592136 721583
3040 721583 760204 882505 1014197 1139286 1136505 1258289 1596291 1596788 1508159 1647545 1717554
$$ packed form
3116G40402J97621J96932j56635J85308J10594m68542K09914R8336j00030k69811
3106G44089K7364L1083J38335j537o165M8531p9486R603J4016Q3033j5823N1186
3094A044229q9728r3157J45349k63375j7373Q0016J0716J27988l7515p6600K25971
3083A056521k01096j73242j3797J40750R9221j93454J93462p1785K73120k2718
3073A086982j93263o0544O8624M2760n2503J48764l5634M6489j33309J82469Q0573
3062A181408m4962q9537l8170P6309l4973k67581N3147R1269j01492L5624j33117
3051G27925J10730k86566K3365K35996j689j84871j46256J1131o1539J63910J29447
3040G21583L8621J22301J31692J25089k781J21784L38002M97q8629J39386P0009
$$ plain form
3029 1717554 1460798 1466324 1226276 1168594 1000051 797055 712405 766512 859384 575748 609857
3018 609857 579690 545845 689448 544244 469126 542118 735069 612027 556804 269952 451761
3007 451761 780015 723213 708746 577127 643173 536013 729111 1038323 969078 953974 978036
2996 978036 865715 630896 498788 722639 598480 692479 644662 606378 669314 610992 451309
2985 451309 289465 265164 376594 479239 505344 273160 210471 323010 518699 436357
2975 436357 387466 559726 547315 246237 149438 177792 365593 376507 410522 640878 689563
2964 689563 680043 554418 380351 420937 558753 600293 470207 447522 504723 306033 350130
2953 350130 455723 317269 281301 466089 440021 267594 293706 350064 349837 534813 387399
$$ packed form
3029A717554k56756N526k40048n7682j68543k02996q4650N4107R2872k83636L4109
3018F09857l0167l3845J43603j45204p5118P2992J92951j23042n5223k86852J81809
3007D51761L28254n6802j4467j31619O6046j07160J93098L09212o9245j5104K4062
2996I78036j12321k34819j32108K23851j24159R3999m7817l8284O2936n8322j59683
2985D51309j61844k4301J11430J02645K6105k32184o2689J12539J95689q2342
2975D36357m8891J72260j2411l01078r6799K8354J87801J0914L4015K30356M8685
2964F89563r520j25625j74067M0586J37816M1540j30086k2685N7201j98690M4097
2953C50130J05593j38454l5968J84788k6068j72427K6112N6358k27J84976j47414
$$ plain form
2942 387399 185480 345257 164411 -14252 58899 66272 92205 213028 412518 501287 540483
2931 540483 572210 629619 439114 412992 447997 342669 322439 352089 410432 380597 125003
2920 125003 325398 431714 426847 258186 409382 440353 320739 408068 293522 597964
2910 597964 363249 362945 462121 465722 385819 411874 405884 519360 546267 665437 569925 614121
2898 614121 748621 620253 607153 729812 719056 498987 661225 626530 569947 697929
2888 697929 599327 427596 509165 450766 451034 534831 470837 480239 467930 409105 623969 590923
2876 590923 453482 458347 531292 505086 463511 491702 490775 328537 360864 491133 494093 612878
2864 612878 492666 601490 651096 572928 416659 465855 657556 637921 632992 593539 592153
$$ packed form
2942C87399k01919J59777j80846j78663P3151P373K5933J20823J99490Q8769L9196
2931E40483L1727N7409j90505k6122L5005j05328k0230K9650N8343k9835k55594
2920A25003K00395J06316m867j68661J51196L0971j19614Q7329j14546L04442
2910E97964k34715l04R9176L601p9903K6055n990J13476K6907J19170r5512M4196
2898F14121J34500j28368j3100J22659j0756k20069J62238l4695n6583J27982
2888F97929r8602j71731Q1569n8399K68Q3797o3994R402j2309n8825K14864l3046
2876E90923j37441M865P2945k6206m1575K8191r27j62238L2327J30269K960J18785
2864F12878j20212J08824M9606p8168j56269M9196J91701j9635m929l9453j386
$$ plain form
2853 592153 353686 387344 362510 411909 235520 263737 313144 382524 377337 297358 207536
2842 207536 80245 84886 277969 -34123 -125942 17963 40757 106301 170107 166469 316555
2831 316555 332795 238901 383175 361943 216634 92845 77078 77710 234880 83346 176566
2820 176566 252151 465434 420944 354399 247048 104726 166963 363670 260155 107848
2810 107848 32268 43818 43942 -78043 33773 34099 -32917 -98916 67359 -3851 -80843 -77898
2798 -77898 86843 107023 332002 128422 97165 41887 103882 310488 84693 65203 105666
2787 105666 149823 95172 51445 -23793 252066 214283 55777 -33438 168202 210320 206315
2776 206315 182912 185530 236914 300748 71051 -13395 63475 36519 -39346 -189560 -80179
$$ packed form
2853E92153k38467L3658k4834M9399j76389K8217M9407O9380n187p9979q9822
2842B07536j27291M641J93083l12092r1819J43905K2794O5544O3806l638J50086
2831C16555J6240r3894J44274k1232j45309j23789j5767O32J57170j51534R3220
2820A76566P5585K13283m4490o6545j07351j42322O2237J96707j03515j52307
2810A07848p5580J1550J24j21985J11816L26o7016o5999J66275p1210p6992K945
2798g7898J64741K0180K24979k03580l1257n5278O1995K06606k25795j9490M0463
2787A05666M4157n4651m3727p5238K75859l7783j58506q9215K01640M2118m005
2776B06315k3403K618N1384O3834k29697q4446P6870k6956p5865j50214J09381
$$ plain form
2765 -80179 126603 200471 164367 256521 318406 50518 216881 418036 163072 248066 238420
2754 238420 210208 113160 47482 128458 -78853 -8374 87271 20430 144496 27451 11034
2743 11034 -221667 -87697 92759 32974 7189 -49758 50191 -55424 -38906 74841 9438
2732 9438 5580 51127 200358 153234 95184 190696 161855 144160 18675 -21817 -68999 -37281
2720 -37281 -20276 141243 -27778 111062 47016 52049 166264 -29015 104633 134840 149583
2709 149583 169167 -58857 -46060 -206008 -204274 185415 187668 13914 79138 7881 87626
2698 87626 3329 -115762 -113422 -10028 -68779 -209818 -93563 183778 134769 34908 -35341
2687 -35341 -97618 -62666 -99367 36674 -19328 -112083 20296 92664 -36301 -105651 19304
$$ packed form
2765h0179K06782P3868l6104R2154O1885k67888J66363K01155k54964Q4994r646
2754B38420k8212r7048o5678Q0976k07311P0479R5645o6841J24066j17045j6417
2743A1034k32701J33970J80456n9785k5785n6947R9949j05615J6518J13747o5403
2732I438l858M5547J49231m7124n8050R5512k8841j7695j25485m0492m7182L1718
2720c7281J7005J61519j69021J38840o4046N033J14215j95279J33648L0207J4743
2709A49583J9584k28024J2797j59948J734L89689K253j73754O5224p1257P9745
2698H7626q4297j19091K340J03394n8751j41039J16255K77341m9009r9861p0249
2687c5341o2277L4952l6701J36041n6002r2755J32379P2368j28965o9350J24955
$$ plain form
2676 19304 66198 160652 124404 -76858 24120 155002 153498 116415 151513 16302 120767
2665 120767 108124 15292 51302 30469 -139644 -86877 -99751 4563 -117389 172840 62645
2654 62645 -42957 -148713 -91828 113050 34741 -25501 132204 182214 -56428 -255529 96720
2643 96720 214062 -70442 -66137 -116365 -174903 -39707 -17832 17597 90420 194837 142874
2632 142874 84729 23724 -164929 -131383 -151401 -97487 -7484 177756 47206 5847 -19470
2621 -19470 77714 280273 225189 -15292 138874 141114 24422 133677 15515 6571 158877
2610 158877 -58037 22748 88437 37658 180263 -55167 -11936 160431 107936 75601 12351
2599 12351 853 26669 -91666 75403 361702 219113 231403 211552 -13043 -74798 -67664
$$ packed form
2676A9304M6894R4454l6248k01262J00978J30882j504l7083L5098j35211J04465
2665A20767j2643r2832L6010k0833j70113N2767j2874J04314j21952K90229j10195
2654F2645j05602j05756N6885K04878p8309o0242J57705N0010k38642j99101L52249
2643I6720J17342k84504M305n0228n8538J35196K1875L5429P2823J04417n1963
2632A42874n8145o1005j88653L3546k0018N3914R0003J85240j30550m1359k5317
2621a9470R7184K02559n5084k40481J54166K240j16692J09255j18162q944J52306
2610A58877k16914Q0785O5689n0779J42605k35430M3231J72367n2495l2335o3250
2599A2351j1498K5816j18335J67069K86299j42589J2290j9851k24595o1755P134
$$ plain form
2588 -67664 124143 148836 87034 6063 125448 -32868 -124190 -46455 68081 80399 14870
2577 14870 133615 17431 -214287 -164439 -48083 -137117 -120135 -210875 -110042 -124109 -143998
2566 -143998 -6027 175679 141783 35267 -248007 -222486 -122625 80266 89905 268366 406728
2555 406728 184876 68956 -316212 -321333 -336517 -387880 -65908 206345 235119 33600 -80085
2544 -80085 -136788 -182813 -72856 141213 68432 297472 307617 261482 191975 4746 73374
2533 73374 -20293 -125689 72360 98403 44237 -8292 -88242 47606 60240 96831 42232
2522 42232 132313 112944 62989 -184665 -92674 35806 -94953 -112990 -83424 -77663 223071
2511 223071 281191 93804 55657 -130928 -48062 119202 271188 101047 -168701 -39675
$$ packed form
2588f7664J91807K4693o1802q0971J19385j58316r1322P7735J14536J2318o5529
2577A4870J18745j16184k31718M9848J16356q9034J6982r0740J00833j4067j9889
2566a43998J37971J81706l3896j06516k83274K5521R9861K02891R639J78461J38362
2555D06728k21852j15920l85168n121j5184n1363L21972K72253K8774k01519j13685
2544h0085n6703m6025J09957K14069p2781K29040J0145m6135o9507j87229O8628
2533G3374r3667j05396J98049K6043n4166n2529p9950J35848J2634L6591n4599
2522D2232R0081j9369m9955k47654R1991J28480j30759j8037K9566N761L00734
2511B23071N8120j87387l8147j86585Q2866J67264J51986j70141k69748J29026
$$ plain form
2501 -39675 85521 -57611 -29387 -102059 -1909 39098 45109 152415 93213 -66049 6087
2490 6087 71349 118864 273626 169969 181829 75046 69535 -11740 -59963 43754 115489
2479 115489 170808 305855 170822 68304 126158 296689 165217 241042 45731 -43597
2469 -43597 -218686 -145030 -119234 -41857 106984 -127353 87622 54018 -6406 -250683 -141336
2458 -141336 7898 66677 -69683 138364 97026 36198 190057 5936 50332 167175
2448 167175 123220 -13157 19536 106344 117274 4328 -127689 73097 95396 197295 331574
2437 331574 409577 -22198 221 -4014 138181 65491 79836 113156 -206099 -52558 -230390
2426 -230390 -261626 -283695 131013 36912 -80956 -4631 -2019 88663 59173 -6837 100766
$$ packed form
2501c9675J25196j43132K8224p2672J00150M1007O011J07306n9202j59262P2136
2490F087O5262M7515J54762j03657J1860j06783n511q1275m8223J03717P1735
2479A15489N5319J35047j35033j02518N7854J70531j31472P5825j95311q9328
2469d3597j75089P3656K5796P7377J48841k34337K14975l3604o0424k44277J09347
2458a41336J49234N8779j36360K08047m1338o0828J53859j84121M4396J16843
2448A67175m3955j36377L2693Q6808J0930j12946j32017K00786K2299J01899J34279
2437C31574P8003m31775K2419m235J42195p2690J4345L3320l19255J53541j77832
2426b30390l1236k2069M14708r4101j17868P6325K612R0682k9490o6010J07603
$$ plain form
2415 100766 180110 89257 -44713 75347 14913 -15264 171326 95668 146686 28455 -75995
2404 -75995 973 -20118 -70429 -69604 -257164 -104293 -108509 -33425 151472 91190 -53601 -60457
2392 -60457 -38004 -90199 -118070 -183740 71703 101489 -20256 147833 237230 57954 10305
2381 10305 69844 309950 234011 140872 -88158 -25742 -72686 87852 -58943 -26557 200688
2370 200688 100736 206757 424983 326837 269134 217608 412647 481904 376647 584514 508326
2359 508326 470463 303351 311213 244217 68351 167424 361735 221267 157487 156737 74518
2348 74518 201849 422322 285915 130788 36460 -198182 -155550 43885 -35899 55756 57628
2337 57628 23388 99075 32412 -79348 -73147 -78406 -82974 20782 192848 170388 53582 68820
$$ packed form
2415A00766P9344r0853j33970J20060o0434l0177J86590p5658N1018j18231j04450
2404g5995P6968k1091n0311Q25j87560J52871m216P5084J84897o0282j44791o856
2392f0457K2453n2195k7871o5670K55443K9786j21745J68089Q9397j79276m7649
2381A0305N9539K40106p5939r3139k29030O2416m6944J60538j46795L2386K27245
2370B00688r9952J06021K18226r8146n7703n1526J95039O9257j05257K07867p6188
2359E08326l7863j67112P862o6996j75866R9073J94311j40468o3780p50q2219
2348G4518J27331K20473j36407j55127r4328k34642M2632J99435p9784R1655J872
2337E7628l4240P5687o6663j11760O201n259m568J03756J72066k2460j16806J5238
$$ plain form
2325 68820 75797 77356 125421 242623 221365 333233 426053 390004 427621 269523 89993
2314 89993 243967 406930 422291 226330 128609 52341 -27110 241395 -13033 -8968 168133
2303 168133 149232 356473 261284 144619 301139 346413 98547 85617 162130 313430 330515
2292 330515 221647 281635 244011 224075 264755 227743 54718 25390 286144 432280 369693
2281 369693 250274 205339 -64615 -128677 24646 43120 245420 95616 210287 353933
2271 353933 195746 -76976 -17801 5122 54204 29086 272877 382053 495910 462099 243756
2260 243756 218635 176563 155218 10539 38092 172413 415919 421432 368561 454065 547004
2249 547004 581722 532527 353499 451227 570290 620708 684086 680075 761243 558057 279483
$$ packed form
2325F8820O977J559M8065J17202k1258J11868R2820l6049L7617j58098j79530
2314H9993J53974J62963J5361j95961r7721p6268p9451K68505k54428M065J77101
2303A68133j8901K07241r5189j16665J56520M5274k47866j2930P6513J51300J7085
2292C30515j08868N9988l7624j9936M0680l7012j73025k9328K60754J46136o2587
2281C69693j19419m4935k69954o4062J53323J8474K02300j49804J14671J43646
2271C53933j58187k72722N9175K2923M9082k5118K43791J09176J13857l3811k18343
2260B43756k5121m2072k1345j44679K7553J34321K43506N513n2871Q5504R2939
2249E47004L4718m9195j79028R7728J19063N0418O3378m011Q1168k03186k78574
$$ plain form
2238 279483 395144 500662 538220 567013 587551 562929 555215 652127 540689 365914 426243
2227 426243 421727 239735 135289 283473 237571 21238 35357 253254 334944 431555 537438
2216 537438 591887 703153 528352 611446 573211 627344 560816 716386 725735 628334 618780
2205 618780 678111 867610 690123 592975 694992 629753 878996 854741 576648 469100
2195 469100 683827 743726 876642 1029531 840273 1064959 1038513 780581 752832 990307
2185 990307 1195782 1340635 1186682 1256086 1446891 1475617 1454902 1379002 1365086 1426705 1505446
2174 1505446 1668118 1647249 1664052 1737704 1852800 1742189 1763568 1770728 1877442 1768407 1792005
2163 1792005 1772578 2188099 2375488 2498423 2476239 2434464 2357506 2471848 2556401 2664834
$$ packed form
2238B79483J15661J05518L7558K8793K0538k4622p714R6912j11438j74775O0329
2227D26243m516j81992j04446J48184m5902k16333J4119K17897Q1690R6611J05883
2216E37438N4449J11266j74801Q3094l8235N4133o6528J55570R349r7401r554
2205F18780N9331J89499j77487r7148J02017o5239K49243k4255k78093j07548
2195D69100K14727N9899J32916J52889j89258K24686k6446k57932k7749K37475
2185I90307K05475J44853j53953O9404J90805K8726k0715p5900j3916O1619P8741
2174A505446J62672k0869J6803P3652J15096j10611K1379P160J06714j09035K3598
2163A792005j9427M15521J87389J22935k2184m1775p6958J14342Q4553J08433
$$ plain form
2153 2664834 2905804 3036767 3239970 3302273 3281452 3359452 3248676 3382826 3595970 3553687
2143 3553687 3570882 3741772 3906003 4012926 3845389 3868802 4163333 4494547 4703383 4843778
2133 4843778 4823574 4888901 5149751 5401922 5653794 6212345 6632394 6671906 6790503 7337596
2123 7337596 7795485 8077102 8474200 8960307 9510475 9886052 10589533 11393160 11940497 12605175
2113 12605175 13681330 14716423 15834109 17135544 18369948 19694080 21366715 23491979
2105 23491979 26446163 29785060 33169574 37977459 44006881 52346405 64375316 79183743
2097 79183743 93308244 104338200 108684144 98303318 83669171 70404705 58643324
2090 58643324 48517261 40679584 35003276 30564765 27163935 24417379 22382574 20922912
$$ packed form
2153B664834K40970J30963K03203O2303k0821P8000j10776J34150K13144m2283
2143C553687J7195J70890J64231J06923j67537K3413K94531L31214K08836J40395
2133D843778k0204O5327K60850K52171K51872N58551M20049L9512J18597N47093
2123G337596M57889K81617L97098M86107N50168L75577P03481Q03627N47337O64678
2113A2605175J076155J035093J117686J301435J234404J324132J672635K125264
2105B3491979K954184L338897L384514M807885O029422Q339524J2028911J4808427
2097G9183743J4124501J1029956M345944j0380826j4634147j3264466j1761381
2090E8643324j0126063p837677n676308m438511l400830k746556k034805j459662
$$ plain form
2082 20922912 19669652 18529910 17467354 16044431 14950920 13756653 12663591 11711709
2074 11711709 10850182 9865882 9137082 8716140 8199088 7755772 7384103 6852221 6472941
2065 6472941 6077284 5984621 5605137 5311096 4892381 4584043 4558167 4474781 4218162 4038436
2055 4038436 3816239 3805591 3573421 3297940 3215659 3022303 3070332 2835923 2806849 2777336
2045 2777336 2795868 2831497 2524399 2330771 2454035 2440771 2369567 2309853 2340229 2196144 2079214
2034 2079214 2176884 2132374 2153165 2030297 1944739 1915554 1895905 1927889 1698779 1564656 1854425
2023 1854425 1725275 1510446 1576660 1627842 1416198 1406353 1326026 1329655 1397050 1488168 1426089
2012 1426089 1256918 1086544 952158 1100954 1237029 1055308 1105909 958542 891236 1019332
$$ packed form
2082B0922912j253260j139742j062556j422923j093511j194267j093062r51882
2074A1711709q61527r84300p28800m20942n17052m43316l71669n31882l79280
2065F472941l95657r2663l79484k94041m18715l08338k5876q3386k56619j79726
2055D038436k22197j0648k32170k75481q2281j93356M8029k34409k9074k9513
2045B777336J8532L5629l07098j93628J23264j3264p1204n9714L0376j44085j16930
2034B079214R7670m4510K0791j22868q5558k9185j9649L1984k29110j34123K89769
2023A854425j29150k14829O6214N1182k11644r845q0327L629O7395R1118o2079
2012A426089j69171j70374j34386J48796J36075j81721N0601j47367o7306J28096
$$ plain form
2002 1019332 911202 1045059 1017597 959142 817454 935428 1121482 933464 965170 722625
1992 722625 728413 749121 865968 729345 651425 799667 710699 617817 537558 451491 402207
1981 402207 413645 576127 738252 717585 450173 290097 548418 646321 646951 585584 465713
1970 465713 445787 598207 632476 465851 372550 512311 444169 444269 494520 347750 343283
1959 343283 354193 448331 502518 598383 563294 385489 281826 362396 295931 158857 225294
1948 225294 237007 262545 296902 164391 364990 403914 471498 435797 395422 121476 112490
1937 112490 151256 307553 323307 58430 156841 294205 339751 385720 341070 406160 313070
1926 313070 247299 -42004 -174059 84384 138458 238457 186662 -32599 91180 247990
$$ packed form
2002A019332j08130J33857k7462n8455j41688J17974J86054j88018L1706k42545
1992G22625N788K0708J16847j36623p7920J48242q8968r2882q0259q6067m9284
1981D02207J1438J62482J62125k0667k67412j60076K58321R7903O30o1367j19871
1970D65713j9926J52420L4269j66625r3301J39761o8142J00N0251j46770m467
1959C43283J0910R4138N4187R5865l5089j77805j03663Q0570o6465j37074O6437
1948B25294J1713K5538L4357j32511K00599L8924O7584l5701m0375k73946q986
1937A12490L8766J56297J5754k64877R8411J37364M5546M5969m4650O5090r3090
1926C13070o5771k89303j32055K58443N4074R9999n1795k19261J23779J56810
$$ plain form
1916 247990 231848 292878 215563 248321 43401 250055 127681 205210 164468 169555 148804
1905 148804 307551 235246 75864 291277 192992 -155161 -39697 74919 156753 -2840
1895 -2840 -23660 91862 -36050 235109 369414 352207 438333 310375 132388 90523 66491
1884 66491 162 13271 103300 52657 63980 50147 -25014 174626 151192 -22359 -190904
1873 -190904 -4922 61567 -10034 59575 180266 229645 281287 117683 183400 70187 6779
1862 6779 -13946 -2383 286988 472379 495373 353041 163786 114296 116964 73880 301231
1851 301231 254893 -11773 4019 190992 300111 245459 104822 256118 343915 211500
1841 211500 61408 183592 98312 135991 332998 205085 257066 -141122 -72726 74399
$$ packed form
1916B47990j6142O1030p7315L2758k04920K06654j22374P7529m0742N087k0751
1905A48804J58747p2305j59382K15413r8285l48153J15464J14616Q1834j59593
1895b840k0820J15522j27912K71159J34305j7207Q6126j27958j77987m1865k4032
1884F6491o6329J3109R0029n0643J1323j3833p5161J99640k3434j73551j68545
1873a90904J85982O6489p1601O9609J20691M9379N1642j63604O5717j13213o3408
1862F779k0725J1563K89371J85391K2994j42332j89255m9490K668m3084K27351
1851C01231m6338k66666J5792J86973J09119n4652j40637J51296Q7797j32415
1841B11500j50092J22184q5280L7679J97007j27913N1981l98188O8396J47125
$$ plain form
1831 74399 275080 623824 632278 656462 374219 476346 666724 736731 782541 655988 311869
1820 311869 99642 257668 373998 304397 254419 96204 41595 22644 118488 263911 397573
1809 397573 367620 219705 134281 122065 -153304 -72808 -111096 111296 196632 57566 -42549
1798 -42549 11351 42953 312073 271031 225400 187600 40434 20066 44514 83363 -106931
1787 -106931 58737 22181 72906 99086 47362 63276 -62264 -187779 -146071 90654 108287
1776 108287 61543 86846 107648 -24529 -18840 -163018 -33888 200388 56216 53911 120102
1765 120102 198173 213777 147730 64252 68314 22775 -102426 -122819 6104 75750 23541
1754 23541 57491 45401 -50390 -96225 -92468 69866 12759 39915 91984 -23970 55246 207333
$$ packed form
1831G4399K00681L48744Q454K4184k82243J02127J90378P0007M5810j26553l44119
1820C11869k12227J58026J16330o9601m9978j58215n4609j8951R5844J45423J33662
1809C97573k9953j47915q5424j2216k75369Q0496l8288K22392Q5336j39066j00115
1798d2549N3900L1602K69120m1042m5631l7800j47166k0368K4448L8849j90294
1787a06931J65668l6556N0725K6180n1724J5914j25540j25515M1708K36725J7633
1776A08287m6744K5303K0802j32177N689j44178J29130K34276j44172k305O6191
1765A20102P8071J5604o6047q3478M062m5539j25201k0393J28923O9646n2209
1754B3541L3950j2090r5791m5835L757J62334n7107K7156N2069j15954P9216J52087
$$ plain form
1742 207333 125590 148854 53405 -61990 57699 42259 -166118 -363037 -474954 -350329
1732 -350329 -14033 -77451 128220 -6135 -157133 127947 109671 72143 34558 -2801 126716
1721 126716 104942 10244 130838 91563 -206647 -108770 -10496 -147967 -183484 -139218 -417164
1710 -417164 -380765 -150947 -235148 -253683 -310466 -236069 -154477 -22271 -115383 -50716 -38679
1699 -38679 11057 -158183 -164750 -254069 -173779 -296317 -147022 -24335 -86753 -171072 -138322
1688 -138322 140263 72656 -11856 10444 -191244 -34546 159699 62456 -140154 38334
1678 38334 200479 160261 -40937 -186769 -368842 -210822 -36619 -63028 -79797 -408238
1668 -408238 -297860 -141203 -233182 -116972 -70336 -200126 -215623 -131769 87632 -84571
$$ packed form
1742B07333q1743K3264r5449j15395J19689j5440k08377j96919j11917J24625
1732c50329L36296o3418K05671j34355j50998K85080j8276l7528l7585l7359J29517
1721A26716k1774r4698J20594l9275k98210R7877R8274j37471l5517M4266k77946
1710d17164L6399K29818q4201j8535n6783P4397Q1592J32206r3112O4667J2037
1699c8679M9736j69240o567q9319Q0290j22538J49295J22687o2418q4319L2750
1688a38322K78585o7607q4512K2300k01688J56698J94245r7243k02610J78488
1678C8334J62145m0218k01198j45832j82073J58020J74203k6409j6769l28441
1668d08238J10378J56657r1979J16210M6636j29790j5497Q3854K19401j72203
$$ plain form
1658 -84571 128358 89063 1488 121860 131862 217699 323471 282306 182592 -16756 -69834
1647 -69834 24642 38506 28267 94832 92371 146563 -4556 44932 -64956 -142497 -121199 38665
1635 38665 -20962 -243217 -93082 8203 -20743 -104016 -73296 73235 284984 125310 -55162
1624 -55162 -68978 50309 -25080 -57060 -220132 -297871 -226362 -219413 -428423 -416623 -159550
1613 -159550 -48025 -116589 -337526 -127641 -114016 -197381 -104334 -214973 -75412 48807
1603 48807 17178 -134783 -196003 116388 243867 158566 161174 159172 89096 109365 107821 157470
1591 157470 86797 94060 -15545 -241882 -205918 128916 69978 -11766 -57087 -163641 -181638
1580 -181638 -175225 -194825 -174586 -208408 11153 37189 -92009 -230620 -197543 -74322 97109
$$ packed form
1658h4571K12929l9295q7575J20372J0002Q5837J05772m1165r9714j99348n3078
1647f9834R4476J3864j0239O6565k461N4192j51119M9488j09888p7541K1298J59864
1635C8665n9627k22255J50135J01285k8946q3273L0720J46531K11749j59674j80472
1624e5162j3816J19287p5389l1980j63072p7739P1509O949k09010J1800K57073
1613a59550J11525o8564k20937K09885J3625q3365R3047j10639J39561J24219
1603D8807l1629j51961o1220L12391J27479q5301K608k002p0076K0269j544M9649
1591A57470p0673P263j09605k26337L5964L34834n8938q1744m5321j06554j7997
1580a81638O413j9600K0239l3822K19561K6036j29198j38611L3077J23221J71431
$$ plain form
1569 97109 163923 -74571 -123650 -154962 101844 58706 -66077 -74574 288555 -54199 -166577
1558 -166577 -101090 58646 102086 -53386 -102086 121175 155913 79107 -39372 -187671 -7301
1547 -7301 139584 -62737 -213967 -15276 -70454 -128126 -235698 -256553 -9682 -114915 -100569
1536 -100569 173320 28106 -93501 -259218 -96795 11516 155480 56032 208266 -101089
1526 -101089 -213073 -196997 -129999 -168430 -224015 122438 236967 320008 217050 293739 38514
1515 38514 -71319 -65544 -90686 116909 78435 31691 64810 50279 1343 -93717 -108016 207327
1503 207327 -6780 -79847 -160502 -327354 -40771 21291 29854 -72142 52152 -32440 -337081
1492 -337081 -37195 -150020 -213553 -105377 -84757 536 -127316 41065 351328 120956
$$ packed form
1569I7109O6814k38494m9079l1312K56806m3138j24783q497L63129l42754j12378
1558a66577O5487J59736M3440j55472m8700K23261L4738p6806j18479j48299J80370
1547g301J46885k02321j51230J98691n5178n7672j07572k0855K46871j05233J4346
1536a00569K73889j45214j21607j65717J62423J08311J43964r9448J52234l09355
1526a01089j11984J6076O6998l8431n5585L46453J14529Q3041j02958P6689k55225
1515C8514j09833N775k5142K07595l8474m6744L3119j4531m8936r5060j4299L15343
1503B07327k14107p3067q0655j66852K86583O2062Q563j01996J24294q4592l04641
1492c37081K99886j12825o3533J08176K0620Q5293j27852J68381L10263k30372
$$ plain form
1482 120956 -78426 15494 -120244 -28894 143212 75657 -154718 -38288 42235 62352 -104281
1471 -104281 -80595 104806 -148321 -68368 -76833 -93226 -25668 46498 105603 201960 165399
1460 165399 -28873 83455 -16512 87916 163268 127041 212333 112300 77675 175962 131878
1449 131878 -36742 -139701 154743 139271 139174 188472 -6050 -53860 -68453 -96675 6874
1438 6874 -136455 -271242 -280099 -73112 -112805 -57491 70580 -35563 62868 238093 42732
1427 42732 -86026 8235 98474 49760 -148604 -172598 -127326 -305946 -271541 -308321 -216378
1416 -216378 -124575 -115068 -206374 -205577 -96071 -144150 -165086 -169406 -131558 -167264 -144451 -136211
1404 -136211 -103911 -174598 -378647 -339582 -197761 -205148 -177144 -190373 -131973 -79214 -50964
$$ packed form
1482A20956j99382R3920j35738R1350J72106o7555k30375J16430Q0523K0117j66633
1471a04281K3686J85401k53127P9953q465j6393O7558P2166N9105R6357l6561
1460A65399j94272J12328r9967J04428P5352l6227Q5292j00033l4625R8287m4084
1449A31878j68620j02959K94444j5472r7M9298j94522m7810j4593k8222J03549
1438F874j43329j34787q857K06987l9693N5314J28071j06143R8431J75225j95361
1427D2732j28758R4261R0239m8714j98364k3994M5272j78620L4405l6780R1943
1416b16378R1803R507r1306P97J09506m8079k0936m320L7848l5706K2813Q240
1404a36211L2300p0687k04049L9065J41821p387K8004j3229N8400N2759K8250
$$ plain form
1393 -50964 68729 41743 19842 -39073 -35936 94105 -9291 -76654 -32354 -78710 11476
1382 11476 110377 -92426 -18542 -172588 -52652 -40561 -70388 -80354 140832 247921 61546
1371 61546 81409 -26638 -123428 294194 301307 298612 20839 -48677 77844 -149026 -217887
1360 -217887 -25632 194663 282054 234105 5572 120817 -13486 53663 205345 6435
1350 6435 -31039 196579 410067 216802 174072 83651 50934 127145 -55955 -89852 -114762
1339 -114762 -167559 -34883 43910 -20979 -39758 -108513 47740 115760 83470 -35326 -216947
1328 -216947 -299118 -35682 -29776 -259584 -178854 -235424 -221541 -123235 -18838 -150258 -260584
1317 -260584 -202853 -94810 65512 -9853 41612 4834 -200313 -193124 -161316 -47124 11003
$$ packed form
1393e0964J19693k6986k1901n8915L137J30041j03396o7363M4300m6356R0186
1382A1476R8901k02803P3884j54046J19936J2091k9827r966K21186J07089j86375
1371F1546J9863j08047r6790M17622P113k695k77773o9516J26521k26870o8861
1360b17887J92255K20295Q7391m7949k28533J15245j34303O7149J51682j98910
1350F435l7474K27618K13488j93265m2730r0421l2717P6211j83100l3897k4910
1339a14762n2797J32676P8793o4889j8779o8755J56253O8020l2290j18796j81621
1328b16947q2171K63436N906k29808Q0730n6570J3883R8306J04397j31420j10326
1317b60584N7731J08043J60322p5365N1465l6778k05147P189L1808J14192N8127
$$ plain form
1306 11003 -80377 -244876 -259818 -185401 43621 -100925 -59614 -127962 -113977 52241 -80187
1295 -80187 3525 -25498 56768 18963 -10244 47841 -37218 -191265 -172135 -158521 -29468
1284 -29468 73223 127304 -196 -24561 -54407 -56658 -15190 7104 -152490 -135917 -215821
1273 -215821 -181362 -1782 -142326 20467 -89493 -286045 -85431 192260 78787 -31552
1263 -31552 -145687 -225743 -19054 61858 -104705 -252816 -186543 -127787 84508 -91842 -91011
1252 -91011 166905 -92704 -169398 -222146 -199301 -150719 -218333 -112809 -87280 62662 -5347
1241 -5347 -10784 -126464 -92201 -42451 32393 15695 198201 172628 269267 33239 -99709
1230 -99709 -142848 -9326 10617 -117933 71047 -105083 24320 -632 -108727 -52344 8490
$$ packed form
1306A1003r1380j64499j4942P4417K29022j44546M1311o8348J3985J66218j32428
1295h0187Q3712k9023Q2266l7805k9207N8085q5059j54047J9130J3614J29053
1284b9468J02691N4081j27500k4365k9846k251M1468K2294j59594J6573p9904
1273b15821L4459J79580j40544J62793j09960j96552K00614K77691j13473j10339
1263c1552j14135q0056K06689Q0912j66563j48111O6273N8756K12295j76350Q31
1252i1011K57916k59609p6694n2748K2845M8582o7614J05524K5529J49942o8009
1241e347n437j15680L4263M9750P4844j6698J82506k5573R6639k36028j32948
1230i9709m3139J33522J9943j28550J88980j76130J29403k4952j08095N6383O0834
$$ plain form
1219 8490 -22950 -48414 513 107530 140354 27229 -25249 -136720 -106522 109330 -3033
1208 -3033 34916 101299 87786 -164335 -309823 -201058 -55774 -104662 -143320 -98428 -159604
1197 -159604 -160212 -133488 -192929 75827 63526 -25129 73941 -70651 -52795 72303 84507
1186 84507 27155 53605 64290 -52628 64517 -2987 52882 48711 224532 253889 1939
1175 1939 -259271 -167296 -232632 -219425 -246492 -402796 -310945 -153786 -183767 -78221 -286625
1164 -286625 -326802 -162228 -419908 -260473 -2605 77432 73282 64931 120022 109024 294040
1153 294040 193441 -147408 -298325 -93239 -226029 -326657 -243855 -163414 -16997 -171195
1143 -171195 -151241 -46305 14393 -99844 -180251 -169997 -191513 -47521 51862 160605 200987
$$ packed form
1219H490l1440k5464M8927J07017L2824j13125n2478j11471L0198K15852j12363
1208c033L7949O6383j3513k52121j45488J08765J45284m8888l8658M4892o1176
1197a59604o08K6724n9441K68756j2301q8655R9070j44592J7856J25098J2204
1186H4507n7352K6450J0685j16918J17145o7504N5869m171J75821K9357k51950
1175A939k61210R1975o5336J3207k7067j56304R1851J57159k9981J05546k08404
1164b86625m0177J64574k57680J59435K57868Q0037m150q351N5091j0998J85016
1153B94040j00599l40849j50917K05086j32790j00628Q2802Q0441J46417j54198
1143a71195J9954J04936O0698j14237q0407J0254k1516J43992R9383J08743M0382
$$ plain form
1132 200987 -74220 3934 -108832 -107459 81462 -84311 -252371 -214456 -195201 -214935 -198264
1121 -198264 63685 -102247 -10242 147836 289657 38236 17385 -62221 -130545 -174484 146792
1110 146792 339595 106011 -35902 5379 57932 -28720 170836 92350 -6390 -101656 -38807
1099 -38807 -40149 -4581 -169932 -254921 -78636 -114750 -16631 -74875 -61695 -125713 -93605 -52886
1087 -52886 -41735 5720 -226304 -179088 -4455 37562 22080 135435 298694 352165 266742
1076 266742 64060 -102362 -161058 -314898 -237765 -80459 -102968 -94200 127040 -101612 -129272
1065 -129272 16234 -55331 -146468 -7221 5275 145255 44089 -148517 -115911 -210930 -120956
1054 -120956 39763 108564 245730 137228 54161 2728 -192841 -149546 -109997 -114050 -64004
$$ packed form
1132B00987k75207P8154j12766J373J88921j65773j68060L7915J9255j9734J6671
1121a98264K61949j65932R2005J58078J41821k51421k0851p9606o8324m3939L21276
1110A46792J92803k33584j41913M1281N2553q6652J99556p8486r8740r5266O2849
1099c8807j342L5568j65351q4989J76285l6114R8119n8244J3180o4018L2108M0719
1087e2886J1151M7455k32024M7216J74633M2017j5482J13355J63259N3471q5423
1076B66742k02682j66422n8696j53840P7133J57306k2509Q768K21240k28652k7660
1065a29272J45506p1565r1137J39247J2496J39980j01166j92606L2606r5019Q9974
1054a20956J60719O8801J37166j08502q3067n1433j95569M3295L9549m053N0046
$$ plain form
1043 -64004 -34692 -315789 -190332 -154582 -215233 -191387 -64572 -58619 42193 126860 144608
1032 144608 136378 1549 -38335 -195828 -134175 60236 41850 -138691 -101628 69679 72953
1021 72953 122490 129870 43698 -99042 -217016 -94852 -22932 -79425 93930 97048 136079
1010 136079 295590 125717 40532 132875 45990 88748 153685 92861 64563 -21563 -13728
999 -13728 7828 105056 246859 80534 -46450 -64790 -158813 -96536 -211198 -83877 36723
988 36723 -114659 -8224 71145 29964 59644 17086 46291 -156307 -124362 -187307 13401
977 13401 99159 -151771 -64855 -83013 -180015 -179900 -10900 24761 -178749 -226833 -96615 -362856
965 -362856 -210480 122180 47552 89196 75120 -22507 97202 163200 51319 45776 -105782
$$ packed form
1043f4004K9312k81097J25457L5750o0651K3846J26815N953J00812Q4667J7748
1032A44608q230j34829l9884j57493O1653J94411j8386j80541L7063J71307L274
1021G2953M9537P380q6172j42740j17974J22164P1920n6493J73355L118L9031
1010A36079J59511j69873q5185R2343q6885M2758O4937o0824k8298q6126P835
999a3728K1556R7228J41803j66325j26984j8340r4023O2277j14662J27321J20600
988C6723j51382J06435P9369m1181K9680m2558K9205k02598L1945o2945K00708
977A3401Q5758k50930Q6916j8158r7002J15J69000L5661k03510m8084J30218k66241
965c62856J52376L32660p4628M1644j4076r7627J19709O5998j11881n543j51558
$$ plain form
954 -105782 -100465 231615 343334 227226 151438 38497 -36788 123709 75938 80504 52464
943 52464 -103205 -131834 -62757 235884 168370 -16421 69422 17405 157834 121510 1223
932 1223 -182550 -74317 -143355 -290300 -72223 86739 54412 120576 286639 23575 21045
921 21045 144731 161247 -114195 -6374 213777 99370 4526 153108 137853 -49145 -63275
910 -63275 134836 -41073 -71172 109245 65670 -32587 -67198 -110802 -316888 -282356 132241
899 132241 168242 -17168 -80276 -264322 -252794 -76145 61487 -68205 15092 -142778 -190328
888 -190328 -94565 -227732 -142719 13241 -183831 -88212 54269 212165 217054 -231583 -42772
877 -42772 297976 231247 118273 -27612 -130110 -130825 -93945 101227 39181 -202488 -125959
$$ packed form
954a05782N317L32080J11719j16108p5788j12941p5285J60497m7771M566k8040
943E2464j55669k8629O9077K98641o7514j84791Q5843n2017J40429l6324j20287
932A223j83773J08233o9038j46945K18077J58962l2327O6164J66063k63064k530
921B1045J23686J6516k75442J07821K20151j14407r4844J48582j5255j86998j4130
910f3275J98111j75909l0099J80417m3575r8257l4611m3604k06086L4532M14597
899A32241L6001j85410o3108j84046J1528J76649J37632j29692Q3297j57870m7550
888a90328R5763j33167Q5013J55960j97072R5619J42481J57896M889m48637J88811
877d2772L40748o6729j12974j45885j02498p15L6880J95172o2046k41669P6529
$$ plain form
866 -125959 -53917 25174 64639 131515 -157512 -59468 -42962 -228185 -46471 -234137 -206943
855 -206943 -96230 -129248 -48624 -169471 29979 102434 94080 87207 -64544 -2457 -89708
844 -89708 67210 20615 -176484 -169512 -15324 -105406 -64860 58226 -12117 -32212 17681
833 17681 -27006 -66069 -290628 -297309 -136247 -157835 -143507 30000 -39714 2551 50690 18331
821 18331 -43775 -99660 80190 120217 175798 118131 50444 289329 160087 -37169 187248
810 187248 74027 88866 -68413 -1701 -120296 -70943 80157 -77535 -114515 -15142 25032
799 25032 112340 -56218 -177614 -13126 12102 -151113 37491 -66979 -256094 -23127
789 -23127 -120589 -56342 -37155 -281165 -365266 -109896 -236346 -270523 -118890 -204303 -238295
$$ packed form
866a25959P2042P9091L9465O6876k89027R8044J6506j85223J81714j87666K7194
855b06943J10713l3018Q0624j20847J99450P2455q354o873j51751O2087q7251
844h9708J56918m6595j97099O972J54188r0082M0546J23086p0343k0095M9893
833A7681m4687l9063k24559o681J61062k1588J4328J73507o9714M2265M8139l2359
821A8331o2106n5885J79850M0027N5581n7667o7687K38885j29242j97256K24417
810A87248j13221J4839j57279O6712j18595M9353J51100j57692l6980R9373M0174
799B5032Q7308j68558j21396J64488K5228j63215J88604j04470j89115K32967
789b3127r7462O4247J9187k44010q4101K55370j26450l4177J51633q5413l3992
$$ plain form
778 -238295 -129024 49637 -40766 -203003 102822 140902 155524 43739 -157539 -214639 27071
767 27071 92055 298181 228669 -49136 -202134 -156144 -121361 -6811 298473 208034 324645
756 324645 148050 31781 -21551 -77132 -211013 -105581 -101587 -41583 137525 349339 215476
745 215476 127458 -61864 7849 -23978 7154 -26270 154087 378044 238698 111339 -75062
734 -75062 -49888 -44894 42930 77551 47924 -18767 -58769 25858 -107506 -140485 163778 222862
722 222862 55008 -56348 -184803 -386738 -321859 -257155 9249 -48675 -143253 -173697 -136939
711 -136939 -263417 180657 256174 143064 121997 80565 291331 317969 120671 280837 91160
700 91160 23210 161667 317561 320240 179541 59360 -18835 -3189 44270 -136502 -178855
$$ packed form
778b38295J09271J78661r0403j62237L05825L8080J4622j11785k01278n7100K41710
767B7071O4984K06126o9512k77805j52998M5990L4783J14550L05284r0439J16611
756C24645j76595j16269n3332n5581j33881J05432L994O0004J79108K11814j33863
745B15476q8018j89322O9713l1827L1132l3424J80357K23957j39346j27359j86401
734g5062K5174M994Q7824L4621k9627o6691m0002Q4627j33364l2979L04263N9084
722B22862j67854j11356j28455k01935O4879O4704K66404n7924r4578l0444L6758
711a36939j26478M44074P5517j13110k1067m1432K10766K6638j97298J60166j89677
700I1160o7950J38457J55894K679j40699j20181p8195J5646M7459j80772m2353
$$ plain form
689 -178855 20772 -68711 -297886 -186156 -58320 27014 136911 82629 115088 46102 -96968
678 -96968 -351628 -120921 -28026 50447 45838 -180139 -63057 113439 41542 180240 -43721
667 -43721 -134486 32815 -10693 -32965 37874 177354 297050 377101 109053 -11887 29027
656 29027 301967 115445 -122572 25890 697 22336 95609 -53203 -20090 2945 -76811
645 -76811 14167 85818 -81760 -199283 39658 -10008 5084 -101966 -53551 -70025 -18348
634 -18348 113910 158285 20736 13101 59732 198290 85034 123169 -168492 -168710 97585
623 97585 -42619 -85454 -6345 103752 71229 134077 141596 -45734 -989 83668 -28016
612 -28016 -135802 77701 190066 147193 40020 -6063 42338 198649 147738 142107 95785
$$ packed form
689a78855J99627q9483k29175J11730J27836Q5334J09897n4282L2459o8986j43070
678i6968k54660K30707R2895P8473m609k25977J17082J76496p1897J38698k23961
667d3721r0765J67301m3508k2272P0839J39480J19696Q0051k68048j20940M0914
656B9027K72940j86522k38017J48462k5193K1639P3273j48812L3113K3035p9756
645g6811R0978P1651j67578j17523K38941m9666J5092j07050M8415j6474N1677
634a8348J32258M4375j37549p635M6631J38558j13256L8135k91661k18K66295
623I7585j40204m2835P9109J10097l2523O2848P519j87330M4745Q4657j11684
612b8016j07786K13503J12365m2873j07173m6083M8401J56311n0911n631m6322
$$ plain form
601 95785 -8342 -60035 -22050 48767 64090 20738 -115410 -178185 100206 94273 73177 173896
589 173896 89974 132546 -61762 -109224 -96835 -98977 -35842 -211889 -229666 -154518 -123877 -75717
577 -75717 89484 103827 -142532 -114626 17703 74243 150125 174110 14974 -106725 -204552
566 -204552 -151415 -60325 66574 163859 5021 -80166 -94807 -197539 -140893 -152683 -215654
555 -215654 -231989 266817 219689 137992 96975 106761 -21549 137669 48647 -36593 -232080
544 -232080 -72672 -124323 -1914 88379 -59470 27914 -83651 -87634 -79798 47286 107946
533 107946 56773 179072 254615 211325 326203 209058 11848 59268 27562 -139208 -87004
522 -87004 -17901 56585 43432 19376 143264 92199 50511 -46537 -122485 -173607 -9991 299497
$$ packed form
601I5785j04127n1693L7985P0817J5323m3352j36148o2775K78391n933k1096J00719
589A73896q3922M2572j94308m7462J2389k142O3135j76047j7777P5148L0641M8160
577g5717J65201J4343k46359K7906J32329N6540P5882K3985j59136j21699r7827
566b04552N3137R1090J26899R7285j58838q5187j4641j02732N6646j1790o2971
555b15654j6335M98806m7128q1697m1017R786j28310J59218q9022q5240j95487
544b32080J59408n1651J22409R0293j47849Q7384j11565l983P836J27084O0660
533A07946n1173J22299P5543m3290J14878j17145j97210M7420l1706j66770N2204
522h7004O9103P4486j3153k4056J23888n1065m1688r7048p5948n1122J63616L09488
$$ plain form
510 299497 56167 798 -1155 283619 307808 -39518 93552 137820 96785 -48610 -38356
499 -38356 218629 116110 -78550 -176427 -85900 53497 67768 150667 114760 12970 76260
488 76260 117071 168093 90064 3765 -184111 -78682 -72451 -2946 22088 29765 27430 170431
476 170431 253050 119747 102739 97233 6372 224292 203503 66508 142910 130499 182495
465 182495 44033 -110682 -19048 12323 158511 53359 -33521 -21189 -50135 -119491 -348407
454 -348407 9509 34326 -65575 168115 223663 98008 -9005 -15955 -15056 -173868 -9620
443 -9620 137598 62607 -12178 123118 311800 172699 67746 -114905 -232430 -9214 206496
432 206496 213743 103277 -139321 16049 120651 186503 171416 172097 -32400 -47127 -44381 -144191
$$ packed form
510B99497k43330n5369j953K84774K4189l47326J33070M4268m1035j45395J0254
499c8356K56985j02519j94660r7877R0527J39397J4271Q2899l5907j01790O3290
488G6260M0811N1022p8029q6299j87876J05429O231O9505K5034P677k335J43001
476A70431Q2619j33303j7008n506r0861K17920k0789j36995P6402j2411N1996
465A82495j38462j54715R1634L1371J46188j05152q6880J2332k8946o9356k28916
454c48407L57916K4817r9901K33690N5548j25655j07013o950Q99j58812J64248
443i620J47218p4991p4785J35296J88682j39101j04953j82651j17525K23216K15710
432B06496P247j10466k42598J55370J04602O5852j5087O81k04497j4727K746r9810
$$ plain form
420 -144191 -15481 69885 206818 124440 75498 93577 91834 126638 89475 -85081 -195684
409 -195684 -196771 -81835 -198773 -377907 -219987 5147 -10995 40682 -271 244377 134475
398 134475 -97900 -16197 -10123 -21751 -27330 -37802 70077 278878 184331 147171 38862
387 38862 79525 272547 33400 117593 101970 -182179 63296 266016 122724 186286 229002
376 229002 66466 124205 -43367 113511 204926 -48011 131925 157536 56249 179309
$$ packed form
420a44191J28710Q5366J36933q2378m8942J8079j743L4804l7163j74556j10603
409a95684j087J14936j16938j79134J57920K25134j6142N1677m0953K44648j09902
398A34475k32375Q1703O074j1628n579j0472J07879K08801r4547l7160j08309
387C8862M0663J93022k39147Q4193j5623k84149K45475K02720j43292O3562M2716
376B29002j62536N7739j67572J56878R1415k52937J79936K5611j01287J23060
$$ [...]
##END NTUPLES=NMR SPECTRUM
##END=
