##TITLE=1H_TG-2370
 CDCl3
 8 sc, 
 23.1.2023
##JCAMPDX= 6.0         $$ Bruker NMR JCAMP-DX V2.0
##DATA TYPE= NMR SPECTRUM
##DATA CLASS= NTUPLES
##ORIGIN= UXNMR, Bruker Analytische Messtechnik GmbH
##OWNER= root
$$ XWIN-NMR		Version 3.5
$$ Mon Jan 23 14:42:44 2023 Russian Standard Time (UT+4h)  she@DPX200
##.OBSERVE FREQUENCY= 200.13135
##.OBSERVE NUCLEUS= ^1H
##.ACQUISITION MODE= SIMULTANEOUS
##.ACQUISITION SCHEME= undefined
##.AVERAGES= 8
##.DIGITISER RES= 18
##SPECTROMETER/DATA SYSTEM= spect
##.PULSE SEQUENCE= zg30
##.SOLVENT NAME= CDCl3
##.SHIFT REFERENCE= (INTERNAL, CDCl3, 0, 15.7822)
##AUDIT TRAIL= $$ (NUMBER, WHEN, WHO, WHERE, WHAT)
$$ ##TITLE= Audit trail, XWIN-NMR		Version 3.5
$$ ##JCAMPDX= 5.01
$$ ##ORIGIN= Bruker BioSpin GmbH
$$ ##OWNER= she
$$ F:/spectra/data/she/nmr/H-F/1/pdata/1/auditp.txt
$$ ##AUDIT TRAIL=  $$ (NUMBER, WHEN, WHO, WHERE, WHAT)
(   1,<2023-01-23 14:41:07.17 +0400>,<she>,<DPX200>,
      <created by zg, POWCHK disabled, PULCHK disabled
       configuration hash MD5:
       00 E9 B6 7A A2 85 ED C7 34 08 36 98 17 FE 4E 26
       data hash MD5: 16K
       9F 14 6B 3A 04 DC F8 CA 76 9F 44 A7 7A 82 D9 80>)
(   2,<2023-01-23 14:41:49.04 +0400>,<she>,<DPX200>,
      <Start of raw data processing
       efp BC_mod = 2 LB = 0.24 FT_mod = 6 PKNL = 1 PHC0 = -19112.27 PHC1 = 12.40079 SI = 16K 
       data hash MD5: 16K
       DE EF 5A 9C A4 9F D3 B0 34 76 9C 53 67 6F B0 AE>)
(   3,<2023-01-23 14:42:04.00 +0400>,<she>,<DPX200>,
      <pk PHC0 = -1.123867 PHC1 = 2.2 
       data hash MD5: 16K
       AF F2 FA 25 A2 3B F7 5E 4A 1C DE 1C 66 2D 64 ED>)
(   4,<2023-01-23 14:42:07.45 +0400>,<she>,<DPX200>,
      <abs ABSG = 5 
       data hash MD5: 16K
       81 E4 A3 07 2C 54 B0 27 D4 F6 4D 07 53 28 47 8F>)
$$ ##END=
$$ 
$$ hash MD5
$$ 8E 50 D6 B8 13 60 B4 F3 54 E4 D8 BB B8 92 9A DD
##$RELAX= 
##$RELAX= 
##$RELAX= 
##$RELAX= 
##$RELAX= 
##$RELAX= 
$$ Bruker specific parameters
$$ --------------------------
##$DU= <F:/spectra>
##$EXPNO= 1
##$NAME= <H-F>
##$PROCNO= 1
##$TYPE= <nmr>
##$USER= <she>
##$AMP= (0..31)
100 100 100 100 100 100 100 100 100 100 100 100 100 100 100 100 100 100 
100 100 100 100 100 100 100 100 100 100 100 100 100 100 
##$AQSEQ= 0
##$AQ_mod= 1
##$AUNM= <au_zg>
##$AUTOPOS= <>
##$BF1= 200.13
##$BF2= 200.13
##$BF3= 200.13
##$BF4= 200.13
##$BF5= 200.13
##$BF6= 200.13
##$BF7= 200.13
##$BF8= 200.13
##$BYTORDA= 1
##$CFDGTYP= 0
##$CFRGTYP= 5
##$CHEMSTR= <none>
##$CNST= (0..31)
1 1 145 1 1 1 1 1 1 1 1 1 1 1 1 1 1 1 1 1 1 1 1 1 1 1 1 1 1 1 1 1 
##$CPDPRG= <>
##$CPDPRG1= <>
##$CPDPRG2= <>
##$CPDPRG3= <>
##$CPDPRG4= <mlev>
##$CPDPRG5= <mlev>
##$CPDPRG6= <mlev>
##$CPDPRG7= <mlev>
##$CPDPRG8= <mlev>
##$CPDPRGB= <>
##$CPDPRGT= <>
##$D= (0..31)
0 1.2 0 0 0 0 0 0 0 0.06 0 0.03 0 0 0 0 0.0002 0 0 0 0 0 0 0 0 0 0 0 0 
0 0 0 
##$DATE= 1674470466
##$DBL= (0..7)
120 120 120 120 120 120 120 120 
##$DBP= (0..7)
150 150 150 150 150 150 150 150 
##$DBP07= 0
##$DBPNAM0= <>
##$DBPNAM1= <>
##$DBPNAM2= <>
##$DBPNAM3= <>
##$DBPNAM4= <>
$$ [...]
##$SUBNAM3= <"">
##$SUBNAM4= <"">
##$SUBNAM5= <"">
##$SUBNAM6= <"">
##$SUBNAM7= <"">
##$SUBNAM8= <"">
##$SUBNAM9= <"">
##$SW= 18.05172834244
##$SWIBOX= (0..15)
0 0 2 0 0 0 0 0 0 0 0 0 0 0 0 0 
##$SW_h= 3612.71676300578
##$TD= 16384
##$TD0= 1
##$TE= 0
##$TE2= 300
##$TE3= 300
##$TEG= 300
##$TL= (0..7)
0 120 120 120 120 120 120 120 
##$TP= (0..7)
150 150 150 150 150 150 150 150 
##$TP07= 0
##$TPNAME0= <>
##$TPNAME1= <>
##$TPNAME2= <>
##$TPNAME3= <>
##$TPNAME4= <>
##$TPNAME5= <>
##$TPNAME6= <>
##$TPNAME7= <>
##$TPOAL= (0..7)
0.5 0.5 0.5 0.5 0.5 0.5 0.5 0.5 
##$TPOFFS= (0..7)
0 0 0 0 0 0 0 0 
##$TUNHIN= 0
##$TUNHOUT= 0
##$TUNXOUT= 0
##$USERA1= <user>
##$USERA2= <user>
##$USERA3= <user>
##$USERA4= <user>
##$USERA5= <user>
##$V9= 5
##$VALIST= <valist>
##$VCLIST= <CCCCCCCCCCCCCCC>
##$VD= 0
##$VDLIST= <DDDDDDDDDDDDDDD>
##$VPLIST= <PPPPPPPPPPPPPPP>
##$VTLIST= <TTTTTTTTTTTTTTT>
##$WBST= 1024
##$WBSW= 4
##$XGAIN= (0..3)
0 0 0 0 
##$XL= 0
##$YL= 0
##$YMAX_a= 249888
##$YMIN_a= -373931
##$ZGOPTNS= <>
##$ZL1= 120
##$ZL2= 120
##$ZL3= 120
##$ZL4= 120
##$ABSF1= 15.74468
##$ABSF2= -2.307169
##$ABSG= 5
##$ABSL= 3
##$ALPHA= 0
##$AQORDER= 0
##$ASSFAC= 0
##$ASSFACI= 0
##$ASSFACX= 0
##$ASSWID= 0
##$AUNMP= <proc_1d>
##$AZFE= 0.1
##$AZFW= 0.1
##$BCFW= 0
##$BC_mod= 2
##$BYTORDP= 0
##$COROFFS= 0
##$CY= -3
##$DATMOD= 1
##$DC= 0
##$DFILT= <>
##$DTYPP= 0
##$F1P= 0
##$F2P= 0
##$FCOR= 1
##$FTSIZE= 16384
##$FT_mod= 6
##$GAMMA= 0
##$GB= 0
##$INTBC= 1
##$INTSCL= 3.70164e-10
##$ISEN= 128
##$LB= 0.24
##$LEV0= 0
##$LPBIN= 0
##$MAXI= 10000
##$MC2= 0
##$MEAN= 0
##$ME_mod= 0
##$MI= 1.114404
##$NCOEF= 0
##$NC_proc= -6
##$NLEV= 6
##$NOISF1= 3.799351
##$NOISF2= 2.8
##$NSP= 0
##$NTH_PI= 0
##$NZP= 0
##$OFFSET= 15.78215
##$PC= 1
##$PHC0= -19113.39
##$PHC1= 14.60079
##$PH_mod= 1
##$PKNL= yes
##$PPARMOD= 0
##$PSCAL= 0
##$PSIGN= 0
##$REVERSE= no
##$SF= 200.129997876434
##$SI= 16384
##$SIGF1= 3
##$SIGF2= 2
##$SINO= 5.538805
##$SIOLD= 16384
##$SREGLST= <1H.CDCl3>
##$SSB= 0
##$STSI= 16384
##$STSR= 0
##$SW_p= 3612.71676300578
##$SYMM= 0
##$S_DEV= 0
##$TDeff= 16384
##$TDoff= 0
##$TI= <>
##$TILT= no
##$TM1= 0
##$TM2= 0
##$TOPLEV= 0
##$USERP1= <user>
##$USERP2= <user>
##$USERP3= <user>
##$USERP4= <user>
##$USERP5= <user>
##$WDW= 1
##$XDIM= 16384
##$YMAX_p= 401253194
##$YMIN_p= -1368727
$$ End of Bruker specific parameters
$$ ---------------------------------
##NTUPLES= NMR SPECTRUM
##VAR_NAME=  FREQUENCY,     SPECTRUM/REAL,   SPECTRUM/IMAG
##SYMBOL=    X,             R,               I
##VAR_TYPE=  INDEPENDENT,   DEPENDENT,       DEPENDENT
##VAR_FORM=  AFFN,          ASDF,            ASDF
##VAR_DIM=   16384,         16384,           16384
##UNITS=     HZ,            ARBITRARY UNITS, ARBITRARY UNITS
##FACTOR=    0.220516191357247, 1,           1
##FIRST=     3158.48169973141, 0,            0
##LAST=      -454.235063274368, 0,           0
##MIN=       -454.235063274368, -1368727,    0
##MAX=       3158.48169973141, 401253194,    0
$$ Real data points
##PAGE= N=1
##DATA TABLE= (X++(R..R)), XYDATA
$$ [...]
$$ plain form
6532 -110681 -162320 -126910 -172882 -116780 -5342 -24012 -80618 -100545 15612 13183 -60063
6521 -60063 -116719 -39191 -79246 756 41118 -3677 34084 -61068 -114102 -137223 -155616 -209003
6509 -209003 -75973 -8414 -140495 -86215 -33586 65074 89515 119899 91820 107660 405872
6498 405872 206868 149945 103910 77630 41143 -7714 -77191 -134956 22664 -87373 49835
6487 49835 101453 -87220 -471 -13660 124062 63160 156226 68017 105942 -3643 132391
6476 132391 -3449 64420 175941 23443 -29180 148590 46628 -34908 -26773 87336 100320
6465 100320 330761 195505 13134 153753 82037 178013 117507 216608 279322 80829 -5006
6454 -5006 -37224 -6297 -70970 -56129 -49790 -44269 -92219 -95851 64925 -68644 -149583 -55381
$$ packed form
6532a10681n1639L5410m5972N6102J11438j8670n6606j9927J16157k429p3246
6521f0063n6656P7528m0055Q0002M0362m4795L7761r5152n3034k3121j8393n3387
6509b09003J33030O7559j32081N4280N2629R8660K4441L0384k8079J5840K98212
6498D05872j99004n6923m6035k6280l6487m8857o9477n7765J57620j10037J37208
6487D9835N1618j88673Q6749j3189J37722o0902R3066q8209L7925j09585J36034
6476A32391j35840O7869J11521j52498n2623J77770j01962q1536Q135J14109J2984
6465A00320K30441j35256j82371J40619p1716R5976o0506R9101O2714j98493q5835
6454e006l2218L0927o4673J4841O339N521m7950l632J60776j33569q0939R4202
$$ plain form
6442 -55381 -35007 -80870 28150 -60736 -55809 -59772 -42189 197785 60751 -76843 19147
6431 19147 52024 95025 115660 132463 161359 180384 47496 2761 -117522 -71760 -12475
6420 -12475 -74915 -111446 -183042 -62910 36338 54974 26022 80821 11093 -174612 -36474
6409 -36474 -37357 -17486 29968 12921 126277 170649 57592 32483 -51482 -203548 -97264
6398 -97264 54199 -49838 -185825 -170618 -18953 -28526 24168 -137651 14445 37145 89733
6387 89733 -78882 -211120 -141148 -105431 -163494 -53022 50068 30345 73583 61363 16714
6376 16714 -96 28860 -14270 155788 153706 87116 144530 -22618 -13765 74667 -67882 -72765
6364 -72765 -58127 -79293 -50336 -105963 -95525 -24672 -41574 97439 98322 150334 130779 169105
$$ packed form
6442e5381K0374m5863J09020q8886M927l963J7583K39974j37034j37594R5990
6431A9147L2877M3001K0635J6803K8896J9025j32888m4735j20283M5762N9285
6420a2475o2440l6531p1596J20132R9248J8636k8952N4799o9728j85705J38138
6409c6474q83J9871M7454j7047J13356M4372j13057k5109q3965j52066J06284
6398i7264J51463j04037j35987J5207J51665r573N2694j61819J52096K2700N2588
6387H9733j68615j32238O9972L5717n8063J10472J03090j9723M3238j2220m4649
6376A6714j6810K8956m3130J70058k082o6590N7414j67148Q853Q8432j42549m883
6364g2765J4638k1166K8957n5627J0438P0853j6902J39013Q83N2012j9555L8326
$$ plain form
6352 169105 92309 59469 79140 46675 71995 131152 39290 40265 -16966 -108142 -19284 226241
6340 226241 69533 121423 66543 -59459 -46507 93743 212483 167066 265822 136726 -34338
6329 -34338 -31467 133509 3533 -89741 -66538 -33844 22263 -34329 92993 155498 98130
6318 98130 68349 -168736 -124752 28672 18072 195169 142083 26402 103791 -73222 95479
6307 95479 11089 -120521 -56982 -110598 -197530 -51299 -19678 98244 41026 -84490 -77903
6296 -77903 -4802 26551 106804 220953 88936 56969 758 -84688 -178971 -139544 -29430
6285 -29430 9374 -71082 43159 135970 206747 203190 267051 84812 8894 136410 127620 183204
6273 183204 131726 27104 121199 231265 65076 138042 172844 50027 -30283 43695 30682
$$ packed form
6352A69105p6796l2840J9671l2465K5320N9157r1862R75n7231r1176Q8858K45525
6340B26241j56708N1890n4880j26002J2952J40250J18740m5417R8756j29096j71064
6329c4338K871J64976j29976r3274K3203L2694N6107n6592J27322O2505n7368
6318I8130k9781k37085M3984J53424j0600J77097n3086j15681P7389j77013J68701
6307I5479q4390j31610O3539n3616q6932J46231L1621J17922n7218j25516O587
6296g7903P3101L1353Q0253J14149j32017l1967n6211q5446r4283L9427J10114
6285b9430L8804q0456J14241R2811P0777l557O3861j82239p5918J27516q790N5584
6273A83204n1478j04622R4095J10066j66189P2966L4802j22817q0310P3978j3013
$$ plain form
6262 30682 90364 -77339 -90920 -115841 -176779 -66769 10037 -9202 -14681 -16923 -9311 -28683
6250 -28683 13510 160143 64672 25054 -12225 -104940 -37323 -43582 2401 144746 198906 200197
6238 200197 138454 146258 23187 117326 118331 179383 -49354 -15955 -41899 107666 -74677
6227 -74677 -76078 79790 114028 95439 120924 166003 177336 88069 65759 -35951 87929
6216 87929 204423 147327 112446 107252 -31039 63304 211849 129280 45432 -14110 111425
6205 111425 112034 127798 94652 75460 100218 182432 117413 199131 224881 200533 128998 177043
6193 177043 190766 220501 155583 203807 230282 174366 113430 197069 214109 149167 307584
6182 307584 411654 335535 372980 340100 351809 386436 363516 257788 194551 156110 219413
$$ packed form
6262C0682N9682j67703j3581k4921o0938J10010P6806j9239n479k242P612j9372
6250b8683M2193J46633r5471l9618l7279r2715O7617o259M5983J42345N4160J291
6238B00197o1743P804j23071R4139J005O1052k28737L3399k5944J49565j82343
6227g4677j401J55868L4238j8589K5485M5079J1333q9267k2310j01710J23880
6216H7929J16494n7096l4881n194j38291R4343J48545q2569q3848n9542J25535
6205A11425O09J5764l3146j9192K4758Q2214o5019Q1718K5750k4348p1535M8045
6193A77043J3723K9735o4918M8224K6475n5916o0936Q3639J7040o4942J58417
6182C07584J04070p6119L7445l2880J1709L4627k2920j05728o3237l8441O3303
$$ plain form
6171 219413 424591 474023 492622 462484 544005 525658 357385 464388 517805 573614 440711
6160 440711 618467 751492 778390 772519 925079 918411 891170 776549 766947 669266 441862
6149 441862 507624 754710 620825 601128 450135 322524 467099 410743 509458 503047 564459
6138 564459 779314 826158 826736 776639 994673 1094671 1038566 1310497 1452389 1604732 1573557
6127 1573557 1293528 1107924 954746 944862 830889 656888 689347 662286 511083 445310
6117 445310 466374 492372 356735 361595 493497 441601 514375 654865 783643 667587 699344
6106 699344 757533 866164 868357 1051490 996009 953064 846724 799173 598990 609314 554855
6095 554855 573493 601690 417213 363159 240694 150218 256380 63797 196803 187298 38585
$$ packed form
6171B19413K05178M9432J8599l0138Q1521j8347j68273J07003N3417N5809j32903
6160D40711J77756J33025K6898n871J52560o668k7241j14621r602r7681k27404
6149D41862O5762K47086j33885j9697j50993j27611J44575n6356R8715o411O1412
6138E64459K14855M6844N78n0097K18034R9998n6105K71931J41892J52343l1175
6127A573557k80029j85604j53178r884j13973j74001L2459k7061j51203o5773
6117D45310K1064K5998j35637M860J31902n1896P2774J40490J28778j16056L1757
6106F99344N8189J08631K193J83133n5481m2945j06340m7551k00183J0324n4459
6095E54855J8638K8197j84477n4054j22465r0476J06162j92583J33006r505j48713
$$ plain form
6084 38585 252015 345076 478231 453410 412382 350194 381910 429947 362110 314969 222315
6073 222315 306606 304510 249378 166601 219228 279901 200998 227483 191473 172133 58983 143483
6061 143483 114101 55878 246762 337927 169016 253405 136387 74033 153059 202640 266072
6050 266072 286572 108511 85303 236413 199508 303512 161701 151483 33818 63184 199300
6039 199300 197059 362978 266394 131046 139411 171142 28498 -80653 -17536 221437 243680
6028 243680 34035 80113 30710 62006 147407 205263 232215 178614 155151 92209 101269 45735
6016 45735 37319 42169 842 -20049 24046 119608 145409 63825 103010 206983 174050 139848
6004 139848 180826 119527 206169 94001 33157 158011 190068 256009 201734 234007 180266
$$ packed form
6084C8585K13430R3061J33155k4821m1028o2188L1716M8037o7837m7141r2654
6073B22315Q4291k096n5132q2777N2627O0673p8903K6485l6010j9340j13150Q4500
6061A43483k9382n8223J90884R1165j68911Q4389j17018o2354P9026M9581O3432
6050B66072K0500j78061k3208J51110l6905J04004j41811j0218j17665K9366J36116
6039A99300k241J65919r6584j35348Q365L1731j42644j09151O3117K38973K2243
6028B43680k09645M6078m9403L1296Q5401N7856K6952n3601k3463o2942R060n5534
6016D5735q416M850m1327k0891M4095R5562K5801q1584L9185J03973l2933l4202
6004A39848M0978o1299Q6642j12168o0844J24854L2057O5941n4275L2273n3741
$$ plain form
5993 180266 146513 175512 250127 180162 52580 -5357 78906 117528 92322 160530 -24792
5982 -24792 -113036 -41955 -35255 -101392 -33395 172702 163106 45666 117321 11503 2639 68873
5970 68873 43154 85473 69500 -25319 120994 278746 199315 -343 123163 195368 135536
5959 135536 83083 86900 -75297 29351 24259 67066 53847 126530 175933 -20163 -159178
5948 -159178 -190826 -70258 -45372 44543 32484 -53380 52640 24297 62232 176807 67002
5937 67002 192443 199114 171536 249871 154796 58329 290076 104024 120919 208606 119358
5926 119358 57683 92719 102935 -81975 -104714 39397 61540 92248 47043 55534 51845 240084
5914 240084 283743 108411 117564 311310 263403 148424 150038 158778 92525 -59147 148871
$$ packed form
5993A80266l3753K8999P4615o9965j27582n7937Q4263L8622k5206O8208j85322
5982b4792q8244P1081O700o6137O7997K06097r596j17440P1655j05818q864O6234
5970F8873k5719M2319j5973r4819J46313J57752p9431j99658J23506P2205n9832
5959A35536n2453L817j62197J04648n092M2807j3219P2683M9403j96096j39015
5948a59178l1648J20568K4886Q9915j2059q5864J06020k8343L7935J14575j09805
5937F7002J25441O671k7578P8335r5075r6467K31747j86052J6895Q7687q9248
5926A19358o1675L5036J0216j84910k2739J44111K2143L0708m5205Q491l689J88239
5914B40084M3659j75332R153J93746m7907j14979J614Q740o6253j51672K08018
$$ plain form
5903 148871 106219 -15546 -29444 -55185 47426 102507 -50769 22553 75774 -35836 -77812
5892 -77812 1865 18288 -45920 169428 257738 393520 283506 200856 251714 277443 88469
5881 88469 83136 18803 -62094 54152 81098 144248 124570 41616 58837 -82238 -43255 252684
5869 252684 103395 -56337 -82371 3180 62664 19749 -1903 42013 149026 98633 127482
5858 127482 353340 243223 286335 253787 37518 -59462 69093 149469 114874 139331 210542
5847 210542 137771 70033 119527 113042 138338 231898 295096 246280 299840 271225 173287 281328
5835 281328 349487 335281 382539 298099 220159 276192 319503 161099 258273 348850 397689
5824 397689 281650 221013 203389 218908 351031 231549 317740 420073 253467 344568 346467
$$ packed form
5903A48871m2652j21765j3898k5741J02611N5081j53276P3322N3221j11610m1976
5892g7812P9677J6423o4208K15348Q8310J35782j10014q2650N0858K5729j88974
5881H8469n333o4333q0897J16246K6946O3150j9678q2954J7221j41075L8983K95939
5869B52684j49289j59732k6034Q5551N9484m2915k1652M3916J07013n0393K8849
5858A27482K25858j10117M3112l2548k16269r6980J28555Q0376l4595K4457P1211
5847B10542p2771o7738M9494o485K5296R3560O3198m8816N3560k8615r7938J08041
5835B81328O8159j4206M7258q4440p7940N6033M3311j58404R7174R0577M8839
5824C97689j16039o0637j7624J5519J32123j19482Q6191J02333j66606R1101J899
$$ plain form
5813 346467 185609 338261 243730 259898 279370 280791 374761 347756 218228 239616 186711
5802 186711 238534 222604 274190 180789 238980 529621 546457 476103 379704 295396 117373
5791 117373 258997 360680 320329 348731 417727 463607 443548 386084 300407 405031 534257
5780 534257 473992 334484 276831 257630 279196 322767 301187 329040 388749 208144 255943
5769 255943 291165 262623 163690 272139 449659 323966 252521 262120 401173 399087 403242
5758 403242 265158 330783 353177 246545 316457 479076 505075 420201 390738 143408 200090
5747 200090 383984 379246 242944 233088 323525 432431 474314 397738 558264 494458 421431
5736 421431 421202 395344 582738 640171 536123 463262 448691 616649 606624 602687 559110 536113
$$ packed form
5813C46467j60858J52652r4531J6168J9472J421R3970k7005j29528K1388n2905
5802A86711N1823j5930N1586r3401N8191K90641J6836p0354r6399q4308j78023
5791A17373J41624J01683m0351K8402O8996M5880k0059n7464q5677J04624J29226
5780E34257o0265j39508n7653j9201K1566M3571k1580K7853N9709j80605M7799
5769B55943L5222k8542r8933J08449J77520j25693p1445R599J39053k086M155
5758D03242j38084O5625K2394j06632O9912J62619K5999q4874k9463k47330N6682
5747B00090J83894m738j36302r856R0437J08906M1883p6576J60526o3806p3027
5736D21431k29k5858J87394N7433j04048p2861j4571J67958j0025l937m3577k2997
$$ plain form
5724 536113 509502 457624 475447 416918 413366 642528 616322 596438 553360 377479 399125
5713 399125 465857 545338 502058 526371 460401 518179 618061 486182 420484 485732 578158
5702 578158 491706 648707 649034 402665 459202 571276 699726 648603 464518 357882 446409
5691 446409 371539 323912 318978 290114 515909 524046 449742 449103 601358 769812 678235 702682
5679 702682 733368 585053 461775 513406 671179 520762 714028 824447 730123 673061
5669 673061 566351 739184 696182 637572 677208 833452 793526 671998 680178 702872 861566
5658 861566 668257 563354 761255 820725 908553 901914 800501 719316 749313 735430 678513
5647 678513 693271 828081 896487 959784 1002435 1027698 1059523 1159446 1111414 1003882 951672
$$ packed form
5724E36113k6611n1878J7823n8529l552K29162k6206j9884m3078j75881K1646
5713C99125O6732P9481m3280K4313o5970N7778R9882j31879o5698O5248R2426
5702E78158q6452J57001L27k46369N6537J12074J28450n1123j84085j06636Q8527
5691D46409p4870m7627m934k8864K25795Q137p4304o39J52255J68454r1577K4447
5679G02682L0686j48315j23278N1631J57773j50417J93266J10419r4324n7062
5669F73061j06710J72833m3002n8610L9636J56244l9926j21528Q180K2694J58694
5658H61566j93309j04903J97901N9470Q7828o639j01413q1185K9997j3883n6917
5647F78513J4758J34810O8406O3297M2651K5263L1825R9923m8032j07532n2210
$$ plain form
5636 951672 899744 917453 921893 831526 882880 821591 752036 845430 975318 922643 888302 988529
5624 988529 991659 1000814 1223557 1267952 1083606 1029028 1263562 1316821 1270900 1386692 1044677
5613 1044677 979385 1079237 1085751 965110 1032531 1065034 995076 971059 1147932 1046536 871024
5602 871024 972370 923175 963604 798968 828480 974484 1015681 1002980 1175627 1181845 1140783
5591 1140783 1215490 1084687 1234344 1245587 1277276 1408323 1456896 1349881 1429092 1449453 1541692
5580 1541692 1652834 1618845 1797894 1797049 1718352 1890159 1871085 1784836 1793762 1678315 1969590
5569 1969590 1979781 2015153 2200873 2086547 2187112 2340888 2303801 2243498 2325373 2406999 2612478
5558 2612478 2727598 2806291 2813960 2874698 2923497 2907231 3100645 3289578 3461949 3537355 3776143
$$ packed form
5636I51672n1928J7709M440r0367N1354o1289o9555R3394J29888n2675l4341J00227
5624I88529L130R155K22743M4395j84346n4578K34534N3259m5921J15792l42015
5613A044677o5292R9852O514j20641O7421L2503o9958k4017J76873j01396j75512
5602H71024J01346m9195M0429j64636K9512J46004M1197j2701J72647O218m1062
5591A140783P4707j30803J49657J1243L1689J31047M8573j07015P9211K0361R2239
5580A541692J11142l3989J79049q45p8697J71807j9074q6249Q926j15447K91275
5569A969590J0191L5372J85720j14326J00565J53776l7087o0303Q1875Q1626K05479
5558B612478J15120P8693P669O0738M8799j6266J93414J88933J72371P5406K38788
$$ plain form
5547 3776143 3934975 3893966 4115810 4229832 4428769 4771875 4853483 5089795 5545133 5962693
5537 5962693 6293332 6729379 7327960 7640395 7970505 8290800 8458965 8433679 8193348 8046324
5527 8046324 8035326 8104483 8273874 8327981 8335784 8485736 8894459 9312526 9865556 10774683
5517 10774683 11426026 12160430 12958790 14063211 14871600 15636381 16283886 16946110 17438712
5508 17438712 17571208 17668987 17848505 17677254 17149380 16759814 16636428 16678075 16962441 17151623
5498 17151623 17304115 17511469 17561832 17856121 18416991 19107054 19600846 20323327 21166250 21841076
5488 21841076 22412567 22830007 22823386 23003632 22988105 23100577 23069360 22898063 22925492 22974838
5478 22974838 22793604 22730826 22874942 22987786 22947619 22568029 22259132 21901509 21470418 21051280
$$ packed form
5547C776143J58832m1009K21844J14022J98937L43106Q1608K36312M55338M17560
5537E962693L30639M36047N98581L12435L30110L20295J68165k5286k40331j47024
5527H046324j0998O9157J69391N4107P803J49952M08723M18067N53030R09127
5517A0774683O51343P34404P98360J104421Q08389P64781O47505O62224M92602
5508A7438712J32496R7779J79518j71251n27874l89566j23386M1647K84366J89182
5498A7151623J52492K07354N0363K94289N60870O90063M93792P22481Q42923O74826
5488B1841076N71491M17440o621J80246j5527J12472l1217j71297K7429M9346
5478B2974838j81234o2778J44116J12844m0167l79590l08897l57623m31091m19138
$$ plain form
5468 21051280 20542439 20128492 19836736 19683792 19604507 19297475 19073981 18930292 18851119 18865215
5458 18865215 19131014 19499574 19751041 19911118 20152826 20136367 19993747 19868789 19382648 18786640
5448 18786640 17858109 16702502 15797620 14628182 13407345 12240519 11437700 10867289 10463138
5439 10463138 10152975 9879721 9709630 9835968 9961196 10259266 10714319 11222102 11542428
5430 11542428 11587840 11493860 10953284 10399043 9678919 8840697 7928940 7253660 6880882 6384249
5420 6384249 5954129 5738176 5499077 5178255 4810155 4691782 4433550 4434110 4358675 4246279
5410 4246279 4205217 4203700 4044406 3904919 3787841 3762322 3657991 3517227 3523601 3578252 3672949
5399 3672949 3776124 3789257 3885655 3839679 3681786 3622550 3551387 3422916 3663308 3670249 3505349
$$ packed form
5468B1051280n08841m13947k91756j52944p9285l07032k23494j43689p9173J4096
5458A8865215K65799L68560K51467J60077K41708j6459j42620j24958m86141n96008
5448A8786640r28531j155607r04882j169438j220837j166826q02819n70411m04151
5439A0463138l10163k73254j70091J26338J25228K98070M55053N07783L20326
5430A1542428M5412r3980n40576n54241p20124q38222r11757o75280l72778m96633
5420F384249m30120k15953k39099l20822l68100j18373k58232N60p5435j12396
5410D246279m1062j517j59294j39487j17078k5519j04331j40764O374N4651R4697
5399C672949J03175J3133R6398m5976j57893n9236p1163j28471K40392O941j64900
$$ plain form
5388 3505349 3557591 3578618 3707183 3743957 3650190 3791882 3944438 3966226 4183369 4316493
5378 4316493 4422000 4489709 4599176 4503718 4572693 4759228 4810441 5010094 5123839 4949106
5368 4949106 5078164 5089087 5316027 5345011 5549314 5693057 5760475 5821378 5731773 5954058
5358 5954058 6101605 6161309 6454275 6651763 6970985 7311796 7729264 7714371 7779340 7881399
5348 7881399 7900014 7981751 7956368 8139488 8130152 8302205 8412806 8761559 8948090 9287380
5338 9287380 9587476 9735220 10129752 10337730 10591216 10981891 11381138 11761000 12378075 12787797
5328 12787797 13229505 13815144 14408462 14973316 15543481 16250311 17277700 18529637 19621552
5319 19621552 20683677 21838982 23453330 25273822 27209435 29267082 31910685 34825210
$$ packed form
5388C505349N2242K1027J28565L6774r3767J41692J52556K1788K17143J33124
5378D316493J05507O7709J09467r5458O8975J86535N1213J99653J13745j74733
5368D949106J29058J0923K26940K8984K04303J43743O7418O0903q9605K22285
5358E954058J47547N9704K92966J97488L19222L40811M17468j4893O4969J02059
5348G881399J8615Q1737k5383J83120r336J72053J10601L48753J86531L39290
5338I287380L00096J47744L94532K07978K53486L90675L99247L79862O17075M09722
5328A2787797M41708N85639N93318N64854N70165P06830J027389J251937J091915
5319A9621552J062125J155305J614348J820492J935613K057647K643603K914525
$$ plain form
5311 34825210 38382354 42636163 47661411 53821558 61821257 72043925 84755468 98042174
5303 98042174 109521332 116124261 114167453 103414181 88727283 75433198 65242625
5296 65242625 57567076 51932597 47841408 44617222 42289189 40886677 40057475 39799166
5288 39799166 40452627 41410919 43337786 45854494 49469156 54541991 60787430 67586123
5280 67586123 74363444 80107250 83005795 82382649 79515670 75424839 69606393 61859014
5272 61859014 53265138 45934462 40175365 35205998 31477879 28331817 25633119 23366650
5264 23366650 21493855 19965033 18538441 17462507 16654772 15841133 15265964 14504835 14060915
5255 14060915 13734715 13522520 13381510 13239700 13169398 12815397 12409102 11797927 11437266 10890845
$$ packed form
5311C4825210L557144M253809N025248O160147P999699J0222668J2711543J3286706
5303I8042174J1479158O602929j956808j0753272j4686898j3294085j0190573
5296F5242625p675549n634479m091189l224186k328033j402512q29202k58309
5288C9799166O53461R58292J926867K516708L614662N072835O245439O798693
5280F7586123O777321N743806K898545o23146k866979m090831n818446p747379
5272F1859014q593876p330676n759097m969367l728119l146062k698698k266469
5264B3366650j872795j528822j426592j075934q07735q13639n75169p61129m43920
5255A4060915l26200k12195j41010j41810p0302l54001m06295o11175l60661n46421
$$ plain form
5245 10890845 10407892 10026252 9655031 9230216 8796315 8343969 8074674 7814053 7434762
5236 7434762 6981496 6801493 6662109 6309215 5925198 5845965 5805351 5685334 5731011 5707408
5226 5707408 5604284 5468814 5291818 5104833 4782568 4612372 4451384 4267307 4213702 4014792
5216 4014792 3872941 3664747 3395574 3340931 3515744 3576560 3310295 3232310 3175138 3154592
5206 3154592 3171699 3099906 2956688 2721862 2730371 2618753 2710100 2586263 2650607 2690804 2522220
5195 2522220 2651662 2579823 2454653 2348250 2339630 2314320 2360056 2252139 2058305 2085116 2163267
5184 2163267 2140372 2144947 2122153 2249297 2106823 2101447 2013924 2113655 2152597 2007482 1986006
5173 1986006 1992667 1985913 1917015 1971761 1883963 1807484 1628411 1620282 1627390 1594589 1604637 1689710
$$ packed form
5245A0890845m82953l81640l71221m24815m33901m52346k69295k60621l79291
5236G434762m53266j80003j39384l52894l84017p9233m0614j20017M5677k3603
5226E707408j03124j35470j76996j86985l22265j70196j60988j84077n3605j98910
5216D014792j41851k08194k69173n4643J74813O0816k66265p7985n7172k0546
5206C154592J7107p1793j43218k34826Q509j11618R1347j23837O4344M0197j68584
5195B522220J29442p1839j25170j06403q620k5310M5736j07917j93834K6811P8151
5184B163267k2895M575k2794J27144j42474n376q7523R9731L8942j45115k1476
5173A986006O661o754o8898N4746q7798p6479j79073q129P108l2801J0048Q5073
$$ plain form
5161 1689710 1762671 1748322 1822284 1788044 1787384 1787261 1718221 1585295 1614267 1668619 1530064 1507015
5149 1507015 1350119 1436192 1487757 1277562 1188928 1376446 1475292 1483997 1469695 1439590 1228800
5138 1228800 1271368 1239167 1163192 1123554 1104634 1114915 1125326 1005721 962311 956649 875403
5127 875403 986688 1138810 1114484 1000453 1041293 1075319 1084043 900930 900329 1029529 1066132
5116 1066132 901571 940401 1029295 975670 1015144 1010989 996692 796175 676952 776033 849831
5105 849831 642101 672579 796542 792447 764703 822860 790282 693552 706016 796985 729814
5094 729814 907691 1102271 1100656 1013340 827551 850122 919816 1114791 1084240 727556 790763
5083 790763 850706 785257 924990 951929 978898 987563 935225 742536 774179 705787 735347
$$ packed form
5161A689710P2961j4349P3962l4240o60j23o9040j32926K8972N4352j38555k3049
5149A507015j56896Q6073N1565k10195q8634J87518R8846Q705j4302l0105k10790
5138A228800M2568l2201p5975l9638j8920J0281J0411j19605m3410n662q1246
5127H75403J11285J52122k4326j14031M0840L4026Q724j83113o01J29200L6603
5116A066132j64561L8830Q8894n3625L9474m155j4297k00517j19223R9081P3798
5105H49831k07730L0478J23963m095k7744N8157l2578r6730J2464R0969o7171
5094G29814J77877J94580j615q7316j85789K2571O9694J94975l0551l56684O3207
5083G90763N9943o5449J39733K6939K6969Q665n2338j92689L1643o8392K9560
$$ plain form
5072 735347 853106 1023616 950753 779440 887545 936397 909310 996747 996940 796625 845071
5061 845071 894688 847627 875332 925329 1090834 1063217 910892 945004 985325 972299 1005577
5050 1005577 933432 860503 954813 965889 892458 914536 926537 1110633 1154047 1075732 926056
5039 926056 1138731 1282598 1281150 1453770 1576386 1541161 1548139 1731069 1756679 1816622 1912725
5028 1912725 2041857 2178235 2177018 2114375 2041885 1971648 1970024 2296173 2256499 2074187 2015287
5017 2015287 2039783 2122967 2170840 2044953 2037381 2015506 1989567 2081790 2196160 2168687 2043406
5006 2043406 2137187 2341060 2421873 2513225 2558266 2611289 2833064 2837271 2816142 2868633 2952520
4995 2952520 2816739 2767940 2884231 2920628 2991337 3075185 2952583 2936688 2955583 2766655 2525706
$$ packed form
5072G35347J17759J70510p2863j71313J08105M8852k7087Q7437J93k00315M8446
5061H45071M9617m7061K7705M9997J65505k7617j52325L4112M0321j3026L3278
5050A005577p2145p2929R4310J1076p3431K2078J2001J84096M3414p8315j49676
5039I26056K12675J43867j448J72620J22616l5225O978J82930K5610N9943R6103
5028A912725J29132J36378j217o2643p2490p0237j624L26149l9674j82312n8900
5017B015287K4496Q3184M7873j25887p572k1875k5939R2223J14370k7473j25281
5006B043406R3781K03873Q0813R1352M5041N3023K21775M207k1129N2491Q3887
4995B952520j35781m8799J16291L6397P0709Q3848j22602j5895J8895j88928k40949
$$ plain form
4984 2525706 2427865 2358256 2306535 2230130 2191986 2243167 2256847 2087694 1951348 1973989 2119973
4973 2119973 2084333 2065346 2162275 2169454 2082781 2126720 2101576 2282194 2390578 2562715 2620839
4962 2620839 2631551 2569722 2471320 2414753 2341850 2277247 2370616 2037042 1923576 1886569 1839012
4951 1839012 1630542 1551061 1613626 1485279 1562854 1411822 1372103 1372346 1354893 1456788 1529600
4940 1529600 1487342 1600613 1642880 1746825 1826258 1878722 1861837 1690701 1582227 1624362 1453428
4929 1453428 1587364 1418539 1384064 1533486 1643140 1597672 1350411 1327810 1304722 1345436
4919 1345436 1477324 1664714 1690139 1644572 1603281 1556442 1452007 1608925 1744199 1574633
4909 1574633 1452446 1411625 1305480 1247204 1405206 1304242 1225946 1467676 1542502 1589891
$$ packed form
4984B525706r7841o9609n1721p6405l8144N1181J3680j69153j36346K2641J45984
4973B119973l5640j8987R6929P179q6673M3939k5144J80618J08384J72137N8124
4962B620839J0712o1829r8402n6567p2903o4603R3369l33574j13466l7007m7557
4951A839012k08470p9481O2565j28347P7575j51032l9719K43j7453J01895P2812
4940A529600m2258J13271M2267J03945P9433N2464j6885j71136j08474M2135j70934
4929A453428J33936j68825l4475J49422J09654m5468k47261k2601k3088M0714
4919A345436J31888J87390K5425m5567m1291m6839j04435J56918J35274j69566
4909A574633j22187m0821j06145n8276J58002j00964p8296K41730P4826M7389
$$ plain form
4899 1589891 1746330 1805037 1696070 1700141 1619459 1585528 1537393 1436563 1260250 1228085 1411097
4888 1411097 1425907 1323044 1337789 1458987 1364701 1427774 1488098 1553039 1501529 1432737 1595873
4877 1595873 1728151 1610533 1689916 1595182 1535860 1597559 1776920 1847100 1735053 1626273
4867 1626273 1631067 1438425 1374423 1610165 1679157 1672508 1627928 1601651 1634412 1705939 1748147
4856 1748147 1774692 1638694 1748016 2047776 1871793 1800879 1927193 1899979 2029369 2159082
4846 2159082 2193578 2171584 2075956 1978558 2039766 2104674 2150949 2232067 2218630 2134515 2024712
4835 2024712 2125909 2092823 1893384 1918236 1977768 2115791 2224917 2210049 2356290 2321370
4825 2321370 2051357 2156820 2186546 2077182 2030647 2255453 2157614 2069968 2123628 2141811 2122551
$$ packed form
4899A589891J56439N8707j08967M071q0682l3931m8135j00830j76313l2165J83012
4888A411097J4810j02863J4745J21198r4286O3073O0324O4941n1510o8792J63136
4877A595873J32278j17618P9383r4734n9322O1699J79361P0180j12047j08780
4867A626273M794j92642o4002K35742O8992o649m4580k6277L2761P1527M2208
4856A748147K6545j35998J09322K99760j75983p0914J26314k7214J29390J29713
4846B159082L4496k1994r5628r7398O1208O4908M6275Q1118j3437q4115j09803
4835B024712J01197l3086j99439K4852N9532J38023J09126j4868J46241l4920
4825B321370k70013J05463K9726j09364m6535K24806r7839q7646N3660J8183j9260
$$ plain form
4814 2122551 2063103 2019948 2056751 2064648 2105871 2299156 2387433 2367145 2308002 2260526 2349328
4803 2349328 2375590 2478020 2484619 2407125 2416026 2504867 2623567 2590227 2525198 2664302 2691568
4792 2691568 2548437 2508499 2529019 2563895 2506871 2588143 2627042 2792251 2801635 2782941 2844349
4781 2844349 2880396 2734899 2689717 2745069 2731456 2817057 2771597 2851477 2923742 2914813 3011757
4770 3011757 3279576 3364800 3432004 3498075 3391720 3282856 3278841 3216509 3310512 3389658 3496441
4759 3496441 3790473 3819936 3820447 3712253 3677940 3822357 3777069 3853558 3962149 4007783 4323330
4748 4323330 4198107 4099023 4089593 4037521 4207289 4388100 4412823 4522628 4671368 4667022 4520947
4737 4520947 4500609 4762123 4686676 4745853 4873909 4852868 4993315 4972439 5060733 5248056 5401495
$$ packed form
4814B122551n9448m3155L6803P897M1223J93285Q8277k0288n9143m7476Q8802
4803B349328K6262J02430O599p7494Q901Q8841J18700l3340o5029J39104K7266
4792B691568j43131l9938K0520L4876n7024Q1272L8899J65209R384j8694O1408
4781B844349L6047j45497m5182N5352j3613Q5601m5460P9880P2265q929R6944
4770C011757K67819Q5224O7204O6071j06355j08864m015o2332R4003P9146J06783
4759C496441K94032K9463N11j08194l4313J44417m5288P6489J08591M5634L15547
4748D323330j25223r9084r430n2072J69768J80811K4723J09805J48740m346j46075
4737D520947k0338K61514p5447N9177J28056k1041J40447k0876Q8294J87323J53439
$$ plain form
4726 5401495 5441988 5593642 5638461 5491265 5539971 5587637 5643118 5823545 5982931 6003774 6031047
4715 6031047 6138320 6302974 6356827 6520701 6604311 6728964 6867760 6933090 7168981 7330658
4705 7330658 7498163 7613439 7617234 7831487 7920301 7904635 8050750 8172454 8519825 8840075
4695 8840075 9193520 9340623 9503796 9879675 10020979 10218999 10469496 10785441 11360513 11708969
4685 11708969 11932529 12419830 12834021 13234415 13758134 14498373 15209950 16035616 17056760
4676 17056760 18278872 19646705 21421699 23400451 25540815 27492689 28339304 28164664
4668 28164664 27086923 25470812 23745190 22331498 21310668 20740196 20564305 20737679 20965786
4659 20965786 21182791 21808289 22752530 24049487 25526776 27567860 29292361 30378990 30642206
$$ packed form
4726E401495M0493J51654M4819j47196M8706M7666N5481J80427J59386K0843K7273
4715F031047J07273J64654N3853J63874Q3610J24653J38796O5330K35891J61677
4705G330658J67505J15276L795K14253Q8814j5666J46115J21704L47371L20250
4695H840075L53445J47103J63173L75879J41304J98020K50497L15945N75072L48456
4685A1708969K23560M87301M14191M00394N23719P40239P11577Q25666J021144
4676A7056760J222112J367833J774994J978752K140364J951874Q46615j74640
4668B8164664j077741j616111j725622j413692j020830n70472j75891J73374K28107
4659B0965786K17005O25498R44241J296957J477289K041084J724501J086629K63216
$$ plain form
4650 30642206 29918978 28251625 26211294 24471506 23133311 22018942 21403435 20899857 20273704
4641 20273704 19945674 19889625 19950792 20093501 20150828 20194530 20434532 20850711 21351931 21726147
4631 21726147 22209260 22665573 23275267 23926924 24829711 25711619 26807934 28031238 29495066
4622 29495066 31309152 33300731 36222318 39804235 43362688 47186706 50217366 51615990
4614 51615990 50646135 48092709 44595313 41348577 38883398 36964438 35883104 35088622
4606 35088622 34877212 35104161 35591555 36593988 37970199 39984934 42691328 45914039 48528205
4597 48528205 50111517 50217820 48320216 44982760 41333068 37936904 35247105 33207450
4589 33207450 31418443 29959822 29172073 28456913 27641247 26888260 26333506 25883129 25444315
$$ packed form
4650C0642206p23228j667353k040331j739788j338195j114369o15507n03578o26153
4641B0273704l28030n6049O1167J42709N7327M3702K40002M16179N01220L74216
4631B1726147M83113M56313O09694O51657R02787Q81908J096315J223304J463828
4622B9495066J814086J991579K921587L581917L558453L824018L030660J398624
4614E1615990r69855k553426l497396l246736k465179j918960j081334p94482
4606C5088622k11410K26949M87394J002433J376211K014735K706394L222711K614166
4597D8528205J583312J06303j897604l337456l649692l396164k689799k039655
4589C3207450j789007j458621p87749p15160q15666p52987n54754m50377m38814
$$ plain form
4580 25444315 25252730 25266687 25078659 24954742 25176463 25041296 24743004 24765688 24803624 24705423
4570 24705423 24869742 24861332 24814449 24674458 24691915 24688714 24635641 24592084 24499774 24423534 24426716
4559 24426716 24368171 24413898 24384339 24483533 24661639 24658007 24586314 24575143 24468581 24477344 24384073
4548 24384073 24378093 24271697 24315632 24360296 24319769 24360330 24287444 24090431 24099511 24120760 24268925
4537 24268925 24266660 24265285 24190497 24163904 24357348 24210036 24105600 24220827 24358613 24595297
4527 24595297 24565008 24362288 24461052 24453355 24447708 24554370 24631946 24830091 24881436 25046769 25334154
4516 25334154 25379024 25418451 25514920 25869018 25961990 26213085 26758846 26816125 27085350 27588985
4506 27588985 27842249 28455691 29114340 30046193 30977373 31867875 33293184 34948987 37321873
$$ packed form
4580B5444315j91585J3957j88028j23917K21721j35167k98292K2684L7936r8201
4570B4705423J64319q410m6883j39991J7457l201n3073m3557r2310p6240L182
4559B4426716n8545M5727k9559R9194J78106l632p1693j1171j06562Q763r3271
4548B4384073n980j06396M3935M4664m0527M0561p2886j97013R080K1249J48165
4537B4268925k265j375p4788k6593J93444j47312j04436J15227J37786K36684
4527B4595297l0289k02720R8764p697n647J06662P7576J98145N1345J65333K87385
4516B5334154M4870L9427R6469L54098R2972K51095N45761N7279K69225N03635
4506B7588985K53264O13442O58649R31853R31180Q90502J425309J655803K372886
$$ plain form
4497 37321873 40299362 43597610 46929588 49644325 50756929 50070605 47405388 43226659
4489 43226659 39268423 36359685 33823720 31835651 30316065 29069603 28163259 27387060
4481 27387060 26652542 25994226 25688056 25240420 25013100 24906139 24929486 25061976 25366733 25319048
4471 25319048 25455645 25948399 26595555 27184348 27908781 28883143 30239740 31861264 34068883
4462 34068883 36905151 39922808 42683171 44343055 44669374 43398965 40228568 36675145
4454 36675145 33399511 30863714 28853731 27279717 26369405 25712887 25119235 24724021 24614017
4445 24614017 24818771 25222588 25981555 27280975 28986153 30530234 31511033 31833035 30902245
4436 30902245 29118578 26807908 24495009 22633075 21214785 20014874 19166245 18466073
$$ packed form
4497C7321873K977489L298248L331978K714737J112604o86324k665217m178729
4489D3226659l958236k908738k535965j988069j519586j246462r06344p76199
4481B7387060p34518o58316l06170m47636k27320j06961K3347J32490L04757m7685
4471B5319048J36597M92754O47156N88793P24433R74362J356597J621524K207619
4462C4068883K836268L017657K760363J659884L26319j270409l170397l553423
4454C6675145l275634k535797k009983j574014r10312o56518n93652l95214j10004
4445B4614017K04754M03817P58967J299420J705178J544081R80799L22002r30790
4436C0902245j783667k310670k312899j861934j418290j199911q48629p00172
$$ plain form
4428 18466073 17791877 17373271 16902969 16370923 15819949 15668190 15631201 15497419 15476551 15238943
4418 15238943 15197769 15251161 15477229 15563542 15795374 16156551 16837448 17426340 17945265 18657914
4408 18657914 19740736 21301317 23119220 24734764 25386676 25206271 23973256 21780286
4400 21780286 19346783 17557528 16115704 14841679 13959890 13066121 12172429 11642609 11071231
4391 11071231 10726828 10258605 9704075 9460656 9329111 8910263 8509213 8513174 8178164 8042864
4381 8042864 7865454 7752859 7530363 7377514 7351340 7313053 7144967 7247730 7198090 6992276
4371 6992276 6745009 6634356 6561762 6343860 6344248 6026590 6003384 6273353 6067478 5908285
4361 5908285 5745958 5672827 5661390 5599359 5520770 5294913 5219800 5239300 5201351 4888336 4830697
$$ packed form
4428A8466073o74196m18606m70302n32046n50974j51759l6989j33782k0868k37608
4418A5238943m1174N3392K26068Q6313K31832L61177O80897N88892N18925P12649
4408A8657914J082822J560581J817903J615544O51912j80405j233015k192970
4400B1780286k433503j789255j441824j274025q81789q93769q93692n29820n71378
4391A1071231l44403m68223n54530k43419j31545m18848m01050L961l35010j35300
4381H042864j77410j12595k22496j52849k6174l8287j68086J02763m9640k05814
4371F992276k47267j10653p2594k17902L88l17658k3206K69969k05875j59193
4361E908285j62327p3131j1437o2031p8589k25857p5113J9500l7949l13015n7639
$$ plain form
4350 4830697 4863301 4698016 4662127 4744850 4613212 4396575 4296920 4496078 4542739 4318050
4340 4318050 4265706 4292715 4113598 4136183 4239099 4054649 3969832 3907449 3977712 4065617 4009118
4329 4009118 3803505 3783410 3665641 3667470 3714809 3637502 3563735 3526995 3620823 3603159 3515768
4318 3515768 3307994 3334289 3329340 3384672 3356611 3245474 3276573 3366593 3343178 3296035 3112430
4307 3112430 3098401 3186590 3111601 2985312 3169626 3200266 3164139 3255435 3154022 2994192 3069141
4296 3069141 3108977 2818496 2912230 3096917 2872454 2930699 3063049 2881704 2943151 2936569 2801687
4285 2801687 2755314 2605244 2738370 2695323 2521282 2624782 2484821 2380463 2416713 2478922
4275 2478922 2539101 2402490 2397823 2455641 2426084 2313319 2192010 2220931 2296981 2228567 2181631
$$ packed form
4350D830697L2604j65285l5889Q2723j31638k16637r9655J99158M6661k24689
4340D318050n2344K7009j79117K2585J02916j84450q4817o2383P0263Q7905n6499
4329D009118k05613k0095j17769J829M7339p7307p3767l6740R3828j7664q7391
4318C515768k07774K6295m949N5332k8061j11137L1099R0020k3415m7143j83605
4307C112430j4029Q8189p4989j26289J84314L0640l6127R1296j01413j59830P4949
4296C069141L9836k90481R3734J84687k24463N8245J32350j81345O1447o582j34882
4285B801687m6373j50070J33126m3047j74041J03500j39961j04358L6250O2209
4275B478922O0179j36611m667N7818k9557j12765j21309K8921P6050o8414m6936
$$ plain form
4264 2181631 2174529 2259254 2478403 2471991 2460066 2350047 2366753 2237912 2218989 2252097 2402137
4253 2402137 2415532 2192160 2442276 2551875 2491879 2317234 2262480 2428047 2492760 2420764
4243 2420764 2250882 2314954 2271387 2338262 2292495 2188264 2170599 2132871 2224017 2191559 2384683
4232 2384683 2115378 2002923 2023970 2041448 2132033 2131334 2215454 2016882 1921475 1958627 1896050
4221 1896050 1912169 1987631 1882054 1929730 1954959 1890026 1831802 1660478 1591201 1746933 1771920
4210 1771920 1683622 1541686 1682615 1719678 1621057 1497624 1534885 1632434 1562046 1611126 1671320
4199 1671320 1628933 1620606 1583926 1627106 1627885 1416194 1532985 1734889 1802781 1729456 1785195
4188 1785195 1701126 1661256 1791659 1861203 1718851 1721952 1693947 1681706 1625901 1542981 1538370
$$ packed form
4264B181631p102Q4725K19149o412j1925j10019J6706j28841j8923L3108J50040
4253B402137J3395k23372K50116J09599n9996j74645n4754J65567O4713p1996
4243B420764j69882O4072m3567O6875m5767j04231j7665l7728R1146l2458J93124
4232B384683k69305j12455K1047J7478R0585o99Q4120j98572r5407L7152o2577
4221A896050J6119P5462j05577M7676K5229o4933n8224j71324o9277J55732K4987
4210A771920q8298j41936J40929L7063r8621j23433L7261R7549p0388M9080O0194
4199A671320m2387q327l6680M3180P79k11691J16791K01904O7892p3325N5739
4188A785195q4069l9870J30403O9544j42352L101k8005j2241n5805q2920m611
$$ plain form
4177 1538370 1514127 1480190 1509883 1695013 1621232 1720802 1730743 1639229 1702911 1403174 1462511
4166 1462511 1613669 1593339 1692568 1696066 1789973 1543878 1486833 1676174 1681267 1526279 1605487
4155 1605487 1772122 1866140 1653367 1532765 1662059 1742799 1728540 1710454 1724805 1782976 1815683
4144 1815683 1833042 1773059 1690836 1716126 1622835 1695748 1720412 1674261 1609201 1553845 1661737
4133 1661737 1694692 1707551 1638532 1834818 1897884 1753472 1742193 1740369 1725377 1730705 1804732
4122 1804732 1813754 1784000 1687315 1755950 1753859 1787564 1787665 1652110 1692071 1914045 1866748 1875372
4110 1875372 1659599 1724451 1666967 1731464 1868273 1880270 1942813 1901659 2080238 1953343 1831979
4099 1831979 1680818 1788021 1791440 1791793 1885765 1875570 2026108 2053907 2063835 2058519 1837148 1855293
$$ packed form
4177A538370k4243l3937K9693J85130p3781R9570R941r1514O3682k99737N9337
4166A462511J51158k0330R9229L498R3907k46095n7045J89341N093j54988P9208
4155A605487J66635R4018k12773j20602J29294Q0740j4259j8086J4351N8171L2707
4144A815683J7359n9983q2223K5290r3291P2913K4664m6151o5060n5356J07892
4133A661737L2955J2859o9019J96286O3066j44412j1279j824j4992N328P4027
4122A804732R022k9754r6685O8635k091L3705J01j35555L9961K21974m7297Q624
4110A875372k15773O4852n7484O4497J36809J1997O2543m1154J78579j26895j21364
4099A831979j51161J07203L419L53R3972j0195J50538K7799R928n316k21371J8145
$$ plain form
4087 1855293 1860888 1888762 1927753 1880175 1930512 1962021 1993032 1954325 1839535 1792875 1886444
4076 1886444 1955966 2131580 2157113 2033705 2123602 2262138 2150562 1933916 1970375 2208919
4066 2208919 2219196 2238926 2278762 2454372 2588713 2503199 2583569 2581124 2510460 2687237 2726398
4055 2726398 2800572 2811212 2845137 3052098 3148653 3221909 3200817 3287361 3363111 3370303 3422506
4044 3422506 3653516 3826243 3896159 4087544 4116434 4143910 4294353 4491524 4579138 4588261 4855097
4033 4855097 4903278 4988840 5286549 5508148 5750120 5811515 5877082 5914695 6058138 6273264
4023 6273264 6574683 6772173 6837677 7071408 7260497 7526639 7712086 8005907 8178600 8342688
4013 8342688 8675530 8890034 9245124 9444911 9720696 9889095 10189784 10729164 11059264 11545546
$$ packed form
4087A855293N595K7874L8991m7578N0337L1509L1011l8707j14790m6660R3569
4076A886444O9522J75614K5533j23408Q9897J38536j11576k16646L6459K38544
4066B208919J0277J9730L9836J75610J34341q5514Q0370k445p0664J76777L9161
4055B726398P4174J0640L3925K06961R6555P3256k1092Q6544P5750P192N2203
4044C422506K31010J72727O9916J91385K8890K7476J50443J97171Q7614R123K66836
4033D855097M8181Q5562K97709K21599K41972O1395O5567L7613J43443K15126
4023F273264L01419J97490O5504K33731J89089K66142J85447K93821J72693J64088
4013H342688L32842K14504L55090J99787K75785J68399L00689N39380L30100M86282
$$ plain form
4003 11545546 11972406 12372621 12628739 13344371 13973737 14387849 14970691 15779173 16589303
3994 16589303 17441005 18073797 18944563 19866340 20757480 21767192 22827459 23818526 24932761
3985 24932761 26299201 27636356 29151450 30707307 32191488 34059707 35997687 37584061
3977 37584061 39316116 41346256 43369443 45356344 47509944 49639111 51918642 54280786
3969 54280786 56473619 58604485 61123454 63662259 66239945 68737507 71280005 73757996
3961 73757996 76184916 78556697 80877845 83035296 84924731 86699153 88536867 89856367
3953 89856367 91104511 92614995 94019961 95430348 96680481 97662484 98418868 99147875 99392137
3944 99392137 99249108 99122852 98779166 97947987 96886591 95812969 94450788 93247298 92149525
$$ packed form
4003A1545546M26860M00215K56118P15632O29366M14112N82842Q08482Q10130
3994A6589303Q51702O32792Q70766R21777Q91140J009712J060267R91067J114235
3985B4932761J366440J337155J515094J555857J484181J868219J937980J586374
3977C7584061J732055K030140K023187J986901K153600K129167K279531K362144
3969E4280786K192833K130866K518969K538805K577686K497562K542498K477991
3961G3757996K426920K371781K321148K157451J889435J774422J837714J319500
3953H9856367J248144J510484J404966J410387J250133R82003P56384P29007K44262
3944I9392137j43029j26256l43686q31179j061396j073622j362181j203490j097773
$$ plain form
3935 92149525 90811083 89312974 87781861 86066096 84191897 82225727 79922432 77407476
3927 77407476 74911650 72334692 69825127 67282263 64722315 62194575 59860431 57576950
3919 57576950 55245978 52932490 50778205 48628336 46416683 44244824 42105517 39929166
3911 39929166 37928649 35852577 34066709 32363434 30589367 29067586 27554265 25959048
3903 25959048 24687326 23574491 22449946 21347931 20453211 19520782 18384000 17356104
3895 17356104 16587132 15795767 14945463 14353433 13671728 13188586 12594997 12198865 11569501
3886 11569501 11111494 10740785 10322211 10034946 9733519 9375859 8997611 8682843 8508275
3877 8508275 8222801 8090573 7970082 7690380 7533859 7197074 7075643 7053654 6883479 6533953
$$ packed form
3935I2149525j338442j498109j531113j715765j874199j966170k303295k514956
3927G7407476k495826k576958k509565k542864k559948k527740k334144k283481
3919E7576950k330972k313488k154285k149869k211653k171859k139307k176351
3911C9929166k000517k076072j785868j703275j774067j521781j513321j595217
3903B5959048j271722j112835j124545j102015q94720r32429j136782j027896
3895A7356104p68972p91365q50304n92030o81705m83142n93589l96132o29364
3886A1569501m58007l70709m18574k87265l01427l57660l78248l14768j74568
3877H508275k85474j32228j20491k79702j56521l36785j21431k1989j70175l49526
$$ plain form
3867 6533953 6446123 6380114 6042467 6020950 5779146 5768699 5807137 5892342 5816627 5703194 5595855
3856 5595855 5470676 5579664 5657399 5449143 5369115 5260326 5296033 5325401 5307445 5262592 5159961
3845 5159961 5200605 5116116 5181952 5095376 5006222 4977776 4948099 5024005 5141981 5004976 5005256
3834 5005256 5015626 4867920 4929158 5003269 4914095 5168777 5137151 5076339 5278261 5252247 5237101
3823 5237101 5389955 5258898 5264554 5301683 5259830 5399163 5538179 5436978 5254521 5334577
3813 5334577 5400619 5141924 5195620 5214856 4995774 4791562 4751509 4641392 4529314 4503675
3803 4503675 4380876 4463310 4492021 4242215 4145348 4135595 3976431 4047803 4022938 3991383 3842765
3792 3842765 3704708 3696140 3873227 3766851 3529678 3417312 3461534 3531301 3446333 3350737 3523565
$$ packed form
3867F533953q7830o6009l37647k1517k41804j0447L8438Q5205p5715j13433j07339
3856E595855j25179J08988P7735k08256q0028j08789L5707K9368j7956m4853j02631
3845E159961M0644q4489O5836q6576q9154k8446k9677P5906J17976j37005K80
3834E005256J0370j47706O1238P4111q9174K54682l1626o0812K01922k6014j5146
3823E237101J52854j31057N656L7129m1853J39333J39016j01201j82457Q0056
3813E334577O6042k58695N3696J9236k19082k04212m0053j10117j12078k5639
3803D503675j22799Q2434K8711k49806r6867r753j59164P1372k4865l1555j48618
3792C842765j38057q568J77087j06376k37173j12366M4222O9767q4968r5596J72828
$$ plain form
3781 3523565 3452879 3489854 3757253 3512474 3491297 3473860 3471585 3408857 3248435 3215522 3296165
3770 3296165 3411491 3421008 3333014 3348463 3308549 3475447 3535156 3423536 3474573 3490125 3499762
3759 3499762 3380723 3500586 3509994 3472501 3536800 3741548 3584007 3471041 3723038 3738529
3749 3738529 3638782 3633597 3462948 3465391 3477610 3500482 3530018 3560800 3674781 3756651 3834424
3738 3834424 3865731 3962454 3791326 3744421 3896237 3810052 3877149 3897649 4004079 4085076 3876318
3727 3876318 3968138 3891229 4074148 4227419 4270471 4343977 4309925 4462625 4675386 4734693 4674173
3716 4674173 4708117 4926132 4951501 4872593 4913474 4835196 5001008 5244732 5349583 5343331 5495452
3705 5495452 5544364 5513929 5619660 5755674 5669158 5741386 5865890 5794774 5732795 5764996 5808593
$$ packed form
3781C523565p0686L6975K67399k44779k1177j7437k275o2728j60422l2913Q0643
3770C296165J15326R517q7994J5449l9914J66898N9709j11620N1037J5552R637
3759C499762j19039J19863R408l7493O4299K04748j57541j12966K51997J5491
3749C738529r9747n185j70649K443J2219K2872K9536L0782J13981Q1870P7773
3738C834424L1307R6723j71128m6905J51816q6185O7097K0500J06430Q0997k08758
3727C876318R1820p6909J82919J53271M3052P3506l4052J52700K12761N9307o0520
3716D674173L3944K18015K5369p8908M0881p8278J65812K43724J04851o252J52121
3705E495452M8912l0435J05731J36014q6516P2228J24504p1116o1979L2201M3597
$$ plain form
3694 5808593 5759078 6010983 6060885 5938582 6005676 6165785 6170481 6370332 6408570 6430429 6458385
3683 6458385 6519338 6648014 6722173 6761867 6915741 7030509 6908143 7272177 7421682 7490571
3673 7490571 7719973 7913348 8085818 8023559 8276413 8361888 8362250 8466211 8826381 9009081
3663 9009081 9235969 9415786 9659695 10055434 10172632 10426873 10846674 11066849 11322102 11623280
3653 11623280 12102761 12501554 13023205 13358770 13793951 14400902 14663576 15294116 16040842
3644 16040842 16769162 17384777 18015760 18735274 19696129 20564914 21372633 22476277 23529347
3635 23529347 24531906 25775250 27188647 28406599 29658532 30920482 32006005 33208042
3627 33208042 34279980 35318069 36307692 37345035 38526753 39500568 40485578 41572897 42532992
$$ packed form
3694E808593m9515K51905M9902j22303O7094J60109M696J99851L8238K1859K7956
3683F458385O0953J28676P4159L9694J53874J14768j22366L64034J49505O8889
3673G490571K29402J93375J72470o2259K52854Q5475L62J03961L60170J82700
3663I009081K26888J79817K43909L95739J17198K54241M19801K20175K55253L01178
3653A1623280M79481L98793N21651L35565M35181O06951K62674O30540P46726
3644A6040842P28320O15615O30983P19514R60855Q68785Q07719J103644J053070
3635B3529347J002559J243344J413397J217952J251933J261950J085523J202037
3627C3208042J071938J038089R89623J037343J181718R73815R85010J087319R60095
$$ plain form
3618 42532992 43620229 44576621 45424636 46054629 46887469 47592439 48146223 48528035 48955299
3609 48955299 49514921 49969868 50406287 50888832 51547870 52460690 53363805 54327608 55300350
3600 55300350 56006776 56744619 57664202 58763985 59641212 60523039 61782228 62973220 64113964
3591 64113964 65546634 67122343 68812907 70671883 72788501 75139486 77757109 80606992
3583 80606992 83840309 87372552 90879552 94690369 98570218 102887112 107212308 111757968
3575 111757968 116367547 120874977 125223566 129651448 134119884 138623540 143385329 148272501
3567 148272501 153172432 158060639 163191713 168381266 173694167 179071786 184393219 189405043
3559 189405043 194586890 199803610 205089550 210581731 216118112 222103437 228528047 235284010
$$ packed form
3618D2532992J087237R56392Q48015O29993Q32840P04970N53784L81812M27264
3609D8955299N59622M54947M36419M82545O59038R12820R03115R63803R72742
3600E5300350P06426P37843R19583J099783Q77227Q81827J259189J190992J140744
3591F4113964J432670J575709J690564J858976K116618K350985K617623K849883
3583H0606992L233317L532243L507000L810817L879849M316894M325196M545660
3575A11757968M609579M507430M348589M427882M468436M503656M761789M887172
3567A48272501M899931M888207N131074N189553N312901N377619N321433N011824
3559A89405043N181847N216720N285940N492181N536381N985325O424610O755963
$$ plain form
3551 235284010 242452433 250343725 258638758 267465304 277113181 287363912 298202022 309552775
3543 309552775 321456804 333793727 346119098 357961153 368785828 378270133 386406115
3536 386406115 392945593 397474728 400250612 401253194 400397392 397891316 394722629 390758435
3528 390758435 386224093 381269458 375366501 368731228 360774060 351372072 340442847 328304109
3520 328304109 315170009 301278762 286853647 272199749 257686255 243247366 229241649
3513 229241649 216090094 203559768 191810766 180731735 170722167 161255303 152808245
3506 152808245 145078759 137998805 131742724 126045246 120968242 116700286 112950185 109393699
3498 109393699 106198318 103365361 100640039 98217056 95865294 93242881 90458182 87834962
$$ packed form
3551B35284010P168423P891292Q295033Q826546R647877J0250731J0838110J1350753
3543C09552775J1904029J2336923J2325371J1842055J0824675R484305Q135982
3536C86406115O539478M529135K775884J002582q55802k506076l168687l964194
3528C90758435m534342m954635n902957o635273p957168r401988j0929225j2138738
3520C28304109j3134100j3891247j4425115j4653898j4513494j4438889j4005717
3513B29241649j3151555j2530326j1749002j1079031j0009568r466864q447058
3506A52808245p729486p079954o256081n697478n077004m267956l750101l556486
3498A09393699l195381k832957k725322k422983k351762k622413k784699k623220
$$ plain form
3490 87834962 85153831 82510926 79986152 77791881 75735105 73809359 72079096 70553111
3482 70553111 69213707 68125679 66942000 65994438 64949738 63558300 62446224 61279637
3474 61279637 59999064 58602927 56995163 55291716 53715139 52420129 51004431 49382563
3466 49382563 47833364 46357091 45217080 43878463 42490426 41236565 39761273 38279287
3458 38279287 36789378 35246118 33833913 32286303 30843532 29531413 28043139 26878868
3450 26878868 25894307 24808110 23879222 23108565 22095902 21199578 20552434 19813965 19332012
3441 19332012 18721667 18385082 17872986 17384379 16912533 16587190 16130192 15683072 15441982
3432 15441982 15008993 14652802 14220673 13959702 13854571 13539148 13331085 13083649 12797344
$$ packed form
3490H7834962k681131k642905k524774k194271k056776j925746j730263j525985
3482G0553111j339404j088028j183679r47562j044700j391438j112076j166587
3474F1279637j280573j396137j607764j703447j576577j295010j415698j621868
3466D9382563j549199j476273j140011j338617j388037j253861j475292j481986
3458C8279287j489909j543260j412205j547610j442771j312119j488274j164271
3450B6878868r84561j086197r28888p70657j012663q96324o47144p38469m81953
3441A9332012o10345l36585n12096m88607m71846l25343m56998m47120k41090
3432A5441982m32989l56191m32129k60971j05131l15423k08063k47436k86305
$$ plain form
3423 12797344 12481653 12186556 11935427 11806580 11828408 11722588 11523286 11123053 10936169 10594163
3413 10594163 10316637 10249583 10232471 9962758 9589309 9400278 9509641 9258794 8983879 8836001
3403 8836001 8611201 8521241 8320965 8396965 8161867 7839736 7690778 7598333 7447234 7231663
3393 7231663 6999417 6856513 6836080 6776303 6516280 6448095 6241099 6101348 6074753 6057180
3383 6057180 5772588 5781285 5684596 5620826 5477098 5418119 5176067 5057687 5024741 4871590 4807927
3372 4807927 4804202 4817750 4750690 4472603 4334719 4271477 4227411 4068246 4029014 3788081 3600015
3361 3600015 3576449 3623275 3495218 3369498 3358271 3258701 3232397 3141205 3126793 3062604 3046423
3350 3046423 2852426 2683109 2808043 2975111 2787922 2807926 2786214 2853804 2802554 2691025
$$ packed form
3423A2797344l15691k95097k51129j28847K1828j05820j99302m00233j86884l42006
3413A0594163k77526o7054j7112k69713l73449j89031J09363k50847k74915j47878
3403H836001k24800q9960k00276P6000k35098l22131j48958r2445j51099k15571
3393G231663k32246j42904k0433n9777k60023o8185k06996j39751k6595j7573
3383F057180k84592Q697r6689o3770j43728n8979k42052j18380l2946j53151o3663
3372D807927l725J3548o7060k78087j37884o3242m4066j59165l9232k40933j88066
3361C600015k3566M6826j28057j25720j1227r9570k6304r1192j4412o4189j6181
3350C046423j93997j69317J24934J67068j87189K0004k1712O7590n1250j11529
$$ plain form
3340 2691025 2659166 2792135 2616835 2547864 2385979 2494320 2500858 2338575 2408631 2538348
3330 2538348 2423230 2380469 2360941 2401654 2332372 2423428 2511798 2309679 2278022 2366185 2421908
3319 2421908 2434644 2283707 2283082 2134271 1927030 1961143 1909781 1981961 2039615 2130688 2087487
3308 2087487 1839848 1881744 2056665 1951297 1934622 2078569 2028342 1934917 1804621 1853003
3298 1853003 1810990 1663103 1714891 1880527 1979872 2015631 1887825 1946581 2065163 2020999 2092213
3287 2092213 2049530 1948703 2132095 2271948 2328074 2268526 2328389 2381468 2352454 2374864 2427097
3276 2427097 2467347 2447600 2391273 2602732 2673244 2690693 2698752 2717233 2550366 2526805 2459179
3265 2459179 2570073 2603833 2593770 2750075 2714853 2709933 2900963 2973300 2830396 3046274 3131992
$$ packed form
3340B691025l1859J32969j75300o8971j61885J08341O538j62283P0056J29717
3330B538348j15118m2761j9528M0713o9282R1056Q8370k02119l1657Q8163N5723
3319B421908J2736j50937o25j48811k07241L4113n1362P2180N7654R1073m3201
3308B087487k47639M1896J74921j05368j6675J43947n0227r3425j30296M8382
3298A853003m2013j47887N1788J65636R9345L5759j27806N8756J18582m4164P1214
3287B092213m2683j00827J83392J39853N6126n9548N9863N3079k9014K2410N2233
3276B427097M0250j9747n6327K11459P0512J7449Q059J8481j66867k3561o7626
3265B459179J10894L3760j0063J56305l5222m920J91030P2337j42904K15878Q5718
$$ plain form
3254 3131992 3164941 3128720 3078781 3124252 3254072 3224512 3144947 3231785 3440404 3386597 3321413
3243 3321413 3149468 3259707 3494935 3501098 3293598 3211781 3142491 2849072 2992937 3098778
3233 3098778 3250720 3231228 2952847 2992412 2905591 2896306 2668259 2665288 2905700 2614334 2507677
3222 2507677 2602584 2264000 2207485 2291058 2280144 2277500 2292491 2313485 2249061 2102801 2333532
3211 2333532 2190994 2188751 2054852 1891715 1789653 1875642 1854472 1870896 1925565 1966535 1758492
3200 1758492 1781945 1804489 1780952 1692668 1678240 1750889 1657645 1642364 1467864 1539613 1721878
3189 1721878 1699063 1639930 1566235 1399456 1557408 1623776 1624513 1592217 1677283 1788682 1681933
3178 1681933 1699223 1673766 1625388 1646592 1727094 1860361 1909820 2022253 2097984 2299089 2487268
$$ packed form
3254C131992L2949l6221m9939M5471J29820k9560p9565Q6838K08619n3807o5184
3243C321413j71945J10239K35228O163k07500q1817o9290k93419J43865J05841
3233C098778J51942j9492k78381L9565q6821r285k28047k971K40412k91366j06657
3222B507677R4907l38584n6515Q3573j0914k644J4991K0994o4424j46260K30731
3211B333532j42538k243j33899j63137j02062Q5989k1170J6424N4669M0970k08043
3200A758492K3453K2544k3537q8284j4428P2649r3244j5281j74500P1749J82265
3189A721878k2815n9133p3695j66779J57952O6368P37l2296Q5066J11399j06749
3178A681933J7290k5457m8378K1204Q0502J33267M9459J12433P5731K01105J88179
$$ plain form
3167 2487268 2669108 2937921 2945154 2751469 2699867 2545940 2414841 2284665 2017834 1575604
3157 1575604 1482054 1451848 1327847 1385647 1441834 1473223 1570163 1288323 1233111 1375435 1397277
3146 1397277 1450460 1669103 1650381 1779286 1818409 2062263 2466432 2695492 2780236 2739870
3136 2739870 2647212 2432407 2230826 1865959 1660479 1590698 1476650 1273659 1187479 1089065
3126 1089065 863328 789403 847454 744983 703010 765402 797892 733260 746820 754937 838228
3115 838228 989061 868615 873793 815588 682538 667522 691830 572229 556296 487645 576099
3104 576099 461426 396265 326429 344722 588247 510678 322427 310797 226362 194441 500984
3093 500984 589811 527287 330264 281581 272248 335682 343196 327104 321262 337579 439565 400873
$$ packed form
3167B487268J81840K68813P233j93685n1602j53927j31099j30176k66831m42230
3157A575604r3550l0206j24001N7800N6187L1389R6940k81840n5212J42324K1842
3146A397277N3183K18643j8722J28905L9123K43854M04169K29060Q4744m0366
3136B739870r2658k14805k01581l64867k05480o9781j14048k02991q6180r8414
3126A089065k25737p3925N8051j02471m1973O2392L2490o4632J3560Q117Q3291
3115H38228J50833j20446N178n8205j33050j5016K4308j19601j5933o8651Q8454
3104E76099j14673o5161o9836J8293K43525p7569j88251j1630q4435l1921L06543
3093E00984Q8827o2524j97023m8683r333O3434P514j6092n842J6317J01986l8692
$$ plain form
3081 400873 332912 387471 391929 405266 469920 514120 364622 381337 328341 471879 488860
3070 488860 332011 204291 223309 218513 198053 165148 131417 123444 200905 97386 84456
3059 84456 33461 130988 200546 43461 209178 239389 82746 22133 109412 67132 86959
3048 86959 134621 209779 165713 200103 144895 135869 130513 208551 149301 179029 235259 299297
3036 299297 229029 88124 -33036 191327 342839 310699 178667 212407 7446 90373
3026 90373 190578 69407 126257 206172 121335 150797 346001 254518 305163 229597 140476
3015 140476 174809 159235 185338 231693 209568 185041 260170 320087 327606 305172 222792 250579
3003 250579 283261 218791 190372 169294 114109 58689 55625 99015 81220 19933 258786 287287
$$ packed form
3081D00873o7961N4559M458J3337O4654M4200j49498J6715n2996J43538J6981
3070D88860j56849j27720J9018m796k0460l2905l3731p973P7461j03519j2930
3059H4456n0995R7527O9558j57085J65717L0211j56643o0613Q7279m2280J9827
3048H6959M7662P5158m4066L4390n5208r026n356P8038n9250K9728N6230O4038
3036B99297p0268j40905j21160K24363J51512l2140j32032L3740k04961Q2927
3026I0373J00205j21171N6850P9915q4837K9462J95204r1483N0645p5566q9121
3015A40476L4333j5574K6103M6355k2125k4527P5129N9917P519k2434q2380K7787
3003B50579L2682o4470k8419k1078n5185n5420l064M3390j7795o1287K38853K8501
$$ plain form
2991 287287 83034 101950 205006 112008 41889 123114 170362 294934 332661 252664 212077
2980 212077 165757 139615 226046 120902 228031 310182 383676 189784 265286 203269 308776
2969 308776 372884 326969 241067 119667 56508 171440 83962 127127 270781 193708 103990
2958 103990 107571 228333 273458 303722 283195 95346 69579 -21619 77602 98769 191138
2947 191138 200037 293287 317433 224149 119711 173097 259222 333802 335866 255212 231556 165799
2935 165799 73399 20219 -1104 27338 151864 53700 -13903 -56849 88096 94752 94018 -65891
2923 -65891 -5398 109945 28102 30917 38021 22873 -77140 -10059 121567 223793 140469
2912 140469 133676 181961 132958 81748 7244 58614 136293 285822 245062 326552 430736
$$ packed form
2991B87287k04253J8916J03056r2998p0119Q1225M7248J24572L7727p9997m0587
2980B12077m6320k6142Q6431j05144J07129Q2151P3494j93892P5502o2017J05507
2969C08776O4108m5915q5902j21400o3159J14932q7478M3165J43654p7073q9718
2958A03990L581J20762M5125L0264k0527j87849k5767r1198R9221K1167R2369
2947A91138Q899R3250K4146r3284j04438N3386Q6125P4580K064q0654k3656o5757
2935A65799r2400n3180k1323K8442J24526r8164o7603m2946J44945O656p34j59909
2923f5891O0493J15343q1843K815P104j5148j00013O7081J31626J02226q3324
2912A40469o793M8285m9003n1210p4504N1370P7679J49529m0760Q1490J04184
$$ plain form
2901 430736 395573 237249 159075 150136 216735 146800 238091 333065 241389 249009 382352 192461
2889 192461 182557 144454 293248 197024 258692 386625 401248 408080 408939 450554 519189 423889
2877 423889 381337 305812 357221 404357 342847 461005 391964 161148 149197 288474 428417
2866 428417 465527 526243 582354 684157 600175 508714 419274 353282 357066 383055 402508 333068
2854 333068 281467 347040 423043 331998 264973 218458 237058 181476 182425 115705 93724 189090
2842 189090 366909 384670 216701 89352 275766 502207 561818 416240 178812 244998
2832 244998 334268 288761 306773 364338 364270 268103 317625 158815 227822 296209 163881 126317
2820 126317 151112 159505 82287 1670 259658 323633 207586 115046 69384 100760 766
$$ packed form
2901D30736l5163j58324p8174q939O6599o9935R1291R4974r1676P620J33343j89891
2889A92461r904l8103J48794r6224O1668J27933J4623O832Q59M1615O8635r5300
2877D23889m2552p5525N1409M7136o1510J18158o9041k30816j1951J39277J39943
2866D28417L7110O0716N6111J01803q3982r1461q9440o5992L784K5989J9453o9440
2854C33068n1601O5573P6003r1045o7025m6515J8600n5582R49o6720k1981R5366
2842A89090J77819J7761j67969j27349J86414K26441N9611j45578k37428O6186
2832B44998Q9270m5507J8012N7565o8r6167M9522j58810O9007O8387j32328l7564
2820A26317K4795Q393p7218q0617K57988O3975j16047r2540m5662L1376r9994
$$ plain form
2809 766 38207 26882 319738 226163 268091 391223 108137 93568 121745 170428 -52728
2798 -52728 -81000 -103693 29141 197103 189689 164678 177851 194732 219753 125996 184713 5323
2786 5323 -61989 -22569 55502 152560 183392 217374 93770 188298 198394 153297 -46619 63274
2774 63274 164347 71353 26129 90269 151179 175096 21523 -155172 56941 -66277 -46744
2763 -46744 76051 75099 91204 165692 52050 -52138 10553 103914 92756 134357 -94233
2752 -94233 -70468 -3306 -80751 -45904 -95292 -46251 -116083 -104031 57340 108200 5637
2741 5637 -73858 -141800 -151603 15229 -81905 -65677 3388 130487 69028 40413 22011 -131924
2729 -131924 -39730 -19056 -15730 -2065 -120636 -148654 -90985 -132355 -112556 -218995 -111663
$$ packed form
2809G66L7441j1325K92856r3575M1928J23132k83086j4569K8177M8683k23156
2798e2728k8272k2693J32834J67962p414k5011J3173J6881K5021r3757N8717j79390
2786E323o7312L9420P8071R7058L0832L3982j23604R4528J0096m5097j99916J09893
2774F3274J01073r2994m5224O4140O0910K3917j53573j76695K12113j23218J9533
2763d6744J22795r52J6105P4488j13642j04188O2691R3361j1158M1601k28590
2752i4233K3765O7162p7445L4847m9388M9041o9832J2052J61371N0860j02563
2741E637p9495o7942r803J66832r7134J6228O9065J27099o1459k8615j8402j53935
2729a31924R2194K0674L326J3665j18571k8018N7669m1370J9799j06439J07332
$$ plain form
2718 -111663 -148743 -118985 14944 72495 16973 95076 33089 -43086 -101979 -167137 -115603
2707 -115603 -133348 -12727 7250 50291 77932 -76956 -90889 70112 88661 -53331 -36544
2696 -36544 28109 -6404 102974 159581 161836 80741 25112 128734 -65011 -96820 -121957
2685 -121957 -15884 -10149 80415 -820 -189960 -101760 -14994 -53973 15847 -101591 -38518
2674 -38518 215057 208983 86013 128475 248972 137604 -77890 -45098 96994 138305 143934
2663 143934 156706 114664 30312 24022 147430 56788 137361 18188 -111106 -48109 958
2652 958 56716 -108402 -103222 -70527 -92832 -81120 -86385 -62306 -60613 -147329 -241232 -230071 -248978
2639 -248978 -373883 -286202 -41938 -18434 -72245 -5842 99407 55139 -93900 -42917 -109947
$$ packed form
2718a11663l7080K9758J33929N7551n5522P8103o1987p6175n8893o5158N1534
2707a15603j7745J20621J9977M3041K7641j54888j3933J61001J8549j41992J6787
2696c6544O4653l4513J09378N6607K255q1095n5629J03622j93745l1809k5137
2685a21957J06073N735R0564q1235j89140Q8200Q6766l8979O9820j17438O3073
2674c8518K53575o074j22970M2462J20497j11368k15494L2792J42092M1311N629
2663A43934J2772m2042q4352o290J23408r0642Q0573j19173j29294O2997M9067
2652I58N5758j65118N180L2695k2305J1712n265K4079J693q6716r3903J1161j8907
2639b48978j24905Q7681K44264K3504n3811O6403J05249m4268j49039N0983o7030
$$ plain form
2628 -109947 -78598 -85300 -45236 -83671 -147478 -17869 -107079 -35161 36409 61965 24644 13012
2616 13012 174233 22598 -55915 -58871 -96207 63104 202946 -28171 -124132 -112261 81955
2605 81955 22114 -24207 26483 112008 129591 76130 29461 -19572 -157367 -107160 -45367 -78387
2593 -78387 -29603 -8759 -47876 273077 247861 198922 282278 95707 3468 133948 163684
2582 163684 -2199 -92620 -104429 -100054 -89733 28425 -96983 152751 -118596 -250511 -233357
2571 -233357 -152269 -87492 -194577 -12717 -126519 -57384 -29502 -72131 -32704 -21866 79835
2560 79835 -7789 -98102 -327865 -203220 -17970 -69753 -76549 -73462 25857 67152 -76540
2549 -76540 -194926 -132499 -191526 -82700 -55260 -124712 -175919 36763 2184 -115594 -216896
$$ packed form
2628a09947L1349o702M0064l8435o3807J29609q9210P1918P1570K5556l7321j1632
2616A3012J61221j51635p8513k956l7336J59311J39842k31117r5961J1871J94216
2605H1955n9841m6321N0690Q5525J7583n3461m6669m9033j37795N0207O1793l3020
2593g8387M8784K0844l9117L20953k5216m8939Q3356j86571r2239J30480K9736
2582A63684j65883r0421j1809M375J0321J18158j25408K49734k71347j31915J7154
2571b33357Q1088O4777j07085J81860j13802O9135K7882m2629L9427J0838J01701
2560G9835q7624r0313k29763J24645J85250n1783o796L087R9319M1295j43692
2549g6540j18386O2427n9027J08826K7440o9452n1207K12682l4579j17778j01302
$$ plain form
2538 -216896 -192932 -143189 -127860 -44075 -105971 3182 -3603 -65743 -249106 -143824 -34969
2527 -34969 -35461 -24884 -65158 -50034 -217056 -226739 -113300 -112454 -76890 -171099 -132656 5076
2515 5076 -22137 -100073 -40602 32658 -161995 -198917 -101435 54162 89932 -35756 -214876
2504 -214876 -344321 -291223 -257983 -174960 32721 15077 -42749 -24968 -91225 -50569 -127647
2493 -127647 -128342 44300 109691 47995 103161 121557 28585 -840 58369 22915 -30646 -41392
2481 -41392 -209074 -331 -85393 -168674 -130687 -21652 -29973 -87513 46796 -40194 5920
2470 5920 125633 54183 -40764 -157373 -91840 -26426 821 50832 -97656 -88888 -202754
2459 -202754 -149594 -34780 -182730 -213052 -17413 105691 26341 -89845 -49497 -12479 56763
$$ packed form
2538b16896K3964M9743J5329Q3785o1896J09153o785o2140j83363J05282J08855
2527c4969m92J0577m0274J5124j67022r683J13439Q46L5564r4209L8443J37732
2515E076k7213p7936N9471P3260j94653l6922R7482J55597L5770j25688j79120
2504b14876j29445N3098L3240Q3023K07681j7644n7826J7781o6257M0656p7078
2493a27647o95J72642O5391o1696N5166J8396r2972k9425N9209l5454n3561j0746
2481d1392j67682K08743q5062q3281L7987J09035q321n7540J34309q6990M6114
2470E920J19713p1450r4947j16609O5533O5414K7247N0011j48488Q768j13866
2459b02754N3160J14814j47950l0322J95639J23104p9350j16186M0348L7018O9242
$$ plain form
2448 56763 122599 80748 -142240 -100341 21933 -23446 -38970 -53205 -50590 81001 59596
2437 59596 51680 43222 82837 -72452 -72533 -47850 1415 -59827 -37810 -95622 -56281 -56820 -189782
2424 -189782 -209237 -250531 -138894 -59190 -88157 31923 83991 55272 -37587 -111001 -127549
2413 -127549 -74160 8943 -175251 -94678 53928 110793 28362 104618 184086 -54253 -111735
2402 -111735 -91372 -44010 100938 -2228 -77041 -81015 -111833 -23766 -156373 -90943 106865
2391 106865 -70846 -36545 -87163 92795 123393 34380 -120040 -185348 -78110 -11453 -57309
2380 -57309 36848 29601 -1397 -248198 -232797 -103661 -126913 -94220 5486 21376 111532 -21838
2368 -21838 -78632 41575 -1843 137906 95547 96033 5479 18200 294552 204005 12415
$$ packed form
2448E6763O5836m1851k22988M1899J22274m5379j5524j4235K615J31591k1405
2437E9596p916q458L9615j55289q1K4683M9265o1242K2017n7812L9341n39j32962
2424a89782j9455m1294J11637P9704k8967J20080N2068k8719r2859p3414j6548
2413a27549N3389Q3103j84194Q0573J48606N6865q2431P6256P9468k38339n7482
2402a11735K0363M7362J44948j03166p4813l974l0818Q8067j32607O5430J97808
2391A06865j77711L4301n0618J79958L0598q9013j54420o5308J07238O6657m5856
2380e7309R4157p247l0998k46801J5401J29136k3252L2693R9706J5890R0156j33370
2368b1838n6794J20207m3418J39749m2359M86r0554J2721K76352r0547j91590
$$ plain form
2357 12415 -96227 -54780 62286 11677 33076 -116618 -141212 52898 159496 224296 254395
2346 254395 202219 66706 111389 97859 -45866 41672 -17138 24531 59466 182038 213990
2335 213990 244916 158288 198022 296468 328625 356673 392166 425531 434630 421851 304070 179998
2323 179998 183029 323378 345920 179121 118710 171701 182221 -78434 -122713 -41378 38436
2312 38436 145412 12542 70760 26425 15392 -112350 3108 57318 54680 52125 -14900
2301 -14900 144680 170205 128938 139502 94177 127613 233687 221027 111914 122174 188603
2290 188603 116446 90009 90227 61721 37930 -6720 14429 38779 30659 -92444 -3746 197406
2278 197406 119041 103255 -39881 -5985 24969 83236 177814 91204 142742 208679 300883
$$ packed form
2357A2415j08642M1447J17066n0609K1399j49694k4594J94110J06598O4800L0099
2346B54395n2176j35513M4683j3530j43725Q7538n8810M1669L4935J22572L1952
2335B13990L0926q6628L9734R8446L2157K8048L5493L3365R099j2779j17781j24072
2323A79998L031J40349K2542j66799o0411N2991J0520k60655m4279Q1335P9814
2312C8436J06976j32870N8218m4335j1033j27742J15458N4210k638k555o7025
2301a4900J59580K5525m1267J0564m5325L3436J06074j2660j09113J0260O6429
2290A88603p2157k6437K18k8506k3791m4650K1149K4350q120j23103Q8698K01152
2278A97406p8365j5786j43136L3896L0954N8267R4578q6610N1538O5937R2204
$$ plain form
2267 300883 162273 105752 -7831 120502 120559 176776 217257 196973 39330 46670 125074 138275
2255 138275 217728 79808 -57558 -122454 73136 152804 294870 362885 393963 262789 86039
2244 86039 223670 345071 134193 81538 184131 178242 225826 303498 306149 313895 233340 445129
2232 445129 477243 429569 341877 304615 96914 24766 204999 265918 276181 213786 271370
2221 271370 170859 201313 351348 103900 106512 163942 222361 219716 91192 50477 122615
2210 122615 183242 379411 423127 357438 360661 192380 119320 175048 100200 198784 245977
2199 245977 379264 291587 230939 378674 394625 357781 169434 175084 92052 177536 105806
2188 105806 -109005 -61703 1845 76091 201325 115693 113177 176433 198994 219511 231224
$$ packed form
2267C00883j38610n6521j13583J28333N7N6217M0481k0284j57643P340P8404J3201
2255A38275P9453j37920j37366o4896J95590P9668J42066O8015L1078j31174j76750
2244H6039J37631J21401k10878n2655J02593n889M7584P7672K651P746q0555K11789
2232D45129L2114m7674q7692l7262k07701p2148J80233O0919J0263o2395N7584
2221B71370j00511L0454J50035k47448K612N7430N8419k645j28524m0715P2138
2210A22615O0627J96169M3716o5689L223j68281p3060N5728p4848R8584M7193
2199B45977J33287q7677o0648J47735J5951l6844j88347N650q3032Q5484p1730
2188A05806k14811M7302O3548P4246J25234q5632k516O3256K2561K0517J1713
$$ plain form
2177 231224 389195 495711 299394 316232 402304 353320 372872 483587 398422 246320 257678
2166 257678 292746 257141 301090 264170 313694 455539 501236 533893 648971 648788 788330
2155 788330 876251 798773 660865 813427 788598 724819 719550 745222 813718 913441 1070484
2144 1070484 951572 1000200 1103618 1203913 1359270 1429072 1488490 1569151 1587434 1637784 2002429
2133 2002429 1951939 1991835 1859384 1725439 1828537 1797286 1848618 2028367 2095784 2180546 2144052
2122 2144052 2080671 2082608 2157312 2119024 2209250 2162190 2157909 2300715 2293849 2396394 2640889
2111 2640889 2844815 2904852 2834740 2694967 2881869 3063756 3248060 3249496 3450760 3657016
2101 3657016 3717020 3848396 4219499 4376963 4484377 4791945 5005663 5201954 5271322 5184437
$$ packed form
2177B31224J57971J06516j96317J6838Q6072m8984J9552J10715q5165j52102J1358
2166B57678L5068l5605M3949l6920M9524J41845M5697L2657J15078j83J39542
2155G88330Q7921p7478j37908J52562k4829o3779n269K5672O8496R9723J57043
2144A070484j18912M8628J03418J00295J55357O9802N9418Q0661J8283N0350L64645
2133B002429n0490L9896j32451j33945J03098l1251N1332J79749O7417Q4762l6494
2122B144052o3381J937P4704l8288R0226m7060m281J42806o866J02545K44495
2111B640889K03926O0037p0112j39773J86902J81887J84304J436K01264K06256
2101C657016O0004J31376L71103J57464J07414L07568K13718J96291O9368q6885
$$ plain form
2091 5184437 5271197 5652791 6118910 6458238 7043984 7468873 8009099 8404458 8994326 9842126
2081 9842126 10637896 11516615 12681711 13886854 15184436 16360364 17399785 18391378 19806627
2072 19806627 21294842 23174906 25636704 28969406 32961154 38517351 45740569 55343913
2064 55343913 67194123 80404572 92050144 98002706 92380084 76881199 61144364
2057 61144364 48951069 40113508 33384177 28562804 24947141 22211596 19828686 17910565
2049 17910565 16608470 15597140 14468983 13690762 12670436 11714578 10794030 10036424 9373370
2040 9373370 8755565 8344761 8041415 7626713 7399523 7080414 6576443 6412796 6253428 5977634
2030 5977634 5677288 5249185 4987138 4571920 4257108 4188385 4007443 3930725 3787943 3646896
$$ packed form
2091E184437Q6760L81594M66119L39328N85746M24889N40226L95359N89868Q47800
2081I842126P95770Q78719J165096J205143J297582J175928J039421R91593J415249
2072A9806627J488215J880064K461798L332702L991748N556197P223218R603344
2064E5343913J1850210J3210449J1645572N952562n622622j5498885j5736835
2057F1144364j2193295q837561o729331m821373l615663k735545k382910j918121
2049A7910565j302095j011330j128157p78221j020326r55858r20548p57606o63054
2040I373370o17805m10804l03346m14702k27190l19109n03971j63647j59368k75794
2030E977634l00346m28103k62047m15218l14812o8723j80942p6718j42782j41047
$$ plain form
2020 3646896 3607511 3453107 3426567 3490693 3342589 3086630 2897301 2969454 2991262 2886890
2010 2886890 2790324 2778130 2654730 2463691 2424772 2399822 2318697 2013433 1849093 1731600
2000 1731600 1680070 1576043 1702377 1714187 1795465 1596435 1400830 1417410 1214565 1113833
1990 1113833 1106052 1158581 1259166 1186497 1048465 1022944 1257610 1280075 1215911 1381092 1346803
1979 1346803 1328483 1245228 1217948 1129960 1051049 1016439 1080157 1154289 1004853 941395 775904
1968 775904 744561 901752 1127352 1044187 787637 941232 1139240 964844 793825 766007
1958 766007 685371 742553 604797 602747 646276 658681 720870 824391 856837 759265 566513
1947 566513 607114 625503 585051 797934 781634 716150 673174 565246 628763 655945 633787
$$ packed form
2020C646896l9385j54404k6540O4126j48104k55959j89329P2153K1808j04372
2010B886890r6566j2194j23400j91039l8919k4950q1125l05264j64340j17493
2000A731600n1530j04027J26334J1810Q1278j99030j95605J6580k02845j00732
1990A113833p781N2529J00585p2669j38032k5521K34666K2465o4164J65181l4289
1979A346803j8320q3255k7280q7988p8911l4610O3718P4132j49436o3458j65491
1968G75904l1343J57191K25600q3165k56550J53595J98008j74396j71019k7818
1958G66007q0636N7182j37756k050M3529J2405O2189J03521L2446r7572j92752
1947E66513M0601J8389m0452K12883j6300o5484m2976j07928O3517K7182k2158
$$ plain form
1936 633787 557450 452809 507311 366663 341767 532593 491381 325669 409037 219285 149337
1925 149337 392732 560888 602568 568366 655453 420126 348061 380746 578531 588547 580593
1914 580593 542449 360184 276986 187407 235317 412500 209466 289827 298084 399356 381100
1903 381100 298078 272703 110956 166908 243351 322671 258689 174530 132138 353004 159081
1892 159081 4132 -107982 8873 151346 92790 72192 133495 77900 119528 72986 -2780
1881 -2780 158226 19593 73081 275159 336823 104303 46341 5780 117130 148368 78224
1870 78224 -121573 -105633 -40388 -111059 72464 162211 211400 92546 89249 -13684 132691
1859 132691 185987 102550 222796 229988 292615 268760 297420 189241 119314 78579 194974
$$ packed form
1936F33787p6337j04641N4502j40648k4896J90826m1212j65712Q3368j89752o9948
1925A49337K43395J68156M1680l4202Q7087k35327p2065L2685J97785J0016p954
1914E80593l8144j82265q3198q9579M7910J77183k03034Q0361Q257J01272j8256
1903C81100q3022k5375j61747N5952P6443P9320o3982q4159m2392K20866j93923
1892A59081j54949j12114J16855J42473n8556k0598O1303n5595M1628m6542p5766
1881b780J61006j38633N3488K02078O1664k32520n7962m0561J11350L1238p0144
1870G8224j99797J5940O5245p0671J83523Q9747M9189j18854l297j02933J46375
1859A32691N3296q3437J20246P192O2627k3855K8660j08179o9927m0735J16395
$$ plain form
1848 194974 275113 276951 187211 236428 138415 47888 115363 116579 169838 191725 97539 31579
1836 31579 27132 -139208 -139069 53068 147756 71755 163402 213510 564 63302 139778 122444
1824 122444 146810 -6891 26170 104980 219776 172969 229240 337319 276777 185640 221555
1813 221555 121973 157135 307877 285635 123927 -10172 -45118 1687 209192 255189 228692
1802 228692 162246 212985 91794 183649 166642 187989 204146 315200 509253 510239 573288
1791 573288 493835 622806 382676 311205 325733 468131 300645 290394 209718 210803 270663
1780 270663 209517 245197 67597 -91415 16873 -111686 -14655 -43311 156690 283157
1770 283157 115190 96586 -19148 149837 151622 83044 3061 -74489 -52562 9261 52769
$$ packed form
1848A94974Q0139J838q9740M9217r8013r0527O7475J216N3259K1887r4186o5960
1836C1579m447j66340J39J92137R4688p6001R1647N0108k12946O2738P6476j7334
1824A22444K4366j53701L3061P8810J14796m6807N6271J08079o0542r1137L5915
1813B21555r9582L5162J50742k2242j61708j34099l4946M6805K07505M5997k6497
1802B28692o6446N0739j21191R1855j7007K1347J6157J11054J94053R86O3049
1791E73288p9453J28971k40130p1471J4528J42398j67486j0251q0676J085N9860
1780B70663o1146L5680j77600j59012J08288j28559R7031k8656K00001J26467
1770B83157j67967j8604j15734J68985J785o8578p9983p7550K1927O1823M3508
$$ plain form
1759 52769 11379 70867 78184 -52345 56237 -47198 -93185 -5571 -2828 106966 -121911
1748 -121911 -190331 -75035 -30158 89529 261969 136671 26486 -17580 -32860 -15074 44920
1737 44920 -96884 -17205 49546 -7701 131728 106649 102482 39674 96862 67031 111864 108223
1725 108223 76350 95109 130719 56562 136611 -32159 11067 -30162 41342 134176 300037
1714 300037 276092 62351 -60880 40260 16936 -35445 105118 110559 158946 43400 -1919
1703 -1919 123471 51001 152508 170869 104146 20789 45091 -54177 -79480 25707 44366
1692 44366 -67836 -14336 -120953 -90619 -112509 -211032 18345 122905 -16268 -1124 52843
1681 52843 -82061 -111630 -164824 -66464 -180303 -55925 -194533 -285751 -123272 -9867 -17916
$$ packed form
1759E2769m1390N9488P317j30529J08582j03435m5987Q7614K743J09794k28877
1748a21911o8420J15296M4877J19687J72440j25298j10185m4066j5280J7786N9994
1737D4920j41804P9679O6751n7247J39429k5079m167o2808N7188k9831M4833l641
1725A08223l1873J8759L5610p4157Q0049j68770M3226m1229P1504R2834J65861
1714C00037k3945k13741j23231J01140k3324n2381J40563N441M8387j15546m5319
1703a919J25390p2470J01507J8361o6723q3357K4302r9268k5303J05187J8659
1692D4366j12202N3500j06617L0334k1890r8523K29377J04560j39173J5144N3967
1681E2843j34904k9569n3194R8360j13839J24378j38608r1218J62479J13405q049
$$ plain form
1670 -17916 -8679 20384 -13877 51428 143740 304416 80347 -30545 25913 21383 74202 34850
1658 34850 -77833 -9 15964 -41321 -23645 -130229 -63883 70154 -23450 133055 -1577
1647 -1577 -75580 -86579 -94817 -55580 -99040 -54563 87051 -3379 -143006 -79932 -152690 -11472
1635 -11472 -25301 61359 108352 37525 -51689 29517 44355 25135 41233 -1169 29379 -84040
1623 -84040 1546 -13799 -17994 42098 -105391 -209498 -192454 22928 -33496 -10923 -78082
1612 -78082 -223235 -170202 3669 60364 85503 -72694 -23168 39291 18032 -11606 -59248
1601 -59248 -106360 -106099 -133501 -94309 -5691 158767 109359 -122158 -110732 -46618 -82290 -170970
1589 -170970 -183243 -101881 -49434 -39963 -237491 -201080 -182972 -175581 17897 101113 31525 -57754
$$ packed form
1670a7916R237K9063l4261O5305R2312J60676k24069j10892N6458m530N2819l9352
1658C4850j12683P7824J5973n7285J7676j06584O6346J34037r3604J56505j34632
1647a577p4003j0999q238L9237m3460M4477J41614r0430j39627O3074p2758J41218
1635a1472j3829Q6660M6993p0827q9214Q1206J4838j9220J6098m2402L0548j13419
1623h4040Q5586j5345m195O0092j47489j04107J7044K15382n6424K2573o7159
1612g8082j45153N3033J73871N6695K5139j58197M9526O2459k1259k9638m7642
1601e9248m7112K61k7402L9192Q8618J64458m9408k31517J1426O4114l5672q8680
1589a70970j2273Q1362N2447R471j97528L6411J8108P391J93478Q3216o9588q9279
$$ plain form
1577 -57754 29181 53880 40561 28090 -32350 -62831 -234694 -336463 -350310 -274359 -96402
1566 -96402 105720 -28022 26349 -421 -94675 -129785 -67118 -73629 -121817 -2337 -51988
1555 -51988 91599 75911 -76426 -90514 -173710 -143808 -170255 -131119 22969 200842 169276
1544 169276 -25708 61599 -101994 -106827 -44821 20510 -132837 -239614 -180743 -158293 -289980
1533 -289980 -198235 -170937 -1649 119876 123306 202903 34552 -14409 25398 20480 6956
1522 6956 47459 29884 19684 -83399 -49251 -78847 -221545 -6445 -122227 -140421 24884
1511 24884 40568 -128136 -191677 -140371 -202418 -172213 -110848 2904 51985 61074 273237
1500 273237 146162 88201 99301 100402 -270292 -170397 -88320 -47862 58984 108565 38064
$$ packed form
1577e7754Q6935K4699j3319j2471o0440l0481j71863j01769j3847P5951J77957
1566i6402K02122j33742N4371k6770r4254l5110O2667o511m8188J19480m9651
1555e1988J43587j5688j52337j4088q3196K9902k6447L9136J54088J77873l1566
1544A69276j94984Q7307j63593m833O2006O5331j53347j06777N8871K2450j31687
1533b89980R1745K7298J69288J21525L430P9597j68351m8961L9807m918j3524
1522F956M0503j7575j0200j03083L4148k9596j42698K15100j15782j8194J65305
1511B4884J5684j68704o3541N1306o2047L0205O1365J13752M9081R089K12163
1500B73237j27075n7961J1100J101l70694R9895Q2077M0458J06846M9581p0501
$$ plain form
1489 38064 82459 38817 -12997 -64960 -44079 43203 36110 106184 60992 63025 -50062 32773
1477 32773 104821 31423 -148008 -113368 -68914 131863 54042 -114330 -180880 -187930 -74395
1466 -74395 -151144 -77694 -9292 -5021 -8580 -141341 15848 63023 14798 -121544 -17551
1455 -17551 33614 123578 20366 841 -3190 -60450 -218280 -202984 -36611 -174099 5825
1444 5825 121938 -35663 -43624 -206398 -112323 3036 -104797 -113263 -41843 -10199 3014
1433 3014 105396 149495 35986 -19612 15268 -167984 -88137 -209215 -310922 -114574 37891
1422 37891 22773 -24391 136192 133004 -11572 -135767 -64297 12136 -145734 -202619 -8099
1411 -8099 -72413 -171375 -63261 77189 39374 -15792 -17368 2299 -59865 -130998 -41651 -170646
$$ packed form
1489C8064M4395m3642n1814n1963K0881Q7282p093P0074m5192K033j13087Q2835
1477C2773P2048p3398j79431L4640M4454K00777p7821j68372o6550p050J13535
1466g4395p6749P3450O8402M271l559j32761J57189M7175m8225j36342J03993
1455a7551N1165Q9964j03212j9525m031n7260j57830J5296J66373j37488J79924
1444E825J16113j57601p961j62774R4075J15359j07833q466P1420L1644J3213
1433C014J02382M4099j13509n5598L4880j83252P9847j21078j01707J96348J52465
1422C7891j5118m7164J60583l188j44576j24195P1470P6433j57870n6885J94520
1411h099o4314r8962J08114J40450l7815n5166j576J9667o2164p1133Q9347j28995
$$ plain form
1399 -170646 -184796 5153 -5300 -99006 44348 152570 113535 -100030 2169 153074
1389 153074 169091 79402 6269 -158062 -127505 -79675 -55348 -13292 10055 92691 -86640
1378 -86640 -80495 14875 -3483 -52753 160990 247469 179580 60860 -7179 106602 47083
1367 47083 112750 129776 133787 -57863 -127579 30068 -26263 -82461 -78201 16685 -86541 -157520
1355 -157520 -304610 -138573 49809 17004 -25496 -49929 119779 211056 59647 26209 126085
1344 126085 134430 30130 -48625 16951 73059 47066 -42839 -17877 32636 -9538 -33794 -229548
1332 -229548 -258364 -199994 -18556 65061 86902 -79755 7527 33508 -51538 -55262 161815
1321 161815 7064 -123119 52445 73222 69848 -45073 -2782 -129181 -171044 -112780 -2294
$$ packed form
1399a70646j4150J89949j0453r3706J43354J08222l9035k13565J02199J50905
1389A53074J6017q9689p3133j64331L0557M7830K4327M2056K3347Q2636j79331
1378h6640O145R5370j8358m9270K13743Q6479o7889j18720o8039J13781n9519
1367D7083O5667J7026M011j91650o9716J57647n6331n6198M260R4886j03226p0979
1355a57520j47090J66037J88382l2805m2500k4433J69708R1277j51409l3438R9876
1344A26085Q345j04300p8755O5576N6108k5993q9905K4962N0513m2174k4256j95754
1332b29548k8816N8370J81438Q3617K1841j66657Q7282K5981q5046l724K17077
1321A61815j54751j30183J75564K0777l374j14921M2291j26399m1863N8264J10486
$$ plain form
1310 -2294 -52678 -107576 -42502 -84189 -58091 34290 -17802 -38406 -38522 145671 50951 -70927
1298 -70927 -76166 -26514 80051 46563 -8232 76806 21925 -29850 -221550 -63233 119826
1287 119826 5814 -33673 -131671 -123412 -76210 88799 175274 118730 125018 94811 113089 9490
1275 9490 -80619 -13289 126960 -1153 -120953 4378 24286 -104793 -95607 -23793 -76890
1264 -76890 -15836 -60906 -238465 -202265 -176673 -99212 -191179 -122710 -35278 -31617 26786 37171
1252 37171 38912 -25387 193791 118641 101758 87156 -87484 -58392 -148227 -229261 -133247 -33682
1240 -33682 -127273 -139714 -150227 -27127 91424 92299 -172935 -39387 -32030 13045 -42368 -191465
1228 -191465 -81891 -182620 -101236 -58509 20939 -62058 -76154 -28682 -173492 -151974 -80380
$$ packed form
1310b294n0384n4898O5074m1687K6098R2381n2092k0604j16J84193r4720j21878
1298g0927n239M9652J06565l3488n4795Q5038n4881n1775j91700J58317J83059
1287A19826j14012l9487r7998Q259M7202J65009Q6475n6544O288l0207J8278j03599
1275I490r0109O7330J40249j28113j19800J25331J9908j29079R186P1814n3097
1264g6890O1054m5070j77559L6200K5592P7461r1967O8469Q7432L661N8403J0385
1252C7171J741o4299K19178p5150j6883j4602j74640K9092q9835q1034R6014R9565
1240c3682r3591j2441j0513J23100J18551Q75k65234J33548P357M5075n5413j49097
1228a91465J09574j00729Q1384M2727P9448q2997j4096M7472j44810K1518P1594
$$ plain form
1217 -80380 -17923 66773 9751 118392 227481 15407 -193123 -78658 -30113 -5903 -37015
1206 -37015 48787 -45936 -214339 -201989 -39781 -80304 -79207 -112486 -99686 -59789 89477
1195 89477 -1791 -37043 -103653 -163456 -155392 -107176 -31800 37315 148250 57508 -76779 33781
1183 33781 97968 99961 -73534 -117557 22284 -8875 -7613 -14861 40987 22755 39808 -58459
1171 -58459 -51558 74773 127847 52391 65618 -20431 -32898 -46886 -107440 26465 -2837 -13677
1159 -13677 -47015 -109001 -145322 -94405 -162652 -260059 -255124 -159326 -92864 -99904 -39420 -70735
1147 -70735 -41421 -22788 42622 -95397 -96212 -167397 -186386 -48639 -823 -47791 -53219 61615
1135 61615 178222 37199 -70800 -56128 -80738 -83372 -40645 -56359 -124382 -31788 -54332
$$ packed form
1217h0380O2457Q4696n7022J08641J09089k12074k08530J14465M8545K4210l1112
1206c7015Q5802r4723j68403J2350J62208m0523J097l3279J2800L9897J49266
1195H9477r1268l5252o6610n9803Q064M8216P5376O9115J10935r0742j34287J10560
1183C3781O4187J993j73495m4023J39841l1159J262p248N5848j8232J7053r8267
1171e8459O901J26331N3074p5456J3227q6049j2467j3988o0554J33905k9302j0840
1159a3677l3338o1986l6321N0917o8247r7407M935R5798O6462p040O0484l1315
1147g0735K9314J8633O5410j38019q15p1185j8989J37747M7816m6968n428J14834
1135F1615J16607j41023j07999J4672k4610k634M2727j5714o8023R2594k2544
$$ plain form
1124 -54332 -252258 -292886 -136207 -35901 -8301 65999 -20779 -139710 -354618 -195671 -33169
1113 -33169 -96064 -181806 -135369 -106753 -23709 178020 12036 -156787 -164248 -137045 -16456
1102 -16456 16858 2193 183169 145860 27685 -94254 -108062 -41241 -93788 -103813 -107807
1091 -107807 -116879 46951 131420 93592 64857 10768 30459 -135274 -153088 -121414 -168940
1080 -168940 -183641 -247758 -217070 -157692 -78576 -14488 49939 18792 59603 32064 -58675 -45365
1068 -45365 120497 15269 -15364 -123648 -39815 -46199 64713 200581 90914 -92357 -119393
1057 -119393 -20484 -69883 -88821 29786 15561 54352 111850 44245 -12539 -133075 15188
1046 15188 196105 225318 82144 -56251 -195753 -187730 -83578 -145680 -102030 14878 27181
$$ packed form
1124e4332j97926m0628J56679J00306K7600P4300q6778j18931k14908J58947J62502
1113c3169o2895q5742M6437K8616Q3044K01729j65984j68823p461K7203J20589
1102a6456L3314j4665J80976l7309j18175j21939j3808O6821n2547j0025l994
1091a07807r072J63830Q4469l7828k8735n4089J9691j65733j7814L1674m7526
1080a68940j4701o4117L0688N9378P9116O4088O4427l1147M0811k7539r0739J3310
1068d5365J65862j05228l0633j08284Q3833o384J10912J35868j09667j83271k7036
1057a19393R8909m9399j8938J18607j4225L8791N7498o7605n6784j20536J48263
1046A5188J80917K9213j43174j38395j39502Q023J04152o2102M3650J16908J2303
$$ plain form
1035 27181 -127330 -83906 81238 151744 72785 -119913 -34943 -7930 138255 179210 119274
1024 119274 59337 -52266 -81272 4421 -29247 -85481 -62719 4652 53317 62266 7569 -22578
1012 -22578 23462 68230 -40326 -221332 -182556 -114910 -54340 -66030 145077 263728 84028
1001 84028 -1530 36011 23924 -6382 -97510 -207985 -121803 -102071 -45469 -3280 -123482
990 -123482 -77240 -24942 -57950 12393 137808 153873 130578 172237 63926 -25793 -107918
979 -107918 -18334 -37964 -43356 -573 -165623 -282396 -195232 -178285 -85701 25034 117179
968 117179 42400 -40731 -53461 45701 33579 20120 -53241 -82188 -48778 25460 100215 8376
956 8376 -122432 150024 68140 -76662 -1075 -34934 37869 90949 58577 -15636 -153635
$$ packed form
1035B7181j54511M3424J65144P0506p8959j92698Q4970K7013J46185M0955n9936
1024A19274n9937j11603k9006Q5693l3668n6234K2762O7371M8665Q949n4697l0147
1012b2578M6040M4768j08556j81006L8776O7646O0570j1690K11107J18651j79700
1001H4028q5558L7541j2087l0306r1128j10475Q6182J9732N6602M2189j20202
990a23482M6242N2298l3008P0343J25415J6065k3295M1659j08311q9719q2125
979a07918Q9584j9630n392M2783j65050j16773Q7164J6947R2584J10735R2145
968A17179p4779q3131j2730R9162j2122j3459p3361k8947L3410P4238P4755r1839
956H376j30808K72456q1884j44802P5587l3859P2803N3080l2372p4213j37999
$$ plain form
945 -153635 -96138 -35369 -78978 -30763 72559 23425 -1666 -30079 -46339 -47090 -43011 100531
933 100531 92317 -108007 -257075 -69175 -159131 -93054 -75378 -220663 -231015 68533 -1384
922 -1384 22516 30003 -16304 -81863 -206260 -163195 -179623 24521 -135170 -180342 -5282 40935
910 40935 88407 -43347 7887 -20479 -19868 -89223 126039 163151 86070 -9663 -43867 -8995
898 -8995 17518 -5745 49644 177703 227666 -5027 -35619 -80798 -65274 -9663 -69286 -160486
886 -160486 -27040 95531 130428 6815 -149875 -5283 -47210 -192470 -144450 -65367 33925
875 33925 43279 -60763 -6521 -120331 -134512 -163129 -117741 -131205 19365 -21964 -223043
864 -223043 -187324 -95129 166444 120169 80792 161590 130806 -24626 -88390 -14785 -21780 19708
$$ packed form
945a53635N7497O0769m3609M8215J03322m9134k5091k8413j6260p51M079J43542
933A00531q214k00324j49068J87900q9956O6077J7676j45285j0352K99548o9917
922a384K3900P487m6307o5559j24397M3065j6428K04144j59691m5172J75060M6217
910D0935M7472j31754N1234k8366O11o9355K15262L7112p7081r5733l4204L4872
898h995K6513k3263N5389J28059M9963k32693l0592m5179J5524N5611n9623r1200
886a60486J33446J22571L4897j23613j56690J44592m1927j45260M8020P9083R9292
875C3925R354j04042N4242j13810j4181k8617M5388j3464J50570m1329k01079
864b23043L5719R2195K61573m6275l9377Q0798l0784j55432o3764P3605o995M1488
$$ plain form
852 19708 -107564 -104011 -102208 98490 69615 19460 29402 -39346 -24805 39833 131110 -30915
840 -30915 26793 -38416 -66213 -95104 35678 -35836 -46745 -12790 77181 168962 -89188 -108350
828 -108350 98849 336706 196184 37292 -106637 -29413 -99144 -117240 -96450 121135 278832
817 278832 122638 -128106 -88355 -44243 -75127 -50319 69257 -1172 -20459 28867 109699
806 109699 56914 65637 43730 143307 61862 -32530 -130036 -33063 176009 27836 -107318
795 -107318 -57347 71936 58862 80209 -51783 70241 140665 9620 -175977 -138215 82898
784 82898 112480 14578 18324 -31238 39964 10930 -178222 -157753 67207 135578 -172863 -258634
772 -258634 -133731 -45977 47066 64882 761 -17063 -34478 119795 67908 181140 329608
$$ packed form
852A9708j27272L553J803K00698k8875n0155R942o8748J4541O4638R1277j62025
840c0915N7708o5209k7797k8891J30782p1514j0909L3955Q9971R1781k58150j9162
828a08350K07199K37857j40522j58892j43929P7224o9731j8096K0790K17585J57697
817B78832j56194k50744L9751M4112l0884K4808J19576p0429j9287M9326Q0832
806A09699n2785Q723k1907R9577q1445r4392r7506R6973K09072j48173j35154
795a07318M9971J29283j3074K1347j31992J22024P0424j31045j85597L7762K21113
784H2898K9582r7902L746m9562P1202k9034j89152K0469K24960O8371l08441q5771
772b58634J24903Q7754R3043J7816o4121j7824j7415J54273n1887J13232J48468
$$ plain form
761 329608 214850 121073 -38444 -57513 76250 183153 -40809 22934 204204 147712 98346
750 98346 168842 71089 67393 159334 222120 110166 234210 236830 113698 139391 262935 247211
738 247211 -9053 -28975 -38682 -63068 -209968 -219949 -45153 118074 46911 -63357 -131803
727 -131803 -91211 -101978 -92337 -136760 -255781 -136651 -119128 -29994 130122 120260 50419 34995
715 34995 -124832 -43553 25063 76971 10159 -94563 -71263 52659 140259 186264 89210
704 89210 48081 74262 -34006 -51462 15977 -40191 22978 -89615 62138 188938 42514
693 42514 49251 -17136 -127041 -147599 -136032 -45458 -3630 9083 104897 88172 178385 184791
681 184791 145638 -19398 159316 142149 98309 -30587 -146077 -208319 -50601 46527 -37152
$$ packed form
761C29608j14758r3777j59517j9069J33763J06903k23962O3743J81270n6492m9366
750I8346P0496r7753l696R1941O2786j11954J24044K620j23132K5693J23544j5724
738B47211k56264j9922r707k4386j46900r981J74796J63227p1163j10268o8446
727a31803M0592j0767R641m4423j19021J19130J7523Q9134J60116r862o9841j5424
715C4995j59827Q1279O8616N1908o6812j04722K3300J23922Q7600M6005r7054
704H9210m1129K6181j08268j7456O7439n6168O3169j12593J51753J26800j46424
693D2514O737o6387j09905k0558J1567R0574M1828J2713R5814j6725R0213O406
681A84791l9153j65036J78714j7167m3840j28896j15490o2242J57718R7128q3679
$$ plain form
670 -37152 -25913 -88016 -134275 -52767 66682 62372 15521 5426 71255 64800 180022 128918
658 128918 45316 112965 26788 -52445 -186476 -176887 -55557 98931 40482 76032 125145
647 125145 41283 179987 87012 -95528 -72454 62564 -88383 -97905 -21131 -33508 -37567
636 -37567 2730 -102733 -51579 -18975 2228 11373 87644 198421 382576 199550 97992
625 97992 -19842 36580 -35640 -163408 -107493 -104331 40980 97590 65560 68381 -98284 -13556
613 -13556 149352 154559 236946 -16547 55063 181063 151443 114859 47543 -5759 184159
602 184159 122530 84892 -16805 -100986 -102533 -9186 67528 101379 167861 32537 -34175 17533
590 17533 -37436 -44743 -111451 -47102 61579 155526 247843 148241 -23874 94816 156378 87905
$$ packed form
670c7152J1239o2103m6259Q1508J19449m310m6851j0095O5829o455J15222n1104
658A28918q3602O7649q6177p9233j34031R589J21330J54488n8449L5550M9113
647A25145q3862J38704r2975j82540K3074J35018j50947r522P6774j2377m059
636c7567M0297j05463N1154L2604K1203R145P6271J10777J84155j83026j01558
625I7992j17834N6422p2220j27768N5915L162J45311N6610l2030K821j66665Q4728
613a3556J62908N207Q2387k53493P1610J26000k9620l6584o7316n3302J89918
602A84159o1629l7638j01697q4181j547R3347P6714L3851O6482j35324o6712N1708
590A7533n4969p307o6708O4349J08681R3947R2317r9602j72115J18690O1562o8473
$$ plain form
578 87905 22203 -20130 6569 214601 50833 -53673 -13632 -33778 100212 93835 62917
567 62917 58357 122900 19355 -5589 69555 138270 96296 188136 162048 59368 144771 24991
555 24991 3824 114425 23685 -86841 -143079 -167720 -63299 -35900 -16499 -65944 -83550
544 -83550 -68328 -5517 -108391 4369 207783 124622 204412 101638 87137 -17461 -21802
533 -21802 7693 -11942 51513 112260 282448 124892 156309 149470 103377 15218 65116 165690
521 165690 42621 -9549 90284 42846 -3950 87989 102656 19718 -46907 66321 141255
510 141255 218003 78826 -101305 -114590 -98223 -102730 -50241 46860 62870 -91992 -168888
499 -168888 -19917 -24364 -62302 -47983 -98734 29166 50719 31256 44609 -76626 -27412
$$ packed form
578H7905o5702m2333K6699K08032j63768j04506M0041k0146J33990o377l0918
567F2917m560O4543j03545k4944P5144O8715m1974R1840k6088j02680Q5403j19780
555B4991k1167J10601r0740j10526n6238k4641J04421K7399J9401m9445j7606
544h3550J5222O2811j02874J12760K03414q3161P9790j02774j4501j04598m341
533b1802K9495j9635O3455O0747J70188j57556L1417o839m6093q8159M9898J00574
521A65690j23069n2170R9833m7438m6796R1939J4667q2938o6625J13228P4934
510A41255P6748j39177j80131j3285J6367m507N2489R7101J6010j54862p6896
499a68888J48971m447l7938J4319n0751J27900K1553j9463J3353j21235M9214
$$ plain form
488 -27412 25403 -101180 -233959 -44428 4544 -20432 -13466 22412 20386 174 49979 -145467
476 -145467 -122813 -161691 -190510 -137015 36805 74548 -47230 1156 388 -81016 -145778 -85903
464 -85903 -100602 -190486 52508 280384 180676 34289 -20923 19073 186587 105498 -34776
453 -34776 24670 -109371 -79070 92467 -31874 163159 110736 8583 3566 82584 23284
442 23284 -32869 -65282 -16242 26876 74322 -6857 2556 49157 -6680 -91261 -7680 -63498
430 -63498 -96000 -83932 -109599 76984 137077 128671 182899 148510 -37068 -95208 -76840 -117921
418 -117921 -77605 68447 109975 84147 104363 42838 24434 65189 -15886 23048 -55872 -157102
406 -157102 82790 141701 139440 -8054 -137238 -31878 -30494 -28022 -58474 -47375 -72031 94389
$$ packed form
488b7412N2815j26583j32779J89531M8972k4976O966L5878k026k0212M9805j95446
476a45467K2654l8878k8819N3495J73820L7743j21778M8386p68q1404o4762N9875
464h5903j4699q9884K42994K27876r9708j46387n5212L9996J67514q1089j40274
453c4776N9446j34041L0301J71537j24341J95033n2423j02153n017P9018n9300
442B3284n6153l2413M9040M3118M7446q1179R413M6601n5837q4581Q3581n5818
430f3498l2502J2068k5667J86583O0093q406N4228l4389j85578n8140J8368m1081
418a17921M0316J46052M1528k5828K0216o1525j8404M0755q1075L8934p8920j01230
406a57102K39892N8911k261j47494j29184J05360J384K472l0452J1099k4656J66420
$$ plain form
394 94389 -28446 -20545 -66346 -146057 -40090 -95794 -194448 -103022 -57872 -104375 -10777 86560
382 86560 86378 148 49410 -67567 -120273 -56065 88181 4135 -75096 -143449 -254360 -288171
370 -288171 -365607 -130370 -129915 -127633 -106327 -176248 -69953 -98970 -43123 16281 -147233 -70214
358 -70214 -203437 -178703 -69395 114485 72246 122052 77320 189704 86202 132749 65527
347 65527 27642 87393 91994 11356 -83167 6823 121937 -16014 -91275 -83451 -154466 -59539
335 -59539 116001 131705 117019 -112790 -141798 -25897 -83178 -94831 37490 -56936 -213162
324 -213162 -101573 -117502 94170 75227 49879 16318 36485 18619 -163343 -31762 48836
$$ packed form
394I4389j22835P901m5801p9711J05967n5704r8654R1426M5150m6503R3598R7337
382H6560j82q6230M9262j16977n2706O4208J44246q4046p9231o8353j10911l3811
370b88171p7436K35237M55K282K1306o9921J06295k9017N5847N9404j63514P7019
358g0214j33223K4734J09308J83880m2239M9806m4732J12384j03502M6547o7222
347F5527l7885N9751M601q0638r4523Q9990J15114j37951p5261P824p1015R4927
335e9539J75540J5704j4686k29809k9008J15901n7281j1653J32321r4426j56226
324b13162J11589j5929K11672j8943k5348l3561K0167j7866j81962J31581Q0598
$$ [...]
##END NTUPLES=NMR SPECTRUM
##END=
