##TITLE=1H_TG-2370-01
 DMSO
 8 sc, 
 24.1.2023
##JCAMPDX= 6.0         $$ Bruker NMR JCAMP-DX V2.0
##DATA TYPE= NMR SPECTRUM
##DATA CLASS= NTUPLES
##ORIGIN= UXNMR, Bruker Analytische Messtechnik GmbH
##OWNER= root
$$ XWIN-NMR		Version 3.5
$$ Tue Jan 24 14:22:15 2023 Russian Standard Time (UT+4h)  she@DPX200
##.OBSERVE FREQUENCY= 200.13135
##.OBSERVE NUCLEUS= ^1H
##.ACQUISITION MODE= SIMULTANEOUS
##.ACQUISITION SCHEME= undefined
##.AVERAGES= 8
##.DIGITISER RES= 18
##SPECTROMETER/DATA SYSTEM= spect
##.PULSE SEQUENCE= zg30
##.SOLVENT NAME= DMSO
##.SHIFT REFERENCE= (INTERNAL, DMSO, 0, 15.7612)
##AUDIT TRAIL= $$ (NUMBER, WHEN, WHO, WHERE, WHAT)
$$ ##TITLE= Audit trail, XWIN-NMR		Version 3.5
$$ ##JCAMPDX= 5.01
$$ ##ORIGIN= Bruker BioSpin GmbH
$$ ##OWNER= she
$$ F:/spectra/data/she/nmr/H-F/1/pdata/1/auditp.txt
$$ ##AUDIT TRAIL=  $$ (NUMBER, WHEN, WHO, WHERE, WHAT)
(   1,<2023-01-24 14:20:56.25 +0400>,<she>,<DPX200>,
      <created by zg, POWCHK disabled, PULCHK disabled
       configuration hash MD5:
       00 E9 B6 7A A2 85 ED C7 34 08 36 98 17 FE 4E 26
       data hash MD5: 16K
       86 29 9A E4 9E 9F 78 DA DA 6E 91 51 37 1C 26 A0>)
(   2,<2023-01-24 14:20:58.46 +0400>,<she>,<DPX200>,
      <Start of raw data processing
       efp BC_mod = 2 LB = 0.24 FT_mod = 6 PKNL = 1 PHC0 = -19115.45 PHC1 = 15.40079 SI = 16K 
       data hash MD5: 16K
       C5 04 79 95 E7 DF EC A3 1A 3E E1 EB ED C3 0B A1>)
(   3,<2023-01-24 14:21:13.57 +0400>,<she>,<DPX200>,
      <pk PHC0 = -1.304577 PHC1 = 0 
       data hash MD5: 16K
       38 B9 86 61 DE BC E2 FF EE 65 4F 91 30 88 EF 1F>)
(   4,<2023-01-24 14:21:28.26 +0400>,<she>,<DPX200>,
      <pk PHC0 = 2.026558e-07 PHC1 = 0 
       data hash MD5: 16K
       82 C8 FB 0B 1C 20 6D 8C E8 1B D8 6A 71 F3 C7 F4>)
(   5,<2023-01-24 14:21:31.17 +0400>,<she>,<DPX200>,
      <abs ABSG = 5 
       data hash MD5: 16K
       69 6D B4 A5 A2 75 AA 72 F1 7F 51 5B 20 70 71 56>)
$$ ##END=
$$ 
$$ hash MD5
$$ F0 E2 45 06 A4 07 22 50 B4 B3 05 4F 91 2C 42 D2
##$RELAX= 
##$RELAX= 
##$RELAX= 
##$RELAX= 
##$RELAX= 
##$RELAX= 
$$ Bruker specific parameters
$$ --------------------------
##$DU= <F:/spectra>
##$EXPNO= 1
##$NAME= <H-F>
##$PROCNO= 1
##$TYPE= <nmr>
##$USER= <she>
##$AMP= (0..31)
100 100 100 100 100 100 100 100 100 100 100 100 100 100 100 100 100 100 
100 100 100 100 100 100 100 100 100 100 100 100 100 100 
##$AQSEQ= 0
##$AQ_mod= 1
##$AUNM= <au_zg>
##$AUTOPOS= <>
##$BF1= 200.13
##$BF2= 200.13
##$BF3= 200.13
##$BF4= 200.13
##$BF5= 200.13
##$BF6= 200.13
##$BF7= 200.13
##$BF8= 200.13
##$BYTORDA= 1
##$CFDGTYP= 0
##$CFRGTYP= 5
##$CHEMSTR= <none>
##$CNST= (0..31)
1 1 145 1 1 1 1 1 1 1 1 1 1 1 1 1 1 1 1 1 1 1 1 1 1 1 1 1 1 1 1 1 
##$CPDPRG= <>
##$CPDPRG1= <>
##$CPDPRG2= <>
##$CPDPRG3= <>
##$CPDPRG4= <mlev>
##$CPDPRG5= <mlev>
##$CPDPRG6= <mlev>
##$CPDPRG7= <mlev>
##$CPDPRG8= <mlev>
##$CPDPRGB= <>
##$CPDPRGT= <>
##$D= (0..31)
0 1.2 0 0 0 0 0 0 0 0.06 0 0.03 0 0 0 0 0.0002 0 0 0 0 0 0 0 0 0 0 0 0 
0 0 0 
##$DATE= 1674555655
##$DBL= (0..7)
$$ [...]
##$SUBNAM3= <"">
##$SUBNAM4= <"">
##$SUBNAM5= <"">
##$SUBNAM6= <"">
##$SUBNAM7= <"">
##$SUBNAM8= <"">
##$SUBNAM9= <"">
##$SW= 18.05172834244
##$SWIBOX= (0..15)
0 0 2 0 0 0 0 0 0 0 0 0 0 0 0 0 
##$SW_h= 3612.71676300578
##$TD= 16384
##$TD0= 1
##$TE= 0
##$TE2= 300
##$TE3= 300
##$TEG= 300
##$TL= (0..7)
0 120 120 120 120 120 120 120 
##$TP= (0..7)
150 150 150 150 150 150 150 150 
##$TP07= 0
##$TPNAME0= <>
##$TPNAME1= <>
##$TPNAME2= <>
##$TPNAME3= <>
##$TPNAME4= <>
##$TPNAME5= <>
##$TPNAME6= <>
##$TPNAME7= <>
##$TPOAL= (0..7)
0.5 0.5 0.5 0.5 0.5 0.5 0.5 0.5 
##$TPOFFS= (0..7)
0 0 0 0 0 0 0 0 
##$TUNHIN= 0
##$TUNHOUT= 0
##$TUNXOUT= 0
##$USERA1= <user>
##$USERA2= <user>
##$USERA3= <user>
##$USERA4= <user>
##$USERA5= <user>
##$V9= 5
##$VALIST= <valist>
##$VCLIST= <CCCCCCCCCCCCCCC>
##$VD= 0
##$VDLIST= <DDDDDDDDDDDDDDD>
##$VPLIST= <PPPPPPPPPPPPPPP>
##$VTLIST= <TTTTTTTTTTTTTTT>
##$WBST= 1024
##$WBSW= 4
##$XGAIN= (0..3)
0 0 0 0 
##$XL= 0
##$YL= 0
##$YMAX_a= 68634
##$YMIN_a= -99742
##$ZGOPTNS= <>
##$ZL1= 120
##$ZL2= 120
##$ZL3= 120
##$ZL4= 120
##$ABSF1= 15.76121
##$ABSF2= -2.290639
##$ABSG= 5
##$ABSL= 3
##$ALPHA= 0
##$AQORDER= 0
##$ASSFAC= 0
##$ASSFACI= 0
##$ASSFACX= 0
##$ASSWID= 0
##$AUNMP= <proc_1d>
##$AZFE= 0.1
##$AZFW= 0.1
##$BCFW= 0
##$BC_mod= 2
##$BYTORDP= 0
##$COROFFS= 0
##$CY= -3
##$DATMOD= 1
##$DC= 0
##$DFILT= <>
##$DTYPP= 0
##$F1P= 0
##$F2P= 0
##$FCOR= 1
##$FTSIZE= 16384
##$FT_mod= 6
##$GAMMA= 0
##$GB= 0
##$INTBC= 1
##$INTSCL= 3.70164e-10
##$ISEN= 128
##$LB= 0.24
##$LEV0= 0
##$LPBIN= 0
##$MAXI= 10000
##$MC2= 0
##$MEAN= 0
##$ME_mod= 0
##$MI= 1.114404
##$NCOEF= 0
##$NC_proc= -7
##$NLEV= 6
##$NOISF1= 3.799351
##$NOISF2= 2.8
##$NSP= 0
##$NTH_PI= 0
##$NZP= 0
##$OFFSET= 15.76121
##$PC= 1
##$PHC0= -19116.75
##$PHC1= 15.40079
##$PH_mod= 1
##$PKNL= yes
##$PPARMOD= 0
##$PSCAL= 0
##$PSIGN= 0
##$REVERSE= no
##$SF= 200.130002066528
##$SI= 16384
##$SIGF1= 3
##$SIGF2= 2
##$SINO= 5.538805
##$SIOLD= 16384
##$SREGLST= <1H.CDCl3>
##$SSB= 0
##$STSI= 16384
##$STSR= 0
##$SW_p= 3612.71676300578
##$SYMM= 0
##$S_DEV= 0
##$TDeff= 16384
##$TDoff= 0
##$TI= <>
##$TILT= no
##$TM1= 0
##$TM2= 0
##$TOPLEV= 0
##$USERP1= <user>
##$USERP2= <user>
##$USERP3= <user>
##$USERP4= <user>
##$USERP5= <user>
##$WDW= 1
##$XDIM= 16384
##$YMAX_p= 269734964
##$YMIN_p= -1057135
$$ End of Bruker specific parameters
$$ ---------------------------------
##NTUPLES= NMR SPECTRUM
##VAR_NAME=  FREQUENCY,     SPECTRUM/REAL,   SPECTRUM/IMAG
##SYMBOL=    X,             R,               I
##VAR_TYPE=  INDEPENDENT,   DEPENDENT,       DEPENDENT
##VAR_FORM=  AFFN,          ASDF,            ASDF
##VAR_DIM=   16384,         16384,           16384
##UNITS=     HZ,            ARBITRARY UNITS, ARBITRARY UNITS
##FACTOR=    0.220516191357247, 1,           1
##FIRST=     3154.29107824626, 0,            0
##LAST=      -458.42568475952, 0,            0
##MIN=       -458.42568475952, -1057135,     0
##MAX=       3154.29107824626, 269734964,    0
$$ Real data points
##PAGE= N=1
##DATA TABLE= (X++(R..R)), XYDATA
$$ [...]
8296a9042m6823O3351Q3831k01114J00472k286K64758j44704n7872O7096k44753
8285a37086K00701j15674j29553j03354K24435M8923J00415j01498p4498M3912
8275d3277N4330N2401P7302p9554k3291q1811k8021j98879J77873l5564j82272
8264c10763J8588o0979N1664J87584L0346n065J79704k08490O2983p7943J4001
8253a18370N6465N1296k9821j11572q2885Q959n4910R5524M4059L3112K12326
8242A04183O349k09381j12876k2199L8854L6534j22526J45415J18811L2743R5932
8231A11839q0382q0769J54663j71182K1898m7620o0286l9363J52448L9510j94423
8220a93667j48167l2691L90920j1952n8771J41527j6815K3046j49592L5071M7436
$$ y = [-19042, -65865, -2514, 81317, -119797, -19325, -21611, 243147, 98443, 40571, 107667, -137086, 63615, -52059, -181612, -284966, -60531, -11608, 88807, -12691, -87189, -43277, 11053, 63454, 140756, 61202, 37911, -43900, -71921, -270800, -92927, -128491, -310763, -292175, -353154, -301490, -113906, -83560, -88625, 91079, -117411, -54428, -132371, -118370, -61905, -10609, -40430, -152002, -234887, -225928, -280838, -185314, -141255, -108143, 104183, 110532, -98849, -211725, -233924, -195070, -158536, -281062, -135647, -16836, 15907, 111839, 31457, -49312, 105351, -65831, -43933, -91553, -151839, -191202, -38754, 756, -193667, -341834, -374525, 16395, 4443, -54328, 87199, 70384, 93430, -56162, -21091, 26345]
8209B6345j14716j57822M4577K1510J04636p775j7143J24032m9574K8803j38696
8198a35823m2406k04461M0773N9036P1568q45822J158826J003276o65332q9635
8188C50000l1701M3494m13245J63394M3516K2486k08653R2164R3607j45809M9160
8177E8413J29001j94162n5809J60288j10077J3758L00276j97194r8950j2727R6808
8166H9625p8220m6045J89011j36549q571K00051j75546P2209R415k00616J29269
8155D4033n334O0122k43930j4520P4149N6689l1484K95776j14146k51280r0950
8144b20875J14119l1689l437k28674J82635Q3028J3653m2587m268k6404r7036
8133b61535J82756K4895k19494J72972M6122j63364J15191K1569l465j57447J79304
$$ y = [26345, -88371, -246193, -201616, -180106, -75470, -83245, -100388, 23644, -25930, 2873, -135823, -178229, -382690, -341917, -282881, -211313, -1057135, 101691, 1104967, 439635, 350000, 318299, 361793, -51452, 111942, 155458, 177944, -30709, 61455, 155062, 9253, 58413, 187414, -6748, -62557, 97731, -12346, 1412, 301688, 104494, 5544, -7183, 89625, 11405, -34640, 154371, 17822, 9251, 209302, 33756, 105965, 115380, -85236, 44033, 38699, 98821, -145109, -159629, -85480, -28791, -60275, 235501, 121355, -129925, -220875, -106756, -138445, -141882, -370556, -187921, -104893, -91240, -133827, -138095, -164499, -261535, -78779, -53884, -273378, -100406, -54284, -217648, -102457, -80888, -84353, -241800, -62496]
8122f2496k0799j5578N6769J24595r5600K3477P1478q57j03898L9720O6145J34003
8110B16959j58344j15493J39698K1518j42581K10625J15506o6759k49154N0755
8100B2730J50327k11245O5675j23237m5752J9265J45682L6478n9343N3835l7466
8089A6949R7053n8835j03991j78786m7566L09292m5579j42144j31259J678J80427
8078a02761K58829j62995J54476J0115K1033Q0647r9363j33182O7381j29808K23275
8067A87647m8490l5216j27977o2240L01119o2841j74285J29831l7581p5350K01614
8056A96231j79012j00825k15509R8424J29227j7920l955N5265m4039M2160J04277
8045F4324r5954j78077J71416j70029P6792L4891j81798L145R3594L2008O9841
$$ y = [-62496, -83295, -98873, -42104, 82491, -13109, 10368, 81846, 80989, -22909, 16811, 82956, 216959, 58615, -56878, 82820, 104338, -38243, 172382, 287888, 221129, -28025, 22730, 173057, -38188, 27487, -95750, -141502, -122237, 23445, 59923, 580, 54415, 16949, 114002, 55167, -48824, -227610, -275176, 34116, -11463, -153607, -284866, -283188, -102761, 156068, -6927, 147549, 157664, 178697, 259344, 159981, 26799, 94180, -35628, 187647, 139157, 103941, -24036, -86276, 214843, 152002, -22283, 107548, 69967, -5383, 196231, 17219, -83606, -299115, -200691, -71464, -89384, -93339, -38074, -82113, -39953, 64324, -31630, -209707, -38291, -208320, -131528, -96637, -278435, -275290, -181696, -149688, -79847]
8034g9847J57605M0950M8226P4285n9264r777m3984n8294j42050J5225J16823
8023E9898K305q0014J22193j29878j0904K16538O250J4196m7018n9137q1258K9834
8011D3005l7257n2241N5055n2792J14755j01397J41130J60435k42187j30462K00513
8000I8557J08368j61619p0320k08725P4105L88802M4206j03713j85215J69927
7990A54373j83451k7253J12980k74743j05354L07789N5684k20677K72291Q2016
7980A73655J26128j25901k88675j44886o2698L5009J75759O7513l9823J96815
7970A12896K59410k26062j7413R5032k88448J18362J49006j06620r5196Q942N3299
7959F3208j46040j56118j40996J64539j27564p0801K44073L0080K94348o1506
$$ y = [-79847, 77758, 118708, 166934, 241219, 181955, 172178, 128194, 69900, -72150, -56925, 59898, 62203, -17811, 104382, -25496, -36400, 180138, 186388, 200584, 153566, 94429, 13171, 43005, 5748, -46493, 8562, -44230, 70525, -30872, 110258, 270693, 28506, -101956, 98557, 206925, 45306, -25014, -233739, -159634, 229168, 273374, 169661, -15554, 154373, -29078, -56331, 56649, -218094, -323448, -15659, 40025, -180652, 91639, 173655, 299783, 173882, -114793, -259679, -322377, -287368, -111609, -44096, -83919, 112896, 372306, 146244, 128831, 223863, -64585, 53777, 202783, 96163, 967, 9909, 63208, -82832, -238950, -379946, -215407, -342971, -413772, -169699, -139619, 154729, 93223]
7949I3223j24420L1330j71738K27584j52811r2282J46k1081m2811N3472L02599
7938A03211N9765j87273n9206l4428M4887j23233M5172N5399R6773P429j39550
7927a31054j3045K06454R3329j39760j32499k05158J20607P3857J73337j96592
7917a50524J8390J4620p4750J39625r1612O8450M4674n1120j07138J16228q9452
7906a62609M2477J88447K29570k25880j91778m7946p6046J41761j53219p9496
7896c34719K6502J71001J57083P5473j28143J40385q2582J5549M9837j00060R0059
7885H0385k11743n0379P2576J37815K981j40170m8633j9957L1930J27352K5222
7874G379k6962j42629J1720r9303j03314J55043L58187j56866J0181j3581K8740
$$ y = [93223, -31197, 133, -171605, 55979, -96832, -189114, -188968, -210049, -252860, -199388, 103211, 162976, -24297, -83503, -117931, -73044, -196277, -151105, -95706, 1067, 8496, -131054, -144099, 62355, 155684, 15924, -116575, -321733, -201126, -127269, 46068, -150524, -132134, -117514, -192264, -52639, -144251, -75801, -31127, -82247, -189385, -73157, -162609, -120132, 68315, 297885, 72005, -119773, -167719, -243765, -102004, -255223, -334719, -308217, -137216, 19867, 95340, -32803, 107582, 25000, 40549, 90386, -9674, 80385, -131358, -181737, -109161, 28654, 31635, -108535, -157168, -177125, -145195, -17843, 7379, -19583, -162212, -150492, -249795, -353109, -198066, 160121, 3255, 13436, -145, 28595]
7863B8595j63200o8130J10521j15805J52203p0914Q6936J3857K2966N5280j52267
7852i9958l30448J08014J23234J90034m9659J26177q9396k13829o289K55317j6386
7841c189j22351Q6906J72674P4014o3699m9129o5215j01262k42060K12747K43175
7830A42611O8416m4948k02397j6420j92707k2359n1810p4834J91161P3006P9248
7819e1033K2091k07704K8259N4883M1922q1048J69219J19069k81279K84873J44784
7808B44036r3345j0480J72062o2836j37055j52453J28335l407n6529j82370J27808
7797b6234Q2360j43496p059q0711J94799N4156J01331j00312q0684q9940j44595
7786b40385q9242J75895J15493L00880j20334j69123p2252j16741r9776J37267
$$ y = [28595, -134605, -202735, -92214, -208019, -55816, -126730, -39794, -25937, -2971, 52309, -99958, -430406, -322392, -199158, -9124, -58783, 67394, -22002, -235831, -242120, 13197, -3189, -125540, -38634, 134040, 208054, 144355, 95226, 30011, -71251, -313311, -100564, 142611, 211027, 166079, -36318, -52738, -245445, -267804, -319614, -394448, -203287, -130281, -51033, -28942, -236646, -208387, -153504, -111582, -192630, -23411, 95658, -185621, 99252, 244036, 150691, 140211, 312273, 249437, 112382, -40071, 88264, 84857, 28328, -154042, -26234, 56126, -87370, -94429, -175140, 19659, 73815, 175146, 74834, -5850, -95790, -240385, -329627, -153732, -38239, 262641, 142307, -26816, -99068, -215809, -315585, -178318]
7776a78318K39101j00251j3100K25605o0167j82778q4733L4847m4334J05927J90578
7765A32377J8984M0476j29302q1116l8771L1207q058q842O568J05341q6517k17133
7753b34786q0453L09480l3553J5418L489J81215j26041j09280K9483J26781j24278
7742d2525j40119J18407K6905M6402o7176n7973o6168K03028j21780q6520O1058
7731a26461q6095J5940J12137j19687L6209K9454o695J52589j12658q7579k5589
7720b18435N0431j0184m7519p8809J71203m9039k07939K07977j80325o0324K82805
7709a40158K31845k15911L7243K76622r9230m7132q8930n0163r5940L0518J93493
7698C2257Q648j69877L9861M1007p1955l8871m2372J42985P1671p3750q879J30512
$$ y = [-178318, 60783, -39468, -52568, 173037, 112870, -69908, -154641, -119794, -164128, -58201, 132377, 151361, 191837, 62535, -18581, -57352, -26145, -34203, -43045, -36477, 68864, -17653, -234786, -315239, -5759, -39312, -23894, -20405, 160810, 34769, -74511, -45028, 81753, -42525, -182644, -64237, -37332, 9070, -58106, -116079, -182247, 20781, -100999, -187519, -126461, -212556, -196616, -84479, -204166, -167957, -138503, -145198, 7391, -105267, -192846, -218435, -168004, -178188, -225707, -304516, -133313, -182352, -390291, -182314, -362639, -422963, -140158, 91687, -124224, -86981, 189641, 90411, 43279, -45651, -95814, -191754, -161236, 32257, 40905, -128972, -89111, -48104, -120059, -158930, -201302, -58317, 13354, -60396, -69275, 61237]
7686F1237N0314J5790q7053l87942J18350j308n494K37876j73243k9313O257k1914
7674b16443K65646j34971N5874k7365j4402L9563r1781l0525J42301q7827k14703
7663c14633L32630k57975N1779K10699j29504k1618J05525n2110K0860j58250
7653b12597J4287J38892R0770k69347J65142J67072q9278m9772j78588K15636
7643g783o130N5386j47560J3757j57628O4142N8881j65253K96299P9379J1859
7632I5349n5769k5131j7930j52229R9379q1623k5490k312O4646j71382k8844K24792
7620g6544p1756J11521K173p6027K21985l3619j37956J67201j74985m1087J11238
7609B144r0131m6443J35119q8414j1317r9655j3031q060l7123J56393J64681p3355
$$ y = [61237, 111551, 127341, 40288, -347654, -229304, -230612, -236106, 1770, -171473, -200786, -194529, -216443, 49203, -85768, -29894, -57259, -71661, -32098, -123879, -154404, -12103, -99930, -314633, 17997, -239978, -188199, 22500, -107004, -128622, -23097, -75207, -54347, -212597, -198310, -59418, 31352, -237995, -72853, 94219, 4941, -44831, -223419, -7783, -13913, 41473, -106087, -92330, -249958, -185816, -126935, -292188, 4111, 83490, 95349, 39580, 14449, -3481, -155710, -56331, -137954, -163444, -165756, -101110, -272492, -301336, -76544, -148300, -36779, -34606, -110633, 111352, 77733, -60223, 106978, -68007, -109094, 2144, -87987, -134430, 689, -87725, -99042, -198697, -211728, -219788, -256911, -100518, 64163, -9192]
7597i192k59306J32926r675j32153P1975K63850j09611k1302J79307p9164M6615
7586G4270j02649k56422J15894j8717J87658M6921J0419p1592o250J25644k82199
7575a77023j29002J37697K03135j87829o9136K14687J91876m3313j41603m2857
7565d3368M4193J7969J25253p5198J05483j28605k18036K00259J0376n0793j35842
7554a48309l4480J13257J41035o6124j28104n5571K26829K1198k4237J7762j11158
7543d7902m7959k03723j26N5109j39536R7973J78657J16841o8250n2893n7571
7532a69380k4340J66911O8451l7769m2170l9044N6889M8028m2340M8576k54899
7521b21087J28122J76551J7901j98779J43386j54167k04291j3354K22865m3054
$$ y = [-9192, -268498, -135572, -145247, -277400, -205425, 58425, -51186, -72488, 106819, 27655, 74270, -28379, -284801, -168907, -187624, 34, 46955, 57374, -14218, -20468, 105176, -177023, -306025, -168328, 34807, -153022, -222158, -7471, 184405, 141092, -511, -43368, 825, 18794, 144047, 68849, 174332, 45727, -172309, 27950, 38326, -12467, -148309, -182789, -69532, 71503, 5379, -122725, -178296, 48533, 69731, 45494, 63256, -47902, -95861, -299584, -299710, -244601, -384137, -286164, -107507, 9334, -58916, -111809, -169380, -193720, -26809, 41642, 3873, -38297, -77341, -20452, 27576, -14764, 33812, -221087, -92965, 83586, 101487, -97292, 46094, -108073, -312364, -325718, -102853, -145907]
7511a45907Q2901l4786q3425J38299M0432O947o4212P450n0677R6274l2052j10850
7499a49606L3565L6397j99133J22720m2122J51975J39261m0289R8365K39452k52117
7488A38468l16040J16458j28871j0701R7504p3985p9173p0399J04853Q007r0327
7477c04206J2111K36742J17622p2653p9542P1572p9568m7448q8547n0720J78614
7466a06023J81200k91672J08095l058l5637l2128p0537l8433R7608m3852M2534
7455a91903K21432j4382p4483n0452J86408n214j49563o0118J61436k0675j18933
7444a16447l2630J5082K74947n9718j69479J34544q7644L5243L1063j13285J11173
7433B2849k8471k8487J29891k76961O9008j387R4334m420j25839l4063m3233R5341
$$ y = [-145907, -63006, -97792, -181217, -42918, -2486, 4461, -59751, -52301, -102978, -6704, -38756, -149606, -116041, -79644, -278777, -156057, -198179, -46204, 93057, 52768, 151133, 390585, 138468, -177572, -61114, -189985, -200686, -103182, -177167, -256340, -326739, -221886, -213879, -304206, -292095, -55353, 62269, -10384, -89926, -18354, -97922, -145370, -233917, -284637, -106023, 75177, -216495, -108400, -111458, -147095, -179223, -249760, -288193, -190585, -234437, -191903, 29529, 15147, -59336, -109788, 76620, 71406, -78157, -138275, 23161, 2486, -116447, -149077, -133995, 140952, 81234, -88245, 46299, -41345, -6102, 24961, -88324, 22849, -5622, -34109, 95782, -181179, -112171, -113558, -19224, -23644, -149483, -183546, -226779, -131438]
7421a31438J34375l7669J27059j97826p2417K0898J28456j48332L06843L5913
7411A65862j42531q8670q2442J35251j07779J92029j31904R7399J29315N0402
7401B16932J12519j20348l45873M2744J43137L9363k22597j3921J31026K8635
7391A1617p7763p0267J04943j33916j3638K06418k07640M7131M3939J21852J00456
7380A33132j32154K34767L2369r7024j94296k65662K02951p3446m1477N6256J26960
7369a7624j79504k06046j26598J78729Q7527r5883m2783P5920J6367K37931J51978
7358H0014J31990j52719j81146J54260n5065J6920o5804K34170k27530j9880O7331
7347a7459k0940l6025o8724j14045N822K19208N7897j90741j01631J08166Q7032
$$ y = [-131438, 2937, -34732, 92327, -105499, -177916, -157018, -28562, -176894, 129949, 165862, 23331, -65339, -147781, -12530, -120309, 71720, -60184, 37215, 166530, 216932, 329451, 209103, -136770, -94026, 49111, 88474, -134123, -148044, -17018, 11617, -66146, -136413, -31470, -165386, -179024, 27394, -180246, -133115, -89176, 32676, 133132, 978, 235745, 268114, 171090, -23206, -288868, -85917, -159363, -200840, -144584, -17624, -197128, -403174, -529772, -351043, -263516, -359399, -402182, -326262, -309895, -71964, 80014, 212004, 59285, -121861, 32399, -22666, -5746, -71550, 162620, -64910, -84790, -17459, -38399, -74424, -143148, -257193, -251371, -32163, 25734, -165007, -266638, -158472, -71440]
7336g1440q7404K58779p7372J11526J6615n169K7020k4200k0233j78095M1731
7325h242j00535o8516N4973J15851q8687K03809K5881j62031O6717j35303K4216
7314g1867P628J08089P7681j64025J36157m3723m6137J05520k04326m0315J86635
7303E1317k01999J71905j2291j46862K03527R8901m616k06038L1202k1530P2274
7292C5790j26851M1744P8487Q478k4494j16445r1043J76110K17127l18374K29523
7281A10052n4232j23593J56567J80796m5403q1052j24802j09575L38773Q0373
7271C27904k42238j73022J65901j18597K7396J94774r6519k30277K44853r2965
7261G210J8649Q4695o3914J0754M1484J7950j76394J2886j48647M4213Q6811k2683
$$ y = [-71440, -158844, 99935, 22563, 134089, 150704, 145535, 172555, 148355, 128122, -49973, -8242, -108777, -177293, -122320, -6469, -95156, 108653, 134534, -27497, 39220, -96083, -71867, -64239, 43850, 121531, -42494, 93663, 49940, 3803, 109323, -95003, -135318, 51317, -150682, 21223, 8932, -137930, 65597, 164498, 159882, -46156, -14954, -36484, 35790, -91061, -49317, 29170, 37648, 13154, -103291, -194334, -18224, 198903, -119471, 110052, 55820, -67773, 88794, 269590, 224187, 143135, 18333, -91242, 247531, 327904, 85666, -87356, 78545, -40052, -12656, 182118, 85599, -144678, 100175, 7210, 25859, 110554, 46640, 57394, 98878, 116828, -59566, -46680, -195327, -151114, -64303, -86986]
7249h6986M735j1496J75093m9676l3732m0608O7928J08536o6883n5798J22719
7238A33832j36157k17339Q1453J24973K13407l60689p7453J88833j51435J8345
7228a82230M7191J16753j4820J59364j07510j62989M2529L37753R1478r6698m6918
7217A83903k50551J90443q6257p34m2136j34298j45877J73908O3974J023n442
7206e2044K18486j68607j20834O3549l9975j15859J58340J13192K88586j78132
7196A66702j12155O7533j83862L2568p0938n7161J0504M1951N8146O0920J72022
7185A86230m1737j27188M1350j22421l7361j5658J93038q8292m0427J8979J42539
7174A09052J13890j32422j14336n154j05682j14278K14272K2472P8634j06043
$$ y = [-86986, -82251, -93747, 81346, 31670, -2062, -42670, 25258, 133794, 66911, 11113, 133832, -2325, -219664, -138211, -13238, 200169, -160520, -237973, -49140, -200575, -182230, -135039, -18286, -33106, 126258, 18748, -144241, -101712, 236041, 327519, 230821, 183903, -66648, 123795, 37538, 36804, -5332, -139630, -285507, -111599, -47625, -46602, -52044, 166442, -2165, -122999, -59450, -99425, -215284, -56944, 56248, 344834, 166702, 54547, 122080, -61782, -29214, -100152, -157313, -146809, -104858, -46712, 14208, 186230, 144493, 17305, 58655, -63766, -101127, -116785, 76253, -12039, -52466, -33487, 109052, 222942, 90520, -23816, -28970, -134652, -248930, -34658, -12186, 66448, -39595]
7164c9595J23145R6800j38074j0732N936r7267o5180O1017p4099n5410K5663R974
7152a57822J41280J94312j85522L8508K4086L0141o5870m9517O4775J10747o7526
7141G7592q7522J6646j3880K378K2741l5342M2647N7477q151J44778l67367j93734
7129c41737J48766r1946m4837J24948J12088k39Q1469R9165L5662n6008q4466
7118a7135K4509j64640j53571K22291Q4806o0809k15448O2914J58210O0115o843
7107e601j81807P8932M5963L5596j19252n8593M631j69906K26413K54872M1766
7096A53014j63097R2033j44716K8776L6651O3501o5357J9921J54407k46693k1247
7085i2807J18951n8483p0724j20633O3601J13535m9290p2522J01097j65745R0471
$$ y = [-39595, 83550, 180350, 42276, 31544, 37480, -59787, -124967, -63950, -138049, -193459, -167796, -157822, -16542, 177770, -7752, 30756, 54842, 84983, 19113, -30404, 34371, 145118, 77592, -9930, 6716, -7164, -4786, 17955, -17387, 25260, 82737, 74586, 219364, -148003, -341737, -192971, -284917, -329754, -204806, -92718, -92957, -11488, 87677, 123339, 67331, -17135, 7374, -157266, -310837, -88546, -3740, -64549, -279997, -217083, -58873, 1242, -5601, -187408, -108476, -62513, -26917, -146169, -204762, -200131, -370037, -143624, 111248, 153014, -10083, 81950, -62766, -33990, 2661, 66162, 805, 20726, 175133, -71560, -92807, 26144, -32339, -103063, -223696, -160095, -46560, -95850, -168372, -67275, -233020, -142549]
7074a42549J73660j98176j8910J49125j14157o3282R5946K64649j50263k4607
7064b8564N4492r329M0818L7324j59301J99763j0797j24089k0464j89439K60143
7053E0557J83438J87510l07337j99362J3525P9670N242k8188o8934J65800j36989
7042e5068J265j24848j55083L4340L8554K42544K04789o3597k13011R7314J63226
7031A70425L7011o3558j13773J90925l4644j96514o2392j23671p1813J04046J90082
7020B6124N8480k5590J06403n3394l9141l3600Q4535L0985j02771k35532k8709
7009b12210R5486J17716j16618M0089J82956k5199O4911O8047q2093r4560Q1399
6998A19924j76514L0432J93924J60438J04506k60147o8516j56772N0735r4380
$$ y = [-142549, 31111, -167065, -185975, -36850, -151007, -214289, -118343, 146306, -3957, -28564, 25928, 16599, 57417, 94741, -64560, 135203, 124406, 317, -20147, -209586, 50557, 233995, 421505, 114168, -85194, -71669, 8001, 13243, -14945, -83879, 81921, -55068, -53803, -178651, -333734, -299394, -260840, -18296, 186493, 122896, -90115, 7199, 170425, 207436, 143878, 30105, 221030, 186386, -10128, -72520, -196191, -268004, -163958, 26124, 84604, 59014, 165417, 112023, 72882, 39282, 123817, 154802, 52031, -183501, -212210, -116724, 992, -115626, -75537, 107419, 82220, 147131, 215178, 133085, 38525, 119924, -56590, -26158, 167766, 328204, 432710, 172563, 104047, -52725, -1990, -96370]
6988i6370j04355J62629J54181O2606J1898L3788P395j64188l6619O9483j53438
6977e2990O5476J05513j06163J16483j80499j73784Q9529J83199q991l6293O230
6966G710J32672j62019j92320K98224J47564n3091p2745P4765k84321P8939m2717
6955f7339j44020J68792K10640J2947q5143p8322J02059l8827j07514P7349j19216
6944f8594J22744K51159L0495j2903k22357p7371m2878K0346J34033N2263p4336
6933A12601M2085j40612o2134p2189J26481J77085r9561j51588q5814o3093J30606
6922h6133K30620m7737j7972k13589K7375j12171p4855J54032R3293k0545l5319
6911a03001L57642j06870j5423k2547l1005J47226k50341n6673r2737O9793J12013
$$ y = [-96370, -200725, -38096, 116085, 178691, 190589, 224377, 231772, 67584, 30965, 100448, -52990, 12486, 117999, 11836, 128319, -52180, -225964, -136435, 46764, 37773, 1480, 7710, 140382, -21637, -213957, 84267, 231831, 178740, 105995, 180760, -103561, -24622, -67339, -211359, -42567, 168073, 181020, 95877, 17555, 119614, 80787, -26727, 50622, -68594, 54150, 305309, 335804, 322901, 100544, 23173, -19705, 641, 134674, 186937, 112601, 154686, 14074, -48060, -120249, 6232, 183317, 83756, -67832, -153646, -216739, -86133, 144487, 96750, 78778, -134811, -107436, -219607, -294462, -140430, -47137, -67682, -103001, 254641, 147771, 132348, 109801, 78796, 226022, -24319, -80992, -173729, -103936, 8077]
6900H077n7662o9297J52619J56333p2379K06586j36554l29964j31887M0534P2012
6889a61582J63516O6790j78806J88256l1864j48151J70667p7723O744J63648k24852
6878f3357K10253P592k66877J39981M0716J41057J2574q3493q9241l9460n3162
6867d3417J55618p5207O1762L5847k093j02246P7209K56892o9093o4112K88782
6856E19942k29905k94467J09608R7716j32208L3849J32684j1700m3512j48461
6846C3546m8049O9855m1499k7642J55098J35663j01777M6989q66k93029J65406
6835I3695O2961n5593j75300J10198J96423p0421m2093J5185O9327j51329j1314
6824D1739o8817J99695O8928k53819K11542J67610N0344l14815p4026N9082J44922
$$ y = [8077, -49585, -118882, 33737, 190070, 117691, 324277, 187723, -142241, -274128, -233594, -161582, 1934, 68724, -110082, 78174, 46310, -101841, 68826, -8897, -2153, 161495, -63357, 146896, 154488, -112389, 27592, 68308, 209365, 221939, 138446, 49205, 9745, -43417, 112201, 36994, 98756, 134603, 132510, 30264, 107473, 364365, 295272, 231160, 519942, 290037, -4430, 105178, 202894, 70686, 104535, 237219, 225519, 182007, 33546, -14503, 55352, 13853, -13789, 141309, 276972, 175195, 222184, 221318, -71711, 93695, 156656, 101063, -74237, 35961, 232384, 161963, 119870, 135055, 204382, 53053, 41739, -27078, 172617, 241545, -12274, 199268, 366878, 417222, 102407, 28381, 87463, 232385]
6813B32385J36307j66315q3258J17848l4965r2377Q9219J0908m0491M7123k22246
6802e862O3845o1732J4559J63463R9372Q6696r5328j49093N9360k5951J3815p3079
6790I0065M4176N2212j0271K7184k493p5637j62845K32632J92979j23357j46056
6779A18589j4632j00164J27098p8946O1018P3131J8641l1368J531j43548j41966
6768a10616P0544J6272K98858N484m2379o5711q6473j78142O7213M557R5656J48757
6756B24020k5038J26106M6508j82379n1526j58087J21920L6850Q6440j32949J23155
6745B15020j14324M7747M9858j07392j3489k8142R1819J46032q8888l8825j28946
6734C0470j98628M2043M7258J87132K6220O4472j27240j5834M5121J45840m5544
$$ y = [232385, 368692, 202377, 119119, 236967, 202002, 109625, 198844, 209752, 169261, 216384, -5862, 57983, -3749, 10810, 174273, 273645, 360341, 265013, 115920, 175280, 149329, 163144, 90065, 134241, 186453, 176182, 203366, 200873, 125236, -37609, 195023, 388002, 264645, 118589, 103957, 3793, 130891, 51945, 112963, 186094, 204735, 173367, 174898, 31350, -110616, -40072, -23800, 275058, 280542, 238163, 172452, 85979, -92163, -24950, -20393, 75263, 224020, 198982, 325088, 371596, 189217, 137691, -20396, 101524, 138374, 224814, 91865, 215020, 100696, 148443, 198301, 90909, 77420, 49278, 141097, 287129, 198241, 159416, 30470, -168158, -126115, -78857, 108275, 134495, 198967, 71727, 55893, 101014, 246854, 201310]
6723B01310m5478j20932r8408p9003N3947J08206J14906p2740q1871l9632Q6839
6712B7144P8475K04935k4616J22400j50584K9293p9866Q7925k05985m3099j0269
6701C5753k0169k75078Q4423N8204m9414L55385o8068L7658l0832k46415J39441
6690B0888L5173M6971J88527l6519J2400j44605K845m7459O3176J17154P3164
6679C31715j97334J03487n4157k798k52050M4415R5802N3974Q837j66313J91648
6668A57226p2609J66458o481j9854R5372o6947p7890J11403n3284l7566j93145
6657B683P0713Q0520j5507M1770P2339m3776J4226N8120k14310L912J79971K72994
6645E23655J8058j42110r7838k0112N9670k36988L3558j12316J55082p3398k15645
$$ y = [201310, 155832, 34900, -63508, -142511, -88564, 19642, 134548, 61808, -20063, -59695, 27144, 105619, 310554, 285938, 408338, 257754, 287047, 207181, 295106, 89121, 46022, 35753, 15584, -259494, -175071, -116867, -166281, 189104, 121036, 158694, 127862, -118553, 20888, 56061, 103032, 291559, 255040, 267440, 122835, 125680, 78221, 141397, 258551, 331715, 134381, 237868, 183711, 180913, -71137, -26722, 69080, 123054, 131891, -34422, 157226, 84617, 251075, 244594, 224740, 320112, 253165, 175275, 286678, 233394, 195828, 2683, 73396, 153916, 138409, 180179, 252518, 208742, 222968, 281088, 66778, 70690, 250661, 523655, 541713, 399603, 301765, 281653, 341323, 104335, 137893, 25577, 180659, 107261, -108384]
6634a08384L0972K16130O7666p8094M0530K2816j37936j30572Q4433j32414K45519
6623A20666k1815J43818j59154p7103j06718J75870p6561p5242R8769l04364R6436
6612a85398K73711K01822n1500k19787o6095J64366J47967j60253p2322P7058
6602A09569j36107n3184J70526j55599J96023j2928K10717k01262Q8829r23J06620
6591C22281p5522j8314o6243p0829P4168k27156J60332L4778o0020K5061J6928
6580A15464j53662p4866n3957j21581J19184K24273P1801J36303j49015j83010
6570f9066n4941n0117P422Q3927Q2494J62246M6327j53316R4024J93042k7836
6559C14206M7461j0771k3447j02669n7043R0292k11045k3934Q3837k9764o2489
$$ y = [-108384, -77412, 138718, 206384, 128290, 168820, 191636, 53700, -76872, 7561, -124853, 120666, 98851, 242669, 83515, 6412, -100306, 75564, -997, -76239, 22530, -281834, -185398, 88313, 290135, 238635, 18848, -47247, 117119, 265086, 104833, 32511, 109569, -26538, -79722, 90804, -64795, 131228, 118300, 329017, 127755, 216584, 215661, 322281, 246759, 228445, 162202, 91373, 165541, -61615, 98717, 133495, 73475, 98536, 115464, -38198, -113064, -167021, -288602, -169418, 54855, 126656, 262959, 113944, -69066, -124007, -174124, -166702, -82775, -281, 161965, 208292, 54976, 149000, 342042, 314206, 361667, 350896, 327449, 224780, 167737, 258029, 46984, 23050, 106887, 77123, 14634]
6548A4634J46521L6912k03267M2965J64234K27290J7364o4418j21831P0137j05197
6537B25344j43008Q9817J02502k23626j9803k6134J02388J6773K10582m27957
6527i3122O1358k57267R7670K79761O5556j32565L2375J17177k72450K35645k33651
6516i9513q3955J91979j79699K1343R6044J80161J61187k13209K03879J10837
6506C89054j19187o5142k0309J33118O0902p9505r5644J58242l6898l05396R4484
6495A13719J67170n378m6646J55979J1761k24561q5206J87762o5281j03698j16781
6484a1160l4179Q3221J18199J74367l5326j44207J21960j21268J43257m5639l22911
6473g3686K4202J06242K78831J1679k04640k01744j6095p2150j0888l4340m8576
$$ y = [14634, 161155, 198067, -5200, 37765, 201999, 429289, 446653, 382235, 260404, 330541, 225344, 82336, 172153, 274655, 51029, 31226, 5092, 107480, 124253, 334835, -93122, -31764, -289031, -191361, 88400, 153956, 21391, 53766, 170943, -101507, 134138, -99513, -183468, 8511, -171188, -149845, -53801, 126360, 287547, 74338, 278217, 389054, 269867, 204725, 184416, 317534, 378436, 298931, 203287, 361529, 324631, 19235, 113719, 280889, 275511, 228865, 384844, 396605, 172044, 86838, 274600, 209319, 105621, -11160, -45339, 37882, 156081, 330448, 295122, 150915, 272875, 151607, 294864, 249225, -73686, -49484, 56758, 335589, 347268, 142628, -59116, -75211, -147361, -158249, -192589, -241165]
6462b41165l2799J79025Q9477M5861P6612j95529J77151R6305n0590J58150j7925
6451B84573l87449R6024J6413Q693n2719J68442o3089j959J78457j15554j28776
6440C056j22275P8875K91931p9005N1619J40316p914j55637r9035J94783j10569
6429A86145k06805j10653N0437J47990K08220k51948k4643K01656j43931L040
6419E9508o6716K4796L2914J71048n5204j23995M9538J05431k4900N3879L4200
6408B60499M7803J29558j57157k19767M6955J12372Q8655j09997k4893P66k996
6397A71798q2780j49990K93266k7716J43156L7866l1050Q8506p6599q5297l3390
6386B47770j60685J18890N5107n4281Q5717K2716j68335P0544L0449J90329k41538
$$ y = [-241165, -273964, -94939, -5462, 40399, 117011, -78518, 98633, 194938, 144348, 302498, 284573, -102876, -6852, 9561, 18254, -34465, 133977, 70888, 68929, 247386, 131832, 3056, -119219, -40344, 251587, 172582, 224201, 364517, 356603, 200966, 101931, 296714, 186145, -20660, -131313, -80876, 67114, 275334, 23386, -1257, 200399, 56468, 59508, -7208, 17588, 50502, 221550, 166346, 42351, 91889, 197320, 172420, 226299, 260499, 308302, 437860, 280703, 60936, 107891, 220263, 308918, 198921, 174028, 174794, 171798, 89018, -60972, 232294, 204578, 347734, 385600, 354550, 443056, 366457, 281160, 247770, 87085, 205975, 261082, 206801, 292518, 315234, 146899, 217443, 247892, 438221, 196683]
6375A96683n6265J36630n9355j37756M0148o7240J01917J32157r3036p0566r221
6364A14096J97237J40323p180q2391q0504q7057J05251q4339j19159M8466P9472
6353B24215n7651k32118K44582P5699j67827l4911M0602J94421K7721n8513r8712
6342A57508K48460P3742k24173N6477J09845K5321J9368j85636p587j34486J05223
6331B44062J5684L5383k99091l9557J27518j35185K36196M2177O8809j45436j48998
6320A562J41812j63147K71617N8092j70855M5941P5033l3156j088k8723k39448
6309d2360j06141K52295L9119k05156l9893m4660K12937q248m9553j2019J93844
6298A90165k1350k5235p0954j02262J46805l0701r9101R9269J9149J16894K7241
$$ y = [196683, 140418, 277048, 217693, 79937, 120085, 52845, 154762, 286919, 193883, 123317, 114096, 311333, 451656, 444476, 362085, 281581, 194524, 299775, 215436, 96277, 144743, 224215, 166564, -65554, 179028, 254727, 86900, 51989, 92591, 287012, 314733, 256220, 157508, 405968, 479710, 255537, 312014, 421859, 447180, 466548, 280912, 273325, 138839, 244062, 259746, 295129, -3962, -43519, 83999, -51186, 185010, 227187, 295996, 150560, 1562, 143374, -19773, 251844, 309936, 139081, 185022, 260055, 226899, 225811, 197088, -42360, -148501, 103794, 142913, -62243, -102136, -146796, 66141, 57893, 8340, -3679, 190165, 168815, 143580, 72626, -29636, 117169, 86468, -12633, 86636, 105785, 222679, 249920]
6287B49920k31630k3985p67O7718n3512k97998J30921L35448M5331R0552n4139
6276B57859j44730J82494n2906j13453k8608P3326k4364r7149R3384O3920m5788
6265A63985J14447N4635j37035K2268q3267o4428r7569K16626q484l7917M0243
6254A83504m1934Q9342N7057m2881l0519P4463k28708M5857J0323o137P9662M6933
6242B36962m5039n1256Q0421J33150l7553j91110P9336q482j6375O0040J49378
6231C89472k12483l5553j00486r6561n2130m5856j04963J28489K38362L9498n6910
6220I0879J95140O4520o0442p6955j68278L9336j94593N1509K7079M9285P2066
6209H9546R7304l02l2851J7858j18004l8086J40566J05465k06J47881m5634J9484
$$ y = [249920, 18290, -5695, -6462, 61256, 7744, -290254, -159333, 176115, 221446, 311998, 257859, 113129, 295623, 242717, 129264, 100656, 173982, 149618, 52469, 145853, 209773, 163985, 278432, 333067, 196032, 218300, 135033, 70605, -26964, 189662, 181178, 143261, 183504, 141570, 230912, 287969, 245088, 214569, 289032, 60324, 106181, 116504, 110367, 190029, 236962, 191923, 140667, 221088, 354238, 316685, 125575, 204911, 196429, 180054, 240094, 389472, 176989, 141436, 40950, -55611, -107741, -153597, -258560, -130071, 108291, 147789, 90879, 286019, 350539, 290097, 213142, 44864, 84200, -110393, -58884, -31805, 17480, 89546, 186850, 186548, 153697, 171555, 53551, 15465, 156031, 261496, 261290, 409171, 363537, 383021]
6197C83021r2207j86260J93574j94608j63044P0034L3063N9541J56771J17357
6187C77242O272j53735j01589j17251k1094N3688J33280P0108k4253j21659J11763
6176B12772O1786m2610O635N0692J00255j32886k5595P310J82065M0181j36484
6165C24121k687J53062m0875j91151J08162J41927J4967M2874M1173j75858M8157
6154D63872r7101k28336K2929j40834J05261k9622l1939M1083K26717j19038P7727
6143B90719j521j64037Q4409K9816O2186O0085l6512k40599J94168p8603j01600
6132I8511R7781n6496O6407J39784j7358j23526J49984n049m6961P951j55801
6121A55227P9823R7899l9257j69353J79504p8898j82295Q9743J46206k6803o6007
$$ y = [383021, 290814, 104554, 298128, 103520, -59524, 10510, 43573, 103114, 259885, 377242, 383514, 229779, 128190, 10939, -10155, 43533, 176813, 246921, 222668, 101009, 212772, 274558, 231948, 238583, 289275, 389530, 256644, 231049, 238359, 420424, 460605, 324121, 321434, 474496, 433621, 242470, 350632, 492559, 507526, 550400, 591573, 415715, 463872, 366771, 138435, 161364, 20530, 125791, 96169, 64230, 105313, 332030, 212992, 290719, 289198, 125161, 209570, 239386, 301572, 361657, 325145, 84546, 278714, 200111, 98511, 196292, 139796, 206203, 345987, 328629, 205103, 355087, 350038, 303077, 311028, 155227, 235050, 332949, 293692, 124339, 303843, 224945, 42650, 132393, 278599, 251796, 185789]
6110A85789r4537N6754J17708R1065J81280o6924j82472J18188k71606j46006
6100a0761M8190J39893R3788l9515l5345j380J61081O7249j20270j27407M4850
6089B20373j64153J79557K8590k52779M9730m1560k38074J03562M361J8956K21398
6078A29961J24985q2468K9468p845j13741N6354j73007K9153M4986Q2974m030
6067A16790j1965R925q3124J31109l6869N4666R4015j61243m9823J94490k21844
6056C6127k7693o561J02629J08909n3899n9133j0025M4912K7932k8895M5837N7102
6044B37242P7701j0253O1008k2063l0857q3316M7266K23345k75257K41014j37148
6033C28682j63233L6086p4662J5875L3237J06696r485p7080M8258K0620L5996
$$ y = [185789, 91252, 148006, 265714, 356779, 538059, 471135, 288663, 406851, 135245, -10761, 37429, 177322, 271110, 231595, 196250, 194870, 355951, 423200, 302930, 175523, 220373, 56220, 235777, 264367, 11588, 61318, 19758, -218316, -114754, -110393, -91437, 129961, 254946, 172478, 201946, 194101, 80360, 136714, -36293, -7140, 37846, 120820, 116790, 104825, 114750, 31626, 162735, 125866, 180532, 274547, 113304, 63481, 257971, 36127, 8434, 1873, 104502, 213411, 159512, 100379, 90354, 135266, 163198, 134303, 180140, 237242, 314943, 304690, 365698, 343635, 312778, 229462, 276728, 500073, 224816, 465830, 328682, 165449, 201535, 126873, 142748, 175985, 282681, 273196, 196116, 244374, 264994, 300990]
6022C00990j18883q3562Q6928O1410N9662J50954j10234j93966L8538j05565M3295
6011A29567n0016L10026q3707j0101p225j72327Q2346p4838j65239L3721o1239
6000f9032K05939J39407j45787l4853L35601J0593j34076j54888R7168K70328
5990E20400j01707P6281k17440k40944J05490K3810J73633r7566l1446j5280l2803
5979A62428k857j53167J7995K14795J15692K5585L1475q0054J39696m626p9921
5968C87041L6729J32188j69564r4438j51302j22480J99628p0590J72170J59335
5958D78717k83054r1371J74639j06661L3516R914j05727j52474K15984K72744
5948D46227k09071O0426L9590J56949k7762L852k14064j2116J540K12776J19319
$$ y = [300990, 182107, 98545, 185473, 246883, 306545, 457499, 347265, 153299, 191837, 86272, 129567, 79551, 389577, 305870, 295769, 288544, 116217, 198563, 123725, -41514, -7793, -69032, 136907, 276314, 130527, 95674, 431275, 441868, 307792, 152904, 250072, 520400, 418693, 494974, 277534, 36590, 142080, 165890, 339523, 241957, 210511, 195231, 162428, 159571, 6404, 24399, 239194, 354886, 380471, 411946, 331892, 471588, 466962, 387041, 423770, 555958, 386394, 291956, 140654, 18174, 217802, 147212, 319382, 478717, 195663, 104292, 278931, 172270, 205786, 215700, 109973, -42501, 173483, 446227, 237156, 297582, 337172, 494121, 466359, 470211, 256147, 244031, 245571, 458347, 577666]
5937E77666p3901q3097n2205j7570K2587m9667Q9255k4549J74557m5097m4381
5926D73598j01931o4259M7002n1761M6377r3107J2911p1233j57613K43407l6099
5915B47292K03364k9013j18065N4356K32312k24269R5171N3190l7896o9158k18228
5904A89056L7612K6170k07623J85808P1604j04529K48305r3865O5356j54455L1686
5893B95125J19350Q4503J17263J20815k43008j41203n4055L29662J456k37435
5883C92473j90416J61866J05458M1999q4437J49482p006l9726j49236M4787Q3693
5872E08937J29694J67671m5482Q5528L4396j03381L0830J90927r3149q7790o0847
5861G57334R226J78459k23305J81882m8094J15627j24044l0548K43303l9978p8687
$$ y = [577666, 503765, 420668, 368463, 350893, 373480, 323813, 413068, 388519, 563076, 517979, 473598, 371667, 307408, 354410, 302649, 349026, 255919, 268830, 197597, 39984, 283391, 247292, 450656, 421643, 303578, 357934, 590246, 365977, 461148, 514338, 476442, 407284, 189056, 226668, 252838, 45215, 231023, 302627, 198098, 446403, 352538, 417894, 263439, 295125, 414475, 498978, 616241, 737056, 494048, 352845, 298790, 628452, 629908, 392473, 202057, 363923, 469381, 511380, 426943, 576425, 569419, 529693, 380457, 425244, 508937, 638631, 806302, 760820, 846348, 880744, 777363, 808193, 999120, 905971, 818181, 757334, 766560, 945019, 721714, 903596, 855502, 971129, 847085, 816537, 1059840, 1019862, 941175]
5850I41175p3862Q6029p5655J76131L56550J37502J85031J21493O1809J44522
5840B060725q6293r536J21926o2857k8644k44789k14472k30401p8690K06905o1220
5829A372654r1836l038j7881q9973K38346R4003K4750J53917j45507P2435J37407
5818A745277J11373L06795J68499K44139J81211K18532R6977k47112L2982k71603
5808B587070l02223k20897l2685k00432m09552m0851m1377N9947j1863l15408
5798A071729N0220K86005k04175Q4257j97655Q5826Q0063J12132O7901L03449
5788A739752K90123J5590K5272J21820q7741l881k21883l6417j14033l76182O7335
5777A419755j83536j26959j9810J10386j86923j99111R8073q0504O0301j52933
$$ y = [941175, 867313, 953342, 877687, 1053818, 1410368, 1547870, 1732901, 1854394, 1916203, 2060725, 1974432, 1964896, 2086822, 2023965, 1995321, 1750532, 1536060, 1305659, 1226969, 1433874, 1372654, 1280818, 1277780, 1259899, 1169926, 1408272, 1502275, 1527025, 1680942, 1535435, 1607870, 1745277, 1856650, 2163445, 2331944, 2576083, 2757294, 2975826, 3072803, 2825691, 2858673, 2587070, 2284847, 2063950, 2031265, 1830833, 1421281, 1380430, 1339053, 1399000, 1387137, 1071729, 1121949, 1407954, 1203779, 1288036, 1090381, 1176207, 1256270, 1368402, 1436303, 1739752, 2029875, 2045465, 2070737, 2192557, 2104816, 2100935, 1879052, 1842635, 1728602, 1352420, 1419755, 1236219, 1109260, 1089450, 1199836, 1012913, 813802, 911875, 831371, 891672, 738739]
5767G38739K06461r1445j62456r5892j05414K33689K33128J15718l0927L549j80973
5756H64177k64201O0001M56737k46134k44139Q8152j27075R644J81819N150l4573
5745G49558l52884l1108L71593J33454o2796k11397j49718m879J11884k47293
5735C06414l390J43305K060j4707m503J54446n8683J52750q3916k03921n3397
5724C36458k68402K32270m3584p9918J89858J21415N9859J0116o9833J31303o5868
5713E53674k11655j11080m76J88951j27471l2876P2136J09965j95737O4728P7215
5702C87374l0164L5276p5091k7249P2698k8112L6478N6301j6266k209j36557l1398
5690B41081Q8622r3445L3182J55478K97304Q9420j20152m80925J01226K0794J13091
$$ y = [738739, 945200, 853755, 691299, 595407, 489993, 723682, 956810, 1072528, 1041601, 1045150, 864177, 599976, 659977, 1116714, 870580, 626441, 714593, 587518, 597162, 778981, 784131, 749558, 396674, 365566, 737159, 870613, 807817, 596420, 446702, 441823, 553707, 306414, 303024, 446329, 448389, 433682, 429179, 583625, 524942, 677692, 593776, 389855, 336458, 68056, 300326, 256742, 176824, 366682, 488097, 547956, 558072, 488239, 619542, 553674, 342019, 230939, 230463, 419414, 291943, 259067, 331203, 441168, 245431, 310159, 387374, 357210, 392486, 317395, 290146, 362844, 334732, 371210, 427511, 411245, 409036, 272479, 241081, 329703, 236258, 269440, 424918, 722222, 811642, 691490, 210565, 311791, 332585, 445676]
5679D45676P6844J5324r7662k89028K15094J13776m2635j3670m9421O5972P1318
5668E11588r0486j02942m6973P5213o4781j5477j36825L740l3639J66645K26643
5657D92706k5410o4938m2854q3949P8924m6182J5499k29408J67348P4712j48477
5646A87971O8176K01081L6979p5937J12899L8911R7836p6431K09681m0588j93763
5635E66815j3215q5518p2019j03718n7790l0620l8591K6260K1091K10752J35293
5624E58740m1773o6231K15697M1798k12066K51228o4472n7866P1561l23492j28464
5613B44660J25759M272N0827j04825j59196j1318J50824J38710M2625j16564j16058
5602B49716J68925J23038k6377j03839k12104m7789J63657M8697l1583J37864
$$ y = [445676, 522520, 537844, 440182, 151154, 366248, 480024, 437389, 423719, 374298, 440270, 511588, 421102, 318160, 271187, 346400, 281619, 266142, 129317, 133057, 99418, 266063, 492706, 467296, 402358, 359504, 275555, 354479, 308297, 323796, 94388, 261736, 336448, 187971, 256147, 457228, 494207, 418270, 531169, 570080, 667916, 591485, 801166, 760578, 566815, 553600, 468082, 396063, 292345, 234555, 203935, 165344, 191604, 212695, 423447, 558740, 516967, 450736, 666433, 708231, 496165, 747393, 682921, 625055, 696616, 373124, 244660, 370419, 374691, 425518, 320693, 161497, 150179, 301003, 439713, 482338, 365774, 249716, 418641, 541679, 515302, 411463, 199359, 151570, 315227, 363924, 332341, 470205]
5592D70205l3900K7816J81986J38827j79327m8827n1640l5373K56792L4202k49685
5581E11076l8504J36148K9722p3965j53541J42093J92577K9162l1988j4544M8758
5570G76994J8980j43910l9476n101K46584n2469k00870M2601k66488k4983J34269
5559D86131Q7166k8944M8581J42872k950k0443l2659k46097j13286K31631M1273
5548E93275O2999k2248q6828R8269j05434o6254Q8012r5085J83424N4877Q8038
5537G93045j08746J03695j12675q2167L8091J0015k2010Q4637N281J19480l4560
5526G94086J15220j73377l39365J87812J51000O8789J2709O7065J20549o0880
5516I43608n9581j90621Q67J95406P1054J4166j22691j60289J59188J41104j09938
$$ y = [470205, 436305, 464121, 646107, 784934, 605607, 556780, 505140, 469767, 726559, 760761, 511076, 472572, 608720, 638442, 564477, 410936, 553029, 745606, 774768, 742780, 728236, 776994, 795974, 652064, 612588, 607487, 854071, 801602, 600732, 643333, 376845, 351862, 486131, 573297, 544353, 592934, 735806, 732856, 712413, 679754, 433657, 320371, 552002, 593275, 656274, 634026, 547198, 645467, 540033, 473779, 561791, 466706, 650130, 705007, 793045, 684299, 787994, 675319, 593152, 631243, 641258, 619248, 703885, 709166, 828646, 794086, 909306, 735929, 396564, 584376, 735376, 804165, 816874, 883939, 1004488, 943608, 884027, 693406, 694273, 889679, 960733, 974899, 852208, 691919, 851107, 992211, 882273]
5505H82273M6126n3521m7404j50897J03849m114N5049P1380o7313J26688o9626
5494H92490j89299m9216Q8819k237R9884K21159j85049J71353J03899L3551l25055
5483H60299p8889J60899L7834Q8094j49956j85684J38199l7861K59540L45014
5473A437489q5412l30102p4284J55275N2079j22588j8630o5874K15999J23434
5463A287386m66626j34379K04192m3333J68593J62883k2075P0203q0976k03735
5453I42133J64525K76779J07399q4222J24074k51503P359J3026j03365K45399
5443A441604q3449j64383K17115R0354q2299K9432j3030L5800m2233R3106J37252
5432A659269j06981q2207r5249k2927L2670J75746J81725K2125J15419j61866
$$ y = [882273, 928399, 874878, 827474, 676577, 780426, 776312, 831361, 902741, 835428, 962116, 892490, 703191, 653975, 742794, 740557, 840441, 1061600, 876551, 1047904, 1151803, 1185354, 860299, 781410, 942309, 980143, 1068237, 918281, 732597, 870796, 832935, 1092475, 1437489, 1352077, 1021975, 947691, 1102966, 1155045, 1032457, 1013827, 947953, 1163952, 1287386, 820760, 686381, 890573, 847240, 1015833, 1178716, 1156641, 1226844, 1145868, 942133, 1106658, 1383437, 1490836, 1406614, 1530688, 1279185, 1286544, 1299570, 1196205, 1441604, 1358155, 1193772, 1410887, 1501241, 1418942, 1448374, 1435344, 1471144, 1428911, 1522017, 1659269, 1552288, 1470081, 1374832, 1351905, 1384575, 1560321, 1742046, 1764171, 1879590, 1717724]
5422A717724J2470K4107N2998R690j66248j11956j6567p4781J62569J32037M7339
5411A789382j16631o7205K39098N91j98582K4004P4170Q0734J42459Q4099J8122
5400B070241o7426q4645M8590j29016L0346J31185K26382j17006R0964j3376P0458
5389B256697J1974k8657J01196Q5661j223J83276O7289K7526j5636k22969J63091
5378B628225Q2976k19912J10693L9712j6998o7826J22155Q8578J36880p4231r9246
5367B731006L7639j20523j5216j63638K18970K04013n8090n4667l2752J65944
5357B912686J51688N8392j37726P7896O3459p3255K6070J41724K0169J60375j00739
5346C300739k12824M9989J20912L5440R1467k1736j00635K87588p3003J02462
$$ y = [1717724, 1730194, 1754301, 1807299, 1816989, 1650741, 1538785, 1522218, 1447437, 1610006, 1742043, 1789382, 1672751, 1605546, 1844644, 1845235, 1646653, 1670657, 1744827, 1825561, 1968020, 2052119, 2070241, 2002815, 1918170, 1966760, 1837744, 1868090, 1999275, 2225657, 2108651, 2199615, 2186239, 2256697, 2268671, 2240014, 2341210, 2426871, 2425648, 2608924, 2676213, 2703739, 2688103, 2465134, 2628225, 2711201, 2491289, 2601982, 2641694, 2624696, 2556870, 2679025, 2767603, 2904483, 2830252, 2731006, 2768645, 2648122, 2632906, 2469268, 2688238, 2892251, 2834161, 2779494, 2746742, 2912686, 3064374, 3122766, 2985040, 3062936, 3126395, 3053140, 3079210, 3220934, 3241103, 3401478, 3300739, 3087915, 3137904, 3258816, 3294256, 3385723, 3363987, 3263352, 3550940, 3477937, 3580399]
5336C580399J9624J70376j6367r749J21031j38269j39012J3230k7686J80882L4630
5325C789089p041o8740J17985k3659O2908N4762K4635Q2339K09808Q4297q5715
5314D240668k20558J27197M19771O3643j26924k1923L02294J96149p0469j08332
5304D801516N6282j84162j9558R029N9318j17637J22096L10105j0791J79750j5532
5293E190416Q0745O4640o814K3947L9791P5209m0562J46635K85308m9149r9325
5282E710841j6314J69948O9615J47073J20784O1834M1525J77832L01260Q530Q445
5271F801373P052L14053J91762p647Q8743M4539j29592N4624N2398J77329L7552
5260G632186J41327J47645J31031K02463J41987k2233N7278J98318J51772L70583
$$ y = [3580399, 3600023, 3770399, 3754032, 3744283, 3865314, 3727045, 3588033, 3601263, 3573577, 3754459, 3789089, 3782048, 3713308, 3831293, 3807634, 3870542, 3925304, 3949939, 4032278, 4242086, 4326383, 4240668, 4020110, 4147307, 4567078, 4630721, 4503797, 4481874, 4784168, 4980317, 4909848, 4801516, 4857798, 4673636, 4654078, 4663107, 4722425, 4604788, 4726884, 5036989, 5026198, 5205948, 5190416, 5271161, 5335801, 5328987, 5352934, 5392725, 5467934, 5427372, 5574007, 5859315, 5810166, 5710841, 5694527, 5864475, 5934090, 6081163, 6201947, 6263781, 6305306, 6483138, 6784398, 6792928, 6801373, 6808425, 7122478, 7314240, 7306593, 7395336, 7439875, 7310283, 7364907, 7417305, 7594634, 7632186, 7773513, 7921158, 8052189, 8254652, 8396639, 8374406, 8431684, 8630002, 8781774, 9152357]
5250I152357J94830K47474J3646J93380K13382J22365Q1259J67971J62296J47695
5240A0696655J61160L6739K28965K22423K89829K81348L83188J94488N2899K40049
5230A2787743M84393M56549L5281L43152K53066K60821K81469M17651L15772J42689
5220A5778586L84841N25102J78731N18094M74680K63659N17248L49894L62320
5211A9353155M04541P50985N12855L76292O94265N49257O44742N46236O13018
5202B4445346M75368M09064P77808M97511N49016Q34427Q94918P22333N41432
5193C0147223Q96960J091182O94701O64119R33448J079475J058379R91889J131579
5184C8688955J253089R71800R88328J367408J612091J224158J713177J759812
$$ y = [9152357, 9347187, 9594661, 9608307, 9801687, 10015069, 10137434, 10218693, 10386664, 10548960, 10696655, 10857815, 10894554, 11123519, 11345942, 11635771, 11917119, 12300307, 12494795, 12547694, 12787743, 13272136, 13728685, 13763966, 14107118, 14360184, 14621005, 14902474, 15320125, 15635897, 15778586, 16163427, 16688529, 16867260, 17385354, 17860034, 18123693, 18640941, 18990835, 19353155, 19757696, 20508681, 21021536, 21397828, 22092093, 22641350, 23286092, 23832328, 24445346, 24920714, 25329778, 26107586, 26605097, 27154113, 27988540, 28883458, 29605791, 30147223, 31044183, 32135365, 32830066, 33494185, 34427633, 35507108, 36565487, 37557376, 38688955, 39942044, 40913844, 41902172, 43269580, 44881671, 46105829, 47819006, 49578818]
5176D9578818J570121J749599J790647K053496K466315K250961K504898K610608
5168F6575463K521709L110772L183756L200072L798387L882079M437662M446686
5160I5156586M814368N367607N813515N968405O657906P077908P710042Q040395
5152A46606732Q728211R833419R871946J0334401J0733941J1069831J1114430
5145B18292911J0821727J0301481R661079P986739O180472M355796K134759k52204
5137B69482760k843842n167292o857553q854649j0230579j1055472j1576447j1643004
5129B01253922j1516846j1255566j0697762j0005497r838568q870613q164789
5122A30904281p701819o952965o485239o005973n581359n142954m985570m466887
$$ y = [49578818, 51148939, 52898538, 54689185, 56742681, 59208996, 61459957, 63964855, 66575463, 69097172, 72207944, 75391700, 78591772, 82390159, 86272238, 90709900, 95156586, 99970954, 105338561, 111152076, 117120481, 123778387, 130856295, 138566337, 146606732, 155334943, 165168362, 175040308, 185374709, 196108650, 207178481, 218292911, 229114638, 239416119, 249077198, 257063937, 263244409, 267600205, 269734964, 269482760, 266638918, 261471626, 254614073, 245759424, 235528845, 224473373, 212896926, 201253922, 189737076, 178481510, 167783748, 157778251, 147939683, 139069070, 130904281, 123202462, 116249497, 109764258, 103758285, 98176926, 93033972, 88048402, 83581515]
5114H3581515m228595l670098l382024l491194l041325k798691k620129k493959
5106E7855500k324854k445223k377451k046613j742403j611614j807755j550781
5098D1948806j520992j391105j453916j262412j259437j034522j111296j260746
5090C1654380j202681j114105r98516q10780p53483o55889p99943p79689o34953
5081B3904341r09968n93443l37720n99771o14291o54965n43564n72737l80640
5072A8697242o12360o70317l87409m66178m32806n19230k64273l12216k98919
5063A4733534l46759n11428l92515m05004k87122l90963k34861r3727l20133n67650
5053A1183372j77244k55942k25137k57876m15211Q4504J7642m12120k03213k14635
$$ y = [83581515, 79352920, 75682822, 72300798, 68809604, 65768279, 62969588, 60349459, 57855500, 55530646, 53085423, 50707972, 48661359, 46918956, 45307342, 43499587, 41948806, 40427814, 39036709, 37582793, 36320381, 35060944, 34026422, 32915126, 31654380, 30451699, 29337594, 28339078, 27528298, 26774815, 26118926, 25318983, 24539294, 23904341, 22994373, 22400930, 22063210, 21463439, 20849148, 20194183, 19650619, 19077882, 18697242, 18084882, 17414565, 17027156, 16560978, 16128172, 15608942, 15344669, 15032453, 14733534, 14386775, 13875347, 13482832, 13077828, 12790706, 12399743, 12164882, 12071155, 11751022, 11183372, 11006128, 10750186, 10525049, 10267173, 9851962, 9936466, 9954108, 9541988, 9338775, 9124140]
5043I124140l88525j23633j04185n0954l6312k81324k92798l0849k25005o4029
5033G526526P237r3101p9612R647j57010l70018j11174J20941j93570j29746m8660
5022F481460j51111j93105j0710j78253j15440J13658j5771q4346j38100j42006
5012E566276j43035l0842r7562p768o4172r8860P306J36538P8865l823P3373L6957
5000E453253l8629J7209J61880P8759K99607L76778L80359Q4859j4525j94295
4990F605255n6128j60269j31283k01542j62326l5598K7506J07850l14679k40742
4980E438044j44111o9332M2812P2218J70401K27055o5077J91671L56006L86984
4970F606671K15495L49711N17614K07823J20717K73281J59169k3209m9943o1374
$$ y = [9124140, 8735615, 8611982, 8507797, 8456843, 8420531, 8139207, 7846409, 7815560, 7590555, 7526526, 7533763, 7440662, 7361050, 7370697, 7213687, 6843669, 6732495, 6853436, 6659866, 6530120, 6481460, 6330349, 6137244, 6126534, 5948281, 5832841, 5946499, 5930728, 5846382, 5708282, 5566276, 5423241, 5392399, 5294837, 5287069, 5222897, 5124037, 5131343, 5267881, 5346746, 5342923, 5416296, 5453253, 5414624, 5431833, 5593713, 5672472, 5972079, 6348857, 6729216, 6814075, 6799550, 6605255, 6549127, 6388858, 6257575, 6056033, 5893707, 5858109, 5885615, 5993465, 5678786, 5438044, 5293933, 5224601, 5267413, 5339631, 5510032, 5737087, 5672010, 5863681, 6219687, 6606671, 6822166, 7171877, 7689491, 7897314, 8018031, 8291312, 8450481, 8427272, 8377329, 8315955]
4960H315955l42224k69677k94644m25982n94308l50589l97107m80979r2583k73728
4950D794134q3053k79475j57925O5247J15939J18836J57098J69P6532J52236J28075
4939E087813m0998k7477L4220J92053j17033J5334K6809j71820l98588k37534
4929D362779l47737k41416q7833k85155k83112m25625l16276L9418m64J4011j2227
4918B416363l28774J90187J59602j02194j03102j30408L8150j98765P9766n92
4908B020233l08659R4397k39469O9366j401L103P3858R2150n3925j51208j03254
4897A495191J45662j83174J34251J65087k33701j77648J3584K13929r7361k83010
4887A192810M4770o833j91312O1438k5679P9553J63676Q874j49963J01454J40630
$$ y = [8315955, 7973731, 7704054, 7409410, 6983428, 6389120, 6038531, 5641424, 5160445, 5067862, 4794134, 4711081, 4431606, 4273681, 4338928, 4454867, 4573703, 4730801, 4730970, 4807502, 4959738, 5087813, 5046815, 5019338, 5053558, 5245611, 5128578, 5143912, 5170721, 4998901, 4600313, 4362779, 4015042, 3773626, 3685793, 3400638, 3117526, 2691901, 2375625, 2415043, 2414579, 2428590, 2416363, 2087589, 2277776, 2437378, 2335184, 2232082, 2101674, 2139824, 1941059, 2020825, 2020233, 1711574, 1805971, 1566502, 1635868, 1634467, 1637570, 1711428, 1803578, 1749653, 1598445, 1495191, 1640853, 1457679, 1591930, 1757017, 1523316, 1345668, 1359252, 1573181, 1475820, 1192810, 1237580, 1230747, 1039435, 1100873, 1075194, 1154747, 1318423, 1327297, 1177334, 1278788, 1419418]
4876A419418j55989K3312k04351R357R4464K1743K20471K2677j08247j56925j56481
4865A029449j42900Q8876R9094j6127j31256P4599J64700k8006k09362R6368n8778
4854I66657N5977J63772k49258M3815K29312l9501k13410j57824K51485K37366
4844A288391j10660j2194M2862n49j48067R1209j10761l461k18970K31646J99331
4833A248777m1869J96289p7480M6468k34211J80340O5031k59913N5393j41738
4823A037087q9745J87518R8023K6239m3514n8872N3538Q5787J32287J21832j21615
4812A428565m4143K95042J88371p6115n9041K20105K06620N9058K37228r1418
4802B364272J29802L87566L08098K72904M25028L97168K03271M3922l54424J61623
$$ y = [1419418, 1263429, 1286741, 1082390, 1091747, 1186211, 1207954, 1428425, 1451102, 1342855, 1185930, 1029449, 886549, 975425, 1074519, 1058392, 927136, 1001735, 1166435, 1138429, 929067, 1025435, 966657, 1022634, 1186406, 937148, 980963, 1210275, 1170774, 957364, 799540, 1051025, 1288391, 1177731, 1165537, 1208399, 1207850, 1059783, 1150992, 1040231, 1036770, 817800, 1049446, 1248777, 1206908, 1403197, 1325717, 1372185, 1137974, 1318314, 1383345, 1123432, 1178825, 1037087, 947342, 1134860, 1232883, 1259122, 1215608, 1156736, 1210274, 1296061, 1428348, 1550180, 1428565, 1384422, 1679464, 1867835, 1791720, 1732679, 1952784, 2159404, 2218462, 2455690, 2364272, 2494074, 2881640, 3189738, 3462642, 3887670, 4284838, 4488109, 4532031, 4177607, 4339230]
4792D339230j08908l85557m1480K55115O2442m28045k15644j95259J03024m6720
4782C338198j18571o8430K64668J55660L8634K47393K99774K29626L10100J28862
4772D825914K36472N75775L2115J43574L04226K91732K56425p0566q1008k86526
4762F228133m06606n7247n97415l73051l75736n78145k84166j21988k52126q2214
4752C099439q1526k75604N4438j01411Q1670J36177J55197M8791r1405k5932L4129
4741C033963M4182m6948J32626j0343M4961j2221j61020j95682k75488j49132
4731B404898k33827l26271q9857j48555k5871J03643q4270k41870n7618J13561
4721A413963m07078j78356R1736J84203o2282L3944j29492m4984N7518J13822
$$ y = [4339230, 4230322, 3844765, 3803285, 4058400, 4120842, 3692797, 3477153, 3281894, 3384918, 3338198, 3219627, 3151197, 3415865, 3571525, 3610159, 3857552, 4157326, 4386952, 4697052, 4825914, 5062386, 5638161, 5670276, 5813850, 6118076, 6409808, 6666233, 6595667, 6514659, 6228133, 5821527, 5764280, 5166865, 4793814, 4418078, 3839933, 3555767, 3433779, 3181653, 3099439, 3017913, 2742309, 2796747, 2695336, 2777006, 2913183, 3068380, 3117171, 3025766, 2999834, 3033963, 3078145, 3031197, 3163823, 3153480, 3198441, 3186220, 3025200, 2829518, 2554030, 2404898, 2171071, 1844800, 1754943, 1606388, 1580517, 1684160, 1599890, 1358020, 1300402, 1413963, 1006885, 828529, 920265, 1104468, 1042186, 1076130, 946638, 901654, 959172, 1072994]
4711A072994o7676k58892M48m5574K03294K3175k62383n426J68782k3987k09123
4700E95632j55289P0815P2530J41652n8048j91658l8459J12677K27402K2008j82714
4689F16548k2425k24882M1784J41256J22078J821k49860P7514J08691K4336l0435
4678F06426M1316R2372j76743n0649M0249q7389J23513j03842k02158o2080K16181
4667D37196K22393K68367m1344k64059j97029K20507j34016l7124r7224o7793
4657C09874J62180M7962j7135m602P9406k8721l5643j6029j34470j44874J19501
4646C37449N5151p0489j80716J37561L17811m2101j97268j21751K3098R0842m5118
4635C04469J38030k48391l1062R3067J63447J88497L9978j29658j88069J60490
$$ y = [1072994, 1005318, 746426, 746874, 701300, 904594, 927769, 665386, 659960, 828742, 804755, 595632, 440343, 511158, 583688, 725340, 667292, 475634, 437175, 549852, 777254, 799262, 616548, 594123, 369241, 411025, 552281, 674359, 676180, 426320, 503834, 612525, 636861, 606426, 647742, 740114, 563371, 512722, 552971, 465582, 589095, 485253, 283095, 221015, 437196, 659589, 927956, 886612, 622553, 425524, 646031, 512015, 474891, 377667, 309874, 472054, 520016, 502881, 498279, 577685, 548964, 513321, 497292, 362822, 217948, 337449, 392600, 322111, 141395, 278956, 596767, 554666, 357398, 235647, 258745, 349587, 304469, 442499, 194108, 163046, 256113, 419560, 608057, 648035, 518377, 330308, 490798]
4625D90798k0756k13498K96076m3624k70177L5020J27320R8646Q2081j54330L2
4614D27588k22468K4821J46033r4312L1067J69952R3559n0149k3507R4816j7704
4603E79696O4028j41366R3454q7006j65220J44056K33380K2365j77732O1304O9204
4592F96163m0905J41575k38635r052J0846j02615L8811L276J3563J61043J39448
4581H13518k13679R200o2218p58k60169j0609N3913L3985j52343J65450J44851
4570E21141K560M6480j37750J64761J124l20418M951o0319J4490n896L4918J18518
4558C84560J24223K9959p6135j87322O8902j35634Q0950J9399K9183l4131j66496
4547A37458J73769M1212j74009J13763L36606N6916l20705o5769R2448p9100j02382
$$ y = [490798, 470042, 256544, 552620, 508996, 238819, 273839, 401159, 499805, 581886, 427556, 427588, 205120, 229941, 375974, 281662, 312729, 482681, 576240, 526091, 502584, 597400, 579696, 643724, 502358, 595812, 508806, 343586, 487642, 721022, 743387, 565655, 626959, 696163, 655258, 796833, 558198, 549146, 559992, 457377, 496188, 499464, 513027, 674070, 813518, 599839, 609039, 546821, 546063, 285894, 275285, 329198, 363183, 210840, 376290, 521141, 523701, 570181, 432431, 597192, 598316, 277898, 282849, 222530, 237020, 231124, 266042, 384560, 508783, 538742, 462607, 275285, 344187, 208553, 289503, 308902, 338085, 303954, 137458, 311227, 352439, 178430, 292193, 628799, 685715, 365010, 299241, 391689, 312589, 210207]
4536B10207J4394J06809L756R3030k3018J39587j43111j25172J8449m9712J07530
4525C52749m8338R5308J45033K2908q3128j69948j34932J10505J94473J51520
4515F36150j21594J00702n1099k8296J2614j69157R6381l2274j1943j8500K10168
4504F23152R6586N8484q2167j65605j28129J34246J11572j85757L3110p7365J34254
4493E52381P1521m8555k34025J347L25008J32450j13693J7793k6805q7274P4286
4482F64434n2684R1938J62766j4483j52744j13454J74443L4888j04734J04463
4472G94833k3984j06180M0300K62148J34138j90643n9496J16597p1079J43683
4462A040317P2528J39545M4363j77175j96052K02847J07771j36190O7266J19009
$$ y = [210207, 224601, 331410, 335166, 428196, 405178, 544765, 401654, 276482, 294931, 245219, 352749, 304411, 399719, 544752, 567660, 484532, 314584, 179652, 290157, 484630, 636150, 514556, 615258, 564159, 535863, 548477, 379320, 475701, 443427, 431484, 412984, 623152, 719738, 778222, 696055, 530450, 402321, 536567, 648139, 462382, 495492, 418127, 552381, 623902, 575347, 341322, 342669, 667677, 800127, 686434, 704227, 677422, 590148, 664434, 611750, 703688, 866454, 851971, 699227, 585773, 760216, 795104, 690370, 794833, 770849, 664669, 704969, 967117, 1101255, 910612, 851116, 967713, 896634, 1040317, 1112845, 1252390, 1296753, 1119578, 923526, 1126373, 1234144, 1097954, 1165220, 1284229]
4452A284229j7439j57457J78776K47077O3860j00615k31622J85865J65914N7687
4442A676275j59286m928j3953J51293J9104O4449J31572P1911L7308q7325L2212
4431A918632N9127P9367J88540J22324J38621J73995l6428J74742J9816n4656
4421B784080J55038K89922Q2682Q6859L11281J13035M9167j55306l2358K38113
4411C922513N5865n630J54086L71611K32650m3603P3742k3232J46637J41607J257
4400E027503L14589J20372K12567N10839R2630M89802L37476M36797N55021L21889
4390H419485O00367Q16797P39891O18672J111705J310322J542024J416443J543541
4381A8119247J569401J215035J171135J134491J346437J804551J842498J820092
$$ y = [1284229, 1266790, 1109333, 1288109, 1535186, 1599046, 1498431, 1266809, 1452674, 1618588, 1676275, 1516989, 1512061, 1498108, 1649401, 1668505, 1732954, 1864526, 1936437, 1973745, 1886420, 1918632, 1977759, 2057126, 2245666, 2367990, 2506611, 2680606, 2644178, 2818920, 2838736, 2784080, 2939118, 3229040, 3311722, 3398581, 3709862, 3822897, 3872064, 3716758, 3684400, 3922513, 3978378, 3972748, 4126834, 4498445, 4731095, 4687492, 4761234, 4738002, 4884639, 5026246, 5027503, 5342092, 5462464, 5675031, 6185870, 6278500, 6768302, 7105778, 7542575, 8097596, 8419485, 9019852, 9836649, 10576540, 11195212, 12306917, 13617239, 15159263, 16575706, 18119247, 19688648, 20903683, 22074818, 23209309, 24555746, 26360297, 28202795, 30022887]
4373C0022887J746390J574994P95623L29344M91799Q98611J203031J669856J169491
4364C9902026L86235j94732j391007j771305j526442j026559o00331o87076p90126
4355C2300683j238433j813245k283648j952264j664145j250385j348862j180431
4347A9569270r01272j585916j737620j531249j535811j322133j045267j074969
4339H835033o80547n57555n65901l60230o46651l55972k80898k40292j88093r2516
4329D866378m07480l35022k09868k12399l36362k56574J56258Q1318l8101n0973
4319C257175j11931k05687o6537q5359k22884o6951j6146l899k56958k19352J76856
4308B178327J25068j62744j45198j21601k09211J99344m45483O773M3710j4125
$$ y = [30022887, 31769277, 33344271, 34139894, 34469238, 34961037, 35859648, 37062679, 38732535, 39902026, 40288261, 40093529, 38702522, 36931217, 35404775, 34378216, 33777885, 33090809, 32300683, 31062250, 29249005, 26965357, 25013093, 23348948, 22098563, 20749701, 19569270, 18667998, 17082082, 15344462, 13813213, 12277402, 10955269, 9910002, 8835033, 8154486, 7596931, 7031030, 6670800, 6024149, 5668177, 5387279, 5146987, 4958894, 4866378, 4458898, 4123876, 3914008, 3701609, 3365247, 3108673, 3264931, 3346249, 3308148, 3257175, 3145244, 2939557, 2873020, 2787661, 2564777, 2497826, 2481680, 2477781, 2220823, 2001471, 2178327, 2303395, 2140651, 1995453, 1873852, 1664641, 1863985, 1418502, 1425275, 1468985, 1454860]
4298A454860n4094l6215N4097k03637P5069k5719l89128J77387P1051j09317o2088
4287I52266K7994O2135k2002k6744O2832j39482j11887L55848l58790k32104J74691
4276G44757J08135q1834k00130J0229P6900q375L6783Q3894L7870k5265J92293
4265I75257k23891P3283P591k27529L488j66878O1457M8160J86720k47370N7872
4254E48160Q2414Q76p4603l18092J46880K553L2392J34040Q1635l31189k1052
4243B84014K98479R5226j08093r5876J27448j89264l115J53546j09574p5117L2930
4232D10604M4043Q8148m499k90022j5865O1487j13398J92139j1608j07325n378
4221B48326Q334o0716l30235J52726J82427k83338J91895N3675j5040j44545J45803
$$ y = [1454860, 1400766, 1364551, 1418648, 1215011, 1290080, 1264361, 875233, 1052620, 1123671, 1014354, 952266, 980260, 1042395, 1020393, 993649, 1056481, 916999, 805112, 1160960, 802170, 570066, 744757, 852892, 771058, 570928, 581157, 658057, 649682, 686465, 770359, 808229, 782964, 975257, 751366, 824649, 832240, 604711, 608199, 441321, 502778, 550938, 737658, 490288, 548160, 630574, 631450, 556847, 238755, 385635, 388188, 420580, 554620, 636255, 305066, 284014, 582493, 677719, 569626, 473750, 601198, 411934, 408819, 562365, 452791, 377674, 410604, 454647, 542795, 538296, 248274, 232409, 293896, 180498, 372637, 361029, 253704, 248326, 256660, 195944, -134291, 18435, 200862, -82476, 109419, 163094, 148054, 3509, 149312]
4210A49312J66248R4398N0718j5930k48029n4457J70822N0189m8613j44930Q5610
4199B55338N0811L26134L7716j89241k50671J55869L27011j90314j39940L8331
4189D21044j69041j11088K69445j41029j04371J15134p0768m8896j5195K15208
4179C60443O301P5001p1705k85425N1962K85980l088m9845m30619n8787L5116
4168h4666N9045K95983j12158j06308K34596q263j50706l6058q1950J1533R7707
4157A18755J46239o4050J2294p0277r3Q4990o2836J9781L4048L3668K00227M8674
4145E01420k15983p5273j30352N3438J15270p7398q2029k45269Q6787J78778J33555
4134B42944J2538k5850p1336R4009k2716k11040J27436j45825l0182Q3755K39995
$$ y = [149312, 315560, 409958, 460676, 444746, 196717, 142260, 313082, 363271, 314658, 169728, 255338, 306149, 632283, 669999, 480758, 230087, 385956, 712967, 522653, 382713, 421044, 252003, 140915, 410360, 269331, 164960, 280094, 209326, 160430, 145235, 360443, 366744, 441745, 370040, 84615, 136577, 422557, 419469, 369624, -60995, -119782, -84666, -25621, 270362, 158204, 51896, 286492, 278229, 127523, 91465, 9515, 21048, 118755, 264994, 200944, 213238, 142961, 142868, 227858, 165022, 184803, 218851, 252519, 452746, 501420, 285437, 210164, 79812, 133250, 248520, 171122, 89093, -156176, -69389, 109389, 242944, 255482, 229632, 158296, 252305, 229589, 18549, 145985, 160, -30022, 53733, 293728]
4123B93728K57436j35599o2447j45147j19973j6110j11350J11498R0614l2775
4113A29875J47045L7742j08745n1475J02505R7965q3476J7544L8821j71628L6610
4102A92783J04460p1380k4791O4910K15776j41618m3332j49805R8036Q2441K3368
4091C50848K6864j24996j18051j13257K16534n7078P2470J45174Q3380j06032
4081C75856j06578P7161j98846K5678J35229j71862M9349K06461o431J4580L6773
4070D37370M8189J71184k54122n1398J07365r9302J3259r0053r6656J04372k4022
4059B66186J63437J58379j80951Q5957k3411R2425k7987R0865m9451k25148J28989
4048D79290R0954o2592N0482R543o9644L1848P4989K9258j33591P2770l1716N8360
$$ y = [293728, 551164, 415565, 353118, 207971, 87998, 71888, -39462, 72036, 162650, 129875, 276920, 314662, 205917, 154442, 256947, 354912, 271436, 288980, 327801, 156173, 192783, 297243, 225863, 201072, 265982, 481758, 340140, 296808, 147003, 245039, 327480, 350848, 377712, 252716, 134665, 21408, 237942, 180864, 253334, 398508, 481888, 375856, 269278, 346439, 147593, 173271, 308500, 136638, 185987, 392448, 386017, 400597, 437370, 485559, 656743, 402621, 351223, 458588, 359286, 372545, 282492, 185836, 290208, 266186, 429623, 588002, 407051, 493008, 469597, 562022, 534035, 624900, 575449, 350301, 479290, 570244, 507652, 558134, 567677, 498033, 529881, 604870, 634128, 500537, 573307, 541591, 599951]
4036E99951K3710r9273L0P4311L7251j8404r2795J94009j95591m5421k6997J5101
4024D65882J65876P3852q7519o4370R0463o4586o9605m5462L8296J9690Q4120
4013F06637P7753l365J5269M310Q8011K23730Q7573k75852j47027N8354M6112
4002G81505j5028L7805M1039l8161j18929n2649L65072p7609J22302K77902k72333
3991A050916j44758K66444J19986o2171m7543o6889L3996k017K41480R4091N844
3980A489379J53778M2966o4232o5816J20055m5708j9553J02920R3645Q7824O5986
3969A961244J14648J27990L9847k17685N1227O4484J7915K70731J80344r6652
3959B514093K68517J47621J03376K17152J2786L25160K15430k2673k2947L11043
$$ y = [599951, 623661, 524388, 524418, 598729, 635980, 617576, 524781, 718790, 523199, 477778, 450781, 465882, 631758, 705610, 618091, 553721, 644184, 579598, 509993, 464531, 502827, 522517, 606637, 684390, 681025, 696294, 700604, 788615, 1012345, 1099918, 824066, 677039, 735393, 781505, 766477, 804282, 845321, 807160, 688231, 635582, 1000654, 923045, 1045347, 1323249, 1050916, 906158, 1172602, 1292588, 1230417, 1182874, 1115985, 1149981, 1147964, 1389444, 1483535, 1489379, 1643157, 1686123, 1621891, 1556075, 1676130, 1630422, 1610869, 1713789, 1807434, 1895258, 1961244, 2075892, 2203882, 2243729, 2026044, 2077271, 2141755, 2159670, 2430401, 2610745, 2514093, 2782610, 2930231, 3033607, 3250759, 3263545, 3588705, 3804135, 3781462, 3758515, 4069558]
3949D069558J79602J77707K52482M00426L89045K94358K23409L60871K16096K97615
3939F861169L21966M13988M50678N14445L03063K35688L77847O36287O59663O64694
3929A1439488M29360M62262N32771O54294N85600M59428O13286N49982M75432
3920A6201903N02946O76010O96290N44195M37871M55356O28369M57390N70060
3911B1170390P11393L96528L02645J84618M23171L79076J02292J31368L44099
3902B4145580J78041R1232M8138O1111J8383K91189N0631l30954k77509m94883
3892B3780959k54681l94550n16881o0918n03958m31784m48929o82003n77863m86441
3882A9422951m73605o60934n24998n02871p31931p74479q85077o59891o31380
$$ y = [4069558, 4249160, 4426867, 4679349, 5079775, 5468820, 5763178, 5986587, 6347458, 6563554, 6861169, 7183135, 7597123, 8047801, 8562246, 8865309, 9100997, 9478844, 10115131, 10774794, 11439488, 11868848, 12331110, 12863881, 13518175, 14103775, 14563203, 15176489, 15726471, 16201903, 16704849, 17380859, 18077149, 18621344, 19059215, 19514571, 20142940, 20600330, 21170390, 21881783, 22278311, 22580956, 22765574, 23188745, 23567821, 23670113, 23801481, 24145580, 24323621, 24414853, 24462991, 24524102, 24542485, 24833674, 24884305, 24553351, 24275842, 23780959, 23526278, 23131728, 22614847, 22553929, 22049971, 21618187, 21169258, 20487255, 19909392, 19422951, 18949346, 18288412, 17763414, 17260543, 16528612, 15754133, 14869056, 14209165, 13577785]
3873A3577785m9801n71567o64033n29020p52293o75428o22076o18639l41835m37720
3863H315373l13624l37949n83353k40560m74091m91075k89657m33914m48105j8307
3853D684738j80249l16190l09865k08153k8622k80341o5025K2455j88274l27378
3843B803096j82382N0028k91935j09654J31859o5996j90054R5983M1727k10589
3833B072083k56941j70524K41797r9257n9233j6371k37984J62963q4928O0966
3823A612571R410j84243j56365J48291k0935m780j16379Q5079k5598j36346j812
3812A208893R5183K4104n2715n3935Q5062r0689j03100p2110J27684K0196M4359
3801A232932J9750R877n8342o3109N1489L4549q311l46399O6033J593J07527M315
$$ y = [13577785, 13527984, 12956417, 12292384, 11763364, 11011071, 10335643, 9713567, 9094928, 8753093, 8315373, 8001749, 7663800, 7080447, 6839887, 6365796, 5874721, 5585064, 5151150, 4703045, 4684738, 4504489, 4188299, 3878434, 3670281, 3641659, 3361318, 3296293, 3318748, 3130474, 2803096, 2620714, 2670742, 2378807, 2269153, 2401012, 2335016, 2144962, 2240945, 2282672, 2072083, 1815142, 1644618, 1886415, 1787158, 1727925, 1711554, 1473570, 1636533, 1551605, 1612571, 1621981, 1437738, 1281373, 1429664, 1408729, 1403949, 1287570, 1372649, 1347051, 1210705, 1208893, 1304076, 1328180, 1275465, 1221530, 1306592, 1215903, 1112803, 1040693, 1168377, 1188573, 1232932, 1252682, 1262559, 1204217, 1141108, 1192597, 1227146, 1218835, 872436, 938469, 940062, 1047589, 1051904]
3789A051904q9625q8650Q6737J12089m8178j351k7055j00593Q0637J37152m7411
3778A065656l3796K5795j9694j40304k136K26033O984j6061N684J48193r029J8259
3766A275584J17417k33737R5326o1641j56282K08870j62317K02922O3226J1760
3756A361128j30943j37234k8744m9226l4741j02972n5332R8929P4991m7519m6225
3745I02112o0078j33779J40498p213R74J72658k24423n4917r9846K840J65235
3734H04061j88030J63349p009j35202J65909P3297p6677j90329q677N6115J11070
3723G67877J0641j33845J29560j52940j32258Q9677O3724K52110j21204j18820
3713F54522j48106j4352J40649J09020N9305J25651Q808k98905r3680K57718O9819
$$ y = [1051904, 962279, 873629, 960366, 1072455, 1024277, 1022926, 995871, 895278, 975915, 1113067, 1065656, 1031860, 1057655, 1037961, 897657, 895521, 1121554, 1128538, 1112477, 1118161, 1266354, 1257325, 1275584, 1393001, 1159264, 1254590, 1192949, 1036667, 1245537, 1083220, 1286142, 1349368, 1361128, 1230185, 1092951, 1064207, 1014981, 980240, 877268, 821936, 920865, 995856, 948337, 902112, 842034, 708255, 848753, 841540, 842514, 1015172, 790749, 735832, 635986, 638826, 804061, 616031, 779380, 772371, 637169, 803078, 876375, 799698, 609369, 600692, 656807, 767877, 778518, 644673, 774233, 621293, 489035, 578712, 642436, 894546, 773342, 654522, 506416, 492064, 632713, 741733, 801038, 926689, 935497, 636592, 542912, 800630, 870449]
3702H70449O1469J36246j3864j0967j12891J1835O6253n5769k45662r4245K36383
3691H49237m3772r6671J87904J23650L3424K4005P5931r4398j4485J36517j36964
3680A044378m4232m829J99355j5709k9322j24401m2612O2717K33485o547O9381
3669A341664j8345p731j15455N2498q7739M7520J08329N901O515K5632L3589j35614
3657A256764k2823J60712j81779R4077M7359M3758L59335q5950P4114P7294q6679
3646A736182Q8379l2698q4940N5181j33225J91931o833M6688o727R407j4740k11268
3634A637337J38209K19876P9834N9048q7112N4216L0916R5526P0361J683N3591
3623B353485K93266M9803q1387j1209J35659J8904N4091k2211R2855K17727L45600
$$ y = [870449, 931918, 1068164, 1054300, 1043333, 930442, 942277, 1008530, 952761, 707099, 612854, 849237, 805465, 708794, 896698, 1020348, 1053772, 1077777, 1153708, 1059310, 1044825, 1181342, 1044378, 1000146, 995317, 1194672, 1178963, 1149641, 1025240, 982628, 1045345, 1278830, 1272283, 1341664, 1323319, 1315588, 1200133, 1252631, 1164892, 1212412, 1320741, 1326642, 1333157, 1358789, 1392378, 1256764, 1233941, 1394653, 1212874, 1306951, 1354310, 1398068, 1757403, 1671453, 1745567, 1822861, 1736182, 1824561, 1791863, 1706923, 1762104, 1628879, 1820810, 1813977, 1860665, 1853938, 1863345, 1848605, 1637337, 1775546, 1995422, 2075256, 2134304, 2047192, 2101408, 2132324, 2227850, 2298211, 2299894, 2353485, 2646751, 2696554, 2615167, 2603958, 2739617, 2758521, 2812612, 2790401, 2883256, 3100983, 3446583]
3612C446583J68367q6537J14089N2253J19684J61435J77946L2382K88850J05705
3602D580757J10404N36446J23914J20577J10890N08348L62119J28106L39853L35497
3592G256911J15911L96379M75470L70170K20351J95017J81329J84056J96709K43269
3582I835572J45434P9930L35737L90894R1830J3012K43291N2729k8106r3387r0704
3571A0976232r0832L07147m3309k27231R9299J54547K99449l7002q6279K18182
3561A1570203R8079L1011l5791j21399K92442K11008L19691M53529K17783L91980
3551A3428536M87571N88409N25887L57296N44504R14961R66018J027790J045386
3542A9886358J085773J257458J337883J165779J070847J111069J251828J375840
$$ y = [3446583, 3614950, 3528413, 3642502, 3694755, 3814439, 3975874, 4153820, 4186202, 4475052, 4580757, 4691161, 5227607, 5351521, 5472098, 5582988, 6091336, 6453455, 6581561, 6921414, 7256911, 7372822, 7769201, 8244671, 8614841, 8835192, 9030209, 9211538, 9395594, 9592303, 9835572, 9981006, 10060936, 10396673, 10787567, 10879397, 10892409, 11135700, 11188429, 11160323, 11066936, 10976232, 10885400, 11192547, 11149238, 10922007, 11021306, 11175853, 11475302, 11438300, 11352021, 11570203, 11668282, 11699293, 11663502, 11542103, 11834545, 12045553, 12365244, 12818773, 13036556, 13428536, 13916107, 14504516, 15030403, 15387699, 15932203, 16847164, 17813182, 18840972, 19886358, 20972131, 22229589, 23567472, 24733251, 25804098, 26915167, 28166995, 29542835]
3534B9542835J205338R22024J140707J418829J057501Q64037J249889J231188
3526C8632348J104444R77842R48007R82242Q17846M51682L46629O23368O78475
3517D5562883N12961K89414N36142M11093M04015M28499M21988M53589K30341
3508D9250925M21984K44291M57008K59958K32429P07664O13688O13238Q36752
3499E3637937J014113J302207J459581J751931J698341K088245K395402K477390
3491F7825147K696860K745732K549736K151644J985351J340153O24732J37738
3483H2057093p06942o96762q74339j340717j423068j181037r11306j208303j196972
3474G2517647j395365j707973k077146k458991k964931l577399l826035l891783
$$ y = [29542835, 30748173, 31670197, 32810904, 34229733, 35287234, 36151271, 37401160, 38632348, 39736792, 40714634, 41662641, 42644883, 43462729, 43914411, 44261040, 44884408, 45562883, 46075844, 46365258, 46901400, 47312493, 47716508, 48145007, 48566995, 49020584, 49250925, 49672909, 49917200, 50374208, 50634166, 50866595, 51574259, 52187947, 52801185, 53637937, 54652050, 55954257, 57413838, 59165769, 60864110, 62952355, 65347757, 67825147, 70522007, 73267739, 75817475, 77969119, 79954470, 81294623, 81919355, 82057093, 81350151, 80653389, 79779050, 78438333, 77015265, 75834228, 74922922, 73714619, 72517647, 71122282, 69414309, 67337163, 64878172, 61913241, 58335842, 54509807, 50618024]
3466E0618024m307413l843458l502425l062207k526943k555501k336767j769205
3458B6714105j640504j557234j019456r93388q51439r67892n65170o88705n16269
3449A7914048k47959k76136m48453l18804m02732l80920m13654k12251j45988
3440A5067151k48155m8565l57701k33625m2969j60228m55318m76255l77512l47857
3430A2318966k34963k35973j87335k26613j99237k33092l47840j2576j91568k98657
3420A0151112j98494k90354l89306q3618k38771K5770j24770j09001O2536k22375
3410H582729R5602J92974M6216K44988J52198J99007L28175M96644P26343Q17612
3400A1882488P20089J100769J187132J180812J087545J460929J424866J270629
$$ y = [50618024, 46310611, 42467153, 38964728, 35902521, 33375578, 30820077, 28483310, 26714105, 25073601, 23516367, 22496911, 21503523, 20652084, 19684192, 19119022, 18430317, 17914048, 17666089, 17389953, 16941500, 16622696, 16219964, 15839044, 15425390, 15213139, 15067151, 14818996, 14770431, 14412730, 14179105, 14136136, 13975908, 13520590, 13044335, 12666823, 12318966, 12084003, 11848030, 11660695, 11434082, 11234845, 11001753, 10653913, 10641337, 10449769, 10151112, 9952618, 9662264, 9272958, 9189340, 8950569, 8976339, 8851569, 8742568, 8805104, 8582729, 8678331, 8871305, 8917521, 9162509, 9314707, 9513714, 9841889, 10338533, 11064876, 11882488, 12602577, 13703346, 14890478, 16071290, 17158835, 18619764, 20044630, 21315259]
3392B1315259J228627P26625M29776L20201N8785r0451M1198j44558j08182p3831
3382B3703449j5419k09362j17464Q1911l46266n16602m87205p16756j064757j379429
3372A8932100j411925j450188j380798j598760j367791q33713r62166p83832q83888
3363H259039o40309m61362o41928m36898n6398k87999l19655k10840n06089n11402
3353D186159k43615k8502K9519k0565k37765j49111j57124j22044p4973k90246
3343B891733j92310K6588j57985J5132j76532j24971M464r2467Q1223j30253j76465
3332A968157Q7552j5401r704p5056j48794N7511q3714j25046k9144k4374R0163
3321A692150k2904j77120N4976l1165M793j40128r1510m2765J13874j03798p8310
$$ y = [21315259, 22543886, 23270511, 23700287, 24020488, 24079273, 23988822, 24030020, 23885462, 23777280, 23703449, 23688030, 23478668, 23361204, 23443115, 23096849, 22580247, 22093042, 21376286, 20311529, 18932100, 17520175, 16069987, 14689189, 13090429, 11722638, 10888925, 9926759, 9142927, 8259039, 7618730, 7157368, 6515440, 6078542, 6022144, 5734145, 5414490, 5203650, 4697561, 4186159, 3942544, 3914042, 3943561, 3922996, 3685231, 3536120, 3378996, 3256952, 3181979, 2891733, 2699423, 2726011, 2568026, 2583158, 2406626, 2281655, 2286119, 2193652, 2274875, 2144622, 1968157, 2055709, 2040308, 2030604, 1955548, 1806754, 1864265, 1780551, 1655505, 1626361, 1601987, 1692150, 1669246, 1492126, 1547102, 1515937, 1520730, 1380602, 1289092, 1246327, 1360201, 1256403, 1178093]
3310A178093J39303o9045j76492k99327K53677q4939p2041J68894r5843j25275
3300H17005J01119l9665p133j90568l4377L07258N2781o2807q6668l4443J23519
3289I46021k23365l3164R371N6312O651P4146O9547q5224o8955n5209K00942j45587
3277G51486q7350j56171J19282O9436j89985P2475p5951j10561K18581R1420p1172
3266F31490R5539j63690J1488P291K8948L9628j67368j06213J43355Q4248J70196
3255G74912l870m9489o9168J8674R6092N3275k57420k886J22208J2516q9889j51638
3243D53317L9495k272N0359j03599J98739Q2395j2866j26226j07787j79143J62452
3232D54864J33108J43636k083k83335K6058M3350q3755O6783K77059m5424Q1399
$$ y = [1178093, 1317396, 1248351, 1071859, 772532, 1026209, 941270, 869229, 1038123, 942280, 817005, 918124, 878459, 871326, 680758, 646381, 953639, 1006420, 943613, 856945, 822502, 946021, 722656, 689492, 698863, 755175, 761826, 835972, 905519, 820295, 751340, 696131, 897073, 751486, 664136, 507965, 627247, 696683, 506698, 579173, 503222, 392661, 611242, 702662, 631490, 727029, 563339, 574827, 582118, 611066, 650694, 483326, 377113, 520468, 604716, 774912, 771042, 721553, 652385, 671059, 767151, 820426, 563006, 560120, 682328, 694844, 604955, 453317, 492812, 490540, 540899, 437300, 636039, 718434, 705568, 579342, 471555, 292412, 454864, 587972, 731608, 729525, 446190, 472248, 515598, 431843, 498626, 775685, 730261, 811660]
3221H11660N2083l0312j92987k92372K67498J7678m0224Q2811o8817R0470k77816
3210D19672l45K92130J67576o3732j3180p9946k22047K38940k9747j3805P6316
3199G71832j5109J28832l9774j99830L1726l6540P8406m9274J70697k5338j12615
3188G03013j97569N3709l8000j22309J28670J9772r256m2158j06112J78585n4677
3177E13668j48695r4310k42J20611L1198m6833j28485R164J86564M568k41033
3166B06175J3749j17551Q308L775N269J75613K2277j66271K4617j33026J16077
3155A59012J2043r6469k7091J25870k70q984J15908k61615J4399K4042M2879J27799
3143B27523M0120M9281j89688J31647J90636n2351q6243O0143j53082n95j6028
$$ y = [811660, 863743, 833431, 640444, 348072, 615570, 633248, 593024, 675835, 607018, 697488, 419672, 419327, 711457, 879033, 815301, 802121, 722175, 500128, 739068, 709321, 695516, 771832, 756723, 885555, 845781, 645951, 677677, 641137, 719543, 670269, 840966, 815628, 703013, 505444, 559153, 521153, 398844, 527514, 547286, 538030, 495872, 389760, 568345, 513668, 364973, 270663, 270421, 391032, 422230, 375397, 246912, 256076, 442640, 447208, 206175, 219924, 102373, 110681, 114456, 119725, 295338, 317615, 151344, 175961, 42935, 159012, 171055, 74586, 47495, 173365, 173095, 164111, 280019, 18404, 32803, 56845, 99724, 227523, 267643, 316924, 127236, 258883, 449519, 397168, 310925, 371068, 217986, 217391, 201363]
3132B01363M3192L5852J5028J54235q1491k2992J91212j9135k01011j1932j35335
3121A68986q1351K15228o394r3179j4539j50576L7721q7989J79102M1848k9411
3110A79446q8523r365j43716O3319M0697L7500K15493j59268n6182l392o7210
3099H799K78648L9740l9362j55639r4740n0304K37581J76087m9909j42448J02216
3088C10669J56103j15751q356j97904j30490r1139J00692M9646R2553j04899J5685
3077G6809Q7207P2892J32607j55817k18678R9364J06570J785l6614L8568j73793
3066C0900J66182J06292j74705l9386m2666m2250K11147j40304K8241Q4341K9327
3055B17119J1886M1226q3612J72624m4626K2725R7086p4473J63644R5062R539
$$ y = [201363, 244555, 280407, 295435, 449670, 368179, 345187, 536399, 517264, 316253, 304321, 168986, 87635, 302863, 296469, 203290, 188751, 38175, 75896, -12093, 167009, 208857, 179446, 90923, 81558, -62158, 1161, 41858, 79358, 294851, 135583, 79401, 76009, 8799, 287447, 327187, 287825, 132186, 37446, -12858, 224723, 400810, 350901, 208453, 310669, 466772, 351021, 342665, 144761, 14271, -76868, 23824, 73470, 166023, 61124, 76809, 164016, 236908, 369515, 213698, -4980, 94384, 200954, 202739, 166125, 204693, 30900, 197082, 303374, 128669, 89283, 46617, 4367, 215514, 75210, 103451, 187792, 217119, 229005, 270231, 186619, 359243, 314617, 337342, 434428, 359955, 523599, 618661, 628200]
3044F28200j88802K8913q2104j33242J88514J809k37136R3381M2655j40032j1829
3033A90327J12699l59220k47694L63733J62509m097K29732J8083p5997j08022
3023B82053j38145Q0355r7921K28690R6900J04794J32858k531n5200n9373j415
3012E71065o4095p141n7246j35278n2925J7624j46147J06079n4609J13724P148
3001B98199j99194R6838J8461p2049k07868o6412L2107j15762J29862J49587K7100
2990I0869j50213k5032O7175J48524o5130k81152J12649J16677K0590N1518j18453
2979c1978j11294M900J89927N8565j31074n164J69775r5615L9548J8158k95918
2968a90170J14083J21783k5948j5832k50980J49782j40782J2568K09550m0969
$$ y = [628200, 439398, 468311, 386207, 252965, 441479, 443288, 206152, 299533, 342188, 202156, 190327, 303026, -56194, -303888, 59845, 222354, 218257, 447989, 466072, 390075, 282053, 143908, 224263, 126342, 355032, 451932, 556726, 689584, 687053, 631853, 572480, 571065, 506970, 499829, 442583, 307305, 254380, 272004, 125857, 231936, 177327, 291051, 298199, 99005, 195843, 214304, 142255, -65613, -132025, -99918, -215680, -85818, 63769, 90869, -59344, -84376, -17201, 131323, 66193, -214959, -102310, 14367, 34957, 86475, -31978, -143272, -138372, 51555, 110120, -20954, -26118, 143657, 48042, 87590, 105748, -190170, -76087, 45696, 19748, 3916, -247064, -97282, -238064, -225496, -15946, -56915]
2958e6915J18445N5223j27424J05844j10087j21342J28187J27041J07801k07391
2948A9382j2139k5286R8316O7981j89900Q2783j13572N1029j27206j46347J57996
2937a36963K54659P5517o390k7640L2176j51749k76680K39878K03450k61601q5278
2926a40621K19167j41597K6176J40822k717l419o9671m7055L7235q364J46602
2915A56558j24568L5471P4789k30379O0946m3517n6987J72876J64179k60299n3484
2904a04415K74404J12817k25334k3268J65484n2792j71443J23816J26454k8354
2894A97369l5970k3988J70852j52483n5981P2285n097M0647r0815m0039m7354
2883B9426p0289l2159O5556J50468j8071Q023r8531J7898l3237l7369J29620J06831
$$ y = [-56915, 61530, 116753, -10671, 95173, -14914, -136256, -8069, 118972, 226773, 19382, 7243, -18043, 80273, 148254, -41646, 41137, -72435, -21406, -148612, -294959, -136963, 117696, 193213, 186823, 159183, 191359, 39610, -237070, 2808, 206258, -55343, -140621, 78546, -63051, -36875, 103947, 101230, 97811, 28140, -18915, 18320, 9956, 156558, 31990, 67461, 142250, -88129, -27183, -70700, -127687, 45189, 209368, -50931, -104415, 169989, 282806, 57472, 34204, 199688, 146896, -24547, 99269, 225723, 197369, 161399, 137411, 308263, 155780, 99799, 172084, 166987, 207634, 116819, 76780, 29426, -40863, -73022, -7466, 143002, 124931, 132954, 34423, 52321, 19084, -18285, 111335, 218166]
2871B18166n5924J19843q5056J25393j05120j73800j10670K12949O5431k45719
2861c4507j15643K25364N3171j48438j37670L5813K3432j69313N2287J44410m4581
2850a15675k0327k4712J33600K9593j47781j70597q3903n698J7561J18199L41280
2839G1540m136K9692M1264j82009J64352j5586p2750k9009M083K2103j5725m7225
2827c3406P4955P4030M6644j49377n5543k01770J44020J45162k4217r482k7294
2816a6278j10972L9315q1670M3895Q8164j24028o0815j03037K02151k6299L2573
2805a17001J00169K5655j00952P7124o7704p0836J24141N7505M8861J01868j49070
2794B9760j35759O4234o1831K9927O9195L1074k57064K58503O1184J768j20767
$$ y = [218166, 162242, 282085, 197029, 322422, 217302, 43502, -67168, 145781, 211212, -34507, -150150, 75214, 128385, -20053, -157723, -121910, -98478, -267791, -215504, -71094, -115675, -136002, -160714, -27114, 2479, -145302, -315899, -399802, -405500, -387939, -269740, 71540, 67404, 97096, 138360, -43649, 120703, 105117, 32367, 3358, 7441, 29544, 13819, -33406, 41549, 115579, 162223, 12846, -42697, -244467, -100447, 44715, 20498, 11016, -16278, -127250, -87935, -169605, -125710, -37546, -161574, -222389, -325426, -123275, -149574, -117001, -16832, 8823, -92129, -15005, -82709, -153545, -29404, 28101, 76962, 178830, 29760, -105999, -41765, -103596, -73669, -4474, 26600, -230464, 28039, 89223, 90991, -29776]
2783b9776p4821p9777J70687l2735k74173J70038R5686k4107j8593j07779k4096
2772b29446J68678j49689l8548O0551j88638J5448P1301J35142J37422m3592j24560
2761a85931P8144L910O1654K2345P2948k0293j26920J26065N1280k66273N3189
2750a29882M3658r1027j11206J19929J47603p7682k84743Q4198P1552J5552L3824
2739a78224O065N9231o2689j89069O4307J74644k05474J3325P8409K52281k7335
2728a4529n5257N8882j6979l6077R232j26063J25052K4235R9034q2602p5869k2653
2716a13594m5898N2047M4315k2493R0045q5808P5293m2533M9751m6188o1277Q3530
2704b2810m2466o1932o7807R0184K8286o0809R6553J26867j17694k30473P9371
$$ y = [-29776, -104597, -184374, -13687, -46422, -320595, -150557, -54871, -78978, -97571, -205350, -229446, -60768, -210457, -249005, -188454, -377092, -361644, -290343, -155201, -17779, -61371, -185931, -107787, -103877, -42223, -19878, 53070, 32777, -94143, 31922, 83202, -183071, -129882, -86224, -177251, -288457, -168528, -20925, -98607, -383350, -299152, -227600, -212048, -178224, -172159, -112928, -175617, -364686, -300379, -125735, -331209, -317884, -239475, 12806, -14529, -69786, -10904, -27883, -63960, -54728, -180791, -55739, -31504, 67530, -15072, -90941, -113594, -159492, -107445, -63130, -85623, 4422, -81386, -6093, -48626, 1125, -45063, -106340, -22810, -65276, -127208, -195015, -104831, -76545, -137354, -40801, 86066, -31628, -262101, -182730]
2693a82730k6478r1729O7048l1321j05447K04159N9515M0083Q0175Q1846j14335
2682a9214n5748N1985j16054J02618P348P5308j38438l2125L3246o4991M8597
2671a07468l5732j8692K01685J9814M3310P489R88j73626n5045N7491m2100L4310
2659f7576R6486j23189R4697p7824o7411p8308Q832P8145K6469P1106L0077J81667
2647A73171m0021j32121j70706K9102M6369L0126p25j43449J49186n244j26918
2636a91230N5710K6541J1706N9809N302N849p8126j2148O4894J59325J5311J01292
2624B24235j14032L4038M0683L464j65094j15944J40655j61408Q7674N1805j65734
2613a39658j54025K20350k33369M9478j7068J5014K96971n4013m1493r6803o1804
$$ y = [-182730, -209208, -300937, -233889, -265210, -370657, -166498, -106983, -66900, 13275, 95121, -19214, -74962, -22977, -139031, -36413, -29065, 46243, -92195, -124320, -91074, -156065, -107468, -143200, -161892, 39793, 59607, 102917, 110406, 111394, -62232, -117277, -59786, -101886, -67576, 28910, -94279, 418, -77406, -144817, -223125, -214293, -136148, -109679, -38573, -8496, 173171, 133150, 1029, -169677, -140575, -94206, -64080, -64805, -208254, -59068, -64312, -191230, -135520, -108979, -97273, -37464, -32162, -26313, -104439, -116587, -51693, 107632, 122943, 224235, 110203, 144241, 184924, 188388, 23294, -92650, 48005, -113403, -25729, 26076, -139658, -293683, -73333, -306702, -257224, -274292, -259278, 37693, -16320, -57813, -154616, -216420]
2602b16420j9530R9852J45890j48698J67498n0422j2566p9188J83583K3811K958
2591I6768m5518o9014K26081j76208P1382j49151j26517K69605o4189j46348j00153
2580b13262O4799R2675J15512K8301j56286J6343R2509K7542j44740m4035Q5690
2569c4952J18134j5997N4370m6325j68779J50138K38492k18576j40594o4403j64279
2558b92771M9766J8490k023J32099P643j0992J55391L5221j66251O4072p2626
2547h1981k8350j12815Q2840R8257j3028J02879M4883j97788O7104o5511O1101
2536d2409R4029j63237J16860k16023J1336j02085J84754R6922j76449N2108J61915
2525A7721m5452P1294O68k31713m6590j31161J62578K04947p0801j06783M9672
$$ y = [-216420, -235950, -136098, 9792, -138906, 28592, -21830, -34396, -113584, 69999, 93810, 96768, 51250, -17764, 208317, 32109, 103491, -45660, -172177, 97428, 33239, -113109, -213262, -148463, -55788, 59724, 88025, -68261, -51918, 40591, 68133, -76607, -120642, -34952, 83182, 67185, 121555, 75230, -93549, 56589, 295081, 76505, -64089, -128492, -292771, -243005, -224515, -226538, -94439, -86796, -97788, 57603, 92824, -73427, -9355, -81981, -110331, -223146, -140306, -42049, -55077, 47802, 92685, -105103, -37999, -103510, -42409, 51620, -111617, 5243, -210780, -199444, -301529, -116775, -19853, -196302, -144194, 17721, -27731, 43563, 44231, -187482, -234072, -365233, -202655, 2292, -68509, -175292, -125620]
2514a25620j40743q0122R5146J57990o2741J54174J8264k6917j13077Q0865J77481
2503A34700l4555q5143l3757K6173j50837M6129N314j02630K62676P5324j80486
2492c7092P2876k14698J86770O1922Q5615N6792j47272P0560J41231l5280r4986
2481A46438j75185N7249J26438k01899R93j4118n4845p1240P3129J80692J56955
2470B24607j0506j45369j3261j26095N067j25082j07885N0937l4761R7676O0196
2459a24476P4700J10265M4582k22487j6615J63609j39838j83293j05033K0036
2449c78550K74345M4697k86339L291R7759k5426R4101M5069k04952j10667J67052
2438b79620L9261K05116j07173O4209J05993j80956M355j3301j96338L0925J19645
$$ y = [-125620, -266363, -346485, -251339, -93349, -156090, -1916, 16348, -10569, -123646, -42781, 134700, 100145, 15002, -18755, 7418, -143419, -97290, -91976, -194606, 68070, 143394, -37092, 35784, -178914, 7856, 69778, 155393, 212185, 64913, 135473, 276704, 241424, 146438, -28747, 28502, 154940, -46959, -45966, -60084, -114929, -186169, -113040, 67652, 224607, 214101, 68732, 55471, -70624, -65557, -190639, -298524, -247587, -282348, -184672, -124476, -49776, 60489, 105071, -117416, -134031, 29578, -110260, -293553, -398586, -378550, -104205, -59508, -345847, -342556, -244797, -270223, -176122, -131053, -336005, -446672, -279620, -240359, -35243, -142416, -78207, 27786, -153170, -148815, -162116, -358454, -327529, -207884]
2427b07884P8156j07259k02710R3946K88264p3300o2857j0459m5669P0180k361
2416a81953J47395m5916R6660j15919M3482P0145k7341j51280j30154J29790M0856
2405a24235o1372p2386k6734K39873M9274j88786j08831N2534j8668n1919j20017
2394d31267K04973R6667k9997K56111o0845j78883K6255O5361M5146Q8246j98792
2383a17025o3831L4564N1940j3331j56734K68118K25537n6373M1986k27319j83317
2372a95785K51850m9879k5745o8705K2235r0229J69748J67491j09397k02772J50904
2361A9716R1658R6620j68909J5582k6713N9336P3059k31939M6479o4528J03231
2350A3592k32701K1886J25189o7449J3574K19090J6568Q7949M195n7653j3613
$$ y = [-207884, -129728, -236987, -439697, -345751, -57487, -130787, -193644, -204103, -249772, -179592, -181953, -34558, -80474, 16186, -99733, -56251, 13894, -13447, -164727, -294881, -165091, -124235, -185607, -257993, -284727, -44854, 4420, -184366, -293197, -240663, -259331, -311250, -431267, -226294, -129627, -159624, 96487, 35642, -143241, -116986, -51625, -6479, 81767, -117025, -180856, -146292, -94352, -107683, -264417, 3701, 229238, 172865, 214851, -12468, -195785, 56065, 6186, -19559, -88264, -66029, -156258, 13490, 180981, 71584, -131188, 19716, 111374, 207994, 39085, 54667, 27954, 87290, 160349, -71590, -25111, -89639, 13592, -219109, -197223, -72034, -139483, -125909, 93181, 109749, 197698, 201893, 144240, 130627]
2339A30627j46640J5643J7628k01692P2435r701m9928q5239J91381j83760J86518
2328f2728L5737l3259m6556m2433j1118M7738R7029j53247J82798j49982K25375
2317H9354k75310r6828J07491K34653j60047j46261K55557k68512K27154J91859
2307A59110M8585n3340o5266k1635j45137j13541J43888N7031j33549m389J47202
2296A8959r7324M5025J47922j01954j1187K58954N5530l27985k65690K0072J42288
2285a15390L2354J6881j5187n0763J28916j53658K23843N398r3607o7035j77769
2274b66017K72404k60200J16881K31714p2674K8612j365j69436J36116o7010j19707
2263a70682Q1314J41556p7568j19617j2451j51853K60556K3652j20440J7249j23163
$$ y = [130627, -16013, -370, 17258, -184434, -111999, -121700, -171628, -256867, -65486, -249246, -62728, -26991, -60250, -106806, -149239, -160357, -112619, -15590, -168837, 13961, -136021, 89354, -185956, -282784, -175293, 59360, -100687, -246948, 8609, -259903, -32749, 159110, 207695, 154355, 89089, 67454, -77683, -191224, -47336, 9695, -123854, -128243, 18959, -78365, -33340, 114582, 12628, 1441, 260395, 315925, -12060, -277750, -257678, -115390, -83036, -66155, -81342, -132105, -3189, -156847, 66996, 72394, -21213, -88248, -266017, 6387, -253813, -136932, 94782, 22108, 50720, 49355, -120081, 16035, -50975, -170682, -89368, 52188, -25380, -144997, -157448, -309301, -48745, -25093, -145533, -128284, -251447]
2252b51447j67440L08535J3354n4394L378J67397Q6160j44367o3801k21503K83689
2241d0439q0352k20194J50092L8140j79633r8394N3035k648J25977J85242J55532
2230H6358n6140r2597j2174n3412M2298n1746O94J60863O2208j55117j63994O7387
2218a65372K5475J61702N2990M811l6760Q4861j8166r3230J17190j4331n0548
2207F8622j73524P5485O3128j65020Q1164J63138k21211j53164M1898J69211j04685
2196a54958q9319N6033L04211J4548j66345N2539K8882j73061K0834J56272k81277
2185b31641K2414K42181Q6819m0574k8376j31427n6296n5391K03843K23076k51675
2174a7047j87028r5710K43883o7694Q6654o5162N8690J6856n9879l07569J32969
$$ y = [-251447, -418887, -110352, -96998, -151392, -148014, 19383, 105543, -38824, -102625, -324128, -40439, -120791, -340985, -190893, -152753, -332386, -430780, -377745, -380393, -254416, -69174, 86358, 30218, -62379, -74553, -127965, -85667, -137413, -136719, 24144, 86352, -68765, -232759, -165372, -139897, 21805, 74795, 79606, 42846, 127707, 109541, 16311, 133501, 119170, 68622, -104902, -29417, 33711, -131309, -50145, 112993, -108218, -261382, -219484, -50273, -154958, -244277, -188244, 115967, 130515, -35830, 16709, 45591, -127470, -106636, 49636, -231641, -209227, 32954, 119773, 79199, 50823, -80604, -136900, -192291, 11552, 234628, -17047, -204075, -299785, -55902, -123596, -36942, -102104, -43414, -26558, -86437, -394006, -261037]
2163b61037L28461J27997P1160j06987N9892k78292J5589n3238L4350p4694l5410
2152a72209q7590n1769J03151m9704J53553o4036K18049j23650J73108n4332N909
2141E0480J82796k10547m1576J56842M423j64587k0718r9735r6878m5967L95748
2130A10281o9845j95196j26360J7660J06770o9010K7404L33711m5137k24072j17287
2119b51081J18341O3161J0826J04738L3169q4646l665j5382K6044j24327K29613
2108A06791j35187K4284J10618p6213q3493l5073J72917r3562J3266J34112K2554
2097A61014J02854k41851N7604J42497j310J88772O3825k7424k33272m5540P2790
2086B39959q6506j12803J07290m0629j65120l5256l7495N0413O7293N8686m4823
$$ y = [-261037, 67424, 195421, 266581, 159594, 219486, -58806, -43217, -96455, -62105, -136799, -172209, -259799, -311568, -208417, -258121, -104568, -168604, 49445, -74205, 98903, 44571, 50480, 233276, 22729, -18847, 137995, 142418, -22169, -42887, -142622, -239500, -285467, 110281, 40436, -154760, -281120, -263460, -156690, -225700, -198296, 135415, 90278, -133794, -251081, -132740, -69579, -58753, 45985, 79154, -5492, -9157, -24539, 1505, -122822, 106791, -28396, -4112, 106506, 30293, -53200, -88273, 84644, -8918, 4348, 138460, 161014, 263868, 22017, 79621, 222118, 220808, 409580, 473405, 445981, 212709, 167169, 239959, 153453, 40650, 147940, 107311, -57809, -93065, -130560, -80147, -12854, 45832, 1009]
2075A009l8847R3766K40844n0297l9365j54527k83393K3901K9122p9506j67633
2064d24926R1518J18017J44629L1067j0581J62660P5510k3836o8813j46678O5612
2053A4179J40876j53349M7542M4498k05996r7209J24664O8180J5256m0569j82259
2042b24187K42550k8003L4568m1925j26416O366R4049J47965l2780P6603J5732
$$ y = [1009, -37838, 55928, 296772, 246475, 207110, 52583, -230810, -206909, -177787, -257293, -424926, -333408, -215391, -70762, -39695, -50276, 112384, 187894, 164058, 95245, -51433, 14179, 155055, 1706, 49248, 93746, -112250, -209459, -84795, -16615, -1359, -41928, -224187, 18363, -9640, 24928, -16997, -143413, -137047, -42998, 104967, 72187, 148790, 164522]
$$ [...]
##END NTUPLES=NMR SPECTRUM
##END=
