##TITLE=1H_TG-2370-0
 DMSO
 8 sc, 
 23.1.2023
##JCAMPDX= 6.0         $$ Bruker NMR JCAMP-DX V2.0
##DATA TYPE= NMR SPECTRUM
##DATA CLASS= NTUPLES
##ORIGIN= UXNMR, Bruker Analytische Messtechnik GmbH
##OWNER= root
$$ XWIN-NMR		Version 3.5
$$ Mon Jan 23 14:59:11 2023 Russian Standard Time (UT+4h)  she@DPX200
##.OBSERVE FREQUENCY= 200.13135
##.OBSERVE NUCLEUS= ^1H
##.ACQUISITION MODE= SIMULTANEOUS
##.ACQUISITION SCHEME= undefined
##.AVERAGES= 8
##.DIGITISER RES= 18
##SPECTROMETER/DATA SYSTEM= spect
##.PULSE SEQUENCE= zg30
##.SOLVENT NAME= DMSO
##.SHIFT REFERENCE= (INTERNAL, DMSO, 0, 15.7491)
##AUDIT TRAIL= $$ (NUMBER, WHEN, WHO, WHERE, WHAT)
$$ ##TITLE= Audit trail, XWIN-NMR		Version 3.5
$$ ##JCAMPDX= 5.01
$$ ##ORIGIN= Bruker BioSpin GmbH
$$ ##OWNER= she
$$ F:/spectra/data/she/nmr/H-F/1/pdata/1/auditp.txt
$$ ##AUDIT TRAIL=  $$ (NUMBER, WHEN, WHO, WHERE, WHAT)
(   1,<2023-01-23 14:57:58.90 +0400>,<she>,<DPX200>,
      <created by zg, POWCHK disabled, PULCHK disabled
       configuration hash MD5:
       00 E9 B6 7A A2 85 ED C7 34 08 36 98 17 FE 4E 26
       data hash MD5: 16K
       62 31 3C 58 74 6C 35 B8 B5 33 92 42 57 7C 93 66>)
(   2,<2023-01-23 14:58:01.32 +0400>,<she>,<DPX200>,
      <Start of raw data processing
       efp BC_mod = 2 LB = 0.24 FT_mod = 6 PKNL = 1 PHC0 = -19110.79 PHC1 = 10.20079 SI = 16K 
       data hash MD5: 16K
       E6 41 88 C3 97 95 07 39 AC 65 27 81 27 25 F1 AF>)
(   3,<2023-01-23 14:58:17.90 +0400>,<she>,<DPX200>,
      <pk PHC0 = -1.737041 PHC1 = 0 
       data hash MD5: 16K
       1E 2C 49 9C F8 20 47 A9 75 81 D1 1A 72 C1 B8 5E>)
(   4,<2023-01-23 14:58:21.37 +0400>,<she>,<DPX200>,
      <abs ABSG = 5 
       data hash MD5: 16K
       15 4A BC 23 31 39 B8 5D C1 AB F2 3B 2C 7A 44 B1>)
(   5,<2023-01-23 14:58:38.76 +0400>,<she>,<DPX200>,
      <abs ABSG = 5 
       data hash MD5: 16K
       D9 F5 1A 5E 37 17 39 F9 17 B9 06 14 89 DC DE 5D>)
$$ ##END=
$$ 
$$ hash MD5
$$ E7 A8 82 6C E5 CD D8 D4 A5 88 46 2C 00 4D 70 DA
##$RELAX= 
##$RELAX= 
##$RELAX= 
##$RELAX= 
##$RELAX= 
##$RELAX= 
$$ Bruker specific parameters
$$ --------------------------
##$DU= <F:/spectra>
##$EXPNO= 1
##$NAME= <H-F>
##$PROCNO= 1
##$TYPE= <nmr>
##$USER= <she>
##$AMP= (0..31)
100 100 100 100 100 100 100 100 100 100 100 100 100 100 100 100 100 100 
100 100 100 100 100 100 100 100 100 100 100 100 100 100 
##$AQSEQ= 0
##$AQ_mod= 1
##$AUNM= <au_zg>
##$AUTOPOS= <>
##$BF1= 200.13
##$BF2= 200.13
##$BF3= 200.13
##$BF4= 200.13
##$BF5= 200.13
##$BF6= 200.13
##$BF7= 200.13
##$BF8= 200.13
##$BYTORDA= 1
##$CFDGTYP= 0
##$CFRGTYP= 5
##$CHEMSTR= <none>
##$CNST= (0..31)
1 1 145 1 1 1 1 1 1 1 1 1 1 1 1 1 1 1 1 1 1 1 1 1 1 1 1 1 1 1 1 1 
##$CPDPRG= <>
##$CPDPRG1= <>
##$CPDPRG2= <>
##$CPDPRG3= <>
##$CPDPRG4= <mlev>
##$CPDPRG5= <mlev>
##$CPDPRG6= <mlev>
##$CPDPRG7= <mlev>
##$CPDPRG8= <mlev>
##$CPDPRGB= <>
##$CPDPRGT= <>
##$D= (0..31)
0 1.2 0 0 0 0 0 0 0 0.06 0 0.03 0 0 0 0 0.0002 0 0 0 0 0 0 0 0 0 0 0 0 
0 0 0 
##$DATE= 1674471478
##$DBL= (0..7)
$$ [...]
##$SUBNAM3= <"">
##$SUBNAM4= <"">
##$SUBNAM5= <"">
##$SUBNAM6= <"">
##$SUBNAM7= <"">
##$SUBNAM8= <"">
##$SUBNAM9= <"">
##$SW= 18.05172834244
##$SWIBOX= (0..15)
0 0 2 0 0 0 0 0 0 0 0 0 0 0 0 0 
##$SW_h= 3612.71676300578
##$TD= 16384
##$TD0= 1
##$TE= 0
##$TE2= 300
##$TE3= 300
##$TEG= 300
##$TL= (0..7)
0 120 120 120 120 120 120 120 
##$TP= (0..7)
150 150 150 150 150 150 150 150 
##$TP07= 0
##$TPNAME0= <>
##$TPNAME1= <>
##$TPNAME2= <>
##$TPNAME3= <>
##$TPNAME4= <>
##$TPNAME5= <>
##$TPNAME6= <>
##$TPNAME7= <>
##$TPOAL= (0..7)
0.5 0.5 0.5 0.5 0.5 0.5 0.5 0.5 
##$TPOFFS= (0..7)
0 0 0 0 0 0 0 0 
##$TUNHIN= 0
##$TUNHOUT= 0
##$TUNXOUT= 0
##$USERA1= <user>
##$USERA2= <user>
##$USERA3= <user>
##$USERA4= <user>
##$USERA5= <user>
##$V9= 5
##$VALIST= <valist>
##$VCLIST= <CCCCCCCCCCCCCCC>
##$VD= 0
##$VDLIST= <DDDDDDDDDDDDDDD>
##$VPLIST= <PPPPPPPPPPPPPPP>
##$VTLIST= <TTTTTTTTTTTTTTT>
##$WBST= 1024
##$WBSW= 4
##$XGAIN= (0..3)
0 0 0 0 
##$XL= 0
##$YL= 0
##$YMAX_a= 142616
##$YMIN_a= -259183
##$ZGOPTNS= <>
##$ZL1= 120
##$ZL2= 120
##$ZL3= 120
##$ZL4= 120
##$ABSF1= 15.74909
##$ABSF2= -2.302759
##$ABSG= 5
##$ABSL= 3
##$ALPHA= 0
##$AQORDER= 0
##$ASSFAC= 0
##$ASSFACI= 0
##$ASSFACX= 0
##$ASSWID= 0
##$AUNMP= <proc_1d>
##$AZFE= 0.1
##$AZFW= 0.1
##$BCFW= 0
##$BC_mod= 2
##$BYTORDP= 0
##$COROFFS= 0
##$CY= -3
##$DATMOD= 1
##$DC= 0
##$DFILT= <>
##$DTYPP= 0
##$F1P= 0
##$F2P= 0
##$FCOR= 1
##$FTSIZE= 16384
##$FT_mod= 6
##$GAMMA= 0
##$GB= 0
##$INTBC= 1
##$INTSCL= 3.70164e-10
##$ISEN= 128
##$LB= 0.24
##$LEV0= 0
##$LPBIN= 0
##$MAXI= 10000
##$MC2= 0
##$MEAN= 0
##$ME_mod= 0
##$MI= 1.114404
##$NCOEF= 0
##$NC_proc= -8
##$NLEV= 6
##$NOISF1= 3.799351
##$NOISF2= 2.8
##$NSP= 0
##$NTH_PI= 0
##$NZP= 0
##$OFFSET= 15.74909
##$PC= 1
##$PHC0= -19112.53
##$PHC1= 10.20079
##$PH_mod= 1
##$PKNL= yes
##$PPARMOD= 0
##$PSCAL= 0
##$PSIGN= 0
##$REVERSE= no
##$SF= 200.130004493116
##$SI= 16384
##$SIGF1= 3
##$SIGF2= 2
##$SINO= 5.538805
##$SIOLD= 16384
##$SREGLST= <1H.CDCl3>
##$SSB= 0
##$STSI= 16384
##$STSR= 0
##$SW_p= 3612.71676300578
##$SYMM= 0
##$S_DEV= 0
##$TDeff= 16384
##$TDoff= 0
##$TI= <>
##$TILT= no
##$TM1= 0
##$TM2= 0
##$TOPLEV= 0
##$USERP1= <user>
##$USERP2= <user>
##$USERP3= <user>
##$USERP4= <user>
##$USERP5= <user>
##$WDW= 1
##$XDIM= 16384
##$YMAX_p= 280913885
##$YMIN_p= -2924532
$$ End of Bruker specific parameters
$$ ---------------------------------
##NTUPLES= NMR SPECTRUM
##VAR_NAME=  FREQUENCY,     SPECTRUM/REAL,   SPECTRUM/IMAG
##SYMBOL=    X,             R,               I
##VAR_TYPE=  INDEPENDENT,   DEPENDENT,       DEPENDENT
##VAR_FORM=  AFFN,          ASDF,            ASDF
##VAR_DIM=   16384,         16384,           16384
##UNITS=     HZ,            ARBITRARY UNITS, ARBITRARY UNITS
##FACTOR=    0.220516191357247, 1,           1
##FIRST=     3151.86549142823, 0,            0
##LAST=      -460.85127157755, 0,            0
##MIN=       -460.85127157755, -2924532,     0
##MAX=       3151.86549142823, 280913885,    0
$$ Real data points
##PAGE= N=1
##DATA TABLE= (X++(R..R)), XYDATA
$$ [...]
6262C349105J66998k73329j49522j65962J85264J78087J58540q0991L66814J20340
$$ 3349105 3516103 3242774 3093252 2927290 3112554 3290641 3449181 3368190 3735004 3855344
6252C855344R9315N4467m22490K15168m17688j85088K29654j25778M68668Q3384
$$ 3855344 3954659 4009126 3586636 3801804 3384116 3199028 3428682 3302904 3771572 3854956
6242C854956k23710N84992J09290L63827l69019o77461J00571L04247K18483m19726
$$ 3854956 3631246 4216238 4325528 4689355 4320336 3642875 3743446 4047693 4266176 3846450
6232C846450N20821J3286p5818k56873Q2722m18555n31518M36571Q24415n40555
$$ 3846450 4367271 4380557 4304739 4047866 4130588 3712033 3180515 3617086 4441501 3900946
6222C900946J73529O00010j46899R958k03631l93079O28784J64292J03944j92774
$$ 3900946 4074475 4674485 4527586 4537544 4333913 3940834 4569618 4733910 4837854 4645080
6212D645080k64152l04926L78177N25339n23984L22240k47115J44323k06401l60679
$$ 4645080 4380928 4076002 4454179 4979518 4455534 4777774 4530659 4674982 4468581 4107902
6202D107902M49948N61353k32979Q7102L2238K78311o74250j81938J96690K85453
$$ 4107902 4557850 5119203 4886224 4973326 5005564 5283875 4609625 4427687 4624377 4909830
6192D909830r4550l37918M7879j10477K3882L01798N54022j51661l17085J97094
$$ 4909830 4815280 4477362 4525241 4414764 4438646 4740444 5294466 5142805 4825720 5022814
6182E022814n97845p2869o5906J12155O10530l2080J57461J6228l59047L47787
$$ 5022814 4424969 4352100 4286194 4398349 5008879 4976799 5134260 5150488 4791441 5139228
6172E139228K24151L96652j188838K00727K24203L92669J24993K94804k77387
$$ 5139228 5363379 5760031 4571193 4771920 4996123 5388792 5513785 5808589 5531202
6163E531202o70265L66299Q2649L41700M6228J46558j17020p32299N02167L16950
$$ 5531202 4860937 5227236 5309885 5651585 5697813 5844371 5727351 4995052 5497219 5814169
6153E814169m17236k37418N67059J11478p82938j6704K28811j05454m95620M25083
$$ 5814169 5396933 5159515 5726574 5838052 5055114 5038410 5267221 5161767 4666147 5091230
6143E091230n17871P6297P9908R0769J47223J08955k81654o92083K60669P5821
$$ 5091230 4573359 4649656 4729564 4820333 4967556 5076511 4794857 4102774 4363443 4439264
6133D439264J272N17760K54055m7037J21464K893N22l99779r520Q7387J65760
$$ 4439264 4440536 4958296 5212351 5165314 5286778 5289671 5290193 4890414 4880894 4968281 5134041
6122E134041K87084n50953L49079l63302j1157J1072n35408K14461P29424K17065
$$ 5134041 5421125 4870172 5219251 4855949 4844792 4855864 4320456 4534917 5264341 5481406
6112E481406m98985k37795J87928o6022J15495l54293l73616P09511J38836n67879
$$ 5481406 4982421 4744626 4932554 4866532 4982027 4627734 4254118 4963629 5102465 4534586
6102D534586k20962K12439P03623n06951m62248j28540K0864J0627M76813N66128
$$ 4534586 4313624 4526063 5229686 4722735 4260487 4131947 4152811 4163438 4640251 5206379
6092E206379l80529L47025K6256m41716N7079j22246M36368j83823o16007l79426
$$ 5206379 4825850 5172875 5199131 4757415 4814494 4692248 5128616 4944793 4328786 3949360
6082C949360L8844L07649J30241J06933N86076J00155J6258L03920l02176j27318
$$ 3949360 3988204 4295853 4426094 4533027 5119103 5219258 5235516 5539436 5237260 5109942
6072E109942J70266j75489K60276j04770o55389J06118L55297J44833m1823n7897
$$ 5109942 5280208 5104719 5364995 5260225 4604836 4710954 5066251 5211084 5169261 5111364
6062E111364K97208O0876m49633J44570j36637n5280K96137K32636o69659r7330
$$ 5111364 5408572 5469448 5019815 5164385 5027748 4972468 5268605 5501241 4831582 4734252
6052D734252K98465N5827L4476Q08433M38637r32622n01970N39095K24138j52403
$$ 4734252 5032717 5088544 5123020 5931453 6370090 5437468 4935498 5474593 5698731 5546328
6042E546328J20865n53906L79678N78411q6456j5885P1749j36610O7107n35898
$$ 5546328 5667193 5113287 5492965 6071376 5984920 5969035 6040784 5904174 5971281 5435383
6032E435383n2537l1033J88766q3696P4802O14964n0191p7417l17998j98170J11918
$$ 5435383 5382846 5351813 5540579 5456883 5531685 6146649 6096458 6019041 5701043 5502873 5614791
6021E614791J83449n70631J75172K48074L36693k96696j06912L07274k77542J51557
$$ 5614791 5798240 5227609 5402781 5650855 5987548 5690852 5583940 5891214 5613672 5765229
6011E765229P12946j85800j10512r2781N4674l33550K84952K68226l21658J29122
$$ 5765229 6478175 6292375 6181863 6089082 6143756 5810206 6095158 6363384 6041726 6170848
6001F170848o4699K5932k09228l42314j20013N43050M65165K34219m00895J47851
$$ 6170848 6106149 6132081 5922853 5580539 5460526 6003576 6468741 6702960 6302065 6449916
5991F449916m33903k89110q8097K87063J84617P23508j28161J67624k13443K10216
$$ 6449916 6016013 5726903 5638806 5925869 6110486 6833994 6705833 6873457 6660014 6870230
5981F870230J081867m51747k63217n45947N5178k22682j22681N94819l0531L009
$$ 6870230 7952097 7500350 7237133 6691186 6746364 6523682 6401001 6995820 6965289 6968298
5971F968298M49294p34474M01560k14701L77575j19870k60961M636K32675M37760
$$ 6968298 7417592 6683118 7084678 6869977 7247552 7127682 6866721 6871357 7104032 7541792
5961G541792L8130J67739n6228L7167j58399j3684l13085o9568L11830j19780
$$ 7541792 7579922 7747661 7691433 7728600 7570201 7556517 7243432 7173864 7485694 7365914
5951G365914O82379l65350k85328M23089J75137K44995K37960j63544k24364R0972
$$ 7365914 8048293 7682943 7397615 7820704 7995841 8240836 8478796 8315252 8090888 8181860
5941H181860K67588q1755j48968l20076K7986L15915o8360J07700J04356N10140
$$ 8181860 8449448 8367693 8218725 7898649 7926635 8242550 8174190 8281890 8386246 8896386
5931H896386r9806m78797j67511P67030L04021K9924L0173l85735M2677o0415
$$ 8896386 8796580 8317783 8150272 8917302 9221323 9251247 9281420 8895685 8938362 8877947
5921H877947j27942K9770K02058L03689k37804M80281q1464J6895k52009k11475
$$ 8877947 8750005 8779775 8981833 9285522 9047718 9527999 9446535 9463430 9211421 8999946
5911H999946L24581j48719O3238K18824k63991k2879J05013N141K32317J93031
$$ 8999946 9324527 9175808 9239046 9457870 9193879 9171000 9276013 9281154 9513471 9706502
5901I706502L97324n04574m58586K96800K57432m605l93014N91554N22269p164
$$ 9706502 10103826 9599252 9140666 9437466 9694898 9690293 9297279 9888833 10411102 10403938
5891A0403938j52800L24941j36500L8408L02063q1770J57945J12632K8625J934
$$ 10403938 10251138 10576079 10439579 10477987 10780050 10698280 10856225 10968857 10997482 10999416
5881A0999416K6786j58876Q3580M76086k33788L87837O25441J70304M62100q0717
$$ 10999416 11026202 10867326 10950906 11426992 11193204 11581041 12206482 12376786 12838886 12758169
5871A2758169j69380M28392j32694o9130P5323L12608L70219p4693k4013N50957
$$ 12758169 12588789 13017181 12884487 12815357 12890680 13203288 13573507 13498814 13474801 14025758
5861A4025758J83374k84718J10419P73785L57017K97343L38178L53233M04433
$$ 14025758 14209132 13924414 14034833 14808618 15165635 15462978 15801156 16154389 16558822
5852A6558822J42835l41604P15991O57995l28547O83343J2316l53221J12775J42555
$$ 16558822 16701657 16360053 17076044 17734039 17405492 18088835 18101151 17747930 17860705 18003260
5842A8003260j22138q0924p87189N26213k3824J7192L08400l19405K42637K78796
$$ 18003260 17881122 17800198 17013009 17539222 17515398 17532590 17840990 17521585 17764222 18043018
5832A8043018L45206K29736N12931J71179K72508k9684J51226N14402J15210K18785
$$ 18043018 18388224 18617960 19130891 19302070 19574578 19544894 19696120 20210522 20325732 20544517
5822B0544517M27696R9359P13559M15175K16982J44872Q5422n0540m52831p70562
$$ 20544517 20972213 21071572 21785131 22200306 22417288 22562160 22647582 22597042 22144211 21373649
5812B1373649o77552j30001k30372N6824J98271j38464n97897J64120j77719J79258
$$ 21373649 20696097 20566096 20335724 20392548 20590819 20452355 19854458 20018578 19840859 20020117
5802B0020117l04927m82961l75651K55269J38815N06001n47921L49300O52848
$$ 20020117 19715190 19232229 18856578 19111847 19250662 19756663 19208742 19558042 20210890
5793B0210890k03906k675J79174N35009N17422k49735p47338k4879o13001m08241
$$ 20210890 20006984 20004309 20183483 20718492 21235914 20986179 20238841 20213962 19600961 19192720
5783A9192720Q6366j55836n17326j59840J89812K02782o52814l54293K01496L3827
$$ 19192720 19279086 19123250 18605924 18446084 18635896 18838678 18185864 17831571 18033067 18066894
5773A8066894j63614k54976k89291L40829k36533l26058K25491k76971k31708
$$ 18066894 17903280 17648304 17359013 17699842 17463309 17137251 17362742 17085771 16854063
5764A6854063Q4400R2920l54113j9151L58239j21323l35073l62146j78615P44682
$$ 16854063 16938463 17031383 16677270 16658119 17016358 16895035 16559962 16197816 16019201 16763883
5754A6763883o34816O4291L40593l07011m6032r41669j2816K8564L19576J26254
$$ 16763883 16129067 16193358 16533951 16226940 16180908 15239239 15226423 15254987 15574563 15700817
5744A5700817L33839m81159k38068M89708r3096j41081R6236q72013Q41560K24102
$$ 15700817 16034656 15553497 15315429 15805137 15712041 15570960 15667196 14795183 15636743 15860845
5734A5860845m27728L55151k38202q9757P8609J73939J17354j95141m095N58847
$$ 15860845 15433117 15788268 15550066 15460309 15538918 15712857 15830211 15635070 15630975 16189822
5724A6189822J01259L4942k03561m31647J48118q6119j16566O24868N06364L13297
$$ 16189822 16291081 16326023 16122462 15690815 15838933 15752814 15636248 16261116 16767480 17080777
5714A7080777J55272j64428m93863l06394L45188m6505l26406L97352N13705M01687
$$ 17080777 17236049 17071621 16577758 16271364 16616552 16570047 16243641 16640993 17154698 17556385
5704A7556385k1711k72841j416Q24925n07521k38751N92680k68644j33144L27863
$$ 17556385 17534674 17261833 17260417 18085342 17577821 17339070 17931750 17663106 17529962 17857825
5694A7857825O2932K62776K38401L2979l69250m6970M88254L13683k59068j42016
$$ 17857825 17920757 18183533 18421934 18454913 18085663 18038693 18526947 18840630 18581562 18439546
5684A8439546J33654N79543J25435N5713l48276L41423j98373M6215J27687L27903
$$ 18439546 18573200 19152743 19278178 19333891 18985615 19327038 19128665 19174880 19302567 19630470
5674A9630470M70773J28934j15264k62744R642k44619L11788K34163K17059Q4589
$$ 19630470 20101243 20230177 20114913 19852169 19861811 19617192 19928980 20163143 20380202 20464791
5664B0464791l45791j16130M01759J48165K07782L84565N35626k2753l65034K03481
$$ 20464791 20119000 20002870 20404629 20552794 20760576 21145141 21680767 21658014 21292980 21496461
5654B1496461M56460m54512R3670O24401L23695l92152K50607L00128J54697L22142
$$ 21496461 21952921 21498409 21592079 22216480 22540175 22148023 22398630 22698758 22853455 23175597
5644B3175597J9004J1471N43927o9891o1104N51384M4184O00471J67231j73251
$$ 23175597 23194601 23206072 23749999 23680108 23619004 24170388 24214572 24815043 24982274 24809023
5634B4809023N7025k36059R1393L73020J22627K60667L25023m9382L691j36188
$$ 24809023 24866048 24629989 24721382 25094402 25217029 25477696 25802719 25753337 25757028 25620840
5624B5620840J02924M26157O38156k11322L78972K11007J08121p7162q6491j43715
$$ 25620840 25723764 26149921 26788077 26576755 26955727 27166734 27274855 27197693 27111202 26967487
5614B6967487O10003K96113k15171q116Q1195K07997O17470R02930k72990l10412
$$ 26967487 27577490 27873603 27658432 27650316 27731511 27939508 28556978 29459908 29186918 28876506
5604B8876506K33162L64153O81634k3570K20880O92178p87431K35325O33792L40704
$$ 28876506 29109668 29473821 30155455 30131885 30352765 31044943 30257512 30492837 31126629 31467333
5594C1467333L87161n5116j88869K17642M08250J74415M61691N1708K78368N82601
$$ 31467333 31854494 31799378 31610509 31828151 32236401 32410816 32872507 32924215 33202583 33785184
5584C3785184L72081K30963K45320O61859k16541M4180J51023j90597J18293P39435
$$ 33785184 34157265 34388228 34633548 35295407 35078866 35123046 35274069 35083472 35201765 35941200
5574C5941200q9000m3012J022978O68597L39467R4002J35721O7082M54270J180547
$$ 35941200 35852200 35809188 36832166 37500763 37840230 37934232 38069953 38137035 38591305 39771852
5564C9771852M14667l92309k91497L05568N21186J56871O64085K70575M09239
$$ 39771852 40186519 39794210 39502713 39808281 40329467 40486338 41150423 41420998 41830237
5555D1830237K95286K87887j49143j39579O73389N87557J19213L39851N23453
$$ 41830237 42125523 42413410 42264267 42124688 42798077 43385634 43504847 43844698 44368151
5546D4368151N11241N98938r1639O1310Q21658L25564N83488K59104J62234O96079
$$ 44368151 44879392 45478330 45386691 45448001 46269659 46595223 47178711 47437815 47600049 48296128
5536D8296128M65561M78587O1729L91565O04713O05683N5868N09901K44491K1608
$$ 48296128 48761689 49240276 49302005 49693570 50298283 50903966 50959834 51469735 51714226 51735834
5526E1735834Q78074O67854r2013O17840R42883K20972M41707R47358L4464L60591
$$ 51735834 52613908 53281762 53189749 53807589 54750472 54971444 55413151 56360509 56394973 56755564
5516E6755564O73166Q20626N9793M32073O07287L51591R19140Q44138M98005n2092
$$ 56755564 57428730 58249356 58309149 58741222 59348509 59700100 60619240 61463378 61961383 61909291
5506F1909291L64021J025380J088496O35412m66321P41372O98938P52758L12945
$$ 61909291 62273312 63298692 64387188 65022600 64556279 65297651 65996589 66749347 67062292
5497F7062292M40101Q30268M18204N62927L87317Q11960P95594Q86118P44946
$$ 67062292 67502393 68332661 68750865 69313792 69701109 70513069 71308663 72194781 72939727
5488G2939727M79857R24468J000269M88903K92594P97539Q82048J015969J81943
$$ 72939727 73419584 74344052 75344321 75833224 76125818 76923357 77805405 78821374 79003317
5479G9003317N26828J379954R67775K91433P19391J813297L10834M32550J238287
$$ 79003317 79530145 80910099 81877874 82169307 82888698 84701995 85012829 85445379 86683666
5470H6683666Q03404M90352Q54812Q17863N60927R28992Q32446J080698Q37271
$$ 86683666 87487070 87977422 88832234 89650097 90211024 91140016 91972462 93053160 93890431
5461I3890431J090006J166178N03439J108098J040937J010118O01572J122987
$$ 93890431 94980437 96146615 96650054 97758152 98799089 99809207 100410779 101533766
5453A01533766J057898J501506J714003J100100R89797P54786N38519J744686
$$ 101533766 102591664 104093170 105807173 106907273 107897070 108651856 109190375 110935061
5445A10935061J588434J066323R07475J423839R48664Q88066J404579Q25893J049669
$$ 110935061 112523495 113589818 114497293 115921132 116869796 117757862 119162441 119988334 121038003
5436A21038003O61085J211011J253642O94044J306543R57973J116984J867659
$$ 121038003 121699088 122910099 124163741 124857785 126164328 127122301 128239285 130106944
5428A30106944K017041R36024R10460J589158J140957O55918Q15126P88355J967847
$$ 130106944 132123985 133060009 133970469 135559627 136700584 137356502 138171628 138959983 140927830
5419A40927830P14635O76613J047057Q47493P23128J464754J167167O06475Q98587
$$ 140927830 141642465 142319078 143366135 144213628 144936756 146401510 147568677 148175152 149073739
5410A49073739J569034J593707J057688J513009J609975J161875P60109J113438
$$ 149073739 150642773 152236480 153294168 154807177 156417152 157579027 158339136 159452574
5402A59452574K229350J217939M95637J374755J468234R89066J591727J448286
$$ 159452574 161681924 162899863 163395500 164770255 166238489 167227555 168819282 170267568
5394A70267568J291919J611971Q13586J186924P35337J015859J395499J141069
$$ 170267568 171559487 173171458 173985044 175171968 175907305 176923164 178318663 179459732
5386A79459732N79594M42841K71465L36464j01000Q77899J60810J99168k44140
$$ 179459732 180039326 180482167 180753632 181090096 180989096 181866995 182027805 182226973 181982833
5377A81982833O11502P03487L23744K86500j11058l15420M49448L70389j37688
$$ 181982833 182594335 183297822 183621566 183908066 183797008 183481588 183931036 184301425 184163737
5368A84163737K65543J47637m2681M06456M1048k598j22504L80613m00866J94
$$ 184163737 184429280 184576917 184534236 184940692 184981740 184979142 184856638 185237251 184836385 184836579
5358A84836579K92871q1390P8021l08784n17761m67049K39268k15604N40538l42462
$$ 184836579 185129450 185048060 185126081 184817297 184299536 183832487 184071755 183856151 184396689 184054227
5348A84054227o46176j02791q3306n5066j72985l49874n29575o91727m01481r24335
$$ 184054227 183408051 183305260 183221954 183166888 182993903 182644029 182114454 181422727 181021246 180096911
5338A80096911n53713p38425l59809n88405p93722k79142p36362p72421q23444
$$ 180096911 179543198 178804773 178444964 177856559 177062837 176783695 176047333 175274912 174451468
5329A74451468j044923n99614q41351q35047o61697m68660r65832o61362p42818
$$ 174451468 173406545 172806931 171965580 171130533 170468836 170000176 169034344 168372982 167630164
5320A67630164k41685q25568j157284p77821j739592q95393r40999p20362j031481
$$ 167630164 167388479 166562911 165405627 164627806 162888214 161992821 161051822 160331460 159299979
5311A59299979m45688j201604j190522r42689j147643j224012j077570j421138
$$ 159299979 158854291 157652687 156462165 155519476 154371833 153147821 152070251 150649113
5303A50649113j062044p03034j288233m30608j061437j367489j189668j144903
$$ 150649113 149587069 148884035 147595802 147165194 146103757 144736268 143546600 142401697
5295A42401697n64938r93194j149475q35013j408641j456596j030810o92180o94167
$$ 142401697 141836759 140843565 139694090 138859077 137450436 135993840 134963030 134270850 133576683
5286A33576683j521201p47114r43058j568301j451243q36393q99672k55682q39467
$$ 133576683 132055482 131308368 130365310 128797009 127345766 126509373 125609701 125354019 124514552
5277A24514552j207774m72683o77375r37067j581108j124744j686819p61496o28478
$$ 124514552 123306778 122834095 122156720 121219653 119638545 118513801 116826982 116065486 115437008
5268A15437008j684730j270080n59863r71327r19185j353736j135604j304524
$$ 115437008 113752278 112482198 111922335 110951008 110031823 108678087 107542483 106237959
5260A06237959q94659o92978j610545p38418q08796p84611p03753p43674q38421
$$ 106237959 105343300 104650322 103039777 102301359 101492563 100707952 100004199 99260525 98422104
5251I8422104j443367j628002m77213n99070o29907o76880j631362p68381p07934
$$ 98422104 96978737 95350735 94873522 94274452 93644545 92967665 91336303 90567922 89859988
5242H9859988j224456o56022j067321j036389p80187k81527o90215j725716n35384
$$ 89859988 88635532 87979510 86912189 85875800 85095613 84814086 84123871 82398155 81862771
5233H1862771j195998p33585p28206q26496n40565j50441j211439o54789l00185
$$ 81862771 80666773 79933188 79204982 78378486 77837921 77687480 76476041 75821252 75521067
5224G5521067j222441q52208m11068r06935n45369p06694r00824l84204q54821
$$ 75521067 74298626 73446418 73035350 72128415 71583046 70876352 69975528 69591324 68736503
5215F8736503r62456p52893m76068p42976n50966l84016q1204n80177q83502q62298
$$ 68736503 67774047 67021154 66545086 65802110 65251144 64867128 64785924 64205747 63322245 62459947
5205F2459947k96671l16397p25911p02156k65029r40938m79163o56408m05024
$$ 62459947 62163276 61846879 61120968 60418812 60153783 59212845 58733682 58077274 57672250
5196E7672250m70671l80651r75675p87434m39143k93240m92664o40052q07690
$$ 57672250 57201579 56820928 55845253 55057819 54618676 54325436 53832772 53192720 52385030
5187E2385030k55818k43824m72630l47276l01110n7107n90793q09644m30875k16580
$$ 52385030 52129212 51885388 51412758 51065482 50764372 50707265 50116472 49306828 48875953 48659373
5177D8659373o15224n96951j02103m78928p43218j58096k46098n09334m73980
$$ 48659373 48044149 47447198 47345095 46866167 46122949 45964853 45718755 45209421 44735441
5168D4735441J35309O8897n49976r82184j04715m77568o71738o61441M3852m02397
$$ 44735441 44870750 44939647 44389671 43407487 43302772 42825204 42153466 41492025 41535877 41133480
5158D1133480K71377j97914p90332l23875j92102k33337L20502n94963r63947
$$ 41133480 41404857 41206943 40416611 40092736 39900634 39667297 39987799 39392836 38428889
5149C8428889m32693o60425K39651l42501m00160l55727L12500m11722n00980
$$ 38428889 37996196 37335771 37575422 37232921 36832761 36477034 36789534 36377812 35876832
5140C5876832L81816j25019j039744o32890K19431j85344K51291q67529m31449
$$ 35876832 36258648 36133629 35093885 34460995 34680426 34495082 34746373 33878844 33447395
5131C3447395n03608k6519q0107j66724n44958o55457R718M21445p9022l28947
$$ 33447395 32943787 32917268 32837161 32670437 32125479 31470022 31479740 31901185 31822163 31493216
5121C1493216n14552J22978n8923k28786j1257k34945j69661o54256k642p33995
$$ 31493216 30978664 31101642 31042719 30813933 30802676 30567731 30398070 29743814 29741172 29007177
5111B9007177j50857j86364k93906M91932m01231j8968k12825k09884K21627o11747
$$ 29007177 28856320 28669956 28376050 28867982 28466751 28447783 28234958 28025074 28246701 27634954
5101B7634954r7740L6160l6474o02400M25783r6178m56326k20418l87253q096
$$ 27634954 27537214 27573374 27536900 26934500 27360283 27264105 26807779 26587361 26200108 26192012
5091B6192012Q6275m54997j18315J84370j09364j1774k89604k33362j12861q47700
$$ 26192012 26278287 25823290 25704975 25889345 25779981 25768207 25478603 25245241 25132380 24284680
5081B4284680l61194K31122J21398j17670O26336N47930q15285n58630o1935m68305
$$ 24284680 23923486 24154608 24276006 24158336 24784672 25332602 24517317 23958687 23896752 23428447
5071B3428447N86069k9676n68944j41169l98688p3147K10586K18097N4056l73125
$$ 23428447 24014516 23984840 23415896 23274727 22876039 22802892 23013478 23231575 23285631 22912506
5061B2912506q1255Q3987J87318n29232l89298l86426Q5830R0296j6899J37789
$$ 22912506 22831251 22915238 23102556 22573324 22184026 21797600 21883430 21973726 21956827 22094616
5051B2094616K19780l55770k30899L35439j8965K11522j61715N9122l88662p42552
$$ 22094616 22314396 21958626 21727727 22063166 22044201 22255723 22094008 22153130 21764468 21021916
5041B1021916j12735N49089J43707k97799M30080N06591j30502k49735J77902
$$ 21021916 20909181 21458270 21601977 21304178 21734258 22240849 22110347 21860612 22038514
5032B2038514L03104Q0414j89390K24635J45671K20361Q2801K14106k02104J28040
$$ 22038514 22341618 22422032 22232642 22457277 22602948 22823309 22906110 23120216 22918112 23046152
5022B3046152L71057L76148P38447J78876L36268M00055M04974M24226Q7587Q26638
$$ 23046152 23417209 23793357 24531804 24710680 25046948 25447003 25851977 26276203 26363790 27190428
5012B7190428K70889N56884O00021M19185L76755r6501N01832K0685N05347J8733
$$ 27190428 27461317 28018201 28618222 29037407 29414162 29317661 29819493 29840178 30345525 30364258
5002C0364258O67243K48526N76315L59500J3418l9134N42819k95960l39478J90947
$$ 30364258 31031501 31280027 31856342 32215842 32229260 32190126 32732945 32436985 32097507 32288454
4992C2288454J32402N51595P80916N70819M23871K21961L54714J047223R78958
$$ 32288454 32420856 32972451 33753367 34324186 34748057 34970018 35324732 36371955 37350913
4983C7350913L63558N65360K33316P47168J22068L10258K8882J36240k33000L10209
$$ 37350913 37714471 38279831 38513147 39260315 39382383 39692641 39721523 39857763 39624763 39934972
4973C9934972L2423o14738p08133k75524n98299o21130j014346p39345n94873
$$ 39934972 39967395 39352657 38644524 38369000 37770701 37149571 36135225 35395880 34801007
4964C4801007o55063K30101l38002J51718m07701q52838p14631m24647k33171
$$ 34801007 34145944 34376045 34038043 34189761 33782060 32929222 32214591 31789944 31556773
4955C1556773j15108j43128k75666j54719K57876R3375J43122q38663m05870r92112
$$ 31556773 31441665 31298537 31022871 30868152 31126028 31219403 31362525 30523862 30117992 29125880
4945B9125880m75371l31675l71634o81758p44426q69990n46892m43185r82322
$$ 29125880 28650509 28318834 27947200 27265442 26521016 25651026 25104134 24660949 23678627
4936B3678627q24151o98409q01219K21867m61297o05408p62084p07092n06288
$$ 23678627 22854476 22156067 21354848 21576715 21115418 20510010 19747926 19040834 18534546
4927A8534546p76118n27038k44492l52488l43174J64585j06522m3078n93967N962
$$ 18534546 17758428 17231390 16986898 16634410 16291236 16455821 16349299 16306221 15712254 15718216
4917A5718216l22359l68664j010282j5729Q30421L08743j046256k90603J81992
$$ 15718216 15395857 15027193 14016911 14001182 14831603 15140346 14094090 13803487 13985479
4908A3985479P2659j42457o70038k48819L5521L79662k95517k65912L29308K29113
$$ 13985479 14058138 13915681 13245643 12996824 13032345 13412007 13116490 12850578 13179886 13408999
4898A3408999l46977m35040k91366O37979n41825j68399O653m21712k05727N683
$$ 13408999 13062022 12626982 12335616 12973595 12431770 12263371 12270024 11848312 11642585 11648268
4888A1648268j33559J21580L17461j44197j8437k41493P1295K66067j95975J00308
$$ 11648268 11514709 11636289 11953750 11809553 11791116 11549623 11620918 11886985 11691010 11791318
4878A1791318j36134J88280j92710L40493m16388k0274j80914j63435k07332k35271
$$ 11791318 11655184 11843464 11650754 11991247 11574859 11554585 11373671 11210236 11002904 10767633
4868A0767633L04152J77520r3920L1203K66387R4888J60442m11906m79136m09963
$$ 10767633 11071785 11249305 11155385 11186588 11452975 11547863 11708305 11296399 10817263 10407300
4858A0407300J79355P22006N16597M7035J34740l95531J82606L38262j42447k65412
$$ 10407300 10586655 11308661 11825258 11872293 12007033 11611502 11794108 12132370 11989923 11724511
4848A1724511J60567J5525N1653j38383l1132L79187M80930L21138j70415K37108
$$ 11724511 11885078 11900603 11952256 11813873 11782741 12161928 12642858 12963996 12793581 13030689
4838A3030689N5868L08151n4189J77232J34647k09141N90394L76739J74013K31122
$$ 13030689 13086557 13394708 13340519 13517751 13652398 13443257 14033651 14410390 14584403 14815525
4828A4815525N93672l88989N09391M19095O4577R97604K00659J9119R32910Q83561
$$ 14815525 15409197 15020208 15529599 15948694 16013271 17010875 17211534 17230653 18163563 19047124
4818A9047124Q18703Q95623Q52168Q53129O57402Q99490M25752J08527N99628
$$ 19047124 19865827 20761450 21613618 22466747 23124149 24023639 24449391 24557918 25157546
4809B5157546Q31674M15230k49791r5339l36706N30466p9402J6549L38049J58024
$$ 25157546 25989220 26404450 26154659 26059320 25722614 26253080 26173678 26190227 26528276 26686300
4799B6686300K03260M1466J82834L83956J84702k80649L74843P38048L65495Q20120
$$ 26686300 26889560 26931026 27113860 27497816 27682518 27401869 27776712 28514760 28880255 29700375
4789B9700375J474970L26807N08061J02731L50737P29034R11454K10604l605K20103
$$ 29700375 31175345 31502152 32010213 32112944 32463681 33192715 34104169 34314773 34311168 34531271
4779C4531271n61928L68298j69277l04310j009290p99267l43940p04045q95979
$$ 34531271 33969343 34337641 34168364 33864054 32854764 32055497 31711557 31007512 30111533
4770C0111533j74684l31035q94607j009452l90895n41258k34629k65571n95154
$$ 30111533 29936849 29605814 28711207 27701755 27310860 26769602 26534973 26269402 25674248
4761B5674248J12715n1894k67187o11307l29787k90844q00918k32321M82020o0574
$$ 25674248 25786963 25735069 25467882 24856575 24526788 24235944 23435026 23202705 23684725 23624151
4751B3624151m54999k95364m90581j023386p33335l27085k14609n48261k97259
$$ 23624151 23169152 22873788 22383207 21359821 20626486 20299401 20084792 19536531 19239272
4742A9239272j061181l38041m04746n99942q49211n61442m1285n12911l71899
$$ 19239272 18178091 17840050 17435304 16835362 15986151 15424709 15383424 14870513 14498614
4733A4498614j08541o43878l11553L0968k41853o09203J76639j46249m77241l29357
$$ 14498614 14390073 13746195 13434642 13465610 13223757 12614554 12791193 12644944 12167703 11838346
4723A1838346o72099l99845m10649K1718N29610J64347j1175m5229q50542m6355
$$ 11838346 11166247 10766402 10355753 10377471 10907081 11071428 11060253 11015024 10164482 10118127
4713A0118127l51968K99368n5274l24023j38807K80971j41177k30754j92560J22263
$$ 10118127 9766159 10065527 10010253 9686230 9547423 9828394 9687217 9456463 9263903 9386166
4703I386166O1468m58321k471P8849r873j01507o63816k75613J88975L9231L24126
$$ 9386166 9447634 8989313 8986842 9065691 9055818 8954311 8290495 8014882 8203857 8243088 8567214
4692H567214o2426M43272l7596j21384m23117M0453K20883j10157J24620p7048
$$ 8567214 8504788 8948060 8910464 8789080 8365963 8406416 8627299 8517142 8641762 8564714
4682H564714k09870k43950m98086K07173R8557k02968K2611J40996j12700j08047
$$ 8564714 8354844 8110894 7612808 7819981 7918538 7715570 7738181 7879177 7766477 7658430
4672G658430r1826j31849k93641j54680J2061O4678j13827L5499M96117R3449
$$ 7658430 7566604 7434755 7141114 6986434 6998495 7063173 6949346 6984845 7480962 7574411
4662G574411q50777J22729o8059o0086R5568l91397l05340L28910j49035J39435
$$ 7574411 6723634 6846363 6778304 6718218 6813786 6422389 6117049 6445959 6296924 6436359
4652F436359J84858j43054n1154n44341O94010k6199n699l69851o067l7270J26464
$$ 6436359 6621217 6478163 6427009 5882668 6576678 6550479 6544780 6174929 6168862 6131592 6258056
4641F258056L3767m56351K2226O91245O2536k71247l39195J31817K67362R6404
$$ 6258056 6291823 5835472 5857698 6548943 6611479 6340232 6001037 6132854 6400216 6496620
4631F496620J13006k34771K22134J89163j16892R6006k46292L7274M0403J09703
$$ 6496620 6609626 6374855 6596989 6786152 6669260 6765266 6518974 6556248 6596651 6706354
4621F706354M07003o46201P8763L84762M1954K14157L1140q9870m34573K12850
$$ 6706354 7113357 6467156 6545919 6930681 6972635 7186792 7217932 7128062 6693489 6906339
4611F906339O42078M221o52823K67146L58915M2702m89634l20352L41902J40406
$$ 6906339 7548417 7552638 6899815 7166961 7525876 7568578 7078944 6758592 7100494 7240900
4601G240900J8731K61782L19214n29326O7203o27266j96477o36027j52716J30974
$$ 7240900 7259631 7521413 7840627 7311301 7378504 6751238 6554761 5918734 5766018 5896992
4591E896992M05441N44234m24899J81714l1779j83843j61018p75N7562l07386
$$ 5896992 6302433 6846667 6421768 6603482 6571703 6387860 6226842 6226067 6283629 5976243
4581E976243k430L86970m74036K95545M24612j47914M5402m83974l45574M91273
$$ 5976243 5973813 6360783 5886747 6182292 6606904 6458990 6504392 6020418 5674844 6166117
4571F166117j15960O0016J18322J46741m48187j11731L32862n173L55937k25383
$$ 6166117 6050157 6110173 6228495 6375236 5927049 5815318 6148180 6143007 6498944 6273561
4561F273561m29465n91858P69348j59934j76383N14643J24993R5505m6853o11857
$$ 6273561 5844096 5252238 6021586 5861652 5685269 6199912 6324905 6420410 6373557 5761700
4551E761700m64220O08348N84503O7567l73586N3659J92385J78111l70423M0751
$$ 5761700 5297480 5905828 6490331 6557898 6184312 6237971 6430356 6608467 6238044 6278795
4541F278795O44338q14654j79881O66702L31210m69780j07136k8206J57843J24882
$$ 6278795 6923133 6108479 5928598 6595300 6926510 6456730 6349594 6321388 6479231 6604113
4531F604113L61876N30043l60269m8336p5310J23395m37077k2820J84637n9157
$$ 6604113 6965989 7496032 7135763 7087427 7012117 7135512 6698435 6675615 6860252 6801095
4521F801095M35250K17047k18688k62986j93984k70L31112K01724l75152l1626
$$ 6801095 7236345 7453392 7234704 6971718 6777734 6777464 7108576 7310300 6935148 6903522
4511F903522O51625J42223j3417j76536k77495M35177P34937L01053L18133j19972
$$ 6903522 7555147 7697370 7683953 7507417 7229922 7665099 8400036 8701089 9019222 8899250
4501H899250m61542K61519j50665n7173K82573k4211k84868L09519K99291P02764
$$ 8899250 8437708 8699227 8548562 8491389 8773962 8749751 8464883 8774402 9073693 9776457
4491I776457J84187J70935K2669J4520J54864m58978n5469L32537J30847R1409
$$ 9776457 9960644 10131579 10154248 10168768 10323632 9864654 9809185 10141722 10272569 10363978
4481A0363978O73866q2330L59749N03818L01991J7923k61888J6430L1227M86897
$$ 10363978 11037844 10955514 11315263 11819081 12121072 12138995 11877107 11893537 11924764 12411661
4471A2411661j7503N7432N1345J70429K6760J72501Q69873O2060M54647N93764
$$ 12411661 12394158 12451590 12502935 12673364 12700124 12872625 13742498 13804558 14259205 14852969
4461A4852969K54325L73316K34888M25481k19313l7813N28557J119349M10227
$$ 14852969 15107294 15480610 15715498 16140979 15921666 15883853 16412410 17531759 17941986
4452A7941986L66058L6420M31024L79805P70428Q81947M04467Q95832R28963K37589
$$ 17941986 18308044 18344464 18775488 19155293 19925721 20807668 21212135 22107967 23036930 23274519
4442B3274519M68716M87703Q94158J133371O34261Q41124P38809P78177Q91122
$$ 23274519 23743235 24230938 25125096 26258467 26892728 27733852 28472661 29250838 30141960
4433C0141960R45304R85022J207754Q34028J126296M54621M80037P35050J332216
$$ 30141960 31087264 32072286 33280040 34114068 35240364 35694985 36175022 36910072 38242288
4424C8242288J191768J44664O64022P53916L01750M68259L01435Q99709P05768
$$ 38242288 39434056 39578720 40242742 40996658 41298408 41766667 42068102 42967811 43673579
4415D3673579m07534k90038O57314O43201R47844K00943L40489J035046Q01118
$$ 43673579 43266045 42976007 43633321 44276522 45224366 45425309 45765798 46800844 47601962
4406D7601962P56838L39763P32713N12685N52194O71309P34370P80116Q19357
$$ 47601962 48358800 48698563 49431276 49943961 50496155 51167464 51901834 52681950 53501307
4397E3501307J034080N96187J073145P37335Q87891R22356J336715J815589J781810
$$ 53501307 54535387 55131574 56204719 56942054 57829945 58752301 60089016 61904605 63686415
4388F3686415J497213K488423K377956K167570K726020K613417L185889K914478
$$ 63686415 65183628 67672051 70050007 72217577 74943597 77557014 80742903 83657381
4380H3657381K021536K591986K856209L412348L007848K786164J763652K484288
$$ 83657381 85678917 88270903 91127112 94539460 97547308 100333472 102097124 104581412
4372A04581412K324823J525579J761175J060040P56716J246116k53955j06391
$$ 104581412 106906235 108431814 110192989 111253029 112009745 113255861 113001906 112895515
4364A12895515l45368j252085j502642j639038j268299k242847k517102l054061
$$ 112895515 112550147 111298062 109795420 108156382 106888083 104645236 102128134 99074073
4356I9074073k468401k944565k927687l037920l130111l184876k947491l515588
$$ 99074073 96605672 93661107 90733420 87695500 84565389 81380513 78433022 74917434
4348G4917434k905829l607739m351938k591383k528282k927528l026821k845495
$$ 74917434 72011605 68403866 64051928 61460545 58932263 56004735 52977914 50132419
4340E0132419j598475k633505k390044j711441j873356j671503j570998k017238
$$ 50132419 48533944 45900439 43510395 41798954 39925598 38254095 36683097 34665859
4332C4665859j154255j036377j083254q50617o75465j512359j086712r03535j030870
$$ 34665859 33511604 32475227 31391973 30541356 29865891 28353532 27266820 26363285 25332415
4323B5332415l35222j236248p21426r56819n8863j29734q93992r13263m50775
$$ 25332415 24997193 23760945 23039519 22082700 22023837 21894103 21000111 20086848 19636073
4314A9636073p41719n86907K73520q54562o86509j0737r11272n40814k71159k88384
$$ 19636073 18894354 18307447 18580967 17726405 17039896 17029159 16117887 15577073 15305914 15017530
4304A5017530j0282o24825m24114q6137K09014n1713m943n31282k89353o34043
$$ 15017530 15007248 14382423 13958309 13872172 14081186 14029473 14024530 13493248 13203895 12569852
4294A2569852n75497o53432n3393K04944l96183j44781j41713j025755N58930
$$ 12569852 11994355 11340923 11287530 11492474 11096291 10951510 10809797 9784042 10342972
4285A0342972n1923p38388J83591m03711L8464l19281K588M0235j18007J66631
$$ 10342972 10291049 9552661 9736252 9332541 9371005 9051724 9054312 9094547 8976540 9143171
4275I143171k35363k99848l426r4321j36933Q0142k63209k74618m69960J2322
$$ 9143171 8907808 8607960 8604534 8510213 8373280 8453422 8190213 7915595 7445635 7457957
4265G457957J3671m53457j39977J14918J22983m90788j6557J42394r4884J09746
$$ 7457957 7471628 7018171 6878194 6993112 7116095 6625307 6608750 6751144 6656260 6766006
4255F766006l9580l69579k81695j96553o4456K15352Q504L44726K26421m55373
$$ 6766006 6726426 6356847 6075152 5878599 5814143 6029495 6037999 6382725 6609146 6153773
4245F153773l73925J17915k8056n26251O14483L14121k32495k16679O4979j18549
$$ 6153773 5779848 5897763 5869707 5343456 5957939 6272060 6039565 5822886 5887865 5769316
4235E769316J11928k85712l0912J8696k21039l02145M15750K16170l30807M6410
$$ 5769316 5881244 5595532 5564620 5583316 5362277 5060132 5475882 5692052 5361245 5407655
4225E407655n0992R206p7815k30657l51353j40312M41793J12262L55827M73590
$$ 5407655 5356663 5365869 5288054 5057397 4706044 4565732 5007525 5119787 5475614 5949204
4215E949204l30278o16811p7751j05580R3616J54394M30852J05790l86206l75504
$$ 5949204 5618926 5002115 4924364 4818784 4912400 5066794 5497646 5603436 5217230 4841726
4205D841726m51377N02772j9327l51262L85700j14280p19968j67155L08886J76596
$$ 4841726 4390349 4893121 4873794 4522532 4908232 4793952 4073984 3906829 4215715 4392311
4195D392311L9895j96190J73285q6163m6714L37027k50147k24787K97217o0597
$$ 4392311 4432206 4236016 4409301 4323138 4276424 4613451 4363304 4138517 4435734 4375137
4185D375137n90325L78041L67277O89807L0736l40339m74430m72525J40555L64942
$$ 4375137 3784812 4162853 4530130 5219937 5250673 4910334 4435904 3963379 4103934 4468876
4175D468876k3168j22696j5497M7577k49338L86966J58847j83374M80090j78822
$$ 4468876 4445708 4323012 4307515 4355092 4105754 4492720 4651567 4468193 4948283 4769461
4165D769461l64624M26600L59044r31903J22622K9681k68226N45020M51434m79194
$$ 4769461 4404837 4831437 5190481 4258578 4381200 4410881 4142655 4687675 5139109 4659915
4155D659915N30013J9533j57463l87119Q3615j15436l09306l16127p782M00958
$$ 4659915 5189928 5209461 5051998 4664879 4748494 4633058 4323752 4007625 3999843 4400801
4145D400801l42716P14178j1991j18499P1668L29969p7054L07170l34450n45548
$$ 4400801 4058085 4772263 4760272 4641773 4713441 5043410 4966356 5273526 4939076 4393528
4135D393528L3717q7734N44225K58363r73932L17183M92687l58648K85166M73160
$$ 4393528 4427245 4339511 4883736 5142099 4168167 4485350 4978037 4619389 4904555 5377715
4125E377715O382m68109k73035j02011L8141N24890j26730n88284M23591K27120
$$ 5377715 5384097 4915988 4642953 4540942 4579083 5103973 4977243 4388959 4812550 5039670
4115E039670N1585O3378j87811k57725L03863n98621J56060J22972J48187P8778
$$ 5039670 5091255 5154633 4966822 4709097 5012960 4414339 4570399 4693371 4841558 4920336
4105D920336N5789M8968K83196K36718l7180k36728n46087l3649K19555M37780
$$ 4920336 4976125 5025093 5308289 5545007 5507827 5271099 4725012 4691363 4910918 5348698
4095E348698l22002O65177L9637L9638l11962J07294L23175m74198R5159O10628
$$ 5348698 5026696 5691873 5731510 5771148 5459186 5566480 5889655 5415457 5510616 6121244
4085F121244K87732j7999L14094m18711l72513J44671k24882N8567J84232K98470
$$ 6121244 6408976 6390977 6705071 6286360 5913847 6058518 5833636 5892203 6076435 6374905
4075F374905j43428j94486K30912m8982M22137M99303o9765J50682m13673L82987
$$ 6374905 6231477 6036991 6267903 6218921 6641058 7140361 7070596 7221278 6807605 7190592
4065G190592k60159p7010K78192L66725J46191J19079j22273O4110L76599N8924
$$ 7190592 6930433 6853423 7131615 7498340 7644531 7763610 7641337 7705447 8082046 8140970
4055H140970n29500k38701L06142J92957L56387J82971J43151R8551l95398L63142
$$ 8140970 7611470 7372769 7678911 7871868 8228255 8411226 8554377 8652928 8257530 8620672
4045H620672j33001o1912P71248J19282L76665j97046l01030J02124J53136Q3364
$$ 8620672 8487671 8425759 9197007 9316289 9692954 9495908 9194878 9297002 9450138 9533502
4035I533502N92363m75047k0048N68250m32120Q25648M84071K08272K89665m47142
$$ 9533502 10125865 9650818 9630770 10199020 9766900 10592548 11076619 11284891 11574556 11127414
4025A1127414O59231L46378k24298L66776O27794q4697J50795N07006R60649N03482
$$ 11127414 11786645 12133023 11908725 12275501 12903295 12818598 12969393 13476399 14437048 14940530
4015A4940530L7956k05521M48853M94058K05563J73518O45111J015661K43574
$$ 14940530 14978486 14772965 15221818 15715876 15921439 16094957 16740068 17755729 17999303
4006A7999303P1134R41529O76103R0419J165631O43064L85684P69168M72573J002043
$$ 17999303 18070437 19011966 19688069 19778488 20944119 21587183 21972867 22742035 23214608 24216651
3996B4216651L46112J224671P77329J236570Q84341M28564O18920J143448J794458
$$ 24216651 24562763 25787434 26564763 27801333 28685674 29114238 29733158 30876606 32671064
3987C2671064R25960J381408P28477J268602K173546J764479J550862J018970
$$ 32671064 33597024 34978432 35706909 36975511 39149057 40913536 42464398 43483368
3979D3483368J520398J839955J143337J301287K079545J857817J707366J428924
$$ 43483368 45003766 46843721 47987058 49288345 51367890 53225707 54933073 56361997
3971E6361997J872510K232055J241955J903542J641195K031060K362787J428864
$$ 56361997 58234507 60466562 61708517 63612059 65253254 67284314 69647101 71075965
3963G1075965J653611J692060K479130K085092J718559J402197J598117J770556
$$ 71075965 72729576 74421636 76900766 78985858 80704417 82106614 83704731 85475287
3955H5475287J079170J591387J721526J442382J768433J874274J806754J146756
$$ 85475287 86554457 88145844 89867370 91309752 93078185 94952459 96759213 97905969
3947I7905969J060992J200661J538698J744939J210756J667288J555023J083374
$$ 97905969 98966961 100167622 101706320 103451259 104662015 106329303 107884326 108967700
3939A08967700R66759M18403R10288J177855O23601R93419R05011P58192O55796
$$ 108967700 109934459 110352862 111263150 112441005 113064606 114058025 114963036 115721228 116377024
3930A16377024M73292R91917J084096L58285L28018N99932M30970r5304M05973
$$ 116377024 116850316 117842233 118926329 119284614 119612632 120212564 120643534 120548230 120954203
3921A20954203M5304l69342n8407M31452P72090o14429q65739q91322r71661q9457
$$ 120954203 120999507 120630165 120571758 121003210 121775300 121160871 120295132 119403810 118432149 118342692
3911A18342692o94874q86019q92946j118555j274533j637689j732477j301134
$$ 118342692 117647818 116761799 115868853 114750298 113475765 111838076 110105599 108804465
3903A08804465j547001j118725j708131j804387k425865j674659k221849k197688
$$ 108804465 107257464 106138739 104430608 102626221 100200356 98525697 96303848 94106160
3895I4106160j247162k310207j993845k156358k585205k180461k482342k791330
$$ 94106160 92858998 90548791 88554946 86398588 83813383 81632922 79150580 76359250
3887G6359250j944731j937403k034040k418085k065430j854912k132055j952938
$$ 76359250 74414519 72477116 70443076 68024991 65959561 64104649 61972594 60019656
3879F0019656j902778j802650j833765k027006j969876j449368k177684j668774
$$ 60019656 58116878 56314228 54480463 52453457 50483581 49034213 46856529 45187755
3871D5187755j120976j407561j881169j289501j523363r54854r59736j813902
$$ 45187755 44066779 42659218 40778049 39488548 37965185 37010331 36050595 34236693
3863C4236693j000250q31577j279474j063175o78125r06743n43621p71105n43477
$$ 34236693 33236443 32404866 31125392 30062217 29384092 28477349 27933728 27162623 26619146
3854B6619146p04247p85663o90842j011270j40547o84176l21513O2723j031581
$$ 26619146 25914899 25129236 24438394 23427124 23286577 22602401 22280888 22343611 21312030
3845B1312030p46488p23952m3504k03806k73812k13774m36499r85386m24559p5815
$$ 21312030 20565542 19841590 19798086 19594280 19320468 19106694 18670195 17684809 17260250 17184435
3835A7184435j19013k16538q53331k27509P0639j81164k57627k62123L40143k64650
$$ 17184435 17065422 16848884 15995553 15768044 15838683 15657519 15399892 15137769 15477912 15213262
3825A5213262l16913l16594j68818M9397l52361k04232o55455j56415N5278J29436
$$ 15213262 14896349 14579755 14410937 14460334 14107973 13903741 13248286 13091871 13147149 13276585
3815A3276585m2665j58941N725j43379k84707p4886J55139l66266J8375j77536
$$ 13276585 13233920 13074979 13080704 12937325 12652618 12577732 12732871 12366605 12384980 12207444
3805A2207444M4744o40633L17155N5113j09514k3332k38139O3346k65853L37872
$$ 12207444 12252188 11611555 11928710 11983823 11874309 11850977 11612838 11676184 11410331 11748203
3795A1748203k85973j68341N43146k56449l35177O65184p93870k50070Q9166J24699
$$ 11748203 11462230 11293889 11837035 11580586 11245409 11910593 11116723 10866653 10955819 11080518
3785A1080518O25535o30069L8750K83771o23420M64406L79672j68542L42781j77531
$$ 11080518 11706053 11075984 11114734 11398505 10775085 11239491 11619163 11450621 11793402 11615871
3775A1615871l96204k04298l14955o5759L49783L68071P73862k62567J60773M02869
$$ 11615871 11219667 11015369 10700414 10634655 10984438 11352509 12126371 11863804 12024577 12427446
3765A2427446k95629j55954L35421j64909m0596m64139k90709m4735L28312J11655
$$ 12427446 12131817 11975863 12311284 12146375 12105779 11641640 11350931 11306196 11634508 11746163
3755A1746163j2112J06036J85419L76312K49566l56202l14606N31829k64092J15376
$$ 11746163 11734051 11840087 12025506 12401818 12651384 12295182 11980576 12512405 12248313 12363689
3745A2363689L7307N8652J55865J4034r6062N11327K79930K30431k4329J51390
$$ 12363689 12400996 12459648 12615513 12629547 12533485 13044812 13324742 13555173 13530844 13682234
3735A3682234q5826L42521n30863L01482L89112J19468K96963J76153m0414N22776
$$ 13682234 13596408 13938929 13408066 13709548 14098660 14218128 14515091 14691244 14650830 15173606
3725A5173606M66923J11903l0802L99003O76344O01856K33128k62421R4009j49504
$$ 15173606 15640529 15752432 15721630 16120633 16796977 17398833 17631961 17369540 17463549 17314045
3715A7314045N53050n8162K66036K85193L04643j16521J055242K62147j55664
$$ 17314045 17867095 17808933 18074969 18360162 18664805 18548284 19603526 19865673 19710009
3706A9710009O96590M70113K30726P81756K09899M16518L90368O3897O12571K37509
$$ 19710009 20406599 20876712 21107438 21889194 22099093 22515611 22905979 22969876 23582447 23819956
3696B3819956M28274P30591K03291J59802O13427L55740R36163R37114O49860
$$ 23819956 24248230 24978821 25182112 25341914 25955341 26311081 27247244 28184358 28834218
3687B8834218M64722Q67788L69540Q18900Q35871M70301O13027J076401J197532
$$ 28834218 29298940 30166728 30536268 31355168 32191039 32661340 33274367 34350768 35548300
3678C5548300J010872R14570R39618R46447J463217J420740J547092R01464J006138
$$ 35548300 36559172 37473742 38413360 39359807 40823024 42243764 43790856 44692320 45698458
3669D5698458K101477J515787J595045K482912J997794J804223J267069K384394
$$ 45698458 47799935 49315722 50910767 53393679 55391473 57195696 58462765 60847159
3661F0847159K820321J844722K569085K647609K396621K380540K737925K503181
$$ 60847159 63667480 65512202 68081287 70728896 73125517 75506057 78243982 80747163
3653H0747163L007768K831236K720353K831933K963441L378316L226392K369321
$$ 80747163 83754931 86586167 89306520 92138453 95101894 98480210 101706602 104075923
3645A04075923K857148K507655K823282K563197K774880L186506K806499K085288
$$ 104075923 106933071 109440726 112264008 114827205 117602085 120788591 123595090 125680378
3637A25680378K480873K668415K777394K511336J917029J834663J273192J662557
$$ 125680378 128161251 130829666 133607060 136118396 138035425 139870088 141143280 142805837
3629A42805837J557646J530611Q39211P12137Q21485J083540P42694Q28042l6956
$$ 142805837 144363483 145894094 146733305 147445442 148266927 149350467 150093161 150921203 150884247
3620A50884247L39889N86466J18516k1646l64017p82546q27358r03647p30432
$$ 150884247 151224136 151810602 151929118 151907472 151543455 150760909 149933551 149029904 148299472
3611A48299472q69409j016904j106621j423751j071670j277820j337102j096651
$$ 148299472 147430063 146413159 145306538 143882787 142811117 141533297 140196195 139099544
3603A39099544m17872j365684j071667q25932j468906j086433j093410j350512
$$ 139099544 138681672 137315988 136244321 135418389 133949483 132863050 131769640 130419128
3595A30419128n12873R2777p08504q50341K13928k84494l84287j82878J2381N41156
$$ 130419128 129906255 129999032 129290528 128440187 128654115 128369621 127985334 127802456 127814837 128355993
3585A28355993O5515O14316J145557J280799R19756J352860J622761J638497J980652
$$ 128355993 128421508 129035824 130181381 131462180 132381936 133734796 135357557 136996054 138976706
3576A38976706K120387K205340J699096J814981K127904K793578K776742K453282
$$ 138976706 141097093 143302433 145001529 146816510 148944414 151737992 154514734 156968016
3568A56968016K381067L091978K268156K243094L229082L077984K624473K733958
$$ 156968016 159349083 162441061 164709217 166952311 170181393 173259377 175883850 178617808
3560A78617808K933685K950549K926877K817892K929687L108516K904025L015804
$$ 178617808 181551493 184502042 187428919 190246811 193176498 196285014 199189039 202204843
3552B02204843K814726L337702L715074L122994L427905K685210L005880L401100
$$ 202204843 205019569 208357271 212072345 215195339 218623244 221308454 224314334 227715434
3544B27715434L845908L613307L202015L457415L504261L092724L358226K513514
$$ 227715434 231561342 235174649 238376664 241834079 245338340 248431064 251789290 254302804
3536B54302804K822086K865288K405230L196092K982120K165275J954634J982084
$$ 254302804 257124890 259990178 262395408 265591500 268573620 270738895 272693529 274675613
3528B74675613J408792J894003J260025N48309P73749L53394l73501k88661K82097
$$ 274675613 276084405 277978408 279238433 279786742 280560491 280913885 280540384 280251723 280533820
3519B80533820n43891r02829j260351j406966j309759j712970j656429j885204
$$ 280533820 279989929 279087100 277826749 276419783 275110024 273397054 271740625 269855421
3511B69855421j671893j120904j371505j825089j820285j711369j208364j418467
$$ 269855421 268183528 267062624 265691119 263866030 262045745 260334376 259126012 257707545
3503B57707545r82267q77943m46394n33053o23795p70820r92350m93290r35362
$$ 257707545 256725278 255847335 255400941 254867888 254244093 253473273 252480923 251987633 251052271
3494B51052271m55376r83369q19072j360706j468532k054865k016053k192678
$$ 251052271 250596895 249613526 248794454 247433748 245965216 243910351 241894298 239701620
3486B39701620k613825k416234k887605l205257l242502l230136l400389l869437
$$ 239701620 237087795 234671561 231783956 228578699 225336197 222106061 218705672 214836235
3478B14836235m555997m833331m353393m609176n622833m366364m660135o021299
$$ 214836235 210280238 205446907 201093514 196484338 190861505 186495141 181835006 175813707
3470A75813707m984687m432655m856326m599582m214306m528613m662964l609189
$$ 175813707 170829020 166396365 161540039 156940457 152726151 148197538 143534574 139925385
3462A39925385l827736m039680l355410l033397l382157k865002k495965l209268
$$ 139925385 136097649 132057969 128702559 125669162 122287005 119422003 116926038 113716770
3454A13716770k827580k364039k360978k045668j852383j968819k299819j878161
$$ 113716770 110889190 108525151 106164173 104118505 102266122 100297303 97997484 96119323
3446I6119323j974882j382629j236825j836815j209505j802904j311898r65979
$$ 96119323 94144441 92761812 91524987 89688172 88478667 86675763 85363865 84397886
3438H4397886j456359m28327j358344j625055m71922o95407o31509p88044j145887
$$ 84397886 82941527 82513200 81154856 79529801 79057879 78362472 77730963 76942919 75797032
3429G5797032k12083p10958n20770j70421j78515l73349j79606k45787J3364q1394
$$ 75797032 75584949 74873991 74353221 74182800 74004285 73630936 73451330 73205543 73218907 73137513
3419G3137513L7735O74481Q63685N99407J082279J433998J695760J777577J439203
$$ 73137513 73175248 73849729 74713414 75312821 76395100 77829098 79524858 81302435 82741638
3410H2741638J632907J900684K773237K556684K857582L298064L143568L530933
$$ 82741638 84374545 86275229 89048466 91605150 94462732 97760796 100904364 104435297
3402A04435297L380025L371549L700210L917923K813127K313967K436475J922373
$$ 104435297 107815322 111186871 114887081 118805004 121618131 123932098 126368573 128290946
3394A28290946J348159J430587Q70165O12015N18352k96072o02640j219980o55977
$$ 128290946 129639105 131069692 131939857 132551872 133070224 132774152 132171512 130951532 130295555
3385A30295555j470378j797714k134534k179466k539877l660546l813044l872238
$$ 130295555 128825177 127027463 124892929 122713463 120173586 116513040 112699996 108827758
3377A08827758l679926m285336l965358l894259m070177m036816l945265l390434
$$ 108827758 105147832 100862496 96897138 93002879 88932702 84895886 80950621 77560187
3369G7560187l278355l592544k992465k604032l060229k762290k617571k229878
$$ 77560187 74281832 70689288 67696823 65092791 62032562 59270272 56652701 54422823
3361E4422823j955862j602711j844261j852481j918782j375873j556115j552323
$$ 54422823 52466961 50864250 49019989 47167508 45248726 43872853 42316738 40764415
3353D0764415j354748n39218j318618j263791j784954j029091o83575j158186
$$ 40764415 39409667 38870449 37551831 36288040 34503086 33473995 32790420 31632234
3345C1632234j64354j102372j102406o79334J54793o94330r48776k36606o33496
$$ 31632234 31467880 30365508 29263102 28583768 28738561 28044231 27095455 26858849 26225353
3336B6225353p12121o32879l31872n07830o08366p02217j045435m26923k8819
$$ 26225353 25513232 24880353 24548481 24040651 23432285 22730068 21684633 21257710 21228891
3327B1228891K17009O7158p47386n38926l41913m26207q43257p4489k74555o25102
$$ 21228891 21445900 21513058 20765672 20226746 19884833 19458626 18615369 18540880 18266325 17641223
3317A7641223l24081n29071m40550k90354o7589m7060j67654k15747j69469n82102
$$ 17641223 17317142 16788071 16347521 16057167 15989578 15942518 15774864 15559117 15389648 14807546
3307A4807546n21845l15979q37321Q7853M83363K5978m10609l12148j34712k22925
$$ 14807546 14285701 13969722 13132401 13220254 13703617 13729595 13318986 13006838 12872126 12649201
3297A2649201m61302J9330J3147J22142r02454o6347o2812k91216P1729K29524
$$ 12649201 12187899 12207229 12220376 12342518 11440064 11373717 11310905 11019689 11091418 11320942
3287A1320942l6291l36892J33402m51407q1942K960k33829o50712M59462l30720
$$ 11320942 11284651 10947759 11081161 10629754 10547812 10550772 10316943 9666231 10125693 9794973
3277I794973J24806K67953p01100o36256M14905J5531l91999l81439L51465n516
$$ 9794973 9919779 10187732 9486632 8850376 9265281 9280812 8888813 8507374 8858839 8853323
3267H853323p9438J1865J50247n2912M12629J76609n95933q16723r4460K20361
$$ 8853323 8773885 8785750 8935997 8883085 9295714 9472323 8876390 8059667 7965207 8185568
3257H185568L46956J62565l44512p4522j28J6322J04521K46469j17037j01890
$$ 8185568 8532524 8695089 8350577 8276055 8275927 8292249 8396770 8643239 8526202 8424312
3247H424312r2963o33491N120j07111q0925K44232m2557j27074R3620J90090J52269
$$ 8424312 8331349 7697858 7702978 7595867 7514942 7759174 7716617 7589543 7683163 7873253 8025522
3236H025522r8959k10741l43045n4447M104O43782O3950l50964q8148o02524l25946
$$ 8025522 7926563 7715822 7372777 7318330 7322434 7966216 8030166 7679202 7591054 6988530 6662584
3225F662584M35787k23496K42029J72279L3254k20425n91565j05060j13432N9722
$$ 6662584 7098371 6874875 7116904 7289183 7322437 7102012 6510447 6405387 6291955 6351677
3215F351677k3497L99201n21457k16887j56085M05738r4405K58855N81271m87380
$$ 6351677 6328180 6727381 6205924 5989037 5832952 6238690 6144285 6403140 6984411 6497031
3205F497031k59787Q442m11058j80681J95796Q246k34986l669j85841L45280L937
$$ 6497031 6237244 6245686 5834628 5653947 5849743 5857989 5623003 5619334 5433493 5778773 5782710
3194E782710j3111O1215o47015r2872M88195l92152J52032J8381m88506N0137
$$ 5782710 5769599 5830814 5183799 5090927 5579122 5186970 5339002 5357383 4868877 4919014
3184D919014K252r6790Q8407J07982l0765j89592l63861N7506R3781J40446J3311
$$ 4919014 4921266 4824476 4912883 5020865 4990100 4800508 4436647 4494153 4587934 4728380 4741691
3173D741691j57973L8858o04579k89147N7649N8852l380m28013p495k38371P77576
$$ 4741691 4583718 4622576 4017997 3728850 3786499 3845351 3841971 3413958 3406463 3168092 3945668
3162C945668M62425m12020K51354p4911k22463k10668L22788K01880n41695m85864
$$ 3945668 4408093 3996073 4247427 4172516 3950053 3739385 4062173 4264053 3722358 3236494
3152C236494M78741O57804j76794m34414k92436l48231J25611L18555R0745j37548
$$ 3236494 3715235 4373039 4196245 3761831 3469395 3121164 3246775 3565330 3656075 3518527
3142C518527K07668J15425m47977k68188p3273N88626k48768j8799L89778o25757
$$ 3518527 3726195 3841620 3393643 3125455 3052182 3640808 3392040 3373241 3763019 3137262
3132C137262r7189M89186L89950K4678r5218o57872L4751n71711J60063O56611
$$ 3137262 3040073 3529259 3919209 3943887 3848669 3190797 3225548 2653837 2813900 3470511
3122C470511n9034J42415j92452J81051L45100m04763q58551N4299L99608m46480
$$ 3470511 3411477 3553892 3361440 3542491 3887591 3482828 2624277 2678576 3078184 2631704
3112B631704O98842O39218k4671l75522K37856m13475l07543J13300m06528j70374
$$ 2631704 3330546 3969764 3945093 3569571 3807427 3393952 3086409 3199709 2793181 2622807
3102B622807l62613K08641N18237J48377Q8362K68331M2882k9828l22112R015
$$ 2622807 2260194 2468835 2987072 3135449 3223811 3492142 3535024 3505196 3183084 3192099
3092C192099M88020N864l24479j89326q1050K55572j32472j50394k3079j10085
$$ 3192099 3680119 3685983 3361504 3172178 3091128 3346700 3214228 3063834 3040755 2930670
3082B930670l45981M52945N78512P0557J68001l58241R3690O6284m19614l44168
$$ 2930670 2584689 3037634 3616146 3686703 3854704 3496463 3590153 3656437 3236823 2892655
3072B892655j44629O94744M05262l16053l69855K79019q2833M26783L77404K88521
$$ 2892655 2748026 3442770 3848032 3531979 3162124 3441143 3358310 3785093 4162497 4451018
3062D451018m35832m3334J93379M67867K74055L11822J47279k3773N14546M69084
$$ 4451018 4015186 3971852 4165231 4633098 4907153 5218975 5366254 5342481 5857027 6326111
3052F326111j92419L17786P97684K69100K20974k39094j76963L36552M37692m22282
$$ 6326111 6133692 6451478 7249162 7518262 7739236 7500142 7323179 7659731 8097423 7675141
3042G675141m52867k00736k43464r5639J41359k99822K11070j6433m78833J38364
$$ 7675141 7222274 7021538 6778074 6682435 6823794 6523972 6735042 6718609 6239776 6378140
3032F378140j47385K06265j2481o496k95287k83248L61127P5793M79664N95292
$$ 6378140 6230755 6437020 6424539 6418043 6122756 5839508 6200635 6276428 6756092 7351384
3022G351384J95119k27437N1033P19093k9853O72952r37203q05337k65468n91330
$$ 7351384 7546503 7319066 7370099 8089192 8059339 8732291 7795088 6989751 6724283 6132953
3012F132953j69841J09178m40492m57512m09727J22868K46491n11531l10425j92166
$$ 6132953 5963112 6072290 5631798 5174286 4764559 4887427 5133918 4622387 4311962 4119796
3002D119796k33524r6816J4258o265m41117m00290J90768o09J14674M1218n24631
$$ 4119796 3886272 3789456 3803714 3797449 3356332 2956042 3146810 3146201 3260875 3302093 2777462
2991B777462l4923k9069j73470k38270L82901k10652p9297M04237n76259o8734
$$ 2777462 2742539 2713470 2540000 2301730 2684631 2473979 2394682 2798919 2222660 2153926
2981B153926R9258k03169K16608M51185n13015o6518J32758o3962l76492R5320
$$ 2153926 2253184 2050015 2266623 2717808 2204793 2138275 2271033 2207071 1830579 1925899
2971A925899k78794l0370K01725r5027j22318L63507j17347j68640n7221j54643
$$ 1925899 1647105 1616735 1818460 1723433 1601115 1964622 1847275 1678635 1621414 1466771
2961A466771o33536L39164J48085P41385j23528J94962l66734q6285M94271j31313
$$ 1466771 833235 1172399 1320484 2061869 1938341 2133303 1766569 1680284 2174555 2043242
2951B043242l80021k97377j14109l63339J35104n79070K15376O68272P8687M41746
$$ 2043242 1663221 1365844 1251735 888396 1023500 444430 659806 1328078 1406765 1848511
2941A848511k24255K34466m28172P310j33480j10379M67155n6538j91472m62643
$$ 1848511 1624256 1858722 1430550 1437860 1304380 1194001 1661156 1604618 1413146 950503
2931I50503q3755M03940N06324m58063j38240O9291n01509J79127j61794J49274
$$ 950503 866748 1270688 1777012 1318949 1180709 1250000 748491 927618 765824 915098
2921I15098R5431k79951l03658M15237L918l5189l635J25641o5593l97147L47237
$$ 915098 1010529 730578 426920 842157 846075 810886 807251 932892 867299 470152 817389
2910H17389J842M5876L67616o60142k54205L84662j10642P74403l66223l28136
$$ 817389 819231 865107 1232723 572581 318376 703038 592396 1366799 1000576 672440
2900F72440L8262L48619K45977j27444j43918M24523j3556k80287J32417J42122
$$ 672440 710702 1059321 1305298 1177854 1033936 1458459 1444903 1164616 1297033 1439155
2890A439155n05824K0866J92187l34150l06056N13267j1530J89717k70437Q692
$$ 1439155 933331 954197 1146384 812234 506178 1019445 1007915 1197632 927195 935887
2880I35887q2253O5214R7440o2538L3328n2442j70796k01665K77027k180J06175
$$ 935887 853634 918848 1016288 953750 987078 934636 763840 562175 839202 837022 943197
2869I43197J26439m47564L60311J10618R7071K07317j91502J3685j08721K94666
$$ 943197 1069636 622072 982383 1093001 1190072 1397389 1205887 1219572 1110851 1405517
2859A405517k16110p69018K51687N10631K09292l44584p0522k07338J87393P7767
$$ 1405517 1189407 420389 672076 1182707 1391999 1047415 976893 769555 956948 1034715
2849A034715K6591M9946j19862m91303K50969L61708l55788j70663K31869k68011
$$ 1034715 1061306 1111252 991390 500087 751056 1112764 756976 586313 818182 550171
2839E50171k3988P01329J39031l68698k80396j39710O0819j78925J19344k63137
$$ 550171 526183 1227512 1366543 997845 717449 577739 638558 459633 578977 315840
2829C15840K62021N0992n50584Q9978J54023N70882p3863l61807k9754M92465
$$ 315840 577861 628853 78269 168247 322270 893152 819289 457482 427728 920193
2819I20193M3135M83138o0633k97994o18224o64230r3337J55655j23609J10528
$$ 920193 963328 1446466 1385833 1087839 469615 -194615 -287952 -132297 -255906 -145378
2809a45378r3491M04493J39908J65228K63936k91480j61566j0592j24674K60996
$$ -145378 -238869 165624 305532 470760 734696 443216 281650 271058 146384 407380
2799D07380O06028K89403m14700k21978r3660r62M23624R8268n111K03727l42207
$$ 407380 1013408 1302811 888111 666133 572473 571511 995135 1093403 1088292 1292019 949812
2788I49812r31224m37220O43977M04541J4384o9228N55297k44847k20616K35057
$$ 949812 18588 -418632 225345 629886 644270 575042 1130339 885492 664876 899933
2778H99933l38590j21406r3836r6629N05119K84552m30730r1217L30162Q7820
$$ 899933 561343 439937 346101 249472 754591 1039143 608413 517196 847358 935178
2768I35178n55666j34201J98109L2573L53041J49281m63101J20123K34358j21947
$$ 935178 379512 245311 443420 475993 829034 978315 515214 635337 869695 747748
2758G47748m50295j16178N00166n42232l8578L44360j43165L9651o67295K24739
$$ 747748 297453 181275 681441 139209 100631 444991 301826 341477 -325818 -101079
2748a01079k09136q1032M49106K97266L56654k52788K76663l0796l2543j7378
$$ -101079 -310215 -391247 57859 355125 711779 458991 735654 704858 672315 654937
2738F54937K97076l91632o7451l51314j2348M19471M48854K61763k50904l92992
$$ 654937 952013 560381 492930 141616 129268 548739 997593 1259356 1008452 615460
2728F15460l26700K06420j02127K77209K25732l86367l98529n7908N439L89452
$$ 615460 288760 495180 393053 670262 895994 509627 111098 53190 58629 448081
2718D48081l41782J29887K87535j98892L50142l03086j02522n4337q0842J40426
$$ 448081 106299 236186 523721 324829 674971 371885 269363 215026 134184 274610
2708B74610m57402K50892J16974j79766n0606J20763K29637r1618j23560N86991
$$ 274610 -182792 68100 185074 5308 -45298 75465 305102 213484 89924 676915
2698F76915j56734m77328k0440L47495j01073N92780j99917m51118J09323M51510
$$ 676915 520181 42853 22413 369908 268835 861615 661698 210580 319903 771413
2688G71413j03944n53869O55500Q6996l96041L3105L62441Q0576r370m67717r7195
$$ 771413 667469 113600 769100 856096 460055 493160 855601 936177 926807 459090 361895
2677C61895k10434J75076L93989L10215j20748l82451k11018J39073k7751l21889
$$ 361895 151461 326537 720526 1030741 909993 527542 316524 455597 427846 105957
2667A05957K79159K98645o09188l06194L31646M16506M6915n41351P2895L50434
$$ 105957 385116 683761 74573 -231621 100025 516531 563446 22095 94990 445424
2657D45424L2175k07281k39943n89554J23282L09133O45116l9049j38783k80308
$$ 445424 477599 270318 30375 -559179 -435897 -126764 518352 479303 340520 60212
2647F0212M19979L4793k23664L68153K56813n11079p09063L28410M47329L65824
$$ 60212 480191 514984 291320 659473 916286 405207 -303856 24554 471883 837707
2637H37707q21819L73952R8129J74178J35733j35139j25450k63875M7975M41577
$$ 837707 15888 389840 487969 662147 797880 662741 537291 273416 321391 762968
2627G62968j87820k29721J5459M4893J17090l44716k6253l07607m9919K54817
$$ 762968 575148 345427 360886 405779 522869 178153 151900 -155707 -205626 49191
2617D9191L98936K89735k81357l9437j11819n09229P11706p3225o51459p1972
$$ 49191 448127 737862 456505 417068 305249 -203980 507726 434501 -216958 -288930
2607b88930J68303K20528J90029l07429k52580M47051O2547L43748j67195n04559
$$ -288930 -120627 99901 289930 -17499 -270079 176972 239519 583267 416072 -88487
2597h8487l36291M2647L77737M69083j35529l03265M40000j06661o8177R2872
$$ -88487 -424778 -382131 -4394 464689 329160 25895 465895 359234 291057 383929
2587C83929R8955J05339J3164m47941J50542K52731n5090l36894J91713k5876
$$ 383929 482884 588223 601387 153446 303988 556719 501629 164735 356448 330572
2577C30572M2433K14788n20039r8519N09583K34565p36519L3011K54091l77964
$$ 330572 373005 587793 67754 -30765 478818 713383 -23136 9875 263966 -113998
2567a13998j3646N51754j72277m30740L54994L1969m3948k07767j69824L37488
$$ -113998 -127644 424110 251833 -178907 176087 208056 164108 -43659 -213483 124005
2557A24005J77474J86160o1647n71555m21765J95985K46766L8511L41687J7522
$$ 124005 301479 487639 425992 -145563 -567328 -371343 -124577 -86066 255621 273143
2547B73143r8420J6280l88871l8478n2800L34591J39373J23047J54551j9356m64799
$$ 273143 174723 191003 -197868 -236346 -289146 45445 184818 307865 462416 443060 -21739
2536b1739L48987l78890k8857N91561N35590n60884l58871M19228j8043j74078
$$ -21739 327248 -51642 -80499 511062 1046652 485768 126897 546125 528082 354004
2526C54004l69692k9445k00789K36554L5179L632p1875K84963m0829Q9772l73745
$$ 354004 -15688 -45133 -245922 -9368 25811 29443 -42432 242531 201702 291474 -82271
2515h2271l82129L33049N12864P6658q9637j4588Q5609K2984j9263J55884l70624
$$ -82271 -464400 -131351 381513 458171 368534 353946 439555 462539 443276 599160 228536
2504B28536p3213j43983n6885J04305p11785M78962K01389k12023J47258J98584
$$ 228536 155323 11340 -45545 58760 -653025 -174063 27326 -184697 -37439 161145
2494A61145M34583M7801j69697m00581K95091j83098l08213N70201R1137o12829
$$ 161145 595728 643529 473832 73251 368342 185244 -122969 447232 538369 -74460
2484g4460k7802p0895K41671J54897l82979N7648l87652k3561k4104K87418Q6440
$$ -74460 -102262 -173157 68514 223411 -159568 -101920 -489572 -513133 -537237 -249819 -163379
2473a63379n2615l20985K43912P31081j25798r6287N6390k93552k90482L35605
$$ -163379 -215994 -536979 -293067 438014 312216 215929 272319 -21233 -311715 23890
2463B3890M71909K62055l61734j26448j22024l49501k01445R8498L28541j35168
$$ 23890 495799 757854 396120 269672 147648 -201853 -403298 -304800 23741 -111427
2453a11427j8958K1922L5039O49945n29835J4673l63948J43960J99218J64880
$$ -111427 -130385 -108463 -73424 576521 46686 61359 -302589 -158629 40589 205469
2443B05469L84975k9000M29054k58114O413k89155m07127R4217m37920o4586N27265
$$ 205469 590444 561444 990498 732384 738797 449642 42515 136732 -301188 -365774 161491
2432A61491m94849J72670L07810k12927L0418K77485J87428p4326k50971j0122
$$ 161491 -333358 -160688 147122 -65805 -35387 242098 429526 355200 104229 94107
2422I4107n1615m4727J28935k07105L3625j25565K71135J11394l93848j82766
$$ 94107 42492 -2235 126700 -80405 -46780 -172345 98790 210184 -183664 -366430
2412c66430L72952J58399Q250J22714J52858j1102m11414Q710K57959M66805n68938
$$ -366430 6522 164921 173171 295885 448743 437641 26227 34937 292896 759701 190763
2401A90763k02596j74148K16265L72339j9569p09975k40140L02059J15241j7813
$$ 190763 -11833 -185981 30284 402623 383054 -326921 -567061 -265002 -149761 -167574
2391a67574K28952K29948m80049j61898J05826M33869m57305J06047n52475O25111
$$ -167574 61378 291326 -188723 -350621 -244795 189074 -268231 -162184 -714659 -89548
2381h9548O93812m63596m82460J48272L59889j16864K94293j91268n7738J18962
$$ -89548 604264 140668 -341792 -193520 166369 49505 343798 152530 94792 213754
2371B13754j27160K23795q7762K499J51575k01716J79513l94312M42895k75773
$$ 213754 86594 310389 222627 225126 376701 174985 354498 -39814 403081 127308
2361A27308K39380n0866l51536O45144l8632o27922l1920M82459k93944J87124
$$ 127308 366688 315822 -35714 609430 570798 -57124 -89044 393415 99471 286595
2351B86595l39778L5994j835K88257k3972l00504K52673j18059r3479K91373l80265
$$ 286595 -53183 -17189 -19024 269233 245261 -55243 197430 79371 -14108 277265 -103000
2340a03000m88280O88899j24215p28151k83969N32581k8869M88167P30276K81477
$$ -103000 -591280 97619 -26596 -754747 -1038716 -506135 -535004 -46837 683439 964916
2330I64916m94528p01671J00323K96683o23901j7045l9121j03361O75115N43858
$$ 964916 470388 -231283 -130960 165723 -458178 -475223 -514344 -617705 57410 601268
2320F01268m98425o35420q2601K78039k45922l27115J41359M6789O96610j55585
$$ 601268 102843 -532577 -615178 -337139 -583061 -910176 -768817 -722028 -25418 -181003
2310a81003k50664j11289r8852M98922k0305Q9615L95599j4383Q9704m65297j49962
$$ -181003 -431667 -542956 -641808 -142886 -163191 -73576 322023 307640 397344 -67953 -217915
2299b17915P97810m9185k99022j01109m42333j34388M88481J70220n37959K1791
$$ -217915 579895 530710 231688 130579 -311754 -446142 42339 212559 -325400 -303609
2289c03609m290j75328L88664L54441j07916j93380j69536k11008L3947L58355
$$ -303609 -307899 -483227 -94563 259878 151962 -41418 -210954 -421962 -388015 -29660
2279b9660q1271M95436l625k72304m62467m8251J04940J0810J49665j55399K36123
$$ -29660 -110931 384505 380880 108576 -353891 -402142 -297202 -286392 -136727 -292126 -56003
2268e6003P4309p6231j55044j8026J5802j69169m4352P41951P7450q42629J14723
$$ -56003 18306 -57925 -212969 -230995 -215193 -384362 -428714 313237 390687 -451942 -337219
2257c37219J17588J28462K72014L40641l38548j52559l15701K92784m27268R0043
$$ -337219 -219631 -91169 180845 521486 182938 30379 -285322 7462 -419806 -329763
2247c29763M91737k0424L17390n0426p72l08933J23438J15957p1727m49730J13382
$$ -329763 161974 141550 458940 408514 407742 98809 222247 338204 266477 -183253 -69871
2236f9871j37051l8672R1393j6508p1457l1988K57665l74804l74439l8424N99265
$$ -69871 -206922 -245594 -154201 -170709 -242166 -274154 -16489 -391293 -765732 -804156 -204891
2225b04891J81761J50277J14363m10103M13260Q8164O0549q23168m28154K24769
$$ -204891 -23130 127147 241510 -168593 244667 332831 393380 -429788 -857942 -633173
2215f33173O30893L03057l80239J73544K89127K63297m75809l76629L2554j37398
$$ -633173 -2280 300777 -79462 94082 383209 646506 170697 -205932 -173378 -310776
2205c10776K46223J2799K0116L29668n13887m2098N64499R066j03361n44955J56761
$$ -310776 -64553 -51754 -31638 298030 -215857 -257955 306544 315610 212249 -332706 -175945
2194a75945K20595k56731j38241J42197N8200k10934N16113m84370L2219M89313
$$ -175945 44650 -212081 -350322 -208125 -149925 -360859 155254 -329116 -296897 192416
2184A92416M3044k47115n389j91712k68877k2332Q24334k17213m71679q9749j94214
$$ 192416 235460 -11655 -17044 -208756 -477633 -499965 324369 107156 -364523 -454272 -648486
2173f48486J50903L41401n7931L09206K03573k82968N29286p31595J10563j168
$$ -648486 -497583 -156182 -214113 95093 298666 15698 544984 -186611 -76048 -77216
2163g7216l34549r3355J68373j84847J99651q9911M847k36420M19383L00636j55976
$$ -77216 -411765 -505120 -336747 -521594 -321943 -411854 -407007 -643427 -224044 76592 -79384
2152g9384O0756J22424J78612J00223J81125J28307m80672n09876j15318J66286
$$ -79384 -18628 103796 282408 382631 563756 692063 211391 -298485 -413803 -247517
2142b47517K31579m6033J8544J82729j22851r5809j31166j09463J71577k31272
$$ -247517 -15938 -61971 -43427 139302 16451 -79358 -210524 -319987 -148410 -379682
2132c79682k73123J61469J013451J65098m78511k55280K09951J13758J4397n56951
$$ -379682 -652805 -491336 522115 687213 208702 -46578 163373 277131 291528 -265423
2122b65423n2915J76558M42995l22405p9558L30221O3552O0245l0999j91995K93544
$$ -265423 -318338 -141780 301215 -21190 -100748 229473 293025 353270 322271 130276 423820
2111D23820N46795j58949r3509j17041Q0317Q3629J15514j6316K12145o8140P6319
$$ 423820 970615 811666 718157 601116 681433 765062 880576 864260 1076405 1008265 1084584
2100A084584L19524L5137l97428l39587L0227k193Q2942Q89856j02075k07734
$$ 1084584 1404108 1439245 1041817 702230 732457 730264 813206 1703062 1600987 1393253
2090A393253M59071p25265o5484K77480Q8480j52143l80730m37051J56408M33034
$$ 1393253 1852324 1127059 1061575 1339055 1427535 1275392 894662 457611 614019 1047053
2080A047053k21904k66989L07974j39197o01267L33788j7875M17181k79936k29800
$$ 1047053 825149 558160 866134 726937 125670 459458 441583 858764 578828 349028
2070C49028k43426K14154L24521n85063K94033L12106k58257j80524k9349q5941
$$ 349028 105602 319756 644277 59214 353247 665353 407096 226572 197223 111282
2060A11282l54030P48289j32480k37376K76794l79919M11787j94365k13825j28586
$$ 111282 -242748 505541 373061 135685 412479 32560 444347 249982 36157 -92429
2050i2429K67539J34808j31142Q0521J2252K23492M11840k77450j42988m4209
$$ -92429 175110 309918 178776 259297 271549 495041 906881 629431 486443 442234
2040D42234k61026p5451K14021M78374m65174r42188J34283M05918L40998R7658
$$ 442234 181208 105757 319778 798152 332978 -609210 -474927 -69009 271989 369647
2030C69647j66945j7656J38123o5882j24913m48731j2342r1857M25068j71105
$$ 369647 202702 185046 323169 257287 132374 -316357 -328699 -420556 4512 -166593
2020a66593j71363K88903r9880j02610P20389l12030l2530L60264J44568k03136
$$ -166593 -337956 -49053 -148933 -251543 468846 156816 124286 484550 629118 425982
2010D25982k56999k74096J26046j23840k39071L30927L03517k68408J8609j27656
$$ 425982 168983 -105113 20933 -102907 -341978 -11051 292466 24058 42667 -84989
2000h4989J59716k96084k55775N85385N08960J8971n44505K24394L12871j73210
$$ -84989 74727 -221357 -477132 108253 617213 636184 91679 316073 628944 455734
1990D55734l84462N45274m45719o0578k00714N95159k5279K01988j22318o98287
$$ 455734 71272 616546 170827 110249 -90465 504694 479415 681403 559085 -139202
1980a39202K7988J38383l97208j07014N06511j0622o93114N90622k21555j35956
$$ -139202 -111214 27169 -370039 -477053 29458 18836 -674278 -83656 -305211 -441167
1970d41167L0009k81066R1739M89701J06445l04347n66694N38965k06894J28999
$$ -441167 -411158 -692224 -600485 -110784 -4339 -308686 -875380 -336415 -543309 -414310
1960d14310O0633J5348M19737R7482Q8478n4863K29426K55699k45322n93316J34483
$$ -414310 -353677 -338329 81408 178890 267368 212505 441931 697630 452308 -141008 -6525
1949f525n50946J51647J06923M31842j41494m95566k16824Q39880K93672p00796
$$ -6525 -557471 -405824 -298901 132941 -8553 -504119 -720943 118937 412609 -288187
1939b88187M37063q4898l78921K16325M80238r7995j02458J57193m46464j7273
$$ -288187 148876 63978 -314943 -98618 381620 283625 181167 338360 -108104 -125377
1929a25377m60227K77289O6986m70164K2433P55550L8592N2387N2148m47827k17597
$$ -125377 -585604 -308315 -241329 -711493 -689060 66490 105082 157469 209617 -238210 -455807
1918d55807L23814N42135l80423k67005K48995p4729n2746o0574J20106p7143
$$ -455807 -131993 410142 29719 -237286 11709 -63020 -115766 -176340 -56234 -133377
1908a33377J83768l4511J71969k40207n92299M17846M45664l71880J78144L47182
$$ -133377 50391 15880 187849 -52358 -644657 -226811 218853 -153027 25117 372299
1898C72299J46550L4411j15776l70267k65214K53632j70188j44716k63149j39621
$$ 372299 518849 553260 437484 67217 -197997 55635 -114553 -259269 -522418 -662039
1888f62039K39154k2606o8384M61943o3058J45531M60824K16985o05759k12447
$$ -662039 -422885 -445491 -513875 -51932 -114990 30541 491365 708350 102591 -109856
1878a09856J92838n4513l04250K60472o9451J98806O91555k43381l58210J06638
$$ -109856 82982 28469 -275781 -15309 -84760 114046 805601 562220 204010 310648
1868C10648o1464j9425K38021j86839o28745k41022m8650n1020M57111K24332
$$ 310648 249184 229759 467780 280941 -347804 -588826 -637476 -688496 -231385 -7053
1858g053J11927k47192o68977L46617L11907m63740J62105k25077K93333Q39180
$$ -7053 104874 -142318 -811295 -464678 -152771 -616511 -454406 -679483 -386150 453030
1848D53030K46777m60257p5711N79408o09922k05758J81r8661K45831J72434Q4071
$$ 453030 699807 239550 163839 743247 133325 -72433 -72252 -170913 74918 247352 331423
1837C31423j84311K33734J75614j04297j04376j10176k61999R3998l72102j59117
$$ 331423 147112 380846 556460 452163 347787 237611 -24388 69610 -302492 -461609
1827d61609r0588K49090J76601l67293j87721L67804Q23495J25170k75524m08698
$$ -461609 -552197 -303107 -126506 -493799 -681520 -313716 509779 634949 359425 -49273
1817d9273r8461l66959K2391J64206K4536J26556L70123k3426M21033j88029l77592
$$ -49273 -147734 -514693 -492302 -328096 -303560 -177004 193119 169693 590726 402697 25105
1806B5105r7243l81617N22499N1654m4096L025j51043j48678L6548K2120j09822
$$ 25105 -72138 -453755 68744 120398 76302 79327 -71716 -220394 -183846 -161726 -271548
1795b71548l52696O2436K94963m6379J20059Q0797n2736k08366L73004j47175
$$ -271548 -624244 -561808 -266845 -313224 -193165 -112368 -165104 -373470 -466 -147641
1785a47641j73323j0712J94943k36445K27059K02598K26800R1247k25007L03599
$$ -147641 -320964 -331676 -136733 -373178 -146119 56479 283279 374526 149519 453118
1775D53118k40880K9379l71821K49193K7933l26654O3320L7954N87907o5787p2528
$$ 453118 212238 241617 -130204 118989 146922 -179732 -116412 -78458 509449 443662 371134
1764C71134k40307l1646R6813J76414l73643k81396M59904Q7932m9097k997j13770
$$ 371134 130827 99181 195994 372408 -1235 -282631 177273 265205 216108 213111 99341
1753I9341k54201J08971n93870K65400N3991o89484O56641L35091m61216L38675
$$ 99341 -154860 -45889 -639759 -374359 -320368 -1009852 -353211 -18120 -479336 -140661
1743a40661j17608M09801J06886j8293j35909l80278l33319K91608K66625L29462
$$ -140661 -258269 151532 258418 240125 104216 -276062 -609381 -317773 -51148 278314
1733B78314j78847n42563k14623J11138N13343j22393l36306J26384M35681j24682
$$ 278314 99467 -443096 -657719 -546581 -33238 -155631 -491937 -365553 70128 -54554
1723e4554J51674J60667n00706K03837Q0351p0163j74152L65051L00467m53929
$$ -54554 97120 257787 -242919 -39082 41269 -28894 -203046 162005 462472 8543
1713H543K33979m12508K6575M55469m8382k67652l20482M71182M31501n76597
$$ 8543 242522 -169986 -143411 312058 263676 -3976 -324458 146724 578225 1628
1703A628m87565J14062k2478K75978K83192K98001l3216J88288L8063J02941N9163
$$ 1628 -485937 -371875 -394353 -118375 164817 462818 429602 617890 655953 758894 818057
1692H18057k87822l35130l48474k02943k43495Q9042j90867K41443R6838J50076
$$ 818057 530235 195105 -153369 -356312 -599807 -510765 -701632 -460189 -363351 -213275
1682b13275l83273n8526L35140K49211N74812n4427l41315P7840j33959j93016
$$ -213275 -596548 -655074 -319934 -70723 504089 449662 108347 186187 52228 -140788
1672a40788K28671K75952m36490r6508J51342j0512J18977k4952j07444m6289
$$ -140788 87883 363835 -72655 -169163 -17821 -28333 90644 65692 -41752 -88041
1662h8041L84238o373m76757k7755K41478J69360j60021K53715l88582Q1421j02962
$$ -88041 296197 289824 -186933 -214688 26790 196150 36129 289844 -98738 -17317 -120279
1651a20279K44978j14181K2246k22414n6373M93015M57919K03064n0301m02283
$$ -120279 124699 10518 32764 -189650 -246023 246992 704911 907975 857674 455391
1641D55391n41382N81263m1651k03594j03147N4125M59044j78257j20445j95391
$$ 455391 -85991 495272 453621 250027 146880 201005 660049 481792 361347 165956
1631A65956k75917L71193j77053K57056j03433n70920l41689K16044M24020K37268
$$ 165956 -109961 261232 84179 341235 237802 -333118 -674807 -458763 -34743 202525
1621B02525l42355k43650K1991O86073j28015j20809k448o218K43656l37045j59665
$$ 202525 -139830 -383480 -361489 324584 196569 75760 73312 67094 310750 -26295 -185960
1610a85960k09594k24725K03032n1645P9098M67936k51255J8188j85204L72630
$$ -185960 -395554 -620279 -417247 -468892 -389794 78142 -173113 -154925 -340129 32501
1600C2501k28643r9320L06826j33768J66348R8123P7810p5463l67586j22023m75201
$$ 32501 -196142 -295462 11364 -122404 43944 142067 219877 144414 -223172 -345195 -820396
1589h20396J61534O97458J23649j41724j33913m144l1079k13481k96718M55068
$$ -820396 -658862 38596 162245 20521 -113392 -117536 -148615 -362096 -658814 -203746
1579b03746K30995R1486O2792Q0726l82561m28668R324K27813k7352K36298L40390
$$ -203746 27249 118735 181527 262253 -120308 -548976 -539652 -311839 -339191 -102893 237497
1568B37497N7812l3357k00329o9628K4751J18801P9569J92825o54445K22171M25084
$$ 237497 295309 261952 61623 -8005 16746 135547 215116 407941 -246504 -24333 400751
1557D00751j69993o4940L918o7753j56713j38833M07581k3632k84521K78969q7388
$$ 400751 230758 165818 169736 101983 -54730 -193563 214018 190386 -94135 184834 97446
1546I7446l2693k45626o5110m25372K17442k24211L81358N98929k2727R3445k8628
$$ 97446 64753 -180873 -245983 -671355 -453913 -678124 -296766 302163 279436 372881 344253
1535C44253n99208L51709n34771j2077K5539m85639R7374N35677L75927L5831
$$ 344253 -254955 96754 -438017 -450094 -424555 -910194 -812820 -277143 98784 134615
1525A34615n13558l29080N3740K91274k09222k88894J16640k47856j70956J31401
$$ 134615 -378943 -708023 -654283 -363009 -572231 -861125 -744485 -992341 -1163297 -1031896
1515a031896L81173O30470N97407l32667l72187q6033m7118J72296J28799k32251
$$ -1031896 -650723 -20253 577154 244487 -127700 -213733 -260851 -88555 40244 -192007
1505a92007Q2777R1484O52008L92489o11160p28586J27945N83012J327J69071
$$ -192007 -109230 -17746 634262 1026751 415591 -312995 -185050 397962 399289 568360
1495E68360r9889m97890n9849j61406K51368k32740N6048l8644L94591J86979
$$ 568360 468471 -29419 -89268 -250674 694 -232046 -175998 -214642 179949 366928
1485C66928J14830n38027J62613L9906O5468Q7001p30438k78734J31782L7771
$$ 366928 481758 -56269 106344 146250 211718 298719 -431719 -710453 -578671 -540900
1475e40900M76414J14671k74014j69455n8738M06689O301m88407L53346L54202
$$ -540900 -64486 50185 -223829 -393284 -452022 -45333 -39032 -527439 -174093 180109
1465A80109L26033n9172j91286L25195m02094O4070j23715j76708J17483k80409
$$ 180109 506142 446970 255684 580879 178785 242855 119140 -57568 59915 -220494
1455b20494P0453K25195k5799j98321l03641j38931M1056j34682J99456M81367
$$ -220494 -150041 75154 49355 -148966 -452607 -591538 -550482 -685164 -485708 -4341
1445d341j59782K20975j43952K78659L17193o78965o42381N26446N78855k57064
$$ -4341 -164123 56852 -87100 191559 508752 -170213 -812594 -286148 292707 35643
1435C5643l6800j08572j91708j44460K51453K31734j40993O02254q0600r52550
$$ 35643 -1157 -109729 -301437 -445897 -194444 37290 -103703 498551 417951 -534599
1425e34599J07651J62773k16573K48810M10047j91631J65080k13173J1262O05084
$$ -534599 -426948 -264175 -480748 -231938 178109 -13522 151558 -61615 -50353 554731
1415E54731P8257n20296N8027j53400J9834j51306k92870O83188k8051j9563j90407
$$ 554731 632988 112692 170719 17319 37153 -114153 -407023 276165 248114 228551 38144
1404C8144J28854j83080k36156J37541N97001M87139q91196m96654l0483K12134
$$ 38144 166998 -16082 -252238 -114697 482304 969443 78247 -418407 -448890 -236756
1394b36756J75138m15108k96450P82230K93651j22974j36999j60361j3206l50870
$$ -236756 -61618 -476726 -773176 9054 302705 179731 42732 -117629 -130835 -481705
1384d81705r0550K40732K6792K81565l57408j80007K69436k51247J98467P23684
$$ -481705 -572255 -331523 -304731 -23166 -380574 -560581 -291145 -542392 -343925 379759
1374C79759k32507o1879M4530n2120k03998p25548O22003n0506j13466o1079P50282
$$ 379759 147252 85373 129903 77783 -126215 -851763 -229760 -280266 -393732 -454811 295471
1363B95471L1303m33072j28107M46106J66773k53027K70748m534q43108j68395
$$ 295471 326774 -106298 -234405 211701 378474 125447 396195 391661 -451447 -619842
1353f19842K74209Q3143k2051k96094m95189M96682J12462L03725K01034j71395
$$ -619842 -345633 -262490 -284541 -580635 -1075824 -579142 -466680 -162955 38079 -133316
1343a33316l21968L38346K77430j82009M2180K1773j61299p90898N68096L02385
$$ -133316 -455284 -116938 160492 -21517 20663 42436 -118863 -909761 -341665 -39280
1333c9280m4686l01183J51717l49184K20759M31277q1698l44762o70453O13198
$$ -39280 -83966 -385149 -233432 -582616 -361857 69420 -12278 -357040 -1027493 -414295
1323d14295K04718Q6709P6219l79033L09524l00093K94503L49962m51430L5532
$$ -414295 -209577 -122868 -46649 -425682 -116158 -416251 -121748 228214 -223216 -187684
1313a87684m86845L82384O72818k85814k49860j51910m11338P4181k94361K83998
$$ -187684 -674529 -292145 380673 94859 -155001 -306911 -718249 -644068 -938429 -654431
1303f54431O12025l36751L72062j01957O69245j74780o28142J66244J69645m11991
$$ -654431 -42406 -379157 -7095 -109052 560193 385413 -242729 -76485 93160 -318831
1293c18831j841m53513K82157N0092k63984O0267N61994N56520k417J12307r75055
$$ -318831 -320672 -774185 -492028 -441936 -705920 -645653 -83659 472861 470444 582751 -392304
1282c92304J19429K78300p9282P6101K8244K86696M36025L962k31206l65976r26257
$$ -392304 -272875 5425 -73857 2244 30488 317184 753209 757171 525965 159989 -766268
1271g66268m22961R56594j58098J65716L93612J27818k50553K9894K1813l13772
$$ -766268 -1189229 -232635 -390733 -225017 168595 296413 45860 75754 97567 -216205
1261b16205J44009m03553j37461K53542J77401M86786O4829l18857k74103l06400
$$ -216205 -72196 -475749 -613210 -359668 -182267 304519 369348 50491 -223612 -530012
1251e30012L4233r3628L20253N36869k53750p1552m2401n89416P6771M12855j38236
$$ -530012 -495779 -589407 -269154 267715 13965 -57587 -99988 -689404 -612633 -199778 -338014
1240c38014J23664k76345M71697l27700J103L22463n7852Q781O7730J71568k37909
$$ -338014 -214350 -490695 -18998 -346698 -345595 -23132 -80984 -72203 -4473 167095 -70814
1229g0814M12302N2859q21249M53183L83454r1930q6832m05822M19563l18325
$$ -70814 341488 394347 -426902 26281 409735 317805 230973 -174849 244714 -73611
1219g3611K33607J13375L22301l69528o56178o8441N84162J05998J0841k43599
$$ -73611 159996 273371 595672 226144 -430034 -498475 85687 191685 202526 -41073
1209d1073K11320K34636j96847l20697o53033m7923R46264r1845l81836L343J18578
$$ -41073 170247 404883 208036 -112661 -765694 -813617 132647 40802 -341034 -337691 -219113
1198b19113M10944o5819J37017q6298m57719N0687J47032k06417l53866j87507
$$ -219113 191831 126012 263029 176731 -280988 -230301 -83269 -289686 -643552 -831059
1188h31059M93536L76197r4649k19401j34256P077K79145Q35259o47336o1510
$$ -831059 -337523 38674 -55975 -275376 -409632 -402555 -123410 711849 64513 3003
1178C003Q8018l02091L57244K01311Q8862k04787M8447L6663k30757j31321M02534
$$ 3003 91021 -211070 146174 347485 436347 231560 280007 316670 85913 -45408 357126
1167C57126J86911j31094r7407Q3518n61537J31601J70564k55958J52714K34189
$$ 357126 544037 412943 315536 399054 -162483 -30882 139682 -116276 36438 270627
1157B70627k45958m05664L9550N12893K27538n96596j77073Q9707J34853K90671
$$ 270627 24669 -380995 -341445 171448 398986 -197610 -374683 -284976 -150123 140548
1147A40548J06994o8562j94968k80918L25571L19042O883k77002K01017o05110
$$ 140548 247542 178980 -15988 -296906 28665 347707 354590 77588 278605 -326505
1137c26505m07398O16765l9838K75004L59886J26383o86427N2794M5844k15138
$$ -326505 -733903 -117138 -156976 118028 477914 604297 -82130 -29336 16508 -198630
1127a98630N4684K48479k7829k71371n14413P1737o9309J41138M92082K15065
$$ -198630 -143946 104533 76704 -194667 -709080 -637343 -706652 -565514 -73432 141633
1117A41633k74182Q23432l43691o11021k8727l43717K59530J46626K89476L34193
$$ 141633 -132549 690883 347192 -263829 -292556 -636273 -376743 -230117 59359 393552
1107C93552q26793j43117R81434N38376m36917j97055N14026l38399k70823j73441
$$ 393552 -433241 -576358 405076 943452 506535 309480 823506 485107 214284 40843
1097D0843M48292Q1382l61608j7638p5990o70590R4050M22920K83401j26422m1574
$$ 40843 489135 570517 208909 191271 115281 -555309 -461259 -38339 245062 118640 77066
1086G7066L0423k09779l45309K51963L47834J81679k70184o55886n6688K90895
$$ 77066 107489 -102290 -447599 -195636 152198 333877 63693 -592193 -648881 -357986
1076c57986M08703j02805N07541q9977m95357k6077j78792j82478N7652m0757
$$ -357986 50717 -52088 455453 365476 -129881 -155958 -334750 -517228 -459576 -500333
1066e00333P3225K05587N64646k6141m49044L69833j52538l04550J15213L3073
$$ -500333 -427108 -221521 343125 316984 -132060 237773 85235 -219315 -104102 -71029
1056g1029Q78018K60837n63898j12647M2409L9294n58411n52149L15952j79018
$$ -71029 806989 1067826 503928 391281 433690 472984 -85427 -637576 -321624 -500642
1046e00642N19617P7708K45516k2643k59779j24436J99856J9668j42076m40886
$$ -500642 18975 96683 342199 319556 59777 -64659 135197 154865 12789 -428097
1036d28097k5599M45710j2285M75686l76725J2633o14288j16046K4711P6804L23757
$$ -428097 -453696 -7986 -20271 455415 78690 91323 -522965 -639011 -614300 -537496 -213739
1025b13739K85228O9834j74835K59166J98687q26447p4774J8147L33474N4087
$$ -213739 71489 141323 -33512 225654 424341 -402106 -476880 -458733 -125259 -71172
1015g1172p6880k24692n3791k19015o21K8570k99020L47078M00232N47624k35571
$$ -71172 -148052 -372744 -426535 -645550 -646171 -617601 -916621 -569543 -169311 378313 142742
1004A42742k52481K39161p2564K60409j74744N5508R8182r0618l58653K15802
$$ 142742 -109739 129422 56858 317267 142523 198031 296213 205595 -153058 62744
994F2744Q2427M66595m65531l07516j76617l2856N51396L02829k45390L26221
$$ 62744 145171 611766 146235 -161281 -337898 -370754 180642 483471 238081 564302
984E64302K46741P3264o78791o36997P60137m94828K02108M2024J65723l91532
$$ 564302 811043 884307 205516 -431481 328656 -166172 35936 77960 243683 -147849
974a47849Q7392L30307L37980k95525R881K48724K45290m16435l99679K532Q9333
$$ -147849 -60457 269850 607830 312305 322186 570910 816200 399765 86 2618 91951
963I1951l37657J22015O02007K09554j7044l78592k61641m90270j05080J18077
$$ 91951 -245706 -123691 478316 687870 670826 292234 30593 -459677 -564757 -446680
953d46680Q6192o5993M87735Q3724k01782p8820M22390k3685j04958j95198l07393
$$ -446680 -360488 -426481 61254 144978 -56804 -135624 286766 263081 158123 -37075 -344468
942c44468K70937j10218k94900Q565K60614j06382k40315M54045J68825m2151
$$ -344468 -73531 -183749 -478649 -470084 -209470 -315852 -556167 -102122 66703 24552
932B4552Q4978j79850j10926L038L46788j14743k18872k44652L30497K26848k02223
$$ 24552 109530 -70320 -181246 -178208 168580 53837 -165035 -409687 -79190 147658 -54565
921e4565L58017j73655J32889K15974o46322k07451L91517J27691l89728L57065
$$ -54565 303452 129797 262686 478660 -167662 -375113 16404 144095 -245633 111432
911A11432L18380j7881l54040k95220L13396j22851r7298j8907l52704K32272
$$ 111432 429812 411931 57891 -237329 76067 -46784 -144082 -162989 -515693 -283421
901b83421r1089O95154j27946K89038j09602m19379k56917N36135O5032r445N1743
$$ -283421 -374510 320644 192698 481736 372134 -47245 -304162 231973 297005 287560 339303
890C39303k70201j62504l41421M82039j04986J22258N188J19892l54906N59864
$$ 339303 69102 -93402 -434823 47216 -57770 64488 69676 189568 -165338 394526
880C94526N7155p50684m33062M77492O5975N2692o43260J58032K17520K68292
$$ 394526 451681 -299003 -732065 -254573 -188598 -135906 -779166 -621134 -403614 -135322
870a35322O96832k64240n57781j68964K57449P3195j63138J91547L97915j002627
$$ -135322 561510 297270 -260511 -429475 -172026 -98831 -261969 -70422 327493 -675134
860f75134k27719P77025O62110l54526l085j87552k19601j80272J00093L24916
$$ -675134 -902853 -125828 536282 181756 178671 -8881 -228482 -408754 -308661 16255
850A6255R180j422N7297k50819j93766J50120L22018P4132m45980j04884Q4729
$$ 16255 25435 24013 81310 -169509 -363275 -213155 108863 182995 -262985 -367869 -283140
839b83140k14932m5274j5023j20141k30147K11501M74109L73335K60149j30553
$$ -283140 -498072 -543346 -558369 -678510 -908657 -697156 -223047 150288 410437 279884
829B79884k1730j77788j27356K07257L97392l81769L08290M35679j6904o29306
$$ 279884 258154 80366 -46990 160267 557659 175890 484180 919859 902955 273649
819B73649m69390R0141L63010J1035m35778K27991M04307j74433m66489L56158
$$ 273649 -195741 -105600 257410 268445 -167333 60658 464965 290532 -175957 180201
809A80201K22031m77589k97977J25273N86669l8219r4891J25299m18056j40499
$$ 180201 402232 -75357 -373334 -248061 338608 300389 205498 330797 -87259 -227758
799b27758J66245J9220k23958P3938k56J24286J13292k09734J01533P1362j80422
$$ -227758 -61513 -42293 -266251 -192313 -192569 -68283 45009 -164725 -63192 8170 -172252
788a72252j24411K52381K14226k15943J25620P8582L5949q7113L14846J9290m90625
$$ -172252 -296663 -44282 169944 -45999 79621 158203 194152 107039 421885 441175 -49450
777d9450K36172r698j79442L2314J43047k48515L76756j3681l30182M60027K14183
$$ -49450 186722 177024 -2418 29896 172943 -75572 301184 287503 -42679 417348 631531
766F31531l99150R8078R7225l17125n91409O5553M98466j48255K91343K82076
$$ 631531 232381 330459 427684 110559 -480850 -415297 83169 -65086 226257 508333
756E08333m28856j50580k80174L13727N6592J91405J98147K4514K78004j22978
$$ 508333 79477 -71103 -351277 -37550 19042 210447 408594 433108 711112 588134
746E88134p91671p99790K85617K71479K86800r5019q0777M33351K49513k15972
$$ 588134 -203537 -1003327 -717710 -446231 -159431 -254450 -335227 98124 347637 131665
736A31665M03547m39474q833j48796J36624N29222q75506p3360L65107K83059
$$ 131665 535212 95738 86905 -61891 74733 603955 -271551 -344911 20196 303255
726C03255k26308M3423k49267k02167L44838N35166m96742j18708J53694m19427
$$ 303255 76947 120370 -128897 -331064 13774 548940 52198 -66510 87184 -332243
716c32243J55576R6183k6176K8351j81317k19026q2043M10412M94238o94709j6784
$$ -332243 -176667 -80484 -106660 -78309 -259626 -478652 -560695 -150283 343955 -350754 -367538
705c67538O43956K87253l23984l84689K78834r6448M34311K03411k69490n6212
$$ -367538 276418 563671 239687 -145002 133832 37384 471695 675106 405616 349404
695C49404p1944k85028p5123K80065n1020l79393l47771J7439L42465M90444j94896
$$ 349404 277460 -7568 -82691 197374 146354 -233039 -580810 -563371 -220906 269538 74642
684G4642R3661j97369o8810n3759j09008K69151J3688l96706N76488J91114J50990
$$ 74642 168303 -29066 -97876 -151635 -260643 8508 22196 -374510 201978 393092 544082
673E44082K85502m61633j75958O56961M2938l05243m85550L520M6521l06082j44963
$$ 544082 829584 367951 191993 848954 891892 586649 101099 104619 151140 -154942 -299905
662b99905L26395K13627K61988L28370k75316J77292l24876k14552q2862J81241
$$ -299905 26490 240117 502105 830475 555159 732451 407575 193023 110161 291402
652B91402m51752J59807L47675k08880j35242k92709k80813R5809L81388m19441
$$ 291402 -160350 -543 347132 138252 3010 -289699 -570512 -474703 -93315 -512756
642e12756K11418K53417M02683P0535k43056j69535J76631l14877K98226M46385
$$ -512756 -301338 -47921 354762 425297 182241 12706 189337 -125540 172686 619071
632F19071n7528n02742l29358P64855L62958n6719k22951j56102k09921l78162
$$ 619071 561543 58801 -270557 494298 857256 800537 577586 421484 211563 -166599
622a66599L80429P8615Q8697K15590j95299l44422r768J98579N7931m80993K30851
$$ -166599 213830 292445 381142 596732 401433 57011 47243 245822 303753 -177240 53611
611E3611L03466k92183j29239k5435K25397o0996j20666k52081p8151L02573O34612
$$ 53611 357077 64894 -64345 -89780 135617 74621 -46045 -298126 -376277 -73704 560908
600E60908j99446k00347j02638R5885j3071k7109l2226M7521p3217P46025k86209
$$ 560908 361462 161115 58477 154362 141291 114182 81956 129477 56260 802285 516076
$$ [...]
##END NTUPLES=NMR SPECTRUM
##END=
