##TITLE=1H_TG-23690
 CDCl3
 8 sc, 
 17.1.2023
##JCAMPDX= 6.0         $$ Bruker NMR JCAMP-DX V2.0
##DATA TYPE= NMR SPECTRUM
##DATA CLASS= NTUPLES
##ORIGIN= UXNMR, Bruker Analytische Messtechnik GmbH
##OWNER= root
$$ XWIN-NMR		Version 3.5
$$ Tue Jan 17 14:04:02 2023 Russian Standard Time (UT+4h)  she@DPX200
##.OBSERVE FREQUENCY= 200.13135
##.OBSERVE NUCLEUS= ^1H
##.ACQUISITION MODE= SIMULTANEOUS
##.ACQUISITION SCHEME= undefined
##.AVERAGES= 8
##.DIGITISER RES= 18
##SPECTROMETER/DATA SYSTEM= spect
##.PULSE SEQUENCE= zg30
##.SOLVENT NAME= CDCl3
##.SHIFT REFERENCE= (INTERNAL, CDCl3, 0, 15.7722)
##AUDIT TRAIL= $$ (NUMBER, WHEN, WHO, WHERE, WHAT)
$$ ##TITLE= Audit trail, XWIN-NMR		Version 3.5
$$ ##JCAMPDX= 5.01
$$ ##ORIGIN= Bruker BioSpin GmbH
$$ ##OWNER= she
$$ F:/spectra/data/she/nmr/H-F/1/pdata/1/auditp.txt
$$ ##AUDIT TRAIL=  $$ (NUMBER, WHEN, WHO, WHERE, WHAT)
(   1,<2023-01-17 14:02:24.26 +0400>,<she>,<DPX200>,
      <created by zg, POWCHK disabled, PULCHK disabled
       configuration hash MD5:
       00 E9 B6 7A A2 85 ED C7 34 08 36 98 17 FE 4E 26
       data hash MD5: 16K
       CD 80 52 92 A4 28 24 47 5D 12 1F 2F 3F 77 09 9D>)
(   2,<2023-01-17 14:02:26.67 +0400>,<she>,<DPX200>,
      <Start of raw data processing
       efp BC_mod = 2 LB = 0.24 FT_mod = 6 PKNL = 1 PHC0 = -19115.5 PHC1 = 18.40073 SI = 16K 
       data hash MD5: 16K
       06 4D 4D 14 04 65 7B 32 AC 59 B9 50 FF CE 1D 2A>)
(   3,<2023-01-17 14:02:46.31 +0400>,<she>,<DPX200>,
      <pk PHC0 = 0.179955 PHC1 = -1.6 
       data hash MD5: 16K
       3A 52 3D 51 6C 91 E7 53 D2 0B 40 3A 33 17 76 C8>)
(   4,<2023-01-17 14:02:49.32 +0400>,<she>,<DPX200>,
      <abs ABSG = 5 
       data hash MD5: 16K
       DE BC 17 2A FD B3 15 4F 8A 5D F4 76 C3 04 81 79>)
(   5,<2023-01-17 14:03:29.70 +0400>,<she>,<DPX200>,
      <pk PHC0 = -1.818175 PHC1 = 0 
       data hash MD5: 16K
       DE A6 4D D5 51 A5 1C F9 C6 7B F8 CF 29 C1 FE 6C>)
(   6,<2023-01-17 14:03:33.59 +0400>,<she>,<DPX200>,
      <abs ABSG = 5 
       data hash MD5: 16K
       4E B7 B0 BA 63 FC 14 6E 0E 78 F9 34 F0 BC FA 77>)
$$ ##END=
$$ 
$$ hash MD5
$$ E3 4D 9C D9 B6 A3 FC F1 E4 0C 07 59 A0 D4 61 7B
##$RELAX= 
##$RELAX= 
##$RELAX= 
##$RELAX= 
##$RELAX= 
##$RELAX= 
$$ Bruker specific parameters
$$ --------------------------
##$DU= <F:/spectra>
##$EXPNO= 1
##$NAME= <H-F>
##$PROCNO= 1
##$TYPE= <nmr>
##$USER= <she>
##$AMP= (0..31)
100 100 100 100 100 100 100 100 100 100 100 100 100 100 100 100 100 100 
100 100 100 100 100 100 100 100 100 100 100 100 100 100 
##$AQSEQ= 0
##$AQ_mod= 1
##$AUNM= <au_zg>
##$AUTOPOS= <>
##$BF1= 200.13
##$BF2= 200.13
##$BF3= 200.13
##$BF4= 200.13
##$BF5= 200.13
##$BF6= 200.13
##$BF7= 200.13
##$BF8= 200.13
##$BYTORDA= 1
##$CFDGTYP= 0
##$CFRGTYP= 5
##$CHEMSTR= <none>
##$CNST= (0..31)
1 1 145 1 1 1 1 1 1 1 1 1 1 1 1 1 1 1 1 1 1 1 1 1 1 1 1 1 1 1 1 1 
##$CPDPRG= <>
##$CPDPRG1= <>
##$CPDPRG2= <>
##$CPDPRG3= <>
##$CPDPRG4= <mlev>
##$CPDPRG5= <mlev>
##$CPDPRG6= <mlev>
##$CPDPRG7= <mlev>
##$CPDPRG8= <mlev>
$$ [...]
##$SUBNAM3= <"">
##$SUBNAM4= <"">
##$SUBNAM5= <"">
##$SUBNAM6= <"">
##$SUBNAM7= <"">
##$SUBNAM8= <"">
##$SUBNAM9= <"">
##$SW= 18.05172834244
##$SWIBOX= (0..15)
0 0 2 0 0 0 0 0 0 0 0 0 0 0 0 0 
##$SW_h= 3612.71676300578
##$TD= 16384
##$TD0= 1
##$TE= 0
##$TE2= 300
##$TE3= 300
##$TEG= 300
##$TL= (0..7)
0 120 120 120 120 120 120 120 
##$TP= (0..7)
150 150 150 150 150 150 150 150 
##$TP07= 0
##$TPNAME0= <>
##$TPNAME1= <>
##$TPNAME2= <>
##$TPNAME3= <>
##$TPNAME4= <>
##$TPNAME5= <>
##$TPNAME6= <>
##$TPNAME7= <>
##$TPOAL= (0..7)
0.5 0.5 0.5 0.5 0.5 0.5 0.5 0.5 
##$TPOFFS= (0..7)
0 0 0 0 0 0 0 0 
##$TUNHIN= 0
##$TUNHOUT= 0
##$TUNXOUT= 0
##$USERA1= <user>
##$USERA2= <user>
##$USERA3= <user>
##$USERA4= <user>
##$USERA5= <user>
##$V9= 5
##$VALIST= <valist>
##$VCLIST= <CCCCCCCCCCCCCCC>
##$VD= 0
##$VDLIST= <DDDDDDDDDDDDDDD>
##$VPLIST= <PPPPPPPPPPPPPPP>
##$VTLIST= <TTTTTTTTTTTTTTT>
##$WBST= 1024
##$WBSW= 4
##$XGAIN= (0..3)
0 0 0 0 
##$XL= 0
##$YL= 0
##$YMAX_a= 362105
##$YMIN_a= -431915
##$ZGOPTNS= <>
##$ZL1= 120
##$ZL2= 120
##$ZL3= 120
##$ZL4= 120
##$ABSF1= 15.77223
##$ABSF2= -2.279619
##$ABSG= 5
##$ABSL= 3
##$ALPHA= 0
##$AQORDER= 0
##$ASSFAC= 0
##$ASSFACI= 0
##$ASSFACX= 0
##$ASSWID= 0
##$AUNMP= <proc_1d>
##$AZFE= 0.1
##$AZFW= 0.1
##$BCFW= 0
##$BC_mod= 2
##$BYTORDP= 0
##$COROFFS= 0
##$CY= -3
##$DATMOD= 1
##$DC= 0
##$DFILT= <>
##$DTYPP= 0
##$F1P= 0
##$F2P= 0
##$FCOR= 1
##$FTSIZE= 16384
##$FT_mod= 6
##$GAMMA= 0
##$GB= 0
##$INTBC= 1
##$INTSCL= 3.70164e-10
##$ISEN= 128
##$LB= 0.24
##$LEV0= 0
##$LPBIN= 0
##$MAXI= 10000
##$MC2= 0
##$MEAN= 0
##$ME_mod= 0
##$MI= 1.114404
##$NCOEF= 0
##$NC_proc= -6
##$NLEV= 6
##$NOISF1= 3.799351
##$NOISF2= 2.8
##$NSP= 0
##$NTH_PI= 0
##$NZP= 0
##$OFFSET= 15.77223
##$PC= 1
##$PHC0= -19117.14
##$PHC1= 16.80073
##$PH_mod= 1
##$PKNL= yes
##$PPARMOD= 0
##$PSCAL= 0
##$PSIGN= 0
##$REVERSE= no
##$SF= 200.129999862746
##$SI= 16384
##$SIGF1= 3
##$SIGF2= 2
##$SINO= 5.538805
##$SIOLD= 16384
##$SREGLST= <1H.CDCl3>
##$SSB= 0
##$STSI= 16384
##$STSR= 0
##$SW_p= 3612.71676300578
##$SYMM= 0
##$S_DEV= 0
##$TDeff= 16384
##$TDoff= 0
##$TI= <>
##$TILT= no
##$TM1= 0
##$TM2= 0
##$TOPLEV= 0
##$USERP1= <user>
##$USERP2= <user>
##$USERP3= <user>
##$USERP4= <user>
##$USERP5= <user>
##$WDW= 1
##$XDIM= 16384
##$YMAX_p= 353410806
##$YMIN_p= -353996
$$ End of Bruker specific parameters
$$ ---------------------------------
##NTUPLES= NMR SPECTRUM
##VAR_NAME=  FREQUENCY,     SPECTRUM/REAL,   SPECTRUM/IMAG
##SYMBOL=    X,             R,               I
##VAR_TYPE=  INDEPENDENT,   DEPENDENT,       DEPENDENT
##VAR_FORM=  AFFN,          ASDF,            ASDF
##VAR_DIM=   16384,         16384,           16384
##UNITS=     HZ,            ARBITRARY UNITS, ARBITRARY UNITS
##FACTOR=    0.220516191357247, 1,           1
##FIRST=     3156.49641741757, 0,            0
##LAST=      -456.220345588215, 0,           0
##MIN=       -456.220345588215, -353996,     0
##MAX=       3156.49641741757, 353410806,    0
$$ Real data points
##PAGE= N=1
##DATA TABLE= (X++(R..R)), XYDATA
$$ [...]
6701B87880K6319r2316K0919k5935L3310M7818J914L239P6399J08563j59047p5403
6689B53660j7877J3525q5943R9111Q4109K8077m808n7884n1504k6819P610Q543
6677B49800l9998o0835P4388M8529k6971k8403Q8485r4427j4369R0507K0219J8458
6665C25383l5248N1134k4344J7495m6276J6570J6147k0400n4850N483J3991m1169
6653B23916J0396P1029j13905m3308m0573j5464K4840m9951J53968J2832l0797
6642B02983J23758r2074j9683j015O0125K9181K4037O752J23890L8791k35269
6631B61476K6612L5577j09407P2529L1215j3662Q095M2913k930k1300q9666j08589
6619A32863n959J89787O9512j21600J0667J9986n0986q543R5692J1308j5356o6413
$$ y = [287880, 314199, 221883, 242802, 216867, 250177, 297995, 299909, 303148, 379547, 488110, 329063, 253660, 235783, 249308, 163365, 262476, 346585, 374662, 369854, 311970, 260466, 233647, 241257, 249800, 209802, 148967, 223355, 271884, 244913, 216510, 304995, 210568, 196199, 286706, 306925, 325383, 290135, 341269, 316925, 334420, 288144, 304714, 320861, 300461, 245611, 251094, 265085, 223916, 234312, 305341, 191436, 148128, 107555, 92091, 116931, 66980, 220948, 233780, 202983, 326741, 234667, 214984, 213969, 274094, 303275, 327312, 334064, 457954, 496745, 261476, 288088, 323665, 214258, 286787, 318002, 304340, 312435, 355348, 352418, 331118, 241452, 132863, 126904, 316691, 386203, 264603, 275270, 295256, 244270, 235727, 331419, 342727, 327371, 260958]
6607B60958M944P2283L2916p05m1695p1468m2782J19430J06281j06449n6377R2366
6595C69702l0342o7624P305Q2024K9636j41275Q8074M9080p0012j6050L6556K1467
6583C58541N2554M1204J271M811L6009q9213M3117J6876q6868J8082r508N4855
6571D41731r4231K7682Q0814n7966k8606M27K6943j7180j7604K2875N8927J8447
6559D62259k5683M874Q103N0691P9446q0801m5127k1770o5569L4130J32723M6464
6547E79740l2039j9411K9503p1357L2118p473m4227N1798k0802q5209Q006O6027
6535D86674O7884l7490j8721P4208N7406J3387p104K3885j06925P9380M2270K9110
6523G03964p5568p2099j4155M4178M6725j3806P9491O9132n7974j13884O4472
$$ y = [260958, 265902, 338185, 371101, 370396, 328701, 257233, 214451, 333881, 440162, 333713, 277336, 369702, 339360, 271736, 279041, 361065, 390701, 249426, 337500, 386580, 316568, 300518, 337074, 358541, 411095, 452299, 453570, 458381, 494390, 405177, 448294, 465170, 378302, 396384, 386876, 441731, 347500, 375182, 455996, 398030, 369424, 369851, 396794, 379614, 362010, 384885, 443812, 462259, 436576, 441450, 449553, 500244, 579690, 498889, 453762, 431992, 366423, 400553, 533276, 579740, 547701, 528290, 557793, 486436, 518554, 511081, 466854, 518652, 497850, 412641, 420647, 486674, 554558, 517068, 498347, 572555, 629961, 643348, 636244, 660129, 553204, 632584, 674854, 703964, 628396, 556297, 542142, 586320, 633045, 619239, 698730, 767862, 709888, 596004, 660476]
6512F60476O9258P2839q495k2353M3673q3996o2921J04555k6057P4007N179j26600
6500F99565j0450J6622P8819j53p472J32069J2340o802k894P0114l091l3137M8499
6487I94029j2732M635M2557q1834n6426K7202J7847L3804N416K8207J0540P7783
6475A091028N779K9224K4931k5001n0808J0616J1014M4187O9676N694j2774L7649
6463A241215n162M7376J01122L0692j54341J18513J03866O7343L3311N5233K6052
6452A665220M3348K4771o2732O581L7021P6180l6839J53044J01119r285M4818
6441B043246l9561K6407J40235L3419l2704J3042J55796M1482J6228J28268R4382
6430B620240M0466Q5398P6316j802O8266J52366J69832J08401K324J68079J09097
$$ y = [660476, 729734, 802573, 794078, 771725, 815398, 731402, 668481, 773036, 746979, 820986, 826165, 699565, 689115, 705737, 784556, 784403, 776931, 909000, 921340, 914538, 911644, 981758, 978667, 945530, 994029, 981297, 985932, 1028489, 946655, 890229, 917431, 935278, 969082, 974498, 1002705, 1013245, 1091028, 1096807, 1126031, 1150962, 1125961, 1075153, 1085769, 1096783, 1140970, 1210646, 1216340, 1203566, 1241215, 1236053, 1283429, 1384551, 1415243, 1260902, 1379415, 1483281, 1550624, 1583935, 1639168, 1665220, 1708568, 1733339, 1670607, 1677188, 1714209, 1790389, 1753550, 1906594, 2007713, 1998428, 2043246, 2003685, 2030092, 2170327, 2203746, 2171042, 2184084, 2339880, 2381362, 2397590, 2525858, 2620240, 2660706, 2746104, 2822420, 2820618, 2888884, 3041250, 3211082, 3319483, 3321807, 3489886, 3598983]
6419C598983N5923R1230J47612J64210K85220M2802K28090K15493J80379M13345
6409E423287L32536K01244M10616L52277L41562L73466M28193M64811J64698J70166
6399H662856J80009O029q5302j7323J03307L9058J00266n9254O5847K74352K10504
6388I480349L41443L18498L77450N51286O04477M40399P31136P43106Q75246R52903
6378A5416293J154809J248528J297614J335104J258609J051420P07026K88316
6370B3757719o1901n18473o99546q84321r40894q55063p92146o09425l34300l38384
6360A7723266k35805L4081J64243J86262M25151N78615P19415P80901R59433J112352
6350B2447914J342146J543449J710425J804325J845231J708255J390540R24460
$$ y = [3598983, 3654906, 3746136, 3893748, 4057958, 4343178, 4385980, 4614070, 4829563, 5009942, 5423287, 5755823, 5957067, 6367683, 6719960, 7061522, 7434988, 7863181, 8327992, 8492690, 8662856, 8842865, 8848894, 8763592, 8746269, 8849576, 8888634, 8988900, 8929646, 8995493, 9269845, 9480349, 9821792, 10140290, 10517740, 11069026, 11673503, 12113902, 12845038, 13588144, 14463390, 15416293, 16571102, 17819630, 19117244, 20452348, 21710957, 22762377, 23469403, 23757719, 23695818, 23177345, 22477799, 21593478, 20652584, 19797521, 19005375, 18395950, 18061650, 17723266, 17487461, 17521542, 17685785, 17872047, 18297198, 18875813, 19595228, 20376129, 21335562, 22447914, 23790060, 25333509, 27043934, 28848259, 30693490, 32401745, 33792285, 34716745]
6342C4716745K42953n88430j350581j796128j809691j978547k033772j640047
6334B3762502j484980j287530j013955q89751o20081l85874k56855m3145m6651
6325A7733680R0232K60079M07515M45531O11112Q66412R14105R23066R78353Q00700
6315B4030785P92025L60389p2647o56316r32655j399615j514547j436174j641490
6306A7529755j567166j226484j167290j081045p58425o95802n59046m15655m09390
6297I649452k93425k22942j47925j02287j38965o762O9012k188M0526J18099l25
6286H962270M8559m5590j93218j96875l72712m87715n86151n38316m30216m85168
6276E674868l89602l95924l33545k75922j76854k56905l19897k69149j98543q9370
$$ y = [34716745, 34959698, 34371268, 33020687, 31224559, 29414868, 27436321, 25402549, 23762502, 22277522, 20989992, 19976037, 19086286, 18466205, 18080331, 17823476, 17780331, 17733680, 17823912, 18083991, 18491506, 18937037, 19548149, 20414561, 21328666, 22251732, 23230085, 24030785, 24822810, 25183199, 25110552, 24454236, 23521581, 22121966, 20607419, 19171245, 17529755, 15962589, 14736105, 13568815, 12487770, 11729345, 11033543, 10474497, 10058842, 9649452, 9356027, 9133085, 8985160, 8882873, 8743908, 8737146, 8806158, 8803970, 8844496, 8962595, 8962270, 9010829, 8965239, 8772021, 8575146, 8202434, 7714719, 7128568, 6590252, 6160036, 5674868, 5285266, 4889342, 4555797, 4279875, 4103021, 3846116, 3526219, 3257070, 3058527, 2969157]
6266B969157o4875j21526k34061j80606l1360n2009j13171N5017j99034m0303
6256A987229p8328j2841J489n0891l5738q5991p6263k3342q5154k0229n8248r829
6244A451864p7793k02334Q1980Q6829j07251n5953N1799o9718n0622m3212q1120
6233I84469j01934J04356N2288j01317R134k6204j02864O1192J6046k3314J9803
6222H91655j8245j01848m4671M3764j3146j9244l731K371M263L075j00j33773
6210F10370o8959j2842r694n557K432O2433N9247n7533j2897q5054N7356O2800
6198F02102o8805q6591m4131J12660J275o5399l7149l3785M8039N9891K0213j2181
6186D96139p2610J3553M4149m8731o0857l1926j9049l1975K6791J066J2350p2191
$$ y = [2969157, 2904282, 2782756, 2548695, 2368089, 2336729, 2284720, 2171549, 2226566, 2027532, 1987229, 1908901, 1896060, 1897549, 1846658, 1810920, 1724929, 1648666, 1625324, 1540170, 1519941, 1461693, 1451864, 1374071, 1171737, 1253717, 1340546, 1233295, 1177342, 1229141, 1159423, 1108801, 1065589, 984469, 882535, 986891, 1039179, 937862, 946996, 920792, 817928, 879120, 895166, 871852, 891655, 873410, 771562, 726891, 770655, 757509, 738265, 734534, 736905, 741168, 744243, 744143, 610370, 541411, 528569, 518875, 513318, 515750, 578183, 637430, 579897, 567000, 481946, 539302, 602102, 533297, 446706, 402575, 515235, 516510, 451111, 413962, 380177, 428216, 488107, 508320, 496139, 423529, 437082, 481231, 432500, 371643, 339717, 320668, 288693, 315484, 316550, 328900, 256709]
6174B56709j8617k628R9960R912j6766j0138j11483J23584J26859j03970m2041
6163C11381j3233P6977j4382r9323n0358J01006j6113q2773P7563j6262j00364
6152A74119r3174Q5687N2164K8523K3204Q1107k3440j11135J3354j9503J7715
6141B28621Q9805r169l8373P6611j0138Q0854q0523k7951K0294K9646j4733m8262
6129B96682j6963l0010n6003R2210k9458j8223N5143J9520J8855m9334j7780k7099
6117B37540n0560J5629l659j3529K00970p0158j34237l4473N6193l9598Q4033
6106B48151l7315m6229N0045J6460Q023K9968o3515P1096J01730J6968r7660r006
6094B88716L6126J9570n2416r319J09833j28835j5315j0219m8895J13907L3147
$$ y = [256709, 238092, 235464, 335424, 345336, 328570, 318432, 206949, 330533, 457392, 353422, 311381, 298148, 375125, 360743, 261420, 211062, 312068, 295955, 213182, 290745, 274483, 174119, 80945, 166632, 218796, 247319, 270523, 351630, 328190, 217055, 230409, 210906, 228621, 318426, 309257, 270884, 347495, 337357, 418211, 337688, 309737, 330031, 359677, 344944, 296682, 279719, 249709, 193706, 285916, 256458, 238235, 293378, 312898, 331753, 282419, 264639, 237540, 186980, 202609, 198950, 185421, 386391, 316233, 181996, 147523, 203716, 164118, 248151, 210836, 164607, 214652, 231112, 239135, 269103, 205588, 276684, 378414, 395382, 297722, 288716, 324842, 344412, 291996, 282677, 392510, 263675, 248360, 238141, 189246, 303153, 336300]
6083C36300R1948N677k09016r5725N5503k0943M8519n1316k7651O9965J33274
6072C36535l8867m025J2012l65r4818Q824j8033J12714K4922o6361l468M7162
6060C16232M9287O462L4367q5221N105K2j16451P5353l1084L0162J59244n3600
6048C89878O122j6452n5754l1203N5458q6408o069M6996J30730N6097n1159n1449
6036C86787M0075q6826n5827K7655J62645M1400m2894j185N36q2334M5732l420
6024D32344l9076R0067j929L67N1215j04123P1915o8888M7640J20189j91247P2437
6012D80911J1708m5823O8238R872p1048L3268J60178n223P419o9990o4836j1003
6000E03671p2380J84408K8397n317q0143j6357R8704l2700M587k1549l9712O2187
$$ y = [336300, 428248, 433925, 224909, 129184, 184687, 163744, 212263, 160947, 133296, 203261, 336535, 297668, 293643, 305655, 305290, 210472, 219296, 201263, 313977, 338899, 272538, 269070, 316232, 365519, 371981, 406348, 321127, 326232, 326254, 209803, 285156, 254072, 284234, 443478, 389878, 396000, 379548, 323794, 292591, 348049, 261641, 255572, 302568, 433298, 489395, 438236, 386787, 426862, 340036, 284209, 311864, 474509, 515909, 473015, 471830, 472366, 390032, 435764, 432344, 393268, 483335, 481406, 481773, 532988, 428865, 500780, 431892, 479532, 599721, 408474, 480911, 492619, 446796, 515034, 524906, 453858, 487126, 647304, 642081, 649500, 579510, 514674, 503671, 431291, 615699, 644096, 638779, 558636, 542279, 640983, 608283, 612870, 591321, 551609, 613796]
5988F13796L2440O2809k5280L2889l6130r3509p072J28594Q5806p8650O879r8290
5976F24282p0446M9919K7673O9640O6225p3271P7629Q809j25196l7346L1724R8947
5964G48589O9294J5655k2168n0363M6718p8055N6308j3941L1341n1056q8707J18208
5952G81823k6127p897M515q1735n936J38623M9383p4141R7564j09277m3201O9471
5940G93065o95j7447j17712O293O1646j3378J2444P8224m6065Q3507j1601o8855
5928G59426l0332L2649J03473k3518j7937n159L3361J8890K7709k3040j0630p5598
5916G89294J6744M9820m0779m7692L4406p816o2005Q1234J8172J3044J5736K6585
5904H86743K3904n2514l4496O5029l9787j09411R0939N1487j1175N7914P2300
$$ y = [613796, 646236, 709045, 683765, 716654, 680524, 587015, 579943, 708537, 794343, 715693, 722572, 624282, 553836, 603755, 631428, 701068, 767293, 694022, 771651, 780460, 655264, 617918, 649642, 748589, 817883, 833538, 811370, 761007, 807725, 729670, 785978, 772037, 803378, 752322, 663615, 781823, 755696, 747799, 752314, 670579, 664643, 803266, 852649, 778508, 876072, 766795, 723594, 793065, 792370, 774923, 657211, 663504, 725150, 711772, 724216, 802440, 756375, 839882, 828281, 759426, 729094, 761743, 865216, 841698, 823761, 818602, 851963, 870853, 898562, 875522, 864892, 789294, 806038, 855858, 815079, 767387, 801793, 793977, 731972, 813206, 831378, 844422, 860158, 886743, 910647, 858133, 823637, 888666, 848879, 739468, 830407, 881894, 870719, 928633, 1000933]
5893A000933K7733k3107l3538R242M3257j4795o9546R5975O3790L5665M3700j41845
5881A037464J6298k0100R2464J0289n7616K3841J141l5037Q1506l4704K2658K8350
5869A166554N9046j3080K4529Q5608l2918j12048J2197N8680K6626n9114n4868
5858A161212J07563L8166k1157k6451R6271L0249o6392M7709L6740j02166M7151
5847A348895l4057O589r6396p42J00080K1728M0542m3182m3545L7922M6319p6928
5835A307225N6135N7054j34674L8684J40002R896n0403M62M7073r071m6905l7795
5823A377683P7216o1355p3742o961J18003R8038m4744j45564P2118J2465N9291
5812A482448O5118N4349J7585k594j18110Q0554J1398k4983J53967q6244j12663
$$ y = [1000933, 1028666, 1005559, 972021, 981263, 1024520, 1009725, 940179, 1036154, 1099944, 1135609, 1179309, 1037464, 1053762, 1033662, 1126126, 1136415, 1078799, 1102640, 1103781, 1068744, 1150250, 1115546, 1138204, 1166554, 1225600, 1212520, 1237049, 1322657, 1289739, 1177691, 1189888, 1248568, 1275194, 1216080, 1161212, 1268775, 1306941, 1285784, 1259333, 1355604, 1385853, 1319461, 1367170, 1403910, 1301744, 1348895, 1314838, 1321427, 1225031, 1224289, 1324369, 1346097, 1386639, 1343457, 1299912, 1337834, 1384153, 1307225, 1363360, 1420414, 1285740, 1324424, 1464426, 1474322, 1423919, 1424381, 1471454, 1462383, 1415478, 1377683, 1454899, 1393544, 1319802, 1312841, 1430844, 1528882, 1484138, 1338574, 1410692, 1423157, 1482448, 1547566, 1601915, 1619500, 1616906, 1498796, 1579350, 1590748, 1565765, 1719732, 1633488, 1520825]
5801A520825M9938o202Q1232J05755q2925L6188j672J6308k6824J7160M3262J10523
5789A863568J860j2088J47277J4872M914j05660p8627j7194R2805J43439k4760
5778B030406k3332m753J36494J7792R7410J3057J01036L393N3417k1105J2783
5767B416598J25179p312k9891O435P0663O165O2478k6841m7691J13440K0239Q9917
5755B799379M076M5113P564J9041p995P729m3121P7545k303J01643P9510O7469
5743C155650M1066Q5732J08543J76816l1676o6608J24324L9126P9831R0082J13363
5732C916249M7630O762k1594O1261K4342Q6018J04394N0946m432n2384J67171
5721D386363J27281l2885J77428J1269P8578M8254m1408J34098O3396Q1633Q4229
$$ y = [1520825, 1570763, 1564561, 1645793, 1751548, 1668623, 1704811, 1703139, 1719447, 1692623, 1709783, 1753045, 1863568, 1865428, 1853340, 2000617, 2015489, 2020403, 1914743, 1836116, 1818922, 1911727, 2055166, 2030406, 2007074, 2002321, 2138815, 2156607, 2254017, 2267074, 2368110, 2371503, 2424920, 2403815, 2416598, 2541777, 2534465, 2504574, 2511009, 2581672, 2587837, 2650315, 2623474, 2575783, 2689223, 2709462, 2799379, 2803455, 2848568, 2856132, 2875173, 2867178, 2874907, 2831786, 2909331, 2907028, 3008671, 3088181, 3155650, 3196716, 3282448, 3390991, 3567807, 3536131, 3469523, 3593847, 3632973, 3712804, 3802886, 3916249, 3963879, 3970641, 3949047, 4010308, 4034650, 4120668, 4225062, 4276008, 4271576, 4219192, 4386363, 4513644, 4480759, 4658187, 4669456, 4748034, 4796288, 4754880, 4888978, 4952374, 5034007, 5118236]
5710E118236O7043J86204J34205Q6274K67088K05236n2116K12992J53689J63743
5700F542594J22022J33109J49274J74289J25506K03657K55975J77520K17807J10518
5690H212271L23860K40266J81291K31256J98030K02901K91793M80793L78812L31002
5680A1072275M56273L77143N34511N33687N35007N96733N43027P34585P32135
5671A6115376R94457R33690J092471J205159J281135J494070J738264J817079
5663B6671701J953621K051561K102319J934364J677378J310222O99009K45202
5655C8645377k6436m00219n48800m89742l65204l89488l77293n17787p13408p45955
5645C4071045q27100o21953m15102l26376l5288K43282N16955O68524J017114
$$ y = [5118236, 5185279, 5371483, 5505688, 5591962, 5859050, 6064286, 6012170, 6225162, 6378851, 6542594, 6664616, 6797725, 6946999, 7121288, 7246794, 7450451, 7706426, 7883946, 8101753, 8212271, 8536131, 8776397, 8957688, 9188944, 9386974, 9589875, 9881668, 10362461, 10741273, 11072275, 11528548, 11905691, 12440202, 12973889, 13508896, 14105629, 14648656, 15383241, 16115376, 17109833, 18043523, 19135994, 20341153, 21622288, 23116358, 24854622, 26671701, 28625322, 30676883, 32779202, 34713566, 36390944, 37701166, 38400175, 38645377, 38618941, 38218722, 37669922, 37180180, 36814976, 36425488, 36048195, 35530408, 34817000, 34071045, 33243945, 32621992, 32206890, 31880514, 31845226, 32088508, 32605463, 33273987, 34291101]
5636C4291101J276470J499163J778073K068297K248878K539478K614759K444722
5628E0760941K107812J818331J465254J097039J019578R25868J017448R24323
5620F1136594Q34157O76753K35461K04264N3397o1119P186j95326m28727j061626
5610F1401014j843828k504077k883345l148519k970407k733140k450141k111084
5602D0756473j605012j284790r03802m81202j22507O485M99002P70335R33488
5593C8568470R67301J142988Q82774Q52735O14084M54887N00746M96818O74327
5584D5155130M79652K62982o0325n22207j211925k056845k633404k828235k828117
5575C3756706k847801k707234k409705k038792j957966j654032j385357j231230
$$ y = [34291101, 35567571, 37066734, 38844807, 40913104, 43161982, 45701460, 48316219, 50760941, 52868753, 54687084, 56152338, 57249377, 58268955, 59194823, 60212271, 61136594, 61970751, 62647504, 62882965, 63087229, 63140626, 63079507, 63086693, 62891367, 62462640, 61401014, 59557186, 57053109, 54169764, 51021245, 48050838, 45317698, 42867557, 40756473, 39151461, 37866671, 36962869, 36481667, 36359160, 36365645, 36864647, 37634982, 38568470, 39535771, 40678759, 41561533, 42414268, 43028352, 43483239, 43983985, 44480803, 45155130, 45634782, 45897764, 45837439, 45315232, 44103307, 42046462, 39413058, 36584823, 33756706, 30908905, 28201671, 25791966, 23753174, 21795208, 20141176, 18755819, 17524589]
5567A7524589j011283q78798q14353p52979n28887o27207n14936m93189m84331
5558A1418626l33280l23695m50140l72076l13575k08001j72144m57171k83797
5549H504747l9260j28735k85076l16472j61881j61676n9633j85910j77233j78878
5539F809993q0302n6643r7062j25118j15785n2384r0451q8178L8036j06325q0259
5528E955522P1571p1418k8162M7565J4076r4655m7911J832l7396l3419j04611
5517E672994J0926J29574k4669l3822k1967J71710p3764k3013M8030J058L3225
5506E890282L256J03240J2585M1331R5127O0671J9404R7293N3341J63074K3325
5495F562929q866J48358Q9132J93713R5452M6236O6908J83731K85680J06269J05486
$$ y = [17524589, 16513306, 15634508, 14820155, 14067176, 13538289, 12911082, 12396146, 11902957, 11418626, 11085346, 10761651, 10311511, 9939435, 9625860, 9417859, 9245715, 8788544, 8504747, 8465487, 8336752, 8051676, 7735204, 7573323, 7411647, 7352014, 7166104, 6988871, 6809993, 6729691, 6673048, 6575986, 6450868, 6335083, 6282699, 6192248, 6104070, 6142106, 6035781, 5955522, 6027093, 5955675, 5927513, 5975078, 5989154, 5894499, 5846588, 5848420, 5811024, 5777605, 5672994, 5683920, 5813494, 5788825, 5755003, 5733036, 5904746, 5830982, 5807969, 5855999, 5857057, 5890282, 5893538, 5996778, 6009363, 6050694, 6145821, 6206492, 6225896, 6323189, 6376530, 6539604, 6562929, 6554063, 6702421, 6791553, 6985266, 7080718, 7126954, 7193862, 7377593, 7663273, 7769542, 7875028]
5484G875028Q4054J95468L02433J15149K35343L87853J90532J51049K83869L47453
5474A0168231J30700L02076L33802M70398L32663M05259N06072M53007L78562
5465A3480770O72576N86976O83754P93808O90304R56894R95022J044945J267307
5456B1172356J338394J460668J692940J850150K103685K277072K487152K623677
5448C7006094K780758K837938K770833K467730J853045J046914L74063l18525
5440E0818850p61425j143605j182581q92385q97402p56056p40815q38017p39318
5431D2867246q86856o97475m50132l37592j20801L81244O37937P67516J205794
5422D3366881J749194K105615K300993K458572K563792K244398J847416J280274
$$ y = [7875028, 7959082, 8154550, 8456983, 8572132, 8807475, 9195328, 9385860, 9536909, 9820778, 10168231, 10298931, 10601007, 10934809, 11405207, 11737870, 12143129, 12649201, 13102208, 13480770, 14153346, 14740322, 15424076, 16217884, 16908188, 17865082, 18860104, 19905049, 21172356, 22510750, 23971418, 25664358, 27514508, 29618193, 31895265, 34382417, 37006094, 39786852, 42624790, 45395623, 47863353, 49716398, 50763312, 51137375, 50818850, 50057425, 48913820, 47731239, 46838854, 45941452, 45185396, 44444581, 43606564, 42867246, 41980390, 41282915, 40832783, 40495191, 40374390, 40755634, 41393571, 42161087, 43366881, 45116075, 47221690, 49522683, 51981255, 54545047, 56789445, 58636861, 59917135]
5414E9917135O58877m5460k42472n40321m92791m89461m73223m48197n81276q53196
5404E6409615j010690j114434j196856r93736q06594r51706r72303j055633j446034
5395D6861629j763820k024273k197309k237091j830455j831180j632526j193842
5387C2151133r40781o17647l67033l28783K1839K26353N53356N96585N03157L80727
5377C2178906M51065L33744L56199K47994K19058M00283J62520j39338n04198
5368C3706233j078848j522522j898000k114031k159154k203707j945270j813763
5360A8970938j433997j374108j175349j040062j041158p75310p11441n07616n69444
5351A0342453m95711l65023l70946m05582l50225l17940l26229l30129j65939
$$ y = [59917135, 60576012, 60530552, 60288080, 59747759, 59254968, 58765507, 58292284, 57844087, 57262811, 56409615, 55398925, 54284491, 53087635, 52093899, 51287305, 50335599, 49363296, 48307663, 46861629, 45097809, 43073536, 40876227, 38639136, 36808681, 34977501, 33344975, 32151133, 31210352, 30592705, 30225672, 29896889, 29918728, 30145081, 30698437, 31295022, 31798179, 32178906, 32629971, 32963715, 33319914, 33567908, 33786966, 34187249, 34349769, 34210431, 33706233, 32627385, 31104863, 29206863, 27092832, 24933678, 22729971, 20784701, 18970938, 17536941, 16162833, 14987484, 13947422, 12906264, 12130954, 11419513, 10911897, 10342453, 9846742, 9481719, 9110773, 8705191, 8354966, 8037026, 7710797, 7380668, 7214729]
5342G214729l04293k95744k35999j87291j68111j53993j43954k36959k44022j09539
5332E134824q8933j57799j40168j71637l7363q3098P631j04731l2123k10513K3511
5321D139601M4717p5594j44958j3402p0390k548l3922j16018j5095j31631l1889
5310C548871o6949l9521j84492n8825K8051m6243j71462J9003L5847p3625m4149
5299B946506n6575l4441m9769q6150o9364j18421k67K7689j31138K1096j6952
5288B432214r9135j2538J01639k7339j22398k4026r2284j9207P5302j18329p4957
5277B018942J37379o1961J6953k7278m306l9407q3856J0569m8623m6574r7751
5266A774087M082j05952o3983m9801K4098L3997o2681j01903o7524J3728o4976
$$ y = [7214729, 6910436, 6614692, 6378693, 6191402, 6023291, 5869298, 5725344, 5488385, 5244363, 5134824, 5045891, 4888092, 4747924, 4576287, 4538924, 4455826, 4463457, 4358726, 4326603, 4116090, 4139601, 4184318, 4108724, 3963766, 3950364, 3879974, 3877426, 3843504, 3727486, 3712391, 3580760, 3548871, 3481922, 3442401, 3257909, 3199084, 3227135, 3180892, 3009430, 3028433, 3064280, 2990655, 2946506, 2889931, 2855490, 2805721, 2719571, 2650207, 2531786, 2531519, 2559208, 2428070, 2449166, 2432214, 2333079, 2320541, 2422180, 2394841, 2272443, 2248417, 2156133, 2136926, 2212228, 2093899, 2018942, 2156321, 2094360, 2111313, 2084035, 2079729, 2040322, 1956466, 1967035, 1918412, 1871838, 1774087, 1778169, 1672217, 1608234, 1558433, 1582531, 1616528, 1553847, 1451944, 1384420, 1398148, 1333172]
5255A333172J17346n9461J7490j32133j13536R7303l1154p0089j0062N700J05578
5244A260154L4276l0641n8270o5887n8690q6309N1649k2848l5892n1655J1043
5233I46930k0512j05102j3969m4289k1967O1794m5781p7579l6795l6123p4494
5222E32113O9647J9849m1083n5175J44825K0170j4526j06333o7124o47l8362M4414
5210E07768j18036K8015Q8027N1700o0143Q841K7867l1258K4935r3148j5357l9427
5198C79784k6716K4770L0298j17706J79090O1671n7227r3030m5874o2383k7954
5187B44723P2659l5083L8277J33177k3898r1229l8942n596p9178J1282K4282n2098
5175A98376J22762K0744J0402j15364N2485N5086m7072j27884J43593k2833n9224
$$ y = [1333172, 1450518, 1391057, 1408547, 1276414, 1162878, 1260181, 1229027, 1158938, 1148876, 1154576, 1260154, 1294430, 1263789, 1205519, 1139632, 1080942, 994633, 1046282, 1023434, 987542, 935887, 946930, 926418, 821316, 807347, 763058, 741091, 802885, 757104, 679525, 642730, 606607, 532113, 601760, 621609, 580526, 525351, 670176, 690346, 675820, 569487, 502363, 501716, 463354, 507768, 389732, 417747, 505774, 557474, 497331, 506172, 534039, 502781, 527716, 434568, 419211, 379784, 353068, 377838, 408136, 290430, 469520, 531191, 473964, 380934, 335060, 272677, 244723, 317382, 282299, 320576, 453753, 429855, 338626, 299684, 294088, 214910, 226192, 250474, 198376, 321138, 341882, 352284, 236920, 289405, 344491, 297419, 169535, 313128, 290295, 231071]
5164B31071J7703J09491L5500j3487k8869m8035l1542N0288J22090r3743o5635
5153B84832O2285o2440o5280P0129P4611m6992p2538j4450M4475J2577j3336N69
5141B74442L9853K8684m9194l8973R137N9882n1802m9519K0438j4152L2922O3596
5129C25314J742O1639R2073l8102n2359K739j2495n0118k5688P4438O995p4009
5117C12169O8729K0862l4385l4848O4539K3190l6926k9603J2529M0260P3733j0555
5105D69694l2492m3032l4449l4192R308P5990K3466k0654K8724L00r2630Q0032
5093D30065o3164j5537K8067K2084j4228L9321r0625J28893J20700n4899p5387
5082D55290L2089J28984n499m5378r3060o8328J80195n4284k7077j9010m8412
$$ y = [231071, 248774, 358265, 393765, 380278, 351409, 303374, 271832, 322120, 444210, 350467, 284832, 347117, 284677, 219397, 289526, 364137, 317145, 244607, 230157, 274632, 287209, 273873, 274442, 314295, 342979, 293785, 254812, 263949, 323831, 272029, 222510, 242948, 228796, 261718, 325314, 327056, 388695, 480768, 442666, 390307, 393046, 380551, 330433, 304745, 379183, 386178, 312169, 380898, 401760, 367375, 332527, 397066, 420256, 383330, 353727, 366256, 406516, 480249, 469694, 437202, 394170, 359721, 325529, 334837, 410827, 434293, 413639, 442363, 442663, 350033, 430065, 366901, 351364, 379431, 401515, 387287, 426608, 335983, 464876, 585576, 530677, 455290, 487379, 616363, 610864, 565486, 472426, 404098, 584293, 530009, 502932, 483922, 435510]
5071D35510m1873n5144J03034L1589j1932l4633m9365M1201p0281Q0113N5041
5060D83260j48270l7304o8636M6477J18482O9660p55j18926K989J68176O2691
5049E77844m2769j51955O9181j8373j4856Q248J60777P8491o8119q1413Q369P9256
5037F04681l3611l854L1164k5048J5581l3049p0224Q0902o9535l264n4042j8944
5025D20757O5699n3728O753j1883M9796q182p9165J07933k5509M8239p4270k803
5013D43637j9040k7029L6243J3263o0326k5241L1347p2784J5778K7925R905m5332
5001C28346L3590j08775M6900Q3076O5990N4852q8344o7863O207J2841J07705
4990D74525p6460M2354O5493l618m7675Q5641m7992m8582K1683J7152M6297q3207
$$ y = [435510, 393637, 338493, 441527, 473116, 461184, 426551, 377186, 418387, 348106, 428219, 483260, 334990, 297686, 229050, 275527, 394009, 463669, 462914, 343988, 346977, 515153, 577844, 535075, 383120, 452301, 433928, 419072, 427320, 588097, 666588, 598469, 517056, 525425, 604681, 571070, 567216, 598380, 573332, 588913, 555864, 485640, 566542, 497007, 493743, 439701, 420757, 486456, 432728, 439481, 427598, 477394, 469212, 390047, 497980, 472471, 520710, 446440, 443637, 424597, 397568, 433811, 447074, 386748, 361507, 392854, 320070, 335848, 363773, 373678, 328346, 361936, 253161, 300061, 383137, 449127, 503979, 415635, 347772, 353979, 366820, 474525, 398065, 440419, 505912, 502294, 454619, 540260, 492268, 443686, 465369, 482521, 528818, 445611]
4978D45611L3127p2189m6934l6212J3403n6635M3184J45007j5528k516J399r6398
4966C55319n4296N8159m5264M489M1065n3247K3210M963Q947J5871M2483J5400
4954D17099l7274L2155P3905o4255m6076P6520p3712o9707m9841P7983L7504k736
4942C71565m116q1014P6878Q673O8771j39561L9337R9015k2747l7355N816m1988
4930C43274l6980J35791r12j6155j1403o2017P2076K4413m2158L0925j29458O3734
4918C71130R3972l4687q0685o839N4558p5287k7072L5023M7093P0094M7154m3877
4906D50577Q2859L3927p8099N3640q5114J3812j20168j4729J5367l662l2257J29525
4894D45678R4281r815O1208q0549m1024p0881O9841R1197L9875p4915L667l696
$$ y = [445611, 478738, 406549, 359615, 323403, 336806, 280171, 323355, 468362, 452834, 450318, 451717, 355319, 301023, 359182, 313918, 318407, 359472, 306225, 329435, 334398, 343345, 359216, 401699, 417099, 379825, 411980, 485885, 421630, 375554, 452074, 378362, 308655, 258814, 336797, 374301, 371565, 367449, 286435, 363313, 371986, 440757, 301196, 340533, 439548, 416801, 379446, 385262, 343274, 306294, 442085, 441173, 425018, 413615, 351598, 423674, 448087, 405929, 436854, 307396, 371130, 465102, 430415, 349730, 342891, 397449, 322162, 295090, 330113, 377206, 447300, 494454, 450577, 533436, 567363, 489264, 542904, 457790, 471602, 351434, 336705, 352072, 348410, 316153, 445678, 539959, 530144, 591352, 510803, 469779, 398898, 468739, 559936, 599811, 524896, 528563, 524867]
4882E24867n658L8994R4436p5609o8611J1828P0775N9123K5024n5205L3400K1094
4870F74458K840M4887Q240n0835J10086R2018J12191l987j13544o1889j32703
4859F81762K0281J35699Q8012J09301L8843q7145K0512o6955j8681j2609J6144
4848I25164L3438M666j4027L6231N5021N1739n8427Q309l5774l3269p4744R2384
4836I90711J08985L5443m5410L5076l010q2762J7066j545N7400j231n8997q2625
4824I69101J31953k9376m7973M2551k1830j9701K6835J7618l9438l6706K8236
4813A021270O8354J4323m2949P1220R2207J9582p210K6924J41568P8789l7167
4802A446911n823N9967O9199M4128O825M2168j3132k7380m2812J9861l2565k8638
$$ y = [524867, 519209, 558203, 652639, 577030, 508419, 520247, 591022, 650145, 675169, 619964, 653364, 674458, 677298, 722185, 730425, 679590, 789676, 881694, 993885, 989898, 876354, 814465, 681762, 702043, 837742, 925754, 1035055, 1073898, 986753, 1007265, 940310, 921629, 909020, 925164, 958602, 963268, 949241, 985472, 1040493, 1092232, 1033805, 1042114, 1006340, 973071, 898327, 990711, 1099696, 1135139, 1089729, 1124805, 1121795, 1039033, 1056099, 1054554, 1111954, 1110723, 1051726, 969101, 1101054, 1071678, 1023705, 1066256, 1044426, 1024725, 1051560, 1069178, 1029740, 993034, 1021270, 1089624, 1103947, 1060998, 1132218, 1224425, 1244007, 1236797, 1263721, 1405289, 1484078, 1446911, 1441088, 1501055, 1570254, 1614382, 1621207, 1663375, 1650243, 1622863, 1580051, 1599912, 1567347, 1538709]
4790A538709K1155m1723j16964r2738J91248N9568n7435J3591j11891M736M8471
4779A456727q1137j25413l7301l7028k7203J4776p8472R957J4263p1300r1239
4768I46630n6638L1213J16670r738o263O6937r8753M8958O6867j14340K1029l40
4756A012232m9926n3415P2321K7820k2619R8958m1951k6608p4383K9509M5545
4745A017483L2739L604M107n5152M23j1845k8544J39821l4904j08416K3294R0671
4733A073281k1927q537K7139O7321N8542j3650l9786J3616L2999M5252k7041L7631
4721A244840M4486M3774M7305P681O985L4719J0401q8685q443M2483q3003j51648
4709A150895P0096L9034n2459k3127K4618M2200k1948l119n7289m5369N7446K3833
$$ y = [1538709, 1559864, 1518141, 1401177, 1308439, 1499687, 1559255, 1501820, 1515411, 1403520, 1408256, 1456727, 1375590, 1250177, 1212876, 1175848, 1148645, 1163421, 1084949, 1094906, 1109169, 1037869, 946630, 889992, 921205, 1037875, 1028137, 1021874, 1088811, 990058, 1039016, 1105883, 991543, 1012572, 1012232, 962306, 908891, 981212, 1009032, 986413, 1085371, 1043420, 1016812, 942429, 971938, 1017483, 1050222, 1053826, 1057933, 1002781, 1003204, 991359, 962815, 1102636, 1067732, 959316, 982610, 1073281, 1051354, 1042817, 1069956, 1137277, 1195819, 1182169, 1142383, 1155999, 1188998, 1234250, 1207209, 1244840, 1289326, 1333100, 1380405, 1388086, 1395071, 1429790, 1440191, 1351506, 1343063, 1385546, 1302543, 1150895, 1220991, 1260025, 1207566, 1184439, 1209057, 1251257, 1229309, 1226190, 1168901, 1123532, 1180978, 1204811]
4697A204811K5460N8901l2047q863M7172K6164k5059M4995K5742K0356N2096L4840
4685A474568n3626j06653l8602J3398m7242M0176l0271k9635m9707r9976K2668
4674A095098P4927l2037l0314K6735Q4899J4097j2018l8498n5876M3061N882P538
4662A183494R696j025n4075m6025p5455M3079j8289M6496m1423Q6949J23389j1251
4650A245560o8970p4319j7343m0445J01959K367j21299J45067L7755N1695q21
4639A261206N1480q5806K2035O9206l990J1141l4616N7499j6853k9540N1712J1446
4627A364920o0839K0344l9892k1404n0545O0451q371j09537o7785L1916m2621
4616A076637J2928o8709L071J1200o1090R1245p2804o112N2340P5601K6269n8811
$$ y = [1204811, 1230271, 1289172, 1257125, 1248262, 1295434, 1321598, 1296539, 1341534, 1367276, 1387632, 1439728, 1474568, 1420942, 1314289, 1275687, 1289085, 1241843, 1282019, 1251748, 1222113, 1172406, 1072430, 1095098, 1170025, 1137988, 1107674, 1134409, 1219308, 1233405, 1221387, 1182889, 1127013, 1170074, 1175956, 1183494, 1193190, 1192165, 1138090, 1092065, 1016610, 1059689, 1041400, 1087896, 1046473, 1133422, 1256811, 1245560, 1176590, 1102271, 1084928, 1044483, 1146442, 1148809, 1027510, 1172577, 1210332, 1262027, 1261206, 1312686, 1226880, 1248915, 1318121, 1314131, 1325272, 1290656, 1348155, 1331302, 1301762, 1353474, 1364920, 1304081, 1324425, 1284533, 1263129, 1212584, 1273035, 1264664, 1155127, 1087342, 1119258, 1076637, 1089565, 1020856, 1023927, 1035127, 974037, 1065282, 992478, 986366, 1038706, 1114307, 1140576, 1081765]
4604A081765K9965J1327q955J8462L4310M0323J09493k5152M5285M5183P4484
4593A456490K4046L8883J1472j56303n412l5126N5318j18543o3262K9211l2669
4582A204105M6907j16933J4263J30924j6479j16237J02547j40835o8346J12147
4572A152063O6286j31504N685M9178L7608K1951K6496P1767N4705M4473p5458
4561A323250O2645J49083o2245o2849k661j39734P081o625K2940K5882r1654R1316
4549A316429J587j61914N4437J3702j40716L5607J19582M535J01537J305m5653
4538A300438m1433m5640M6805M8370p4313j0615l3360M4666N8787l757j1244M8970
4526A327674q8344j5478K3523k6005k9214n1017M5703l706p4941k1407J6555m8265
$$ y = [1081765, 1111730, 1123057, 1114102, 1132564, 1166874, 1207197, 1316690, 1291538, 1336823, 1382006, 1456490, 1480536, 1519419, 1530891, 1374588, 1369176, 1334050, 1389368, 1270825, 1207563, 1236774, 1204105, 1251012, 1134079, 1148342, 1279266, 1262787, 1146550, 1249097, 1108262, 1039916, 1152063, 1218349, 1086845, 1092530, 1141708, 1179316, 1201267, 1227763, 1299530, 1354235, 1398708, 1323250, 1385895, 1534978, 1472733, 1409884, 1407223, 1267489, 1274570, 1267945, 1290885, 1316767, 1225113, 1316429, 1318016, 1156102, 1210539, 1224241, 1083525, 1119132, 1238714, 1243249, 1344786, 1346091, 1300438, 1259005, 1213365, 1260170, 1308540, 1234227, 1223612, 1190252, 1234918, 1293705, 1289948, 1278704, 1327674, 1239330, 1223852, 1247375, 1221370, 1192156, 1141139, 1186842, 1183136, 1108195, 1086788, 1103343, 1055078]
4514A055078r4535J8314L5414M2238q0975M2228n7433L795M2090J2945M5576K5472
4502A090207n485j4544p315j7750J3515j0170J16882o1825k3948n1217m7621R1460
4490A072189l6346R943O5388j04671J06194P9855k320j32184J19673P7424n7615
4479A197530n0555l1344k9069R0744M0243r1208M1178O2165L3073q5208J1254
4468A188803m8485J28740J20500J3855n4619q0354J617L4385j7120P2936k695
4457A357563l4516P5055k7856n7956M2657J05326j23460k5031N8450q133o076
4446A356023o3509J23854J9761n4897j12560Q9633k7377k3311O5776l090r8179
4435A272124L4941J30880k6026M1192r7618k8002L5317R445q640m0998J7422m6251
$$ y = [1055078, 960543, 978857, 1014271, 1056509, 975534, 1017762, 960329, 964124, 1006214, 1019159, 1064735, 1090207, 1084722, 1070178, 1062863, 1045113, 1058628, 1048458, 1165340, 1103515, 1079567, 1028350, 980729, 1072189, 1035843, 1045786, 1111174, 1006503, 1112697, 1192552, 1190232, 1058048, 1177721, 1255145, 1197530, 1146975, 1115631, 1086562, 1177306, 1217549, 1126341, 1167519, 1229684, 1262757, 1177549, 1188803, 1140318, 1269058, 1389558, 1403413, 1348794, 1268440, 1270057, 1304442, 1287322, 1360258, 1357563, 1323047, 1398102, 1370246, 1312290, 1354947, 1460273, 1336813, 1311782, 1370232, 1362099, 1356023, 1292514, 1416368, 1436129, 1381232, 1268672, 1358305, 1330928, 1307617, 1373393, 1370303, 1272124, 1307065, 1437945, 1411919, 1453111, 1355493, 1327491, 1362808, 1372253, 1363613, 1322615, 1340037, 1293786]
4423A293786m6344O1542K0942n9092K2142R7354n0788M554o7080r3030M4293J27950
4411A356229j42376P6224O0173J364l6252P3518L450j6626j06466P1552N0980
4400A391770M3674j3709J4953L0455r792J04209n7904k9865p0293J0511N2042
4389A466051j2796J0884R7460r4994l713P5163l292J1576R5858J2793r8682M5351
4377A601659K7628j5252N0665J24564q75o1584M0178k7263P1154O3951j0084M2370
4365A907111K9404p4775J8615K5208J11136j18863j21634P5283N1446K2510o753
4354A918688P033n1760j52075R1208J1664J7689k7886Q1848r8671j8236L3538
4343A813040j4968O0085j48730l3778J47659P3851J4430m4924j43237j6568L5700
$$ y = [1293786, 1247442, 1308984, 1329926, 1270834, 1292976, 1390330, 1339542, 1344096, 1277016, 1183986, 1228279, 1356229, 1213853, 1290077, 1350250, 1351614, 1315362, 1388880, 1392330, 1375704, 1269238, 1340790, 1391770, 1435444, 1421735, 1436688, 1467143, 1457351, 1561560, 1503656, 1473791, 1403498, 1414009, 1466051, 1453255, 1464139, 1561599, 1466605, 1462892, 1538055, 1534763, 1546339, 1642197, 1654990, 1556308, 1601659, 1629287, 1614035, 1664700, 1789264, 1788389, 1726805, 1766983, 1739720, 1810874, 1874825, 1864741, 1907111, 1936515, 1861740, 1880355, 1905563, 2016699, 1897836, 1776202, 1851485, 1902931, 1925441, 1918688, 1925721, 1873961, 1721886, 1813094, 1824758, 1842447, 1814561, 1896409, 1797738, 1779502, 1813040, 1798072, 1858157, 1709427, 1675649, 1823308, 1897159, 1911589, 1866665, 1723428, 1706860, 1742560]
4332A742560j066M0985L2310K5018l8656j0196j17285l3501P0548O6720L3806
4321A811243m3754m6614m7688L4706l228m8220m9378j363P1599J38799j01798
4310A714304l2797k2162Q1810L9800r4686M1155Q632K3178k7883K4673N6694r6516
4298A716202r874Q9302j24929k16553P3342J58801J10242p0739P636L0413q1485
4287A682358j2333J30373p4904m5002Q7454n0878r461Q0374L070n723P5200L4804
4275A895332n6593M7174Q5407Q031l0504J8666L8638Q3219J03460N0832n7737
4264B185925o6250N3751L1867o0068j3872K0125q3933m7268L8717k3388k655j6124
4252B016827N6114O1582Q8973j3754k6096P5977j0587K1471m196N9895L5800m7247
$$ y = [1742560, 1741494, 1782479, 1814789, 1839807, 1801151, 1790955, 1673670, 1640169, 1710717, 1777437, 1811243, 1767489, 1720875, 1673187, 1707893, 1704665, 1656445, 1607067, 1605704, 1677303, 1816102, 1714304, 1681507, 1659345, 1741155, 1780955, 1686269, 1727424, 1736056, 1759234, 1731351, 1756024, 1812718, 1716202, 1706328, 1795630, 1670701, 1454148, 1527490, 1686291, 1796533, 1725794, 1733430, 1763843, 1682358, 1670025, 1800398, 1725494, 1680492, 1767946, 1717068, 1707607, 1787981, 1791051, 1785328, 1860528, 1895332, 1838739, 1885913, 1971320, 1979351, 1948847, 1967513, 2006151, 2089370, 2192830, 2243662, 2185925, 2119675, 2173426, 2205293, 2145225, 2131353, 2151478, 2067545, 2020277, 2058994, 2035606, 2032951, 2016827, 2072941, 2134523, 2223496, 2209742, 2183646, 2259623, 2249036, 2270507, 2266311, 2326206, 2362006, 2314759]
4240B314759O1396m6395L6049j692n9955J21631L6889p0593N477L6946J11118
4229B545630P3169j50568O6002O8662K1801l964o3032R7184O2378L9978J13587
4218B870827j22469L2087N5448L3191O3808o2083j3681L3462K7738k0720P0438
4207B968046O4507p5554P8219O7773k3466K123N3479M7270N7927k3477m0387J12062
4195C288522Q3817J9639L3964K9209n9978p3253J52891Q9609j37972J12924R2877
4184C632249l5157J58641P7710N9568N9500j3789J00293n735j8346M6092L3615
4173D094641M4680P5037J50999R4932P7542r455L5992J08394Q1140R2070J68522
4162E014494J50131K5415N7071J22721J80533P8752J66034J7836N5016J71189
$$ y = [2314759, 2376155, 2329760, 2365809, 2364117, 2304162, 2425793, 2462682, 2392089, 2397566, 2434512, 2545630, 2618799, 2468231, 2534233, 2602895, 2624696, 2620732, 2557700, 2654884, 2717262, 2757240, 2870827, 2748358, 2780445, 2835893, 2869084, 2932892, 2870809, 2857128, 2890590, 2918328, 2897608, 2968046, 3032553, 2956999, 3035218, 3102991, 3079525, 3081648, 3135127, 3182397, 3240324, 3216847, 3176460, 3288522, 3372339, 3391978, 3425942, 3455151, 3395173, 3321920, 3474811, 3564420, 3426448, 3539372, 3632249, 3597092, 3755733, 3833443, 3893011, 3952511, 3938722, 4039015, 4033280, 4014934, 4061026, 4094641, 4139321, 4214358, 4365357, 4460289, 4537831, 4528376, 4564368, 4672762, 4753902, 4845972, 5014494, 5164625, 5190040, 5247111, 5369832, 5550365, 5629117, 5795151, 5812987, 5868003, 6039192]
4152F039192K27863Q6990N4960J49993K5196K52052J85308J17105J26592J21311
4142G386562K05158K34488J40368K12317J02975K02259K32823K69251K03495K17381
4132I407077K55889K81775K31049J52476J59213L01053K85991K18109M06425L70243
4122A2069300M05782K29018L21613M14147L85686M01346N44152M52690M78698
4113A5702432N19003N69599O50102O77892P27966O74231P71137Q47483Q12015
4104B1951860Q73084J076327J075019J079281J322151J225048J308655J490523
4096C1401948J526430J605435J627838J944243J971990J921558K074203K221899
4088D6295544K298301K313977K313043K378522K629776K673581K639419K773610
$$ y = [6039192, 6267055, 6354045, 6409005, 6558998, 6584194, 6836246, 7021554, 7138659, 7265251, 7386562, 7591720, 7826208, 7966576, 8178893, 8281868, 8484127, 8716950, 8986201, 9189696, 9407077, 9662966, 9944741, 10175790, 10328266, 10487479, 10788532, 11074523, 11292632, 11699057, 12069300, 12475082, 12704100, 13025713, 13439860, 13825546, 14226892, 14771044, 15223734, 15702432, 16221435, 16791034, 17441136, 18119028, 18846994, 19521225, 20292362, 21139845, 21951860, 22824944, 23901271, 24976290, 26055571, 27377722, 28602770, 29911425, 31401948, 32928378, 34533813, 36161651, 38105894, 40077884, 41999442, 44073645, 46295544, 48593845, 50907822, 53220865, 55599387, 58229163, 60902744, 63542163, 66315773]
4080F6315773K669156K847314K833599K794308K993180K951420K774565K877692
4072H9057007K736317K649929K575848K290711K217391K061077K034303J835752
4064A07458335J522764J476897J461386R89854J063278P82802O03661K81711J8029
4055A15658717j82201n16055p44105r56750j119686j331230j651820j684477j817732
4046A05654661j914245k014300k152541k290284k577296k571177k665184k714379
4038H6755255k727459k828059k818313k863323k859264k732953k745808k575912
4030F4604164k550961k523680k432242k299841k304335k339402k111755j980001
4022D6061947j947370k042259j828692j479110j625326j555520j429157j228023
$$ y = [66315773, 68984929, 71832243, 74665842, 77460150, 80453330, 83404750, 86179315, 89057007, 91793324, 94443253, 97019101, 99309812, 101527203, 103588280, 105622583, 107458335, 108981099, 110457996, 111919382, 112909236, 113972514, 114755316, 115358977, 115640688, 115658717, 115476516, 114960461, 114216356, 113259606, 112139920, 110808690, 109156870, 107472393, 105654661, 103740416, 101726116, 99573575, 97283291, 94705995, 92134818, 89469634, 86755255, 84027796, 81199737, 78381424, 75518101, 72658837, 69925884, 67180076, 64604164, 62053203, 59529523, 57097281, 54797440, 52493105, 50153703, 48041948, 46061947, 44114577, 42072318, 40243626, 38764516, 37139190, 35583670, 34154513, 32926490]
4014C2926490j341709j096305j157511j039163r66014r53623p43746p92506q29383
4005B4006530p95009n72416o00583n72682m34334m34746m06632m41716l70489
3996A9377923l73812l42187j79912j87755k05265j83852l07895j44322q3969j84207
3986A7184747j20197l5611N8889n2567o1344L6544K2950L1918Q6532Q5600J4010
3975A7251471J6365M8093N1862J08885N9673J40342K9145J46376R2248N7919L6782
3964A8039161j2238k1923M3172L5973J20220J5604o7708j40373m6688j25859k63173
3953A7576168j42733k64658k43605k26522j97535k54078j91432l42046k62107
3944A5451452k58807k12156l16982l73770k81441l14273k76404l60264k75553
$$ y = [32926490, 31584781, 30488476, 29330965, 28291802, 27325788, 26372165, 25628419, 24835913, 24006530, 23211521, 22639105, 22038522, 21465840, 21031506, 20596760, 20190128, 19748412, 19377923, 19004111, 18661924, 18482012, 18294257, 18088992, 17905140, 17597245, 17452923, 17368954, 17184747, 17064550, 17028939, 17087828, 17035261, 16973917, 17010461, 17033411, 17065329, 17151861, 17237461, 17251471, 17267836, 17315929, 17367791, 17476676, 17536349, 17676691, 17705836, 17852212, 17944460, 18002379, 18039161, 18026923, 18005000, 18048172, 18084145, 18204365, 18219969, 18152261, 18011888, 17965200, 17839341, 17576168, 17433435, 17168777, 16925172, 16698650, 16501115, 16247037, 16055605, 15713559, 15451452, 15192645, 14980489, 14663507, 14289737, 14008296, 13694023, 13417619, 13057355, 12781802]
3935A2781802j18078k23968l46249k35234l38884l29583j19005j81236k36264
3926A0653301k32300j58655j01822k29796j09059k0544q2121j22597j4746L8094
3916I619755P4901J4761J89491J83696K04009M21838N10720O00354L57187J5903
3906A2192615n89252p58130n35933o42888n38588m23295k04120k14052j70311
3897H116046k7446j30466p7376m0792L0564r3886m8087q7501K1698k8886P942
3886G641810K4797n9401J15895O2020mk1346n2353K5943R4933R7823J02436j6463
3874H016090j3547J59919J08739J9929m431L9013R5678p2793J20363R5635j38944
3863H425651J18850O7638l924k2782J10390k8513l9779N4563O2329p245r5225
$$ y = [12781802, 12663724, 12439756, 12093507, 11858273, 11519389, 11189806, 11070801, 10889565, 10653301, 10421001, 10262346, 10160524, 9930728, 9821669, 9801125, 9719004, 9596407, 9581661, 9619755, 9694656, 9709417, 9898908, 10082604, 10286613, 10708451, 11219171, 11819525, 12176712, 12192615, 11603363, 10845233, 10309300, 9666412, 9127824, 8704529, 8500409, 8286357, 8116046, 8088600, 7958134, 7880758, 7839966, 7870530, 7776644, 7728557, 7641056, 7662754, 7633868, 7641810, 7666607, 7607206, 7723101, 7785121, 7785117, 7763771, 7711418, 7737361, 7832294, 7930117, 8032553, 8016090, 8002543, 8162462, 8271201, 8291130, 8286699, 8325712, 8421390, 8348597, 8468960, 8564595, 8425651, 8544501, 8612139, 8608215, 8585433, 8695823, 8667310, 8627531, 8682094, 8744423, 8737178, 8641953]
3852H641953J4177q7737r8208j1000j28040n2836L6355j6294l8492K9396N3397
3841H342671m3243n2856p2563K0622O057P3915P6699l2484l4611p8057J0907L2856
3829H249913Q3492Q9914k5150j04472R4477J65876J43476o0293k4879K05655O61
3818H818670R3630Q0914Q8182O9923L6542J14206J45745J4847J28760k1339O6968
3807I637048l9084J02175J26932J36136M0770J04060J17833Q7196j1191J5865
3797A0317740J15767K13209J97386Q4596J11169N4585J37851R5370J79351N3772
3787A1560796J31205J53524K17041J77324O1530K06599K84857J33395J61470J88046
3777A3275787K13679K06149K30702K13234K80855K85139J02685K58555K18516
$$ y = [8641953, 8656130, 8568393, 8470185, 8459185, 8331145, 8278309, 8314664, 8298370, 8259878, 8289274, 8342671, 8299428, 8246572, 8174009, 8194631, 8200688, 8274603, 8351302, 8318818, 8284207, 8206150, 8217057, 8249913, 8333405, 8423319, 8398169, 8293697, 8388174, 8554050, 8697526, 8637233, 8612354, 8818009, 8818670, 8912300, 8993214, 9081396, 9151319, 9187861, 9302067, 9447812, 9462659, 9591419, 9570080, 9637048, 9597964, 9700139, 9827071, 9963207, 10003977, 10108037, 10225870, 10313066, 10301875, 10317740, 10433507, 10646716, 10844102, 10928698, 11039867, 11094452, 11232303, 11327673, 11507024, 11560796, 11692001, 11845525, 12062566, 12239890, 12301420, 12508019, 12792876, 12926271, 13087741, 13275787, 13489466, 13695615, 13926317, 14139551, 14420406, 14705545, 14808230, 15066785, 15285301]
3768A5285301L80750K57801J35027J56308L54618L75131L11908L01308L91790
3759A7949942L62516L36345M83469L91342M66830N09897M45019N90244N93375
3750B2128979M73895N98264O18103O52641N71604O14113P00579P00698O69477
3741B7728353P07625O33892P25249N46317N81964N27985O34450N28222M97042
3732C3111099M31445N01450M66963M89890N33401M41000L82571M81159M74214
3723C7313192M04357M33692L98946M32413N71191M71525N35771N79775O80513
3714D1821375O99196P38054Q39147Q69709J101561R63353J002683J296800J179964
3705E0511842J332436J631717J647278J781625J750652J922926K175065K219826
$$ y = [15285301, 15666051, 15923852, 16058879, 16215187, 16569805, 16944936, 17256844, 17558152, 17949942, 18312458, 18648803, 19132272, 19523614, 19990444, 20500341, 20945360, 21535604, 22128979, 22602874, 23201138, 23819241, 24471882, 25043486, 25657599, 26358178, 27058876, 27728353, 28435978, 29069870, 29795119, 30341436, 30923400, 31451385, 32085835, 32614057, 33111099, 33542544, 34043994, 34510957, 35000847, 35534248, 35975248, 36357819, 36838978, 37313192, 37717549, 38151241, 38550187, 38982600, 39553791, 40025316, 40561087, 41140862, 41821375, 42520571, 43258625, 44097772, 44967481, 46069042, 47032395, 48035078, 49331878, 50511842, 51844278, 53475995, 55123273, 56904898, 58655550, 60578476, 62753541, 64973367]
3697F4973367K358136K617424K772238K870527L214007L410207L813932M056788
3689I0086626M432902M990578N481611N879047O558148P180315P721890Q616472
3681A40947589R507027J0515019J1554265J2679336J3785167J4946464J5997022
3674B29931889J6805858J7260941J7154288J6142615J4478176J2193972R713296
3667C33681035P178622M976696L367354J990998J122242P12330L03249P8280l06004
3658C53104802q21194j587715k635818m273897n977890q210330j0176345j1943131
3650C07478482j3542360j4680043j5014158j5120717j4382955j3564674j2670048
3643B08503527j1333353j0095102q979049p994047o893063o038915n366629m722303
$$ y = [64973367, 67331503, 69948927, 72721165, 75591692, 78805699, 82215906, 86029838, 90086626, 94519528, 99510106, 104991717, 110870764, 117428912, 124609227, 132331117, 140947589, 150454616, 160969635, 172523900, 185203236, 198988403, 213934867, 229931889, 246737747, 263998688, 281152976, 297295591, 311773767, 323967739, 333681035, 340859657, 345836353, 349203707, 351194705, 352316947, 353029277, 353332526, 353410806, 353104802, 352283608, 350695893, 348060075, 343786178, 337808288, 329597958, 319421613, 307478482, 293936122, 279256079, 264241921, 249121204, 234738249, 221173575, 208503527, 197170174, 187075072, 178096023, 170101976, 163208913, 157169998, 151803369, 147081066]
3635A47081066m207839l680161l450052k992888k684758k236226j862387j414084
3627A24552671q20276l16901K5276N12341J098976J523664J864081K131473K428973
3618A33000278K629985K852673K988628L110436L080984L199903L130681K994594
3610A56988162L037757L111356K846878L011077K928791K673161K665331K451213
3602A79713726K224926J973725J351763R68620N96529K83937J63615j88005l11140
3593A86777696k30541n0632p5760L6486R5396K8387P0496j93630l42081o74484
3583A85441333o99903q02833r27036r18685p97318p78329o90099p17591n49879
3574A78559660p41010p43462r06696j123261j256737j787207k105764k381011
$$ y = [147081066, 142873227, 139193066, 135743014, 132750126, 130065368, 127829142, 125966755, 124552671, 123732395, 123415494, 123440770, 123953111, 125052087, 126575751, 128439832, 130571305, 133000278, 135630263, 138482936, 141471564, 144582000, 147662984, 150862887, 153993568, 156988162, 160025919, 163137275, 165984153, 168995230, 171924021, 174597182, 177262513, 179713726, 181938652, 183912377, 185264140, 186232760, 186829289, 187113226, 187276841, 187088836, 186777696, 186547155, 186496523, 186420763, 186457249, 186552645, 186581032, 186651528, 186457898, 186115817, 185441333, 184741430, 183938597, 183011561, 182092876, 181295558, 180517229, 179827130, 179109539, 178559660, 177818650, 177075188, 176168492, 175045231, 173788494, 172001287, 169895523, 167514512]
3566A67514512k750957l166984l336839l599263l798353l927672l912053l865275
3558A39157116l948124l914274m089393m084935l940984m182227m310959m236675
3550A06449545m374796m381396m185203m094485m023842l715892l392865l169297
3542G5111769k824716k594048k374097k151691j914897j674603j597093j473603
3534E8507021j273321j030995q70041o38885p55541p37224n11171n12810o02510
3525E1574523m68197l04388m21736m01320l57520k89253k18014k27011k36929
3516D8650155l25893m22697n05347n76064o80302q20615q02723r59194r63833
3507D2593487j108373j059815j074240j154745j086578j114837j193911j015390
$$ y = [167514512, 164763555, 161596571, 158259732, 154660469, 150862116, 146934444, 143022391, 139157116, 135208992, 131294718, 127205325, 123120390, 119179406, 114997179, 110686220, 106449545, 102074749, 97693353, 93508150, 89413665, 85389823, 81673931, 78281066, 75111769, 72287053, 69693005, 67318908, 65167217, 63252320, 61577717, 59980624, 58507021, 57233700, 56202705, 55332664, 54693779, 53938238, 53201014, 52689843, 52177033, 51574523, 51106326, 50801938, 50380202, 49978882, 49621362, 49332109, 49114095, 48887084, 48650155, 48324262, 47901565, 47396218, 46820154, 46139852, 45319237, 44516514, 43557320, 42593487, 41485114, 40425299, 39351059, 38196314, 37109736, 35994899, 34800988, 33785598]
3499C3785598j047317j167025j018998j141271j165017j227937j199694j164688
3491B4653651j121513j033703r85367r29913q74454r17032q35182o59242n55536
3482A6741709o35906o33473n39238n08861m28560m54961l63327m68227m58117
3473A2251039l57384m10997l16518j98325k59976l28273k36428k20019k23545
3464I699574k43669k63865k38717k33806k33892k07698j89942j94238j02687k34380
3454G556680k16463j82457j24634k87418r2139l1744j21476j07335j65864j48990
3444F078160k39030j11226q9565j61295r7205j57362j60740q5588j85764j17977
3434D672408K2854o5465j46034j61801p658p0652r3874j03601r7002N7559m4875
$$ y = [33785598, 32738281, 31571256, 30552258, 29410987, 28245970, 27018033, 25818339, 24653651, 23532138, 22498435, 21513068, 20583155, 19708701, 18791669, 17956487, 17297245, 16741709, 16105803, 15472330, 14933092, 14424231, 13995671, 13540710, 13177383, 12709156, 12251039, 11893655, 11482658, 11166140, 10967815, 10707839, 10379566, 10143138, 9923119, 9699574, 9455905, 9192040, 8953323, 8719517, 8485625, 8277927, 8087985, 7893747, 7791060, 7556680, 7340217, 7157760, 7033126, 6745708, 6653569, 6621825, 6500349, 6393014, 6227150, 6078160, 5839130, 5727904, 5638339, 5477044, 5379839, 5222477, 5061737, 4976149, 4790385, 4672408, 4695262, 4629797, 4483763, 4321962, 4314304, 4243652, 4149778, 4046177, 3949175, 4006734, 3961859]
3423C961859j51528P1189p7149j01345r8454j9410j11477j19129O6234k633j15207
3412C302950p5140M0658p3142j49884p8709R9658j8379R7491j49459n5289l9443
3401B901312k3955j2268m1040l5204o856L3967L8501l7819p0680P0476K3423L3285
3389B873142N2085j08671n4199M9751O2419K3920K9837p435L2742J80463L5648
3378C169702K0105N1789n7582K792n5576O4930j117p8297M4488n9854K9303q185
3366C122498k165n7637q1948k8377L7257j26819j42417n1198j10723l8449P085
3355B527107p4302j08106r019j47614p6816J8405j29345j04593M4090r606o2099
3344A868102l7853j44505q0795N8703M2236L2400N6455j32713o7201p2332j05326
$$ y = [3961859, 3810331, 3881520, 3804371, 3703026, 3604572, 3585162, 3473685, 3354556, 3420790, 3418157, 3302950, 3227810, 3268468, 3195326, 3045442, 2966733, 3066391, 3048012, 3145503, 2996044, 2940755, 2901312, 2877357, 2865089, 2824049, 2788845, 2781989, 2815956, 2854457, 2816638, 2745958, 2816434, 2839857, 2873142, 2925227, 2816556, 2762357, 2812108, 2874527, 2898447, 2928284, 2920849, 2953591, 3134054, 3169702, 3189807, 3241596, 3184014, 3186806, 3131230, 3196160, 3195043, 3116746, 3161234, 3101380, 3130683, 3122498, 3120333, 3062696, 2980748, 2952371, 2989628, 2862809, 2720392, 2669194, 2558471, 2520022, 2527107, 2452805, 2344699, 2335680, 2188066, 2111250, 2129655, 2000310, 1895717, 1939807, 1930201, 1868102, 1830249, 1685744, 1604949, 1663652, 1705888, 1738288, 1794743, 1662030, 1594829, 1522497, 1417171]
3333A417171l87M0104j6959K0413K8370J4768L2382o3852M5678N8907m9179M7063
3321A574479Q534N4952J9679k6349p226J6792K735J9336n3576m0979M8975n6851
3309A560501j1575l0725N4331m0107J7935n4793O9078N4676j10598M176j9099
3298A493800q783M6124k6019L7715k5273q9593M7474j8032M2521p3370j11708
3287A314856k627k867N3056L5928R313p1443r197m4297n4216K1599J5440q7302
3275A178243L8428m7831O183O3793j3234L07j19943j04599P4345L9437J2739k7912
3263A099956o5771j1119q6560k3097j4816J9046L7430j37470o7583J7872m1392
3252G26496m5562L9486O7353j08444R1399K0762j66498K8422o822k3771j5474
$$ y = [1417171, 1416784, 1456888, 1439929, 1460342, 1488712, 1503480, 1535862, 1472010, 1517688, 1576595, 1527416, 1574479, 1583013, 1637965, 1657644, 1631295, 1624069, 1640861, 1643596, 1662932, 1609356, 1568377, 1617352, 1560501, 1548926, 1518201, 1572532, 1532425, 1550360, 1495567, 1564645, 1619321, 1508723, 1512899, 1493800, 1485017, 1531141, 1505122, 1542837, 1517564, 1427971, 1475445, 1457413, 1499934, 1426564, 1314856, 1312229, 1309362, 1362418, 1398346, 1407659, 1336216, 1327019, 1282722, 1228506, 1250105, 1265545, 1178243, 1216671, 1168840, 1175023, 1238816, 1225582, 1225889, 1105946, 1001347, 1075692, 1115129, 1127868, 1099956, 1034185, 1023066, 936506, 913409, 898593, 917639, 955069, 817599, 750016, 767888, 726496, 680934, 720420, 787773, 679329, 770728, 791490, 624992, 653414, 646592, 622821, 607347]
3241F07347p8162J02622O4995l3065l4889j1582m4499j4658K1077R6173j56491
3230E18868K9399L947O776R0087n3755r6491R2194O8357K6369J04827j02275r7965
3218E90338n265J95285N269K3174L3804R686R1489P5683l2914j59117N1777K5616
3206I04825J04402P1180n6921r3264n4418K128j3764p776j17638L3603Q2517k9378
3194H25496o8519q2594O4060L0771m6882J32031J11689J22767J50093M7326J56902
3183A443140K52668R6361k5996j07274l24821j86247r2589j58338m1767M740J42907
3172A002784m8857j3672l8262M2797j6593J38966M0036K7060J3148k03654P2179
3161A015932j2750Q3947K0959K377J71092J78373J10972J5631j50490k08222l9993
$$ y = [607347, 529185, 631807, 696802, 663737, 628848, 617266, 572767, 558109, 579186, 675359, 518868, 548267, 552214, 558990, 649077, 595322, 498831, 591025, 659382, 685751, 790578, 688303, 590338, 585073, 780358, 785627, 808801, 842605, 852291, 943780, 1019463, 986549, 827432, 879209, 904825, 1009227, 1080407, 1023486, 930222, 875804, 877932, 864168, 856392, 738754, 772357, 854874, 825496, 756977, 674383, 738443, 769214, 722332, 854363, 966052, 1088819, 1238912, 1286238, 1443140, 1695808, 1792169, 1766173, 1658899, 1334078, 1147831, 1055242, 896904, 855137, 859877, 1002784, 953927, 940255, 901993, 944790, 928197, 1067163, 1107199, 1134259, 1147407, 943753, 1015932, 1003182, 1087129, 1108088, 1110465, 1281557, 1459930, 1570902, 1586533, 1436043, 1227821, 1187828]
3150A187828q0241j30134p7269j9789j4676j39995n7205l6978k7274K1484l4137
3139E91614O2733J49492K9481j1153Q0502M2439P3604K9350j89916j48797j28280
3128E81069k6698n6980q8362M4260l9200j40618M4927n8954O4903O095m4708M7346
3116C33080M6414Q644M0605j74980j27441L9300O3724M834M3103P0203O5466k9695
3104C83257l1103R7155j12488N2795L8460o9044N4080J1354j21729m1084J8010
3093B79663L501j76593M5784O2126m4019j63837P9192N0947q0461K9650k9892
3082E6061L7423j36722M3423Q5739r0015L5390K1500j1883j58416Q2779Q4002
3071D9281j61260m7295J47177Q4922l6276j6300P0197k7513j9489j14545k8125
$$ y = [1187828, 1107587, 977453, 900184, 880395, 865719, 725724, 668519, 631541, 604267, 625751, 591614, 654347, 803839, 833320, 822167, 902669, 945108, 1018712, 1048062, 858146, 709349, 581069, 554371, 497391, 409029, 453289, 414089, 273471, 318398, 259444, 324347, 330442, 285734, 333080, 379494, 388138, 428743, 253763, 126322, 165622, 229346, 234180, 277283, 347486, 412952, 383257, 352154, 449309, 336821, 389616, 428076, 359032, 413112, 424466, 302737, 261653, 279663, 283164, 106571, 152355, 214481, 170462, 6625, 85817, 136764, 56303, 85953, 56061, 93484, -43238, 185, 85924, -4091, 31299, 52799, 40916, -117500, -34721, 49281, -111979, -159274, -12097, 72825, 36549, 20249, 90446, 62933, 43444, -71101, -99226]
3060i9226l6149J3078J42400o4716q093n2936k0982L441P224J8754M526J32589
3048C9910K1109j6962j1090K145m5034p5333j2123k9284P8600k5060r6026N2941
3036a16207n0338N9743P409r568M3401O7112K815r7020M0837p9162o6257N7425
3024a39810k6133l631L9711l5395L8649M4937j35958k0108J41759K6335l7252
3013a06896l0111l4157j009l1725N1610m1283k2701l2145j05579L6705J00356
3002b16935M7671o8722O8702L2978q2293N448J0591K8562p860j6965P1517j09636
2990b36942j6686J16231O3949l2487l5184Q9357l8680m7278P139p4730P1318k8178
2978a62171l0710m9246P3476N4689J9088j33490k9396k309k7299J8603L2463L4309
$$ y = [-99226, -135375, -122297, 20103, -44613, -52706, -105642, -126624, -123183, -115959, -97205, -92679, 39910, 61019, 44057, 32967, 35112, -9922, -85255, -97378, -126662, -48062, -73122, -169148, -116207, -166545, -106802, -99393, -108961, -65560, 1552, 4367, -92653, -51816, -130978, -197235, -139810, -165943, -169574, -129863, -165258, -126609, -81672, -217630, -237738, -95979, -69644, -106896, -137007, -171164, -172173, -203898, -152288, -193571, -216272, -248417, -353996, -317291, -216935, -169264, -237986, -169284, -136306, -218599, -213151, -202560, -173998, -181858, -198823, -127306, -236942, -253628, -137397, -73448, -105935, -141119, -51762, -90442, -137720, -130581, -205311, -133993, -162171, -192881, -242127, -168651, -113962, -94874, -228364, -257760, -260069, -287368, -268765, -236302, -201993]
2966b01993M3468n3392M5430P169m609J147R4761O757r6560m0388k7656J6113
2954b09753P6437q793L2726l9796r78k5918J05441j493R1690l9799j06637O1762
2942f5111j4189K1784m1750l1579k736P7293O4895L3185r9790m4913k1410r953
2930a34274l4958P1668r5376J06331M670p452n0338k5745O0219N6253O276l7219
2918g9945P559n5054q9072k4095R1246M0773n4796L748k6987N1564K8430L789
2906a02840J2208K2973o7306O3503o875j09195J0361Q3505j0126O1265j26084
2895a68611q203O0500p5096J23166p0713K3687L755l7774J4157L4458L5926J1648
2883e3100O4495p1665j10033L3100J5763J448p76J661L6329n3945n054k0854Q0504
$$ y = [-201993, -158525, -211917, -166487, -159318, -163927, -162780, -68019, -61262, -157822, -198210, -225866, -209753, -133316, -142109, -109383, -149179, -150157, -176075, -70634, -72127, 19563, -20236, -126873, -65111, -79300, -57516, -99266, -130845, -133581, -56288, 8607, 41792, -57998, -102911, -124321, -134274, -169232, -97564, -192940, -86609, -81939, -89391, -139729, -165474, -105255, -49002, -42726, -79945, -72386, -127440, -216512, -240607, -149361, -108588, -163384, -159636, -186623, -135059, -106629, -102840, -90632, -67659, -134965, -71462, -78337, -187532, -177171, -93666, -103792, -42527, -168611, -176814, -116314, -191410, -68244, -138957, -115270, -111515, -149289, -135132, -100674, -64748, -53100, 11395, -60270, -170303, -137203, -121440, -119992, -120768, -119107, -82778, -136723, -141777, -162631, -82127]
2870h2127K1159m556r606p8062M8808J26369p9709o997J658n2980K5115j2224
2858a03152O3092r2186j31016J47416O0165o6725J637L8701o8874K5355j6314
2847a41901N8598O4717J0289m7721k3498n2834n6341J94812L3917J6331r4557
2836c8188n9469N5625j080N91q9388j6244K6348K1585N5916J034O1044j371m0881
2823b4478j12811Q7428o9660K9149J6045q200o9749K0681Q9662L5456o6162k7479
2811a00118N5708m8008L6551N6241l179r8348N3989p6695j9324r3028k3361J9193
2799b40379L4796L7618q6708N182L7457J16392R164j23152k3138J48878j0438
2788i4328K9444n8630r577j9695O5725N1054j9550Q737j35199K8162L4984k5516
$$ y = [-82127, -60968, -65524, -75130, -153192, -104384, 21985, -57724, -64721, -63063, -116043, -90928, -103152, -40060, -132246, -263262, -115846, -55681, -122406, -120769, -82068, -150942, -125587, -141901, -83303, -18586, -8297, -56018, -79516, -132350, -188691, 6121, 40038, 56369, -38188, -97657, -42032, -43112, -42521, -131909, -148153, -121805, -100220, -44304, -43270, 17774, 16403, -24478, -137289, -49861, -119521, -90372, -74327, -82527, -152276, -131595, -41933, -6477, -72639, -100118, -44410, -92418, -55867, 374, -2805, -101153, -47164, -123859, -143183, -236211, -259572, -240379, -205583, -167965, -254673, -249491, -212034, -95642, -86478, -209630, -232768, -83890, -94328, -64884, -123514, -133091, -152786, -87061, -36007, -55557, -46820, -182019, -153857, -118873, -144389]
2776a44389j48123J27940Q5021k8752N5975j35296p71Q4776P842O1576k6255j12318
2764a72774k9539N6843R219j38454R5416j5770P270O1713l4233J1254o5118O1595
2752a52578k6788M0863L9325j09643K6666L2109j52213K7864J02144q139j4564
2741a94954J6330N6591N0678p7342p9860N3552l863M0862p2362M6620N2934p2340
2729a83154M2560J6655j33122P4050J61085q456j14295M8045l2956p7680l6927
2718b44195L3099O717m8671P8733Q4316m2726k5357K2293j1464k2299P8718r3978
2706a84814l1486K4872m331J16841j2079j10217n0059K8008O7353p2457K8046
2695b00323J6131o6768L1210J09262l359p8344O0073o8892L5001K6044Q0394m859
$$ y = [-144389, -292512, -164572, -79551, -108303, -52328, -187624, -188395, -103619, -95777, -34201, -60456, -172774, -202313, -145470, -136251, -274705, -179289, -195059, -187789, -126076, -160309, -149055, -214173, -152578, -179366, -138503, -99178, -208821, -182155, -150046, -302259, -274395, -172251, -180390, -194954, -178624, -122033, -71355, -148697, -228557, -175005, -178868, -138006, -210368, -163748, -110814, -183154, -140594, -123939, -257061, -183011, -21926, -30382, -144677, -96632, -129588, -207268, -244195, -211096, -204379, -253050, -174317, -90001, -132727, -158084, -135791, -147255, -169554, -90836, -184814, -216300, -191428, -195759, -78918, -90997, -201214, -251273, -223265, -155912, -228369, -200323, -184192, -250960, -219750, -110488, -113847, -192191, -132118, -201010, -166009, -139965, -59571, -64430]
2683f4430o4700o2081L3966L6687J8100j29277K4494R9364m1439N4183k3554p6953
2671a95640k3597M8335j0212J2722p3146l3049R0661L0905L6114j7138K7365J8404
2659h8276l9254m4191L4502n5276r288r3631P3360N6420R4113L7899k3413n4710
2647a11745N9681J6486q1833m9597K1800P7403L8771r7697p3560j5660P4960l7253
2635a78244J22422r364L409j06825r28P8115L4355p4371j33195Q0963M1605N4402
2623h7656q565n7377M081m2109L5232J7744r587J6424M1064M3800j9485j8331
2611h4765j7393j4439n7418J875k8997j6292L4831J07791m3234P4284r5715l4594
2599a74066M5406q20j47458K1561R0565m5916l017R8773P2343k0510o0562N3422
$$ y = [-64430, -129130, -191211, -157245, -120558, -102458, -231735, -207241, -107877, -149316, -95133, -118687, -195640, -219237, -170902, -181114, -168392, -241538, -274587, -183926, -153021, -116907, -134045, -106680, -88276, -127530, -171721, -137219, -192495, -201783, -295414, -222054, -165634, -71521, -33622, -57035, -111745, -52064, -35578, -117411, -167008, -145208, -67805, -29034, -126731, -200291, -215951, -140991, -178244, -55822, -65186, -61777, -168602, -169530, -91415, -57060, -131431, -264626, -183663, -142058, -87656, -96221, -153598, -149517, -191626, -156394, -138650, -148237, -131813, -90749, -46949, -66434, -84765, -102158, -116597, -174015, -172140, -201137, -217429, -182598, -74807, -118041, -43757, -139472, -174066, -128660, -129480, -276938, -255377, -164812, -210728, -213745, -114972, -42629, -63139, -123701, -70279]
2587g0279M9101q8382k6681Q371j2614J18804k1472P610r145M2734k14664M1634
2575a74983K1416m9060N7674R3690K6347J00333p2866j52173n8836M9137Q7874
2564g1447O6967l2998R8871o0851j07721O1712l5979l7747M14j11323p3652Q9873
2552b13881P9407j3678l8390J4474M39J37628o5987o8051M7296K9932l8100j6099
2540a45010L6473l2388k9806L9630N3948m929r3327k6743n0999L2450N9130k7818
2528a89389R6198o571j4399L769j6906j3914j24155P5917M2567O4316O5510j3291
2516c0348l3762m6191o6413M8533o3685N6365k5556r159O8598n9940K8984K5067
2504a07507L9371K6715q3833J5619k5948m611l4153o118J08446j51604J3808O9771
$$ y = [-70279, -21178, -109560, -136241, -127870, -140484, -21680, -43152, -35542, -44687, -1953, -216617, -174983, -153567, -202627, -144953, -51263, -24916, 75417, 2551, -149622, -208458, -159321, -71447, -4480, -37478, 61393, 542, -107179, -45467, -81446, -119193, -118779, -230102, -303754, -213881, -134474, -148152, -186542, -172068, -171629, -34001, -99988, -168039, -120743, -90811, -128911, -145010, -108537, -140925, -170731, -131101, -77153, -82082, -175409, -202152, -253151, -220701, -161571, -189389, -93191, -99762, -114161, -110392, -127298, -141212, -265367, -189450, -146883, -82567, -17057, -30348, -64110, -110301, -176714, -128181, -191866, -135501, -161057, -170216, -101618, -161558, -132574, -107507, -68136, -41421, -125254, -109635, -135583, -140194, -174347, -180465, -72019, -223623, -209815, -140044]
2492a40044q2830J0688l5644J42706j5400k7534M9145K901P058j19750R5822j2824
2480a25706K1214R4664j7012O7083J01099j41114j31230N5639k8584J9810L0327
2469e3810o237m6498j6221p2144J2811L8320m5053O2068P7383o8904j4904q0574
2457b13763J01235J32399O205j10196L0992n1189L0503k1316N2615M2737m6913
2446d6691J5729j5365j01184k9808J43013r213K6207j5956k3057J5308O1113N0021
2434G0117j47656n1880J3228L1061K6933K193m5978J7289j693L2349K4390m6865
2422g6512k9707J11620j0376q1830l938j07060j6073R3162K5021p1695K9296l1365
2410a69457J2879l369Q7391o7786p9436m2506O1266M2356p836p6772R7108R2981
$$ y = [-140044, -222874, -212186, -247830, -105124, -120524, -148058, -98913, -96012, -88954, -208704, -112882, -125706, -104492, -9828, -26840, 40243, 141342, 228, -131002, -75363, -103947, -84137, -53810, -60047, -106545, -122766, -194910, -182099, -143779, -188832, -126764, -49381, -118285, -133189, -213763, -112528, 19871, 26076, -84120, -53128, -104317, -73814, -95130, -42515, 222, -46691, -30962, -46327, -147511, -177319, -34306, -43519, -17312, -33268, -56325, -41017, 20096, 70117, -77539, -129419, -116191, -85130, -58197, -56004, -101982, -84693, -86386, -54037, -29647, -76512, -106219, 5401, -4975, -86805, -90743, -197803, -213876, -120714, -95693, -167388, -138092, -169457, -156578, -159947, -72556, -140342, -219778, -262284, -201018, -158662, -166498, -243270, -146162, -53181]
2398e3181q2103k5788K26465j3234k0289l0866r9182P5833m0242p5372P2279P3676
2386G996L2132J1149o3634j07131J09284N5074n1464N3538n3075l8965O2470q4797
2374f7423k5442P0259L6783m724m0911r222j6936N3423L477o5139J1769O6822
2362A2736L1846k8378j5103N104K7511L841J1089q6792k4873L5843l8731Q2676
2350A6769p1938J6427K9108N0337L6855N3646L4319j33102L4027N4773k9995Q7233
2338A78459R1571o6482R9191J2867k1269n5702L177m9362L2271j28929j11620
2327a5828k0867R4797r0332k5065l4095O8726M6093n9371N4896q7165k2041J20224
2315B9972n1025n0538J48105j2842K5537j6081J7472o3801P2032p1912l2723J03399
$$ y = [-53181, -135284, -161072, 65393, 52159, 31870, 1004, -98178, -22345, -62587, -137959, -65680, 7996, 40128, 51277, -12357, -119488, -10204, 44870, -6594, 46944, -6131, -45096, 17374, -67423, -92865, -22606, 14177, 9453, -31458, -40680, -57616, -4193, -716, -65855, -54086, 12736, 44582, 16204, 1101, 6205, 33716, 37557, 48646, -38146, -63019, -27176, -65907, 16769, -55169, -38742, -9634, 40703, 77558, 131204, 165523, 32421, 66448, 121221, 91226, 178459, 270030, 203548, 302739, 315606, 294337, 238635, 241812, 192450, 224721, 95792, -15828, -36695, 58102, -32230, -57295, -91390, -22664, 23429, -35942, 18954, -68211, -90252, 29972, -21053, -71591, 76514, 63672, 89209, 73128, 90600, 26799, 98831, 26919, -5804, 97595]
2303I7595J1687j64184J08412j3166j30310l2544P1906O5095L5985M2945p2706
2292B0715j15641Q5177J3975o8679n0465O7662J07139r031o405j7876l1705Q2216
2280G7082J18612o7268n778n3347k9804k7785p3612J22709N5477L1103j10763
2269C6626K5611n3539K3994J42980N1802j39598m7525l3999m8963O9335O9317
2258I6041k0548j9635O7458p3396o945J5431Q4082J1626j09947R6173J15803o7490
2246A88653p8408J6836m2323J7947m1860M3371R1800O360p2550P5461K9124m1745
2234A92666l7170m6749P2901J663l820k5001J14249k4296l2867n9804p238M8436
2222A92970o056l6413p3155l1748Q5466N8638J13827p8622k9461J36502J5831
$$ y = [97595, 109282, -54902, 53510, 40344, -89966, -122510, -50604, 14491, 50476, 93421, 20715, -94926, -9749, 4226, -64453, -114918, -47256, 59883, 50852, 44447, 26571, -5134, 77082, 195694, 128426, 122648, 69301, 39497, 11712, -61900, 60809, 116286, 147389, 36626, 62237, 8698, 32692, 175672, 227474, 87876, 40351, 6352, -42611, 26724, 96041, 75493, 55858, 123316, 49920, 42975, 58406, 142488, 154114, 44167, 140340, 256143, 188653, 110245, 127081, 84758, 102705, 60845, 104216, 196016, 202376, 129826, 205287, 234411, 192666, 155496, 108747, 181648, 183311, 179491, 154490, 268739, 244443, 211576, 151772, 144534, 192970, 186914, 150501, 77346, 45598, 131064, 189702, 303529, 224907, 195446, 331948, 347779]
2211C47779j40281m9682Q11r956M1666O6426J1393q0029K7130m5307k0277O6722
2199B16395J16940k7471r8798L443M9379M7567r1089N9792J1760o2130r3224K2997
2187A55561J04294n2383N7335J20711l184L2313j4576l734m8279J21271j4374
2176D54955j1747l7834J4024Q942m1877K752m981l0736M5586O9886L7664r8766
2164D07868P2190P9425q5840R9198K2869Q617J01253k8522n796R9586p3796K8230
2152G25282J26293j68L385J45350N4813o7494P4164J21440m928q2772k2046M1085
2140A114404M3895l9772n5308J30517P0109l6314J26990J44601k3035R9354L2437
2129A607878O906q180Q952J3329j3048K8031J56273N2474P482j0478L6816J10489
$$ y = [347779, 207498, 157816, 158627, 148671, 190337, 256763, 268156, 188127, 215257, 169950, 149673, 216395, 333335, 305864, 207066, 210509, 259888, 307455, 216366, 276158, 287918, 225788, 132564, 155561, 259855, 207472, 264807, 385518, 382334, 414647, 400071, 396337, 348058, 469329, 454955, 443208, 405374, 419398, 428340, 386463, 389215, 384234, 353498, 399084, 468970, 506634, 407868, 480058, 559483, 473643, 572841, 595710, 604327, 705580, 677058, 671262, 770848, 697052, 725282, 851575, 851407, 854792, 1000142, 1054955, 987461, 1061625, 1183065, 1178137, 1095365, 1073319, 1114404, 1158299, 1118527, 1063219, 1193736, 1263845, 1227531, 1354521, 1499122, 1476087, 1575441, 1607878, 1614784, 1606604, 1615556, 1628885, 1615837, 1643868, 1800141, 1852615, 1860097, 1849619, 1886435, 1996924]
2117A996924J64438O6505N8863J29296J48905L6398j3903o6324J43525J38498
2107B803125J13201R5675O1028J31298J57494L34064J59442J25331K00036K81394
2097D462088K24747K26461L09150K56096L26419L93727L71666M36416N68760N43151
2087H118681O62750P65000P73204Q59682Q98187Q70134R91838J347667J511293
2078A6798436J756013K115007K791356L593969M550770N684330O862511P416890
2070E1569282N345727n15797o049200p606918p185849n860760m968622m080674
2062B0647189l055356k376708j813524j402085r77311n99346n52591m73203n56661
2053H840404p40520o48983o10031n58095l68679l39402l36626k37898k71025j90195
$$ y = [1996924, 2161362, 2227867, 2286730, 2416026, 2564931, 2601329, 2587426, 2521102, 2664627, 2803125, 2916326, 3012001, 3073029, 3204327, 3361821, 3695885, 3855327, 3980658, 4180694, 4462088, 4686835, 4913296, 5222446, 5478542, 5804961, 6198688, 6570354, 7006770, 7575530, 8118681, 8781431, 9546431, 10319635, 11179317, 12077504, 12947638, 13939476, 15287143, 16798436, 18554449, 20669456, 23460812, 27054781, 31605551, 37289881, 44152392, 51569282, 56915009, 56399212, 50350012, 42743094, 35557245, 29696485, 24727863, 20647189, 17591833, 15215125, 13401601, 11999516, 11022205, 10422859, 9870268, 9397065, 8840404, 8099884, 7450901, 6840870, 6282775, 5914096, 5574694, 5238068, 5000170, 4729145, 4538950]
2043D538950j86623k80050j66960j82691k67933k08129k12349j29807m2196q3871
2033B778341p2118j46709j65517m8702o0504M7554j75859o8609j56836r5544o1228
2022A774269p5121K8415o478o9255j8342n5286j0657j61245M1327j9089o7221
2011A361317J3407j34829m4932o0368L5517n525l0001P86p7487l2479l6816j30768
1999H57822j2546j105P4307j03950K4868l7631k7455o4835j12093m8833n3784
1988D94765J69596L3258p077n0604o7690r5296P8850L3626N9069k1349j33411
1977D93737J29438q4401o1253M5873O390K9069j24275l3198k0453K2045O6568
1966D69540k0881Q8396p2333k8310K3366m3971L9221m2221k0078J19867l0050
$$ y = [4538950, 4352327, 4072277, 3905317, 3722626, 3454693, 3246564, 3034215, 2904408, 2862212, 2778341, 2706223, 2559514, 2393997, 2345295, 2284791, 2332345, 2156486, 2087877, 1931041, 1835497, 1774269, 1699148, 1727563, 1721085, 1651830, 1633488, 1578202, 1567545, 1406300, 1447627, 1428538, 1361317, 1374724, 1239895, 1194963, 1134595, 1170112, 1164587, 1134586, 1135372, 1057885, 1025406, 988590, 857822, 845276, 844171, 918478, 814528, 839396, 801765, 774310, 709475, 597382, 548549, 494765, 664361, 697619, 690542, 639938, 572248, 476952, 555802, 589428, 648497, 627148, 493737, 623175, 538774, 477521, 523394, 529784, 558853, 434578, 401380, 380927, 402972, 469540, 448659, 537055, 464722, 436412, 459778, 415807, 455028, 412807, 392729, 512596, 482546]
1955D82546J9137j02995o4807q0386L3500M3720J519l7544o0857l2809m5515M8090
1943B03599O2239k0613o1228L7076N4729n0441l679J66256n4957l0491O4292j00370
1931B66412m7434p5947Q9724P094r7381J26144K7649j3683n5556n4598j00878
1920G1546N6620n4593L639R7169l2371M3371O0105J1917K2422j04100p2032K7150
1908A30843j28336n9665J82613j5966k7691m0030M8569P4100m3034o6160m5859
1897I384K2514p8473R9969J31127k5235p5668N7891K9346m2094r0999j12960M7152
1885b8046P4563P9520J4781l0096J8378k4233n8212j8016k6516j10815k2006M8602
1873h2096J41603j1582J21362j4347n4329m7350j41078P4014n2014l2703n8074
$$ y = [482546, 501683, 398688, 333881, 253495, 286995, 330715, 332234, 294690, 233833, 201024, 155509, 203599, 265838, 245225, 183997, 221073, 275802, 225361, 221682, 387938, 332981, 302490, 366782, 266412, 218978, 143031, 232755, 239849, 142468, 268612, 296261, 282578, 227022, 172424, 71546, 128166, 73573, 77212, 174381, 142010, 185381, 245486, 257403, 279825, 175725, 103693, 130843, 2507, -57158, 125455, 109489, 81798, 41768, 90337, 164437, 121403, 55243, 9384, 31898, -46575, 53394, 184521, 159286, 83618, 141509, 170855, 128761, 37762, -75198, -28046, 46517, 126037, 140818, 110722, 129100, 104867, 46655, 28639, 2123, -108692, -130698, -82096, 59507, 47925, 169287, 154940, 100611, 53261, -87817, -13803, -65817, -98520, -156594]
1862a56594J39346p9523P7179J21910o4129o9171J1336O9578r197O6663k8398
1851G9000K9589j495l9092P5114l0706n4143L6913o3059K6181N2188n5485j7511
1839C7494l9118p9825j4671J16068R7331r594l1821o6553J56152j1419q6782L2409
1827I9671L0658k6287j00932M0314O5607k5236q043J6838l3639J6705q5399K8318
1815A8575J461N8537L9085q734m7429o0842N6842q8011R8517r7856J67537j52871
1803a5189J5634J72180N9540O1296q105n9214j9568m2967j14288Q7183K087o350
1791A32239r2385n6604P0339J15191j02776j5681J0933P9199j0786j36791m5649
1780e2771R3804J9350o0204n2670P5840n9187o1474J49550l5058m6699L7783R6889
$$ y = [-156594, -17248, -96771, -19592, 102318, 38189, -30982, -19646, 49932, 40735, 107398, 79000, 108589, 107094, 68002, 143116, 112410, 58267, 95180, 32121, 58302, 110490, 55005, 37494, -1624, -81449, -96120, 19948, 117279, 107685, 75864, 9311, 165463, 154044, 67262, 99671, 130329, 104042, 3110, 43424, 109031, 83795, 75752, 92590, 58951, 75656, -9743, 18575, 20036, 78573, 117658, 108924, 61495, 653, 57495, -30516, 68001, -29855, 137682, -15189, 445, 172625, 232165, 293461, 285356, 226142, 206574, 163607, 49319, 136502, 138589, 132239, 39854, -16750, 53589, 168780, 66004, 50323, 61256, 140455, 129669, -7122, -52771, 41033, 60383, 179, -52491, 23349, -35838, -97312, 52238, 17180, -29519, 8264, 105153]
1768A05153q2085r2002r048O6889N333k4826J05706r1939r0781l4346J50578O2357
1756G0989k3832K2520o0783J8785N5928l2731j5283j1163K3479j7011N2984j3707
1744G0175m8261L7182K8120p5451p6435J5034K8919n3219j5057P0462k6204m530
1732d9265R1964o4187m1174M5558L6760r2021Q705M7093J01594R3653p5468o6241
1720C6971j40810J2809J54674j1721j20177n0270N1040P4415M3772p9712o6985
1709i5994L9203K4074l3235q0492J2804J06219J13961K5854L2264q0901J885m3396
1697B2246p838p7305l4602K3518J1976Q4051j180N6600l0906k2677P8655r1133
1685A1405Q902r159J769l732K1137O2269n7332n5958K7851J4102r1741j9010N4609
$$ y = [105153, 23068, -68934, -77982, -11093, -5760, -30586, 75120, -16819, -107600, -141946, 8632, 70989, 47157, 69677, 8894, 27679, 83607, 50876, 35593, 24430, 47909, 30898, 83882, 70175, 21914, 59096, 87216, 11765, -64670, -49636, -20717, -73936, -88993, -18531, -44735, -49265, 42699, -21488, -62662, -17104, 19656, -72365, -63660, -16567, 85027, 178680, 103212, 36971, -103839, -91030, 63644, 51923, -68254, -118524, -67484, 6931, 50703, -29009, -95994, -56791, -32717, -65952, -146444, -133640, -27421, 86540, 112394, 144658, 63757, 65642, 22246, 14408, -62897, -97499, -73981, -62005, 22046, 20866, 77466, 46560, 23883, 102538, 11405, 20307, 11148, 12917, 9185, 30322, 92591, 35259, -20699, 7152, 21254, -70487, -89497, -34888]
1672c4888L2667K5164M3499M104K046n1271l6208M4843L5131j090k1567l4020
1660H410O7913j5958l4810J5309o8399m2556J2747j828L3013J3445n2558R1325
1648B6053j0137k8776l8375p0092P7278Q9203j1499j0383n6350R5084j23672l1385
1636i3051L0380K977M4292q4100Q2311R3448n7162n365j3711J2442M2570l4655
1624B0376l0495O607M8154O4405Q0443j781o5810j40038l6413j06893J45740J43262
1612A27557o3549r0264p3324M2278j12901k2398R3405l0608N0111L2389o7825
1601a15129q9120J08367P765k3552J732R2076l9561n0063P0808N6917l6683K1397
1589D954q1688j3735J07003m7692k3670k4864N6645R5819L1286l5196j5250m0187
$$ y = [-34888, -2221, 22943, 66442, 70546, 72592, 21321, -14887, 29956, 65087, 63997, 42430, 8410, 76323, 60365, 25555, 40864, -27535, -70091, -57344, -59172, -26159, -12714, -65272, 26053, 15916, -12860, -51235, -121327, -44049, 45154, 33655, 23272, -33078, 62006, -61666, -93051, -62671, -59694, -15402, -99502, -17191, 76257, 19095, 13730, 19, 12461, 55031, 20376, -10119, -3512, 44642, 109047, 189490, 187709, 121899, -18139, -54552, -161445, -15705, 127557, 64008, -26256, -99580, -57302, -170203, -192601, -99196, -129804, -79693, -47304, -115129, -204249, -95882, -88117, -111669, -109937, -17861, -57422, -107485, -36677, 20240, -16443, 4954, -76734, -90469, 16534, -31158, -54828, -79692, -23047, 72772, 104058, 68862, 53612, 13425]
1577A3425Q844n663n0435Q842R8420L8216r1069m3441P2756k8325N6025r2285
1565a4690n4456K6138J2971j853J0285J2156J9933M6349j24128R4160L8431p73
1553F4523j6206n8348n0302N2067n0040o4306O604K3384R9348O829q9801k8333
1541a04581q3969j21155J00523J32369L8019J8743L1951L5849o687p4459O7164
1530C3767M452N875o6270K8976L9829q655j5529n5085K7789l9821O5178K0412
1518D0918k5152O9657l9l1132O816p9861N4751K4707j04438P9892O5672K738k5408
1505G9121q4170L9598Q0711j27784l0459K3397J0157n4582P9662M7770j41424
1494g8003K9337P4200k0630K3938j06644M5854J50728m7582k4053k4548k4832
$$ y = [13425, 22269, 16606, -33829, -24987, 73433, 111649, 20580, -22861, 49895, 21570, 77595, -14690, -69146, -43008, -30037, -31890, -21605, -9449, 10484, 56833, -67295, 26865, 65296, 64523, 48317, -10031, -60333, -8266, -58306, -122612, -116008, -92624, 6724, 13553, -76248, -104581, -188550, -309705, -209182, -76813, -38794, -20051, 11900, 47749, 41062, -33397, 33767, 38219, 44094, -22176, 6800, 46629, 37974, 22445, -32640, -4851, -44672, 20506, 40918, 15766, 85423, 85384, 54252, 61068, -18793, 35958, 60665, -43773, 36119, 101791, 104529, 79121, -5049, 34549, 115260, -12524, -42983, -19586, -9429, -64011, 15651, 63421, -78003, -48666, 25534, 4904, 28842, -77802, -31948, 118780, 71198, 47145, 22597, -2235]
1483b235m112j46777J1354Q0279K0648k168L9665J5417M7289M6012j20958k1974
1471c7560r474L2919P1388r2270r2572N606k8263M7726J35975l0588j34596P0638
1459f1071M3811n2646m9626Q1406J04354n8924p5500o6382L8131J17876O512r2492
1447f4551K7194m4550p0389L1662M0908O6342m7502O6353J28114m0147j15729
1436b2295M853P5749J2506q2613N4919l0797K6671j15660p8175k2558N4363J03931
1424a9106J2254j4539N0201P40j61441K7935J2185R1412L9957N1169j28048m1316
1412g8597K5709O6419M923l3081K3507L1393L5201p3205M187L9343j3504K3796
1400E6091K2183l9044n8021j07644P8797j2946l8739K9598l3087N2552K1868J7038
$$ y = [-2235, -6347, -153124, -141770, -61491, -40843, -43011, -3346, 12071, 59360, 105372, -15586, -37560, -47034, -14115, 57273, -34997, -127569, -121963, -150226, -102500, 33475, 2887, -131709, -61071, -17260, -69906, -119532, -38126, 66228, 7304, -68196, -134578, -96447, 21429, 27941, -64551, -37357, -81907, -152296, -120634, -79726, -13384, -60886, 5467, 133581, 93434, -22295, -17442, 58307, 70813, -11800, 43119, 12322, 38993, -76667, -154842, -177400, -123037, -19106, -6852, -21391, 28810, 29550, -131891, -103956, -91771, -359, 39598, 90767, -37281, -78597, -52888, 13531, 18454, -14627, 8880, 40273, 75474, 2269, 6456, 45799, 32295, 56091, 78274, 39230, -18791, -126435, -47638, -60584, -99323, -69725, -102812, -50260, -28392, -11354]
1388a1354M2428p5574R3156m2712K4779p338P8268j5504q8434P213j11020n0731
1376a56823J38141J07491K4984p5216r8358k9022j863L2352m0323l65P4799J13347
1364H9144j12585m5746L9184O4445J33676j8801q7353n8995N605m7024m6597L5767
1352d9280J51441r4017m7058n7387p138K4412k8771J88018p9110L3478R5774q5356
1340D5006n1523J00442j31573n9930M003J2412p876J7254K89O1338J4486Q1017
1328H5345k9551m6002L3774k4675p9400K2485O0161R409l3061k4234J7437J118
1316g194m405P3n0223J67545J19781q7376n1722j33997L9161J49801o7246n5227
1304A8971L471N021K5591n9339O6469r240K7047J1691n7929n7866M3465o8575
$$ y = [-11354, 31074, -44500, 48656, 5944, 30723, 23385, 101653, 86149, -2285, 4928, -106092, -156823, -18682, 88809, 113793, 38577, -59781, -88803, -90666, -58314, -98637, -99002, -24203, 89144, -23441, -69187, -30003, 34442, 168118, 149317, 61964, 2969, 8574, -38450, -85047, -49280, 102161, 8144, -38914, -96301, -103439, -79027, -107798, 80220, 1110, 34588, 130362, 45006, -6517, 93925, -37648, -97578, -93575, -81163, -89039, -71785, -71496, -10158, 4328, 85345, 55794, 9792, 43566, 18891, -60509, -38024, 22137, 31546, -1515, -25749, -8312, -7194, -11599, -11526, -61749, 105796, 225577, 138201, 86479, -47518, -8357, 141444, 74198, 18971, 22442, 27463, 53054, -6285, 60184, 50944, 77991, 89682, 31753, -26113, 17352, -51223]
1292e1223p2124j5040M4665Q2248J5882l98l0561O6354j03749m1327J1058M8944
1280d5271K09333j5742j35214j67030j2583P6122J29461m502J13246k2570j03790
1269B1460J07526K0389l4924j11583l3725L6133k0609j11575k5656N1801J3474
1258h7289Q3837P1893K164q1313O8480O0399j03907j9396j9509N42j8086J74040
1246A31855R849n2951m9453n0374L5774p752k7911k6241O3634j6183L8849j3565
1234C5531K6273R9706m6706j61737P5670P4275j57880N1463K0827m5211N0353
1223B2564l8900J17984j9254j3280o9570j6066K6752p2107O3709Q9663q358m69
1211H2668J02252p6504j26197N5568M481j0267m3956m7077l3666m7270K364K3320
$$ y = [-51223, -123347, -138387, -93722, -11474, 4408, 4010, -26551, 39803, -63946, -105273, -94215, -45271, 164062, 148320, 13106, -153924, -166507, -90385, 39076, 34574, 147820, 125250, 21460, 128986, 149375, 114451, 2868, -30857, 5276, -15333, -126908, -152564, -100763, -87289, -3452, 68441, 70605, -10708, 57772, 118171, 14264, -5132, -24641, -24099, -42185, 131855, 141704, 88753, 39300, -11074, 24700, 16948, -10963, -37204, 26430, 10247, 49096, 35531, 61804, 161510, 114804, -46933, 28737, 103012, -54868, -3405, 17422, -27789, 22564, -16336, 101648, 82394, 69114, -456, -16522, 10230, -61877, 1832, 91495, 83137, 82668, 184920, 108416, -17781, 37787, 42268, 32001, -11955, -59032, -92698, -139968, -137604, -114284]
1199a14284P5166P5336p2834n8901L6451k5343J04861l7154m3903Q2991o670K364
1187A8080K0915J5677k3126N5651K1483k4642q4311l8346N0217j3501l3820j8369
1175e4092J7927J33656k3546p4666J163k7537J9482l6047P0392m4729J0852N1287
1163D4142J70931m625r5361l4885j03749j27467J00221J4108q3611R8248P4150
1152E2102o4245M4767N8203n8612j1592l1824j6972j124N4569p7555L3672j3895
1140c2506Q2699P5170l3089k9273n0813P3728r4247j8278k6434q594L3721R7749
1128F9833k3704J3058O0268J2652l297q9843o8592j9449J61459J5269o1765l6759
1116B9130o1062l5244R1318Q9682l9645j4185L4656p9860j20112L2789J627O1295
$$ y = [-114284, -39118, 36218, -36616, -95517, -59066, -84409, 20452, -16702, -60605, 22386, 15716, 18080, 38995, 54672, 31546, 87197, 108680, 84038, -273, -38619, 11598, -1903, -35723, -54092, -36165, 97491, 73945, -721, 442, -27095, -7613, -43660, 26732, -17997, -7145, 44142, 215073, 210448, 115087, 80202, -23547, -151014, -50793, -36685, -120296, -22048, 52102, -12143, 32624, 90827, 32215, 20623, -11201, -28173, -29297, 25272, -52283, -18611, -32506, 50193, 125363, 92274, 63001, 12188, 85916, -8331, -26609, -53043, -61637, -27916, 69833, 46129, 59187, 119455, 132107, 128810, 38967, -29625, -49074, 112385, 127654, 65889, 29130, -31932, -67176, 24142, 113824, 74179, 59994, 94650, 14790, -105322, -72533, -70906, -9611]
1104i611j2480j24893J56061R3334k8304l7748q7799q549L6974n6838j1085N3041
1092c7897Q547k2437J1601O6020k521K517j24015J25752R1220j4614n7645j04760
1080e8232L6168j3155J0977R417q972R86J69114P78n5110o2547k6222Q5603o4860
1067B3945k5376K5625j27204J5039P8820O4236m6443o6120P6673n8212M9442O0707
1055G1132m5734J4375o2636O4328l092K5340m3561K8222n0478J14862K4187q9210
1043D7735Q0131l4997l5783p9735L0560R010o0963O4216k1174K8743M976p6506
1031d3787K5717P1040P950q172J732n6763L336O0049l1007N2779k500k6882o2422
1018h930r8371K7939J41627O0100p8866Q9659o6606k1762O7730N0535r1107q3254
$$ y = [-9611, -22091, -146984, 9077, 102411, 74107, 36359, -51440, -59989, -23015, -79853, -90938, -37897, -29350, -51787, -40186, 25834, 23313, 25830, -98185, 27567, 118787, 104173, 46528, -58232, -22064, -35219, -24242, -14825, -23797, -22811, 146303, 147081, 91971, 29424, 3202, 88805, 23945, -1431, 24194, -103010, -87971, -9151, 55085, 8642, -57478, 19195, -39017, 10425, 71132, 25398, 39773, -22863, 41465, 38373, 63713, 20152, 48374, -2104, 112758, 136945, 47735, 127866, 92869, 57086, -22649, 7911, 16921, -44042, 20174, -1000, 27743, 32719, -43787, -18070, 52970, 60920, 52748, 54480, -2283, 1053, 61102, 30095, 82874, 80374, 53492, -8930, -107301, -79362, 62265, 122365, 43499, 133158, 66552, 44790, 112520, 163055, 71948, -11306]
1006a1306o627L1808j8597O6158K4948L7340o3957j11526J5305K6846k5536K0560
994a4584j4115k6241K2781K570m9690R9272j2053N2170M2033J2069o2188m6453
982E571j6382p0929P1242L7298P9513p3294q1328m5813K4368J58655l6533j08634
970e6266O195K7749O8542j3944p981K1173o1565j0643N0913J4500J155P0078j5881
957I4025n6122p8549n7365J4899Q1076O5285m0041Jp9304J8224J24118j40794
945e4547r7838J38818K9997m1346k0469P6108M2783l3962j0298N8242j8242k2423
933D6823o3001L963m1276j9345P6979J1732m3933k7565L1536Q5048J4011K5824
921A00796J3594j38458m1757P8339K3856Q7265o5897Q959P1687j22940m2185P037
$$ y = [-11306, -17933, 13875, -4722, 61436, 86384, 123724, 59767, -51759, -36454, -9608, -35144, -14584, -28699, -54940, -32159, -29589, -79279, 19993, 7940, 60110, 102143, 114212, 52024, 5571, -10811, -81740, -10498, 26800, 106313, 33019, -48309, -94122, -69754, 88901, 52368, -56266, -50071, -22322, 46220, 32276, 24295, 45468, -16097, -26740, 24173, 38673, 39828, 109906, 94025, 37903, -40646, -98011, -83112, -2036, 63249, 23208, 23209, -56095, -37871, 86247, -54547, -152385, -13567, 16430, -24916, -45385, 30723, 73506, 39544, 29246, 87488, 69246, 46823, -16178, -12215, -53491, -72836, 4143, 15875, -28058, -55623, -24087, 60961, 74972, 100796, 114390, -24068, -65825, 12514, 36370, 123635, 57738, 66697, 138384, 15444, -26741, -19704]
909a9704l6337j2330Q9701k2347Q1905l2568n7376K2579l2455K2736N9342k0397
897D2749M753p4970j56397J82234n6199m7365N2760J4788J7404K2632J0527L4459
885D7375m8656P3350K3223n800K2954j9212k683o4626j0693O090R0476p3420J1503
872D9881k3631K3768k8565k7836l7645p1877q371P9532j478P9507P7024p6895
860C3414m3005l3368n264n3269J03510J20566o3337J9993J2044j22316o0456N3905
848c7583J19754n8690n9182J7293N2462K2035o126N3771M6988r0416j11650l3499
836h4843L1744J4433l7842J00020l7624o012p518j5404l3149l7667Q3385r3271
824a23748R6230J13687J045r0946o0402N5556N7374N8504n5236K550k5756k0821
$$ y = [-19704, -56041, -68371, 21330, -1017, 80888, 48320, -9056, 13523, -18932, 3804, 63146, 42749, 47502, -27468, -183865, -1631, -57830, -105195, -52435, -37647, -20243, 2389, 12916, 47375, -1281, 72069, 95292, 89492, 112446, 93234, 90551, 25925, 15232, 21322, 111798, 38378, 49881, 26250, 50018, 21453, -6383, -44028, -115905, -124276, -44744, -46222, 33285, 110309, 33414, -9591, -42959, -48223, -101492, 2018, 122584, 59247, 79240, 91284, -31032, -91488, -37583, 82171, 23481, -35701, -18408, 34054, 56089, 49963, 103734, 150722, 60306, -51344, -84843, -53099, -38666, -76508, 23512, -14112, -20124, -27642, -43046, -76195, -113862, -30477, -123748, -27518, 86169, 87214, -3732, -64134, -8578, 48796, 107300, 52064, 54614, 28858, 8037]
812H037k5293R7659m0845l7301J2164p9367Q6348p8482n7548R1931L0720P5104
800H3127l9574l976K9918K2237n5351j4696J02317j5418q2585j4660K9136j9805
788B0670J20199j9690j08664J521p8258J3949N8714K0908n0037m6659J9516N3121
776E290N4519p4543L4531N6161o0825Q317l4422J6679O2138q7782n6420L6569
764c9788R8568o6934J1060p3304J10672P0352q680q3970J8918L9439r1498J77759
752A62594K2983p1549j08480J3230j02126k1904Q3511R9511k9556M0275O4321
741A52810j20330n5207j09507j4099Q0241M6697J1720j5931M5614k7055N4282
730D9235j3599O5499K127l0382j179K9279n1846l2725j28937k4688M7750j5826
$$ y = [8037, -17256, 80403, 39558, 2257, 14421, -64946, 21402, -57080, -114628, -22697, 8023, 83127, 43553, 39577, 69495, 91732, 36381, 21685, 124002, 108584, 25999, 11339, 40475, 20670, 140869, 121179, 12515, 14036, -64222, -50273, 8441, 29349, -20688, -67347, -47831, 5290, 59809, -14734, 19797, 75958, 15133, 23450, -10972, 5707, 67845, -19937, -76357, -39788, 58780, -8154, 2906, -70398, 40274, 110626, 101946, 17976, 36894, 76333, -15165, 162594, 185577, 114028, 5548, 18778, -83348, -105252, -21741, 77770, 48214, 88489, 152810, 32480, -22727, -132234, -146333, -66092, -19395, -7675, -23606, 22008, -5047, 49235, 35636, 101135, 103262, 72880, 71701, 100980, 49134, 16409, -112528, -137216, -89466, -105292]
718a05292R5736P406k537o8767K3927n5520L3712L2417J02649m8656O361o998
706A4438j9527q3036J8701K3101R6246r7710Q883M4603M5547k1471J5284L0236
694G5295l8289P1456j13159q6031k8903N949L1569Q8092J5446m745K2269M9099
682H8048q1353M7644n9517J8810M6108N5812j22498l7616m7738m6998J09092Q079
670b2127N953r7386P8305P9902m4386J9139n4357K5620O0691q4354J2827R6382
658G6209j1722N4740k5333n3549n7634M0457R9992k7386p1925j2417L9678K9977
646H1087p6822k6223N1687l3299N76J9047j4875J14556M9318j36932r891M2227
634F0456l7313k587l0990L5527N9736m6500k3808j3479o2500j4065L9030L1932
$$ y = [-105292, -9556, -2150, -4687, -73454, -49527, -105047, -71335, -38918, 63731, 15075, 21436, 14438, -5089, -88125, -69424, -46323, 49923, -47787, -38904, 5699, 51246, 29775, 45059, 75295, 37006, 108462, -4697, -90728, -119631, -113682, -82113, 5979, 21425, 16680, 38949, 88048, 6695, 54339, -5178, 13632, 59740, 115552, -6946, -44562, -92300, -139298, -30206, -22127, -16174, -113560, -35255, 44647, 261, 19400, -34957, -9337, 51354, -33000, -20173, 76209, 64487, 119227, 93894, 40345, -17289, 23168, 123160, 95774, 23849, 11432, 51110, 81087, 4265, -21958, 29729, -3570, -2994, 16053, 1178, 115734, 165052, 28120, 18229, 60456, 23143, 20556, -10434, 25093, 84829, 38329, 14521, 1042, -61458, -75523, -36493, -4561]
622d561N1352O1876m7587j3350O3899j16857k7251l4332l4281J4754j7950J10841
610F553K9875o2127J3402L2263L2736p560k2874n9739L2876j2828M2483j14865
598h9805m3349P3950M8429N2995K8341k6332j06130K0140k2572J5592N269O1216
586A7744K9547l3153n7537R2438P0937j70380L9499Q6427m5977L0566j160k5152
574C3799Q248o9053l2568K4404Q2450j32143O4393q7287n7246R0305J77894K892
562A06088j36596L7901j23975Q1101Q7324l7836k5731o6128J11823j2903L3393
551E4461J2973m9326L2900k6724l379O5359o9720o0676J2074n2837M3975N4081
539A3161R635k9696J23037j18889K8297j1166L7552L4034q1111m4445O4661k0575
$$ y = [-4561, 46791, 108667, 61080, 47730, 111629, -5228, -32479, -66811, -101092, -86338, -104288, 6553, 36428, -25699, -12297, 19966, 52702, 45142, 22268, -37471, -4595, -17423, 25060, -89805, -133154, -59204, -10775, 42220, 70561, 44229, -61901, -41761, -64333, -48741, -43472, 17744, 47291, 14138, -43399, 49039, 119976, -50404, -10905, 75522, 29545, 60111, 58951, 33799, 42047, -27006, -59574, -35170, 47280, -84863, -20470, -107757, -165003, -74698, 103196, 106088, -30508, 7393, -116582, -35481, 51843, 14007, -11724, -77852, 33971, 21068, 54461, 67434, 18108, 51008, 24284, 20905, 86264, 16544, -44132, -32058, -84895, -40920, 13161, 22796, -6900, 116137, -2752, 25545, 14379, 51931, 85965, 4854, -39591, 25070, 4495]
527D495K044J0861k9434j1938J1217k6078p9398m6725J38883l2786M8646R3908
515H3695n9073l5763n0460J22221O1102m8554q9378o3236J63653m092r8343L3463
503A5235n7665l8533m0757N2962J20072J2192k720j6864l6017k5769n4332Q0156
491G960N8626r4998Q0262r608j46935L947n415Q7451O0810R906J2996m0596k8064
478c658j2552K8105j08246o8281m012J21494P5788j19093P1664J9066l2622R0551
466E8204J4839o8210L4621J6926p3781L6058M3536p2907J17495l1004n4305n1869
454c0397K637q680Q3013R8670K396n4238j99562K3714M2891q2058M4751R8934
442B2071J04426q4285J4723l7722j41464K3988J44886P0011j03624n4495J8640
$$ y = [4495, 6539, 17400, -12034, -23972, -12755, -38833, -118231, -164956, -26073, -58859, -10213, 83695, 24622, -11141, -61601, 60620, 121722, 73168, -16210, -79446, 84207, 80115, -18228, 15235, -42430, -80963, -121720, -68758, 51314, 63506, 60786, 43922, 7905, -17864, -72196, 7960, 66586, -28412, 51850, 42242, -104693, -100746, -106161, -18710, 42100, 52006, 65002, 24406, -3658, -16210, 11895, -96351, -164632, -168644, -47150, 28638, -90455, -18791, 275, -32347, 58204, 73043, 4833, 39454, 56380, -17401, 18657, 62193, -10714, 106781, 75777, 21472, -30397, -27760, -36440, 46573, 145243, 147639, 93401, -106161, -82447, -39556, -121614, -76863, 22071, 126497, 42212, 56935, 19213, -122251, -98263, 46623, 116634, 13010, -41485, -22845]
431b2845O870M0076j2698L1815l0724L7769r8730M9426Q892J6837k5980N3355
419E4063p3810l6699k9395Q6954K04251j22834o6371k00292J35504l5464J08040
408B3947j0638q497R8416j9974p2472p9394P1251k7567K0000n315J236n7571L4528
$$ y = [-22845, -15975, 24101, 11403, 43218, 12494, 50263, -48467, 959, 9851, 26688, 708, 54063, -19747, -56446, -85841, 1113, 205364, 82530, 16159, -184133, -48629, -84093, 23947, 13309, 4812, 103228, 83254, 10782, -68612, 2639, -24928, -4928, -10243, -9007, -66578, -32050]
$$ [...]
##END NTUPLES=NMR SPECTRUM
##END=
