##TITLE=1H_TG-2369-p
 CDCl3
 8 sc, 
 17.1.2023
##JCAMPDX= 6.0         $$ Bruker NMR JCAMP-DX V2.0
##DATA TYPE= NMR SPECTRUM
##DATA CLASS= NTUPLES
##ORIGIN= UXNMR, Bruker Analytische Messtechnik GmbH
##OWNER= root
$$ XWIN-NMR		Version 3.5
$$ Tue Jan 17 14:08:55 2023 Russian Standard Time (UT+4h)  she@DPX200
##.OBSERVE FREQUENCY= 200.13135
##.OBSERVE NUCLEUS= ^1H
##.ACQUISITION MODE= SIMULTANEOUS
##.ACQUISITION SCHEME= undefined
##.AVERAGES= 8
##.DIGITISER RES= 18
##SPECTROMETER/DATA SYSTEM= spect
##.PULSE SEQUENCE= zg30
##.SOLVENT NAME= CDCl3
##.SHIFT REFERENCE= (INTERNAL, CDCl3, 0, 15.77)
##AUDIT TRAIL= $$ (NUMBER, WHEN, WHO, WHERE, WHAT)
$$ ##TITLE= Audit trail, XWIN-NMR		Version 3.5
$$ ##JCAMPDX= 5.01
$$ ##ORIGIN= Bruker BioSpin GmbH
$$ ##OWNER= she
$$ F:/spectra/data/she/nmr/H-F/1/pdata/1/auditp.txt
$$ ##AUDIT TRAIL=  $$ (NUMBER, WHEN, WHO, WHERE, WHAT)
(   1,<2023-01-17 14:07:38.84 +0400>,<she>,<DPX200>,
      <created by zg, POWCHK disabled, PULCHK disabled
       configuration hash MD5:
       00 E9 B6 7A A2 85 ED C7 34 08 36 98 17 FE 4E 26
       data hash MD5: 16K
       6A 21 37 19 DD A2 18 C8 39 5B F1 C7 7C 2D 20 10>)
(   2,<2023-01-17 14:07:41.20 +0400>,<she>,<DPX200>,
      <Start of raw data processing
       efp BC_mod = 2 LB = 0.24 FT_mod = 6 PKNL = 1 PHC0 = -19117.14 PHC1 = 16.80073 SI = 16K 
       data hash MD5: 16K
       3B 4D 95 03 B9 A5 CE AE FC BF 71 0B 30 97 DB 53>)
(   3,<2023-01-17 14:08:06.96 +0400>,<she>,<DPX200>,
      <pk PHC0 = 4.28997 PHC1 = -3.4 
       data hash MD5: 16K
       C7 FC A3 10 5E A7 EF D0 61 78 A0 63 53 9F A7 00>)
(   4,<2023-01-17 14:08:10.25 +0400>,<she>,<DPX200>,
      <abs ABSG = 5 
       data hash MD5: 16K
       44 B1 AB 9D 00 64 8D A1 AB BC D5 A5 6D F5 53 70>)
(   5,<2023-01-17 14:08:30.09 +0400>,<she>,<DPX200>,
      <abs ABSG = 5 
       data hash MD5: 16K
       86 F0 A0 91 5F A3 00 93 57 99 FA 15 B5 05 56 55>)
$$ ##END=
$$ 
$$ hash MD5
$$ 87 DE FD 50 42 45 A3 E0 55 5B 08 3C 02 81 F4 8D
##$RELAX= 
##$RELAX= 
##$RELAX= 
##$RELAX= 
##$RELAX= 
##$RELAX= 
$$ Bruker specific parameters
$$ --------------------------
##$DU= <F:/spectra>
##$EXPNO= 1
##$NAME= <H-F>
##$PROCNO= 1
##$TYPE= <nmr>
##$USER= <she>
##$AMP= (0..31)
100 100 100 100 100 100 100 100 100 100 100 100 100 100 100 100 100 100 
100 100 100 100 100 100 100 100 100 100 100 100 100 100 
##$AQSEQ= 0
##$AQ_mod= 1
##$AUNM= <au_zg>
##$AUTOPOS= <>
##$BF1= 200.13
##$BF2= 200.13
##$BF3= 200.13
##$BF4= 200.13
##$BF5= 200.13
##$BF6= 200.13
##$BF7= 200.13
##$BF8= 200.13
##$BYTORDA= 1
##$CFDGTYP= 0
##$CFRGTYP= 5
##$CHEMSTR= <none>
##$CNST= (0..31)
1 1 145 1 1 1 1 1 1 1 1 1 1 1 1 1 1 1 1 1 1 1 1 1 1 1 1 1 1 1 1 1 
##$CPDPRG= <>
##$CPDPRG1= <>
##$CPDPRG2= <>
##$CPDPRG3= <>
##$CPDPRG4= <mlev>
##$CPDPRG5= <mlev>
##$CPDPRG6= <mlev>
##$CPDPRG7= <mlev>
##$CPDPRG8= <mlev>
##$CPDPRGB= <>
##$CPDPRGT= <>
##$D= (0..31)
0 1.2 0 0 0 0 0 0 0 0.06 0 0.03 0 0 0 0 0.0002 0 0 0 0 0 0 0 0 0 0 0 0 
0 0 0 
##$DATE= 1673950058
##$DBL= (0..7)
$$ [...]
##$SUBNAM3= <"">
##$SUBNAM4= <"">
##$SUBNAM5= <"">
##$SUBNAM6= <"">
##$SUBNAM7= <"">
##$SUBNAM8= <"">
##$SUBNAM9= <"">
##$SW= 18.05172834244
##$SWIBOX= (0..15)
0 0 2 0 0 0 0 0 0 0 0 0 0 0 0 0 
##$SW_h= 3612.71676300578
##$TD= 16384
##$TD0= 1
##$TE= 0
##$TE2= 300
##$TE3= 300
##$TEG= 300
##$TL= (0..7)
0 120 120 120 120 120 120 120 
##$TP= (0..7)
150 150 150 150 150 150 150 150 
##$TP07= 0
##$TPNAME0= <>
##$TPNAME1= <>
##$TPNAME2= <>
##$TPNAME3= <>
##$TPNAME4= <>
##$TPNAME5= <>
##$TPNAME6= <>
##$TPNAME7= <>
##$TPOAL= (0..7)
0.5 0.5 0.5 0.5 0.5 0.5 0.5 0.5 
##$TPOFFS= (0..7)
0 0 0 0 0 0 0 0 
##$TUNHIN= 0
##$TUNHOUT= 0
##$TUNXOUT= 0
##$USERA1= <user>
##$USERA2= <user>
##$USERA3= <user>
##$USERA4= <user>
##$USERA5= <user>
##$V9= 5
##$VALIST= <valist>
##$VCLIST= <CCCCCCCCCCCCCCC>
##$VD= 0
##$VDLIST= <DDDDDDDDDDDDDDD>
##$VPLIST= <PPPPPPPPPPPPPPP>
##$VTLIST= <TTTTTTTTTTTTTTT>
##$WBST= 1024
##$WBSW= 4
##$XGAIN= (0..3)
0 0 0 0 
##$XL= 0
##$YL= 0
##$YMAX_a= 274162
##$YMIN_a= -439100
##$ZGOPTNS= <>
##$ZL1= 120
##$ZL2= 120
##$ZL3= 120
##$ZL4= 120
##$ABSF1= 15.77003
##$ABSF2= -2.281819
##$ABSG= 5
##$ABSL= 3
##$ALPHA= 0
##$AQORDER= 0
##$ASSFAC= 0
##$ASSFACI= 0
##$ASSFACX= 0
##$ASSWID= 0
##$AUNMP= <proc_1d>
##$AZFE= 0.1
##$AZFW= 0.1
##$BCFW= 0
##$BC_mod= 2
##$BYTORDP= 0
##$COROFFS= 0
##$CY= -3
##$DATMOD= 1
##$DC= 0
##$DFILT= <>
##$DTYPP= 0
##$F1P= 0
##$F2P= 0
##$FCOR= 1
##$FTSIZE= 16384
##$FT_mod= 6
##$GAMMA= 0
##$GB= 0
##$INTBC= 1
##$INTSCL= 3.70164e-10
##$ISEN= 128
##$LB= 0.24
##$LEV0= 0
##$LPBIN= 0
##$MAXI= 10000
##$MC2= 0
##$MEAN= 0
##$ME_mod= 0
##$MI= 1.114404
##$NCOEF= 0
##$NC_proc= -7
##$NLEV= 6
##$NOISF1= 3.799351
##$NOISF2= 2.8
##$NSP= 0
##$NTH_PI= 0
##$NZP= 0
##$OFFSET= 15.77003
##$PC= 1
##$PHC0= -19112.85
##$PHC1= 13.40073
##$PH_mod= 1
##$PKNL= yes
##$PPARMOD= 0
##$PSCAL= 0
##$PSIGN= 0
##$REVERSE= no
##$SF= 200.130000303559
##$SI= 16384
##$SIGF1= 3
##$SIGF2= 2
##$SINO= 5.538805
##$SIOLD= 16384
##$SREGLST= <1H.CDCl3>
##$SSB= 0
##$STSI= 16384
##$STSR= 0
##$SW_p= 3612.71676300578
##$SYMM= 0
##$S_DEV= 0
##$TDeff= 16384
##$TDoff= 0
##$TI= <>
##$TILT= no
##$TM1= 0
##$TM2= 0
##$TOPLEV= 0
##$USERP1= <user>
##$USERP2= <user>
##$USERP3= <user>
##$USERP4= <user>
##$USERP5= <user>
##$WDW= 1
##$XDIM= 16384
##$YMAX_p= 344459202
##$YMIN_p= -1153300
$$ End of Bruker specific parameters
$$ ---------------------------------
##NTUPLES= NMR SPECTRUM
##VAR_NAME=  FREQUENCY,     SPECTRUM/REAL,   SPECTRUM/IMAG
##SYMBOL=    X,             R,               I
##VAR_TYPE=  INDEPENDENT,   DEPENDENT,       DEPENDENT
##VAR_FORM=  AFFN,          ASDF,            ASDF
##VAR_DIM=   16384,         16384,           16384
##UNITS=     HZ,            ARBITRARY UNITS, ARBITRARY UNITS
##FACTOR=    0.220516191357247, 1,           1
##FIRST=     3156.05611302345, 0,            0
##LAST=      -456.660649982333, 0,           0
##MIN=       -456.660649982333, -1153300,    0
##MAX=       3156.05611302345, 344459202,    0
$$ Real data points
##PAGE= N=1
##DATA TABLE= (X++(R..R)), XYDATA
$$ [...]
6392D976795k46870k51977R325j36045k13818r3362K4274j85641k7532Q0214n9180
$$ 4976795 4729925 4477948 4487273 4351228 4137410 4044048 4068322 3882681 3855149 3935363 3876183
6381C876183k32630j16343j74948k09063J5950L148l17689j17572k00113k13998
$$ 3876183 3643553 3527210 3352262 3143199 3159149 3162297 2844608 2727036 2526923 2312925
6371B312925j36263N576l4580l8251j72102l8597m3496k19094k09036j82591P9520
$$ 2312925 2176662 2182238 2147658 2109407 1937305 1898708 1855212 1636118 1427082 1244491 1324011
6360A324011N294q1402k9321r9169j3186o8626j90557m8269J74116j63752O6341
$$ 1324011 1329305 1247903 1218582 1119413 1106227 1037601 847044 798775 972891 809139 875480
6349H75480J59428k00403j62061j5533o706j91695k55612R3461K25000j3126o72
$$ 875480 1034908 834505 672444 656911 650205 458510 202898 296359 521359 508233 507561
6338E07561P6218P6181j9783j66863k3199j37456k17147K9154o332J93581j09540
$$ 507561 583779 659960 640177 473314 450115 312659 95512 124666 118334 311915 202375
6327B02375r056k691K6620j74872R3290J48694J08247k14147o2860R4966N3613
$$ 202375 193319 190628 217248 42376 135666 284360 392607 178460 115600 210566 264179
6316B64179R9000P0983q8150o7810R023l887N6575k9162P9250J72194k31109n0532
$$ 264179 363179 434162 346012 278202 287225 283338 339913 310751 390001 562195 331086 280554
6304B80554J46913O3377K15499j7647j61143O0796k6005O9779p313K03375r8852
$$ 280554 427467 490844 706343 688696 527553 588349 562344 632123 624810 828185 729333
6293G29333n3893R0172o2359j31445L21914J72497k00924J8178m7380J08810j28677
$$ 729333 675440 765612 703253 571808 893722 1066219 865295 883473 836093 944903 816226
6282H16226j36289M2615k0931J91854K72426j42385l49599M7584O1683M0916J20618
$$ 816226 679937 722552 701621 893475 1165901 1023516 673917 721501 783184 824100 944718
6271I44718k8844J35916Q3998L9059J03300m4359k33973K51690J40887n5638N7397
$$ 944718 915874 1051790 1135788 1174847 1278147 1233788 999815 1251505 1392392 1336754 1394151
6260A394151n2792q6228k7574L6795M4669J11310N2269Q5144K35229k39406l6616
$$ 1394151 1341359 1255131 1227557 1264352 1309021 1420331 1472600 1557744 1792973 1553567 1516951
6249A516951O1983J0416M8489K38325j85744J08508R6431j93619J527K71000K32878
$$ 1516951 1578934 1589350 1637839 1876164 1690420 1798928 1895359 1701740 1703267 1974267 2207145
6238B207145o3717k47607j22608J5175k90490N6161m3413K9675J10149M0160j5088
$$ 2207145 2143428 1895821 1773213 1788388 1497898 1554059 1510646 1540321 1650470 1690630 1675542
6227A675542k02911Q0893r0862j9649j85341J49594K88246q3918p6697J00499
$$ 1675542 1472631 1553524 1462662 1443013 1257672 1407266 1695512 1611594 1534897 1635396
6217A635396p6382k3337p251J86557K24274k59352K2008M3654k55640J2678J98944
$$ 1635396 1559014 1535677 1528426 1714983 1939257 1679905 1701913 1745567 1489927 1502605 1701549
6206A701549J01886k77970J0577K05051j5207q4234j56899M4856Q5888l7244k39471
$$ 1701549 1803435 1525465 1536042 1741093 1725886 1641652 1484753 1529609 1615497 1578253 1338782
6195A338782R4045L05087k53164J60443P2849J8183J2621l16422j16282j1696
$$ 1338782 1432827 1737914 1484750 1645193 1718042 1736225 1748846 1432424 1316142 1304446
6185A304446N4131J12877p1037k42062K0771k5950n2581J67093J01952j77134
$$ 1304446 1358577 1471454 1400417 1158355 1179126 1153176 1100595 1267688 1369640 1192506
6175A192506j53581J30199J65382j41580Q87N5041j32641k6646M7426j22809L9124
$$ 1192506 1038925 1169124 1334506 1192926 1193813 1248854 1116213 1089567 1136993 1014184 1053308
6164A053308J80408L67j60241J96416k33272n3877J27792r3280O0456P9476r462
$$ 1053308 1233716 1234083 1073842 1270258 1036986 983109 1110901 1017621 1078077 1157553 1148091
6153A148091k997m1125o9345M8578j885J42601n2549l36942n6896L64786r3299
$$ 1148091 1145094 1103969 1034624 1083202 1081317 1223918 1171369 834427 777531 1142317 1049018
6142A049018o1587K4180o3327J07978j92325o54m9578M7151l26134J66844l4764
$$ 1049018 987431 1011611 948284 1056262 863937 863283 813705 860856 534722 701566 666802
6131F66802N7005J3494m1672J7364R765j3978O3966j62063m9984l4538J81055
$$ 666802 723807 737301 695629 712993 722758 708780 772746 610683 560699 526161 707216
6120G07216j38190k57760L21654q4813j64040q0746J06943J8133j69532o4551
$$ 707216 569026 311266 632920 548107 384067 303321 410264 428397 258865 194314
6110A94314k3892r6291j40811J6009L5522p5982K71408k48034J29089J50508j9332
$$ 194314 170422 74131 -66680 -50671 -15149 -91131 180277 -67757 61332 211840 192508
6099A92508J48278k34581K1107K20495l7191j31371J45104r286n1615n8765j3189
$$ 192508 340786 106205 127312 347807 310616 179245 324349 315063 263448 204683 191494
6088A91494J65732J59988K08937N208j72466j20808j37753J95853P1990j93318
$$ 191494 357226 517214 726151 731359 558893 438085 300332 496185 568175 374857
6078C74857N6386n6567L1616j86853L6638J67990J72687l089p6815M7355j4406
$$ 374857 431243 374676 406292 219439 256077 424067 596754 593665 516850 564205 549799
6067E49799M7761J66672L9430j59126j05193K34851R0766N6403K7938r5170l5265
$$ 549799 597560 764232 803662 644536 539343 774194 864960 921363 949301 854131 818866
6056H18866q579P6131n8881L6584J35596j81195k6461k9316J29184k8705k0021
$$ 818866 810287 886418 827537 864121 999717 818522 792061 762745 891929 863224 843203
6045H43203j7986k4231j56604J11482J32770N7042K037r9793O1350K11970J10977
$$ 843203 825217 800986 644382 755864 888634 945676 947713 847920 909270 1121240 1232217
6034A232217j66132O5446J20978l3471J168q1237K44792j1717p9455J51577O2832
$$ 1232217 1066085 1131531 1252509 1219038 1220206 1138969 1383761 1372044 1292589 1444166 1506998
6023A506998j23562j63341o8918R8509j3850j92442l1176l743L859K3341J65139
$$ 1506998 1383436 1220095 1151177 1249686 1235836 1043394 1012218 1008475 1012334 1035675 1200814
6012A200814J19902m571j30168L8663Q5309j54993L8885J56913O2597l8102j56770
$$ 1200814 1320716 1316145 1185977 1224640 1309949 1154956 1193841 1350754 1413351 1375249 1218479
6001A218479k9401J27014J3776j23002j6006j8428p7878J46677J39834o4313K6798
$$ 1218479 1189078 1316092 1329868 1206866 1190860 1172432 1094554 1241231 1381065 1316752 1343550
5990A343550O4714N7406P9058r3627q9304J13089K01314J68827j12230j12367
$$ 1343550 1408264 1465670 1544728 1451101 1361797 1474886 1676200 1845027 1732797 1620430
5980A620430K21239r2353j62556J5065k10673j3485l8996J60527j90002J37757
$$ 1620430 1841669 1749316 1586760 1601825 1391152 1377667 1338671 1499198 1309196 1446953
5970A446953P9319J12523J9671M0154j2638p8393L9251J12003l3658P4919m0815
$$ 1446953 1526272 1638795 1658466 1698620 1685982 1607589 1646840 1758843 1725185 1800104 1759289
5959A759289K8892j17079N5477L33095l216o2713K15648J15777Q4346j16835J82786
$$ 1759289 1788181 1671102 1726579 2059674 2056458 1993745 2209393 2325170 2409516 2292681 2475467
5948B475467n1964J07200k04145j79987J54299K1987J90873l7112J92352O4231
$$ 2475467 2423503 2530703 2326558 2146571 2300870 2322857 2513730 2476618 2668970 2733201
5938B733201J9964j32789K3558P7474M3186M6727Q6173K21059j16182k42119J15663
$$ 2733201 2753165 2620376 2643934 2721408 2764594 2811321 2897494 3118553 3002371 2760252 2875915
5927B875915O457Q2725K43505J56073l2586m6796M9797J1408r1099J32538L07311
$$ 2875915 2882372 2965097 3208602 3364675 3332089 3285293 3335090 3346498 3255399 3387937 3695248
5916C695248K61436j05775n0645J3729J19508L6577J63169m9041R244K48698K44747
$$ 3695248 3956684 3850909 3800264 3813993 3933501 3970078 4133247 4084206 4093450 4342148 4586895
5905D586895j034J38603R3060L2765K51369K02341J37107K38174P0792r2085J42051
$$ 4586895 4585861 4724464 4817524 4850289 5101658 5303999 5441106 5679280 5750072 5657987 5800038
5894E800038L00966j960M02547K80489M05807L10945K39855K67624O13331K66849
$$ 5800038 6101004 6099044 6501591 6782080 7187887 7498832 7738687 8006311 8619642 8886491
5884H886491K75105O95862N96739O28574O22670Q98765O94246Q92964N27395P81191
$$ 8886491 9161596 9857458 10454197 11082771 11705441 12604206 13298452 14191416 14718811 15500002
5874A5500002P02133O42500O12305K75094L49239O6792R0432K57052k26400n9753
$$ 15500002 16202135 16844635 17456940 17732034 18081273 18148065 18238497 18495549 18269149 18209396
5864A8209396j47170l27629j58440p68j35971l25155j02207J03387N9568J2354
$$ 18209396 18062226 17734597 17576157 17575389 17439418 17114263 17012056 17115443 17175011 17187365
5854A7187365k8180J11645M44147L73554M47298P32298O97473P24856N26915Q51044
$$ 17187365 17159185 17270830 17714977 18088531 18535829 19268127 19965600 20690456 21217371 22068415
5844B2068415O64694O02179Q20040O46701O80695P47530N87901L46457M65850
$$ 22068415 22733109 23335288 24155328 24802029 25482724 26230254 26818155 27164612 27630462
5835B7630462O32027P20348L72350N48988P24670M05752L51262O12203M39577
$$ 27630462 28262489 28982837 29355187 29904175 30628845 31034597 31385859 31998062 32437639
5826C2437639M98968L38702N4916j91733n45363n54482j020910j060841j119317
$$ 32437639 32936607 33275309 33330225 33138492 32593129 32038647 31017737 29956896 28837579
5817B8837579r70447j035348j031432q59707p14603l57843m09816k88271m9681
$$ 28837579 27867132 26831784 25800352 24940645 24226042 23868199 23458383 23170112 23120431
5808B3120431o0800M58506P64423M78724O57052P50899N32518P24857M71275j77808
$$ 23120431 23059631 23518137 24282560 24761284 25418336 26169235 26701753 27426610 27897885 27720077
5798B7720077j5514j57139m39929n04503k57485l33954j95262o15915p09594o56613
$$ 27720077 27704563 27547424 27107495 26602992 26345507 26011553 25816291 25200376 24490782 23834169
5788B3834169j011047j049270p80493r64764j164030q77500p69501o25269l53696
$$ 23834169 22823122 21773852 20993359 20028595 18864565 17987065 17217564 16592295 16238599
5779A6238599l59397n50411n67860m40240l76315q09195q32523o91729p40523
$$ 16238599 15879202 15328791 14760931 14320691 13944376 13135181 12302658 11610929 10870406
5770A0870406m64626l40052k47534m38151m65196j89913O1595j1445n80176j65029
$$ 10870406 10405780 10065728 9818194 9380043 8914847 8724934 8786529 8775084 8194908 8029879
5760H029879j79227l8409J84784J3465J80223J01704P6004j91995n5656j74032
$$ 8029879 7850652 7812243 7997027 8010492 8190715 8292419 8368423 8176428 8120772 7946740
5750G946740l41402j38574J10744o6723j12130Q667r0459O2624J25147K03270
$$ 7946740 7605338 7466764 7577508 7510785 7398655 7407322 7316863 7379487 7504634 7707904
5740G707904K17249Q6134j73900K48644K3969N341J43253K64253K07228L28547
$$ 7707904 7925153 8011287 7837387 8086031 8110000 8115341 8258594 8522847 8730075 9058622
5730I058622J58593k0442j13095J09047K43383J47330K66357K85738J24687M8123
$$ 9058622 9217215 9196773 9083678 9192725 9436108 9583438 9849795 10135533 10260220 10308343
5720A0308343K27485K99930L84907Q3561J97131L32071K83644M73263J70790M00715
$$ 10308343 10535828 10835758 11220665 11304226 11501357 11833428 12117072 12590335 12761125 13161840
5710A3161840K31065J99052L22104K59505L99375K37947J67594J44917J94405
$$ 13161840 13392905 13591957 13914061 14173566 14572941 14810888 14978482 15123399 15317804
5701A5317804K50302K32393L64801M68506L19150M15483M60060L99037M01726
$$ 15317804 15568106 15800499 16165300 16633806 16952956 17368439 17828499 18227536 18629262
5692A8629262N10226K35637N04100M81106N14041N57960O13160M81754O34149
$$ 18629262 19139488 19375125 19879225 20360331 20874372 21432332 22045492 22527246 23161395
5683B3161395R68015O20478Q53857J029987Q17512J044514J330451J206866R56108
$$ 23161395 24129410 24749888 25603745 26633732 27451244 28495758 29826209 31033075 31989183
5674C1989183J335635J123811J029821R19967P37183M80646J48699K30425L4275
$$ 31989183 33324818 34448629 35478450 36398417 37135600 37616246 37764945 37995370 38029645
5665C8029645k2677j93267o2617k43940k69049k21314j54878l78345r6426K0851
$$ 38029645 38006968 37813701 37751084 37507144 37238095 37016781 36861903 36483558 36387132 36407983
5655C6407983j68211R5265J61740K34082K40730N86964M15639L42638J47217N06034
$$ 36407983 36239772 36335037 36496777 36730859 36971589 37558553 37974192 38316830 38464047 38970081
5645C8970081O54071N07070N50325M47299O78823L14249J17166j14370n36411
$$ 38970081 39624152 40131222 40681547 41128846 41807669 42121918 42239084 42124714 41588303
5636D1588303k42291m83181n49585m70967m04325l93502k79850n18177p71404
$$ 41588303 41346012 40862831 40313246 39842279 39437954 39044452 38764602 38246425 37475021
5627C7475021m65348n68823m71924l62170n97171m79350l73038m97048p68791
$$ 37475021 37009673 36440850 35968926 35606756 35009585 34530235 34157197 33660149 32891358
5618C2891358o98365o34520n15507p70505r61292q20073q12681j23973p73286
$$ 32891358 32192993 31558473 31042966 30272461 29311169 28491096 27678415 27554442 26781156
5609B6781156q09602l18332n76124l86100q7494j33031m08298m6077K13908K6928
$$ 26781156 25971554 25653222 25077098 24690998 24603504 24470473 24062175 24016098 24230006 24256934
5599B4256934J1498J4767P2849J58930j66307n5270k77525o54198n28479p94067
$$ 24256934 24268432 24283199 24356048 24514978 24348671 24293401 24015876 23361678 22833199 22039132
5589B2039132q70294j088314j013046q30824j058435j179627r07042n74613n14754
$$ 22039132 21168838 20080524 19067478 18236654 17178219 15998592 15091550 14516937 14002183
5580A4002183o00796n23661n41819m94845k39855l87190l43247k77125n88113
$$ 14002183 13401387 12877726 12335907 11841062 11601207 11214017 10870770 10593645 10005532
5571A0005532l53893l52788m22049k07050k05990l66421k99539l98407k38639
$$ 10005532 9651639 9298851 8876802 8669752 8463762 8097341 7797802 7399395 7160756
5562G160756k27175p1325l02412k83992J36036j44102n0060j77955l73181k55384
$$ 7160756 6933581 6862256 6559844 6275852 6411888 6267786 6217726 6039771 5666590 5411206
5552E411206j66343J46573q3491j20113J6790k45851n9433l7850k43618Q9517
$$ 5411206 5244863 5391436 5307945 5187832 5204622 4958771 4899338 4861488 4617870 4707387
5542D707387r073n4609K1038p0837p5540m7534j28265J4655Q6698M0800L251M9131
$$ 4707387 4698314 4643705 4664743 4593906 4518366 4470832 4342567 4357222 4443920 4484720 4487971 4537102
5530D537102j56382r7133R5549q5164J66974r5719J32995M211L6587J59138j74844
$$ 4537102 4380720 4283587 4379136 4293972 4460946 4365227 4498222 4502433 4539020 4698158 4523314
5519D523314k48885J61826L055M6205L64141o1709j7395L00939o0876j49708J15931
$$ 4523314 4274429 4436255 4439310 4485515 4849656 4787947 4770552 5071491 5010615 4860907 4976838
5508D976838J26102R1097m9241m9326J06959r4345J81805K70547K05069J18862
$$ 4976838 5102940 5194037 5144796 5095470 5202429 5108084 5289889 5560436 5765505 5884367
5498E884367J35139K22405j69009J70831J45254J2541J49319J55223j3050J34747
$$ 5884367 6019506 6241911 6072902 6243733 6388987 6401528 6550847 6706070 6693020 6827767
5488F827767L27098K72985K06695J98158J39670K63613J80411L03779K88410J05782
$$ 6827767 7154865 7427850 7634545 7832703 7972373 8235986 8416397 8720176 9008586 9114368
5478I114368L58431N98712O22808M82901P32049O94602J006349J077384J329336
$$ 9114368 9472799 10071511 10694319 11177220 11909269 12603871 13610220 14687604 16016940
5469A6016940J562218K065215K239114K734880L161721L536943L610206L002510
$$ 16016940 17579158 19644373 21883487 24618367 27780088 31317031 34927237 37929747
5461C7929747J539521r24057k879770l879014l645355k816312k246590j904256
$$ 37929747 39469268 38545211 35665441 31786427 28141072 25324760 23078170 21173914
5453B1173914j109128o39843l33675j75631J41337L61151M26775O28835R87561
$$ 21173914 20064786 19424943 19091268 18915637 19056974 19418125 19844900 20473735 21461296
5444B1461296J187878J492271J964223K226814K298554K301949J676897N86480
$$ 21461296 22649174 24141445 26105668 28332482 30631036 32932985 34609882 35196362
5436C5196362j251066k551735l213454l155726k798580k058969j723249j594730
$$ 35196362 33945296 31393561 28180107 25024381 22225801 20166832 18443583 16848853
5428A6848853j063784q53365n52498q49684q10710j76532k43247l16506j56451
$$ 16848853 15785069 14931704 14379206 13529522 12718812 12542280 12299033 11982527 11826076
5419A1826076r9282K3376j34829m02360k11123p3237j73646k20192k54409n1481
$$ 11826076 11726794 11750170 11615341 11212981 11001858 10928621 10754975 10534783 10280374 10228893
5409A0228893k18907k52350k39324j97899O621k9560j57730J93419J0382J30595
$$ 10228893 10009986 9757636 9518312 9320413 9327034 9297474 9139744 9333163 9343545 9474140
5399I474140Q5941J11647L28951Q2135R1691K46006L32379J8013P4638K38110
$$ 9474140 9560081 9671728 10000679 10082814 10174505 10420511 10752890 10770903 10845541 11083651
5389A1083651K04174Q6725o7122L3014n6383L4818J20286K6248o667L0776J55464
$$ 11083651 11287825 11374550 11307428 11340442 11284059 11318877 11439163 11465411 11458744 11489520 11644984
5378A1644984K13439M08184Q107K28572K15784M8592L04452L97945M32239J65976
$$ 11644984 11858423 12266607 12274714 12503286 12719070 12767662 13072114 13470059 13902298 14068274
5368A4068274L10097O07951L90547K21676O17500O96444L96322J73756M87722
$$ 14068274 14378371 14986322 15376869 15598545 16216045 16912489 17308811 17482567 17970289
5359A7970289N75752N04929J98519N23780O72437Q12915Q23383P07361J068377
$$ 17970289 18546041 19050970 19249489 19773269 20445706 21258621 22082004 22789365 23857742
5350B3857742J187151J266674J373841J614670K029074K387793K677416K924003
$$ 23857742 25044893 26311567 27685408 29300078 31329152 33716945 36394361 39318364
5342C9318364L473000L904229L940433L729663L102104K045101M83863j049437
$$ 39318364 42791364 46695593 50636026 54365689 57467793 59512894 59996757 58947320
5334E8947320k194570k140682j826037j238920p27777J56759Q44287J393820J886102
$$ 58947320 56752750 54612068 52786031 51547111 50819334 50976093 51820380 53214200 55100302
5325E5100302K086948K482945K440429J922719J101214J76088l57263p30164l69246
$$ 55100302 57187250 59670195 62110624 64033343 65134557 65310645 64953382 64223218 63853972
5316F3853972M9093L84232L56909m74454j593450k454481l286131l055326l002138
$$ 63853972 63903065 64287297 64644206 64169752 62576302 60121821 56835690 53780364 50778226
5307E0778226k579652j904752j279122l75303q9866L05576N12299M96059M29605
$$ 50778226 48198574 46293822 45014700 44639397 44549531 44855107 45367406 45863465 46293070
5298D6293070m03533j498459k092067k822225l144214l229563k930006k178861
$$ 46293070 45889537 44391078 42299011 39476786 36332572 33103009 30173003 27994142
5290B7994142k076737j640465j254313j115569j114549j193504j024846p62638
$$ 27994142 25917405 24276940 23022627 21907058 20792509 19599005 18574159 17811521
5282A7811521q22233q43151p17602q39634l99683p58407o66547n95990l27449
$$ 17811521 16989288 16146137 15428535 14588901 14189218 13430811 12764264 12168274 11840825
5273A1840825n06928m52322l44235j83857l17318l30230k03903k03237k99652
$$ 11840825 11333897 10881575 10537340 10353483 10036165 9705935 9502032 9298795 8999143
5264H999143k73908j52061j25130r0476j60624l44084q5743j22933k37849k87199
$$ 8999143 8725235 8573174 8448044 8357568 8196944 7852860 7767117 7644184 7406335 7119136
5254G119136j12331k87861l78364q6818J07859j58858l59009L5860j96842k45319
$$ 7119136 7006805 6718944 6340580 6253762 6361621 6202763 5843754 5879614 5682772 5437453
5244E437453J21787k64517m5253P1749k1729J24489O2825R2122k70886k22336
$$ 5437453 5559240 5294723 5249470 5321219 5299490 5423979 5486804 5578926 5308040 5085704
5234E085704j789J98237j82338J55314J50633j69364k15610J19265P9297j60709
$$ 5085704 5083915 5282152 5099814 5255128 5405761 5236397 5020787 5140052 5219349 5058640
5224E058640j69938J5279O6104K28755k261M8909J9188J16363O5585J97800O2453
$$ 5058640 4888702 4903981 4970085 5198840 5196579 5245488 5264676 5381039 5446624 5644424 5706877
5213E706877J29231J28441r541J20443N2030j11131j81932K22192J21025m4240
$$ 5706877 5836108 5964549 5955008 6075451 6127481 6016350 5834418 6056610 6177635 6133395
5203F133395L2390l8293k35727k56409J8516L7530J07700n7491k78263n9515j42329
$$ 6133395 6165785 6127492 5891765 5635356 5653872 5691402 5799102 5741611 5463348 5403833 5261504
5192E261504j80447k27928j1943j67476J40481p2716l05665O218j74706k4344
$$ 5261504 5081057 4853129 4841186 4673710 4814191 4741475 4435810 4442028 4267322 4242978
5182D242978j05142L8276P5594j83608o35P5413o6325J87756k8012j80941O5379
$$ 4242978 4137836 4176112 4251706 4068098 4067463 4142876 4076551 4264307 4236295 4055354 4120733
5171D120733k337j7933P8913L58553J43907m3130Q4247J29149J90762K58562J27055
$$ 4120733 4118396 4100463 4179376 4537929 4681836 4638706 4722953 4852102 5042864 5301426 5428481
5160E428481J17075P8512K68444r3650J65288J53261J43503K4538j73173j42844
$$ 5428481 5545556 5624068 5892512 5798862 5964150 6117411 6260914 6285452 6112279 5969435
5150E969435k1055j26806M4255j60531k634J85047k67317o373q4206Q0621O0603
$$ 5969435 5948380 5821574 5865829 5705298 5702664 5887711 5620394 5614021 5529815 5610436 5671039
5139E671039j66203l22506j12278k26985j78266k61512k05169J1115j77497n3918
$$ 5671039 5504836 5182330 5070052 4843067 4664801 4403289 4198120 4209235 4031738 3977820
5129C977820m6357j94032J1574j27619J79460K5822p8699N7014K61455n8168l12754
$$ 3977820 3931463 3737431 3749005 3621386 3800846 3826668 3747969 3804983 4066438 4008270 3695516
5118C695516N8773k14794N5778J65209J21585P8147j30180J04156n3604J506J06436
$$ 3695516 3754289 3539495 3595273 3760482 3882067 3960214 3830034 3934190 3880586 3882092 3988528
5107C988528L04649j31365l1964j45297n8180M6832j6569q3721J18675N5594j43117
$$ 3988528 4293177 4161812 4129848 3984551 3926371 3973203 3956634 3872913 3991588 4047182 3904065
5096C904065J07394k57109J90719J87112j7046k11921j07580L9850M3306k0674
$$ 3904065 4011459 3754350 3945069 4132181 4115135 3903214 3795634 3835484 3878790 3858116
5086C858116J36357j26302j81523J11526K60354k73315L179J6106j19243J49297
$$ 3858116 3994473 3868171 3686648 3798174 4058528 3785213 3788392 3804498 3685255 3834552
5076C834552K07892J29701j64940J59081K1020j66448K8585m282K10135J84115
$$ 3834552 4042444 4172145 4007205 4166286 4187306 4020858 4049443 4045161 4255296 4439411
5066D439411j25917K19458K14982J48258J63972J38132O7558J70268k812K68470
$$ 4439411 4313494 4532952 4747934 4896192 5060164 5198296 5265854 5436122 5433310 5701780
5056E701780M07106M6119j7313J48256m6585J88360L14621J7865L71327K0727
$$ 5701780 6108886 6155005 6137692 6285948 6239363 6427723 6742344 6760209 7131536 7152263
5046G152263R3066J42452k8572q664Q1898l5492q8890J96276J80644J54239n9668
$$ 7152263 7245329 7387781 7359209 7350545 7432443 7396951 7308061 7504337 7684981 7839220 7779552
5035G779552P1305J1920j03785l7544L08284K71506n4257O203j41253J46128J98148
$$ 7779552 7850857 7862777 7758992 7721448 8029732 8301238 8246981 8253184 8111931 8258059 8456207
5024H456207P1754n0360M9387J45098J41977J08095K41318J7869K75961K71163
$$ 8456207 8527961 8477601 8526988 8672086 8814063 8922158 9163476 9181345 9457306 9728469
5014I728469J64405J36323L42069K76834k05349J29980K70883L33129K88989R3200
$$ 9728469 9892874 10029197 10371266 10648100 10442751 10572731 10843614 11176743 11465732 11558932
5004A1558932K79161K11107K07438J87498N53032K56564M29904N52491J81897
$$ 11558932 11838093 12049200 12256638 12444136 12997168 13253732 13683636 14236127 14418024
4995A4418024L22317M29909P41354O18596O17902O53162P07701Q59263J090607
$$ 14418024 14740341 15170250 15911604 16530200 17148102 17801264 18508965 19368228 20458835
4986B0458835J187537J288757J226630J752373J978355K211842K329791K546291
$$ 20458835 21646372 22935129 24161759 25914132 27892487 30104329 32434120 34980411
4978C4980411L083501L378134L259508K956059J543177N1709j254547k165093
$$ 34980411 38063912 41442046 44701554 47657613 49200790 49252499 47997952 45832859
4970D5832859k180992k156582j931417j336661j214081j010982n89105n04948
$$ 45832859 43651867 41495285 39563868 38227207 37013126 36002144 35413039 34908091
4962C4908091j13268J30243J80313N31571O33385R67973J579702J725482J735431
$$ 34908091 34794823 34925066 35105379 35636950 36270335 37238308 38818010 40543492 42278923
4953D2278923J927761K422805K703287L143777L736448M530045N051356O076898
$$ 42278923 44206684 46629489 49332776 52476553 56213001 60743046 65794402 71871300
4945G1871300P391618Q424201Q927849P845320N150860M13213n817447j0245878
$$ 71871300 79262918 87687119 96614968 104460288 109611148 110024361 104206914 93961036
4937I3961036j0704543r653745p686245o136863m872306l746505k709434k295246
$$ 93961036 83256493 73602748 65916503 59779640 54907334 51160829 48451395 46156149
4929D6156149j625446j141557q86410l01187k56276R3440N37635Q44563J186619
$$ 46156149 44530703 43389146 42502736 42201549 41945273 42038713 42576348 43420911 44607530
4920D4607530J464535J896402K329347L113238L848139M282148N420972O606258
$$ 44607530 46072065 47968467 50297814 53411052 57259191 61541339 66962311 73568569
4912G3568569P861224Q896917R498382R142164O696303K125584m042430r662579
$$ 73568569 81429793 90326710 99825092 108967256 115663559 117789143 113746713 104084134
4904A04084134j1579722j0703433q803209p219422n927491m736519l856810l395283
$$ 104084134 92504412 81800979 72997770 65778348 59850857 55114338 51257528 47862245
4896D7862245k790744k369610j808784j196140j091639r01936o09018l93401r0415
$$ 47862245 45071501 42701891 40893107 39696967 38605328 37703392 37094374 36700973 36610558
4887C6610558j68512l05567o5682L9095L47970L97072O93966J127379J376351
$$ 36610558 36442046 36136479 36070797 36109892 36457862 36854934 37548900 38676279 40052630
4878D0052630K148163K103303K269366J641126q617j756015l231696l719405l693314
$$ 40052630 42200793 44304096 46573462 48214588 48205971 46449956 43218260 39498855 35805541
4869C5805541l271399k742899k241358j713485j408536j066637o80603r88124
$$ 35805541 32534142 29791243 27549885 25836400 24427864 23361227 22680624 21692500
4861B1692500r41162o55262n80013l93665k66005m09022n33492l99631m19325
$$ 21692500 20751338 20096076 19516063 19122398 18856393 18447371 17913879 17514248 17094923
4852A7094923l52594n11746m58425m45864l55264m84223l73971m93053m99360
$$ 17094923 16742329 16230583 15772158 15326294 14971030 14486807 14112836 13619783 13120423
4843A3120423m09859j66547j85124l53861J2603k58316k47382k64443m70184k06853
$$ 13120423 12710564 12544017 12358893 12005032 12017635 11759319 11511937 11247494 10777310 10570457
4833A0570457J11355p9572p1257J740Q2859q4495p5537Q3899r8492L21669L4064
$$ 10570457 10681812 10602240 10530983 10532723 10615582 10531087 10455550 10539449 10440957 10762626 10796690
4822A0796690j15269K82643L65190L93682J60067M33877M65798K52376K34263
$$ 10796690 10681421 10964064 11329254 11722936 11883003 12316880 12782678 13035054 13269317
4813A3269317M00732L43720M47034M36974N32588L46100K04067K36179L30468
$$ 13269317 13670049 14013769 14460803 14897777 15430365 15776465 15980532 16216711 16547179
4804A6547179L9363m2023j118Q8251j61964L3881N6650p2752k73143l69010N8198
$$ 16547179 16586542 16544519 16543401 16631652 16469688 16503569 16560219 16487467 16214324 15845314 15903512
4793A5903512j76544k9287k92527l91250n11870n42591n50965j97308l51053l61629
$$ 15903512 15726968 15697681 15405154 15013904 14502034 13959443 13408478 13211170 12860117 12498488
4783A2498488k97509m68339l59993m20622k63307m03007l31530l16747j63593
$$ 12498488 12200979 11732640 11372647 10952025 10688718 10285711 9954181 9637434 9473841
4774I473841l36246k32884q057P306J32917o8503o101m7587J57368j03623J54601
$$ 9473841 9137595 8904711 8896654 8903960 9036877 8968374 8962273 8914686 9072054 8968431 9123032
4763I123032Q5434Q7366O9776P9684J91630K35565L16635l8029N16635K61126
$$ 9123032 9208466 9295832 9365608 9445292 9636922 9872487 10189122 10151093 10667728 10928854
4753A0928854L20524M17664J10932L30188M18404L60253O58034P95235N05223
$$ 10928854 11249378 11667042 11777974 12108162 12526566 12886819 13544853 14340088 14845311
4744A4845311L25165K58055K76189L4010j56102j917M5524j06350j00807k47951
$$ 14845311 15170476 15428531 15704720 15738730 15582628 15580711 15626235 15519885 15419078 15171127
4734A5171127R266Q5103j91700l0622n30457k24518j87329n24464m03041m76137
$$ 15171127 15180393 15265496 15073796 15043174 14512717 14288199 14100870 13576406 13173365 12697228
4724A2697228n08960o69026p21989m52272o99603o20698l15374l17231p09281
$$ 12697228 12188268 11519242 10797253 10344981 9645378 9024680 8709306 8392075 7682794
4715G682794l18845q6919l41166k52110j44795j36592r851j85005j94614k91768
$$ 7682794 7363949 7277030 6935864 6683754 6538959 6402367 6392516 6207511 6012897 5721129
4705E721129j64693J27234j93764J3308j12884j56544l00948q5392L5392j65586
$$ 5721129 5556436 5683670 5489906 5503214 5390330 5233786 4932838 4847446 4882838 4717252
4695D717252j72286P7851j09602j16655l60205J10277L5892j48796j02j26899
$$ 4717252 4544966 4622817 4513215 4396560 4036355 4146632 4182524 4033728 4033626 3906727
4685C906727k63319j61486K53263j63427j17635j72526j47780J03140J02006j9355
$$ 3906727 3643408 3481922 3735185 3571758 3454123 3281597 3133817 3236957 3338963 3319608
4675C319608j16679K7974k11907l6603L41667j7999k72488J09784J30326j59130
$$ 3319608 3202929 3230903 3018996 2982393 3324060 3306061 3033573 3143357 3273683 3114553
4665C114553M2575l962J364K4948p0367j27840j7265L1085K01582k24949j68295
$$ 3114553 3157128 3153166 3154530 3179478 3109111 2981271 2964006 2995091 3196673 2971724 2803429
4654B803429j7961m9388K76056J10524k07954l17227L61956p4898o8713Q4779
$$ 2803429 2785468 2736080 3012136 3122660 2914706 2597479 2959435 2884537 2815824 2900603
4644B900603J85249J18366k83424J41K4886P7242p0236p9278K6640J96977M8552
$$ 2900603 3085852 3204218 2920794 2920935 2945821 3023063 2952827 2873549 2900189 3097166 3145718
4633C145718p2250R8070M4883L03983K08087k0286M0037P1855Q865J06902r8378
$$ 3145718 3073468 3171538 3216421 3520404 3728491 3708205 3748242 3820097 3828962 3935864 3837486
4622C837486l8239K01635M33969J53253K0430J04706k02668J12922m8936J78138
$$ 3837486 3799247 4000882 4434851 4588104 4608534 4713240 4510572 4623494 4574558 4752696
4612D752696j49539j77318J35954l05664o7437K01255l0182j02268q8985l1475
$$ 4752696 4603157 4425839 4561793 4256129 4188692 4389947 4359765 4257497 4168512 4137037
4602D137037p6168j08436J59558J00203J89543m6561k38254j13976J648q346l1541
$$ 4137037 4060869 3952433 4111991 4212194 4401737 4355176 4116922 4002946 4004594 3996248 3964707
4591C964707K30276K36628Q859j4679r876J29363K98967J58258M0481J57417n9655
$$ 3964707 4194983 4431611 4440470 4425791 4415915 4545278 4844245 5002503 5042984 5200401 5140746
4580E140746l6013Q082l7612O4670Q6469K13473j32260K06529j7814K09333K51807
$$ 5140746 5104733 5112815 5075203 5139873 5226342 5439815 5307555 5514084 5496270 5705603 5957410
4569E957410K31439K36721Q1231L46076K49794K44276J48446K39691M12685M33770
$$ 5957410 6188849 6425570 6506801 6852877 7102671 7346947 7495393 7735084 8147769 8581539
4559H581539M17992M63533L74188N26537J83772M45488M84612K12521m8808Q2590
$$ 8581539 8999531 9463064 9837252 10363789 10547561 10993049 11477661 11690182 11641374 11723964
4549A1723964R0049k92023l82564l38722o02610o08288k93631m46255j55678l53810
$$ 11723964 11814013 11521990 11139426 10800704 10198094 9589806 9296175 8849920 8694242 8340432
4539H340432l49205k36777n9624q729j56015j85472J15738L335J01990q7836R3841
$$ 8340432 7991227 7754450 7694826 7686097 7530082 7344610 7460348 7463683 7565673 7477837 7571678
4528G571678J94619M7324L08002R5921J44501N1885O8543K46764L14556M61890
$$ 7571678 7766297 7813621 8121623 8217544 8362045 8413930 8482473 8729237 9043793 9505683
4518I505683N33515J33374M29347K99485J81986M39234N49859M25921N75474L49891
$$ 9505683 10039198 10172572 10601919 10901404 11083390 11522624 12072483 12498404 13073878 13423769
4508A3423769l40565j03803j2064j22546j52609k80306k23321q9210K1283J44940
$$ 13423769 13083204 12979401 12967337 12844791 12692182 12411876 12188555 12099345 12120628 12265568
4498A2265568m2572O2081J00677J78703L59519M77115N35449M49342N82665N19435
$$ 12265568 12222996 12285077 12385754 12564457 12923976 13401091 13936540 14385882 14968547 15487982
4488A5487982K36195K76598j16845n5883n8758m57696m71699m90592m63917n71041
$$ 15487982 15724177 16000775 15883930 15828047 15769289 15311593 14839894 14349302 13885385 13314344
4478A3314344p38578o90849m05407l11417m99527l16545m25442j29058j65067
$$ 13314344 12575766 11884917 11479510 11168093 10668566 10352021 9926579 9797521 9632454
4469I632454l29490N3876l20587n6909N5435j26295q1058J04655K71105J30971
$$ 9632454 9302964 9356840 9036253 8979344 9034779 8908484 8827426 8932081 9203186 9334157
4459I334157K9575J17288K41063K28611K04481L91977L24918L34381M91262N21935
$$ 9334157 9363732 9481020 9722083 9950694 10155175 10547152 10872070 11206451 11697713 12219648
4449A2219648O05697N77697L73762J36558L99065J00510R068m099m27418n03542
$$ 12219648 12825345 13403042 13776804 13913362 14312427 14412937 14422005 14417906 13990488 13486946
4439A3486946n07585n13187o97771l28143n58275l27952k98947l44185k00120
$$ 13486946 12979361 12466174 11768403 11440260 10881985 10554033 10255086 9910901 9710781
4430I710781j39128q2162n7761N2562j17627K85652L26457l2235P0642J25838
$$ 9710781 9571653 9489491 9431730 9484292 9366665 9652317 9978774 9946539 10017181 10143019
4420A0143019j72853j37505Q3467j23517l78542k13182l34841k90059k39634l97375
$$ 10143019 9970166 9832661 9916128 9792611 9414069 9200887 8866046 8575987 8336353 7938978
4410G938978l37976n12380j61083k13924k75941j99923J76224k32800j73110j0779
$$ 7938978 7601002 7088622 6927539 6713615 6437674 6237751 6413975 6181175 6008065 5997286
4400E997286r6945p5124R827N5008k26919L0471L7045J23729J16048n6681Q1416
$$ 5997286 5900341 5825217 5835044 5890052 5663133 5693604 5730649 5854378 5970426 5913745 5995161
4389E995161k6284L3279K19283j803L59915n9853J77791K41045K06079J12010
$$ 5995161 5968877 6002156 6221439 6219636 6579551 6519698 6697489 6938534 7144613 7256623
4379G256623j2218j09909j38143O1192k39100k89927j90547l36268j49240m65457
$$ 7256623 7244405 7134496 6996353 7057545 6818445 6528518 6337971 6001703 5852463 5387006
4369E387006l34119o4116l00410j13275l24879l02550o1856R2888l4621r4123
$$ 5387006 5052887 4988771 4688361 4575086 4250207 3947657 3885801 3978689 3944068 3849945
4359C849945j42879j07141m9123J0088j80759j69745M6729Q0800M6184j18674
$$ 3849945 3707066 3599925 3550802 3560890 3380131 3210386 3257115 3337915 3384099 3265425
4349C265425n7K452j64194n2222k01018l2439K72326j27537N1439n1796q3605
$$ 3265425 3265368 3267820 3103626 3051404 2850386 2817947 3090273 2962736 3014175 2962379 2878774
4338B878774m9873j35578N6974M0351l6329k05473R6589k7931l02985K25341L43839
$$ 2878774 2828901 2693323 2750297 2790648 2754319 2548846 2645435 2617504 2314519 2539860 2883699
4327B883699J6567J9308o7609k07503K41411j93620j07765K43309M7410j22861
$$ 2883699 2900266 2919574 2851965 2644462 2885873 2692253 2584488 2827797 2875207 2752346
4317B752346j27934J42463r8401j99297L6074L00135o6813k77398K5786j64376
$$ 2752346 2624412 2766875 2668474 2469177 2505251 2805386 2738573 2461175 2486961 2322585
4307B322585L956j02610J17384K50210j14678j96485J9337L607j05539Q1875J18854
$$ 2322585 2326541 2223931 2341315 2591525 2476847 2280362 2299699 2303306 2197767 2279642 2398496
4296B398496j04986J43085J89967L4874j14040j54614L56484j16729m4287q846
$$ 2398496 2293510 2436595 2626562 2661436 2547396 2392782 2749266 2632537 2588250 2579404
4286B579404Q5425J42988M5683J37776k8689j49673J02558l9781J27346M6860
$$ 2579404 2664829 2807817 2853500 2991276 2962587 2812914 2915472 2875691 3003037 3049897
4276C049897m8065O925k564J5965J1195J8247r5229n5653R8213k7888L62334r6721
$$ 3049897 3001832 3008757 3006193 3022158 3033353 3051600 2956371 2900718 2998931 2971043 3333377 3236656
4264C236656j47737M1980M2473M7404q5610J05924l1629K9494Q9323r2565j16090
$$ 3236656 3088919 3130899 3173372 3220776 3135166 3241090 3209461 3238955 3328278 3235713 3119623
4253C119623J63283M5735K57210r7987R5384J35182k2098j24436L10442R3136
$$ 3119623 3282906 3328641 3585851 3487864 3583248 3718430 3696332 3571896 3882338 3975474
4243C975474j34121N5996Q1693J9626L2103J20116J86652J25858q1117j4184Q9252
$$ 3975474 3841353 3897349 3979042 3998668 4030771 4150887 4337539 4463397 4382280 4368096 4457348
4232D457348K20276N873k47632R0490J53754q5100J09024k20895K14772K10295
$$ 4457348 4677624 4683497 4435865 4526355 4680109 4595009 4704033 4483138 4697910 4908205
4222D908205k2964J24400m334q4961L7195k8882K06665K02451n0272Q5742l8510
$$ 4908205 4885241 5009641 5005307 4920346 4957541 4928659 5135324 5337775 5287503 5373245 5334735
4211E334735r2690j67898p8897J97138N4073J03020l906o5818J97440J65248m1977
$$ 5334735 5242045 5074147 4995250 5192388 5246461 5349481 5345575 5279757 5477197 5642445 5600468
4200E600468R0994J99645K0179K2826K2340J75046J13122q6017m8445K43514k4352
$$ 5600468 5691462 5891107 5911286 5934112 5956452 6131498 6244620 6158603 6110158 6353672 6329320
4189F329320O3162J45351K60477J61848J38546K58021K80128J29500J2900J4660
$$ 6329320 6392482 6537833 6798310 6960158 7098704 7356725 7636853 7766353 7779253 7793913
4179G793913R7628M84348n4959J50114J37697J82347L11883L65715K95415J96248
$$ 7793913 7891541 8375889 8320930 8471044 8608741 8791088 9102971 9468686 9764101 9960349
4169I960349R0306J05554L70105K05399J3687M11663L05310J21676M55512M13033
$$ 9960349 10050655 10156209 10526314 10731713 10745400 11157063 11462373 11584049 12039561 12452594
4159A2452594K45622M03628L21710P7547M96038M58298N41807M74361N01111N45596
$$ 12452594 12698216 13101844 13423554 13501101 13997139 14455437 14997244 15471605 15972716 16518312
4149A6518312N53871N13478P06049K66908P51280Q32273O45487Q14940O31928
$$ 16518312 17072183 17585661 18291710 18558618 19309898 20142171 20787658 21602598 22234526
4140B2234526J109082J085765R29364J109057J136118J066137J343659J200871
$$ 22234526 23343608 24429373 25358737 26467794 27603912 28670049 30013708 31214579
4132C1214579J143557J258968J497960J479321J456419J381895J609734J579419
$$ 31214579 32358136 33617104 35115064 36594385 38050804 39432699 41042433 42621852
4124D2621852J710917J650888J658188J977750J729903J593975J719349J748815
$$ 42621852 44332769 45983657 47641845 49619595 51349498 52943473 54662822 56411637
4116E6411637J774963J843275J884704J707628J512923J652895J566933J620466
$$ 56411637 58186600 60029875 61914579 63622207 65135130 66788025 68354958 69975424
4108F9975424J765893J321850J024672J239135J446308J083828J333409J220350
$$ 69975424 71741317 73063167 74087839 75326974 76773282 77857110 79190519 80410869
4100H0410869R59572R90867O20444N28079K53762N45673N82131L68847L83314
$$ 80410869 81370441 82361308 82981752 83509831 83763593 84309266 84891397 85260244 85643558
4091H5643558M26243K44133J31589J19960m9699j93858M8411r1209k17085l64643
$$ 85643558 86069801 86313934 86445523 86565483 86515784 86321926 86370337 86279128 86062043 85697400
4081H5697400l51374k57482k1294n5851k97269m24017k994l47625k15776l9054
$$ 85697400 85346026 85088544 85067250 85011399 84714130 84290113 84287119 83939494 83723718 83684664
4071H3684664k21691p972K4374k63031J09331r9021l11651o061K44650K39567
$$ 83684664 83462973 83455001 83479375 83216344 83325675 83226654 82915003 82908942 83153592 83393159
4061H3393159J34072J32309L94076O80202K09173K88336M96096L25599O23225
$$ 83393159 83527231 83659540 84053616 84733818 84942991 85231327 85727423 86053022 86676247
4052H6676247Q07805N01774N27501L69925N67708N82368P75850O94497Q17214
$$ 86676247 87484052 87985826 88513327 88883252 89450960 90033328 90809178 91503675 92320889
4043I2320889O68724Q30459Q21427Q65390J006851J002201J184022J283590J323989
$$ 92320889 92989613 93820072 94641499 95506889 96513740 97515941 98699963 99983553 101307542
4034A01307542J483262J392082J448107J298127J677871J652381J541424J834149
$$ 101307542 102790804 104182886 105630993 106929120 108606991 110259372 111800796 113634945
4026A13634945J352160J512981J535949J711818J744097J782538J828179J476899
$$ 113634945 114987105 116500086 118036035 119747853 121491950 123274488 125102667 126579566
4018A26579566J404393J299106J458092J006937R89301J012836J202825J037040
$$ 126579566 127983959 129283065 130741157 131748094 132737395 133750231 134953056 135990096
4010A35990096Q33329Q63296N51610P54383P66198M96029L32779K08685L16401
$$ 135990096 136823425 137686721 138238331 138992714 139758912 140254941 140587720 140796405 141112806
4001A41112806M4372r1693q6761j56577k39228k27422m5972m16710m63418l36527
$$ 141112806 141157178 141065485 140978724 140822147 140582919 140355497 140309525 139892815 139429397 139092870
3991A39092870m18702m09989n46669o87170n75320m67472l25186l47413o48574
$$ 139092870 138674168 138264179 137717510 137030340 136455020 135987548 135662362 135314949 134666375
3982A34666375l89226k85869j45691k45993l53411k88285j50991p7352J40294
$$ 134666375 134277149 133991280 133845589 133599596 133246185 132957900 132806909 132729557 132869851
3973A32869851M5896R8159M25858N05015M00644P19178R95795J108510J512142
$$ 132869851 132915747 133013906 133439764 133944779 134345423 135064601 136060396 137168906 138681048
3964A38681048J526978J808640K441720K606852L055369L581578L679058M373153
$$ 138681048 140208026 142016666 144458386 147065238 150120607 153702185 157381243 161754396
3956A61754396M502022M514224N095192M792383M214148L980004L016755J770746
$$ 161754396 166256418 170770642 175865834 180658217 184872365 188852369 191869124 193639870
3948A93639870O80472j01460j102963j832615k735107k885869k741140l181621
$$ 193639870 194320342 194218882 193115919 191283304 188548197 185662328 182921188 179739567
3940A79739567l489774l592763l753952m296267m604276m782724n438569n766686
$$ 179739567 176249793 172657030 168903078 164606811 160002535 155219811 149781242 144014556
3932A44014556o054535o319819o713325o139066o070316n777810n603829n203393
$$ 144014556 137960021 131640202 124926877 118787811 112717495 106939685 101335856 96132463
3924I6132463m654998m322948m016337l417902l224597k992102k923671k742356
$$ 96132463 91477465 87154517 83138180 79720278 76495681 73503579 70579908 67837552
3916F7837552k523752k331024k061112k104195j839269j548803j541896j604714
$$ 67837552 65313800 62982776 60921664 58817469 56978200 55429397 53887501 52282787
3908E2282787j658190j400971j460613j258635j123310j137575j050434q96345
$$ 52282787 50624597 49223626 47763013 46504378 45381068 44243493 43193059 42296714
3900D2296714j105396r79370p72591r94746n68050q24657r98894o69297q67156
$$ 42296714 41191318 40211948 39439357 38444611 37876561 37051904 36053010 35383713 34516557
3891C4516557n73476n89399m95055n24213p81982k85656o40126o98706l99738
$$ 34516557 33943081 33353682 32858627 32334414 31552432 31266776 30626650 29927944 29528206
3882B9528206n69979o01567m61291l16211k50654n45220m09921l28048l54400
$$ 29528206 28958227 28356660 27895369 27579158 27328504 26783284 26373363 26045315 25690915
3873B5690915l73155j67953n39880m73458m90851l56318j23098l39301m09669
$$ 25690915 25317760 25149807 24609927 24136469 23645618 23289300 23166202 22826901 22417232
3864B2417232j87538j18769j61595l80043j88438m5614l13279j94802n7304k63882
$$ 22417232 22229694 22110925 21949330 21569287 21380849 21335235 21021956 20827154 20769850 20505968
3854B0505968j13267k23343Q474j91378j36902J36822q328o1147j3128l77075
$$ 20505968 20392701 20169358 20177832 19986454 19849552 19986374 19978046 19916899 19903771 19526696
3844A9526696K5737J81672J80706j6096J8298M8268J69843K3373J15683O27814
$$ 19526696 19552433 19734105 19914811 19898715 19917013 19965281 20135124 20158497 20274180 20901994
3834B0901994N3473P6091K55012J31647K29686K37589J16410N04745L28790Q4340
$$ 20901994 20955467 21031558 21286570 21418217 21647903 21885492 22001902 22506647 22835437 22919777
3824B2919777J33253L06072O94598K00996J60523M49103l1006M37027O98730J73075
$$ 22919777 23053030 23359102 24053700 24254696 24415219 24864322 24833316 25270343 25969073 26142148
3814B6142148M79315L53546L73851L28942O30370N51375M71271N24395N68699
$$ 26142148 26621463 26975009 27348860 27677802 28308172 28859547 29330818 29855213 30423912
3805C0423912R89518O87224M81582P82283J025150J071539Q13997J109825R69039
$$ 30423912 31413430 32100654 32582236 33364519 34389669 35461208 36275205 37385030 38354069
3796C8354069R91227J328759J277738J398303J528584J771507J655829J572015
$$ 38354069 39345296 40674055 41951793 43350096 44878680 46650187 48306016 49878031
3788D9878031J671179K216770J924105K078954K384225K538189K646975K995020
$$ 49878031 51549210 53765980 55690085 57769039 60153264 62691453 65338428 68333448
3780F8333448L313959L494447L856163M092796M639454M932812N270873N986965
$$ 68333448 71647407 75141854 78998017 83090813 87730267 92663079 97933952 103920917
3772A03920917O382250O870519P308436P499026P547334P607038P050498O748941
$$ 103920917 110303167 117173686 124482122 131981148 139528482 147135520 154186018 160934959
3764A60934959N877617M726679L543453K294309J230446O72664K19337k21234
$$ 160934959 166812576 171539255 175082708 177377017 178607463 179280127 179499464 179278230
3756A79278230m20505p39392p40395j015048j087134j798510k514892l267173
$$ 179278230 178857725 178118333 177377938 176362890 175275756 173477246 170962354 167695181
3748A67695181m221552m980564n973785o682701o837511o795461o935337o300299
$$ 167695181 163473629 158493065 152519280 145836579 138999068 132203607 125268270 118967971
3740A18967971n874072n341949m769371m217286l888656l149529k559059k528497
$$ 118967971 113093899 107751950 102982579 98765293 94876637 91727108 89168049 86639552
3732H6639552k295197j703551j604959j346885j222023j027565q94094p32763
$$ 86639552 84344355 82640804 81035845 79688960 78466937 77439372 76545278 75812515
3724G5812515o61108m23987p48945n84242n61452q11209p52318p50889n48760
$$ 75812515 75151407 74727420 73978475 73394233 72832781 72021572 71269254 70518365 69969605
3715F9969605m74796p96653p22263p38913p76400p29460n81769n63894n11572
$$ 69969605 69494809 68698156 67975893 67236980 66460580 65731120 65149351 64585457 64073885
3706F4073885k89561n96910n32965k78244k05062n51187j81050j08874k87624
$$ 64073885 63784324 63187414 62654449 62376205 62171143 61619956 61438906 61330032 61042408
3697F1042408J33322M11407L21964P6546R4131O13837O60317M37703M68696P10208
$$ 61042408 61175730 61587137 61909101 61985647 62079778 62693615 63353932 63791635 64260331 64970539
3687F4970539P56988N61567R52354Q92206J037488J062205J220096J090796J054499
$$ 64970539 65727527 66289094 67241448 68133654 69171142 70233347 71453443 72544239 73598738
3678G3598738J254845R02365J326547J361350J264040J391759J400581J355795
$$ 73598738 74853583 75755948 77082495 78443845 79707885 81099644 82500225 83856020
3670H3856020J444323J560384K057679J996168K321704K680207K849611K777172
$$ 83856020 85300343 86860727 88918406 90914574 93236278 95916485 98766096 101543268
3662A01543268L147794L438641L970330M111245M287729M449138M668026M832658
$$ 101543268 104691062 108129703 112100033 116211278 120499007 124948145 129616171 134448829
3654A34448829N015786M914643N106646M365429M388058M419944M214394M339360
$$ 134448829 139464615 144379258 149485904 153851333 158239391 162659335 166873729 171213089
3646A71213089M550818M614132M589689M781719N199250N339984N382041N250407
$$ 171213089 175763907 180378039 184967728 189749447 194948697 200288681 205670722 210921129
3638B10921129M994294M981583M651378M592073M584442M286876M430691M311323
$$ 210921129 215915423 220897006 225548384 230140457 234724899 239011775 243442466 247753789
3630B47753789M561548M986842N153091N321724N654862N744531O011916O145487
$$ 247753789 252315337 257302179 262455270 267776994 273431856 279176387 285188303 291333790
3622B91333790O104355N853933N608578N401406M799692M445142L924265L164683
$$ 291333790 297438145 303292078 308900656 314302062 319101754 323546896 327471161 330635844
3614C30635844K732788K609995K179536J712032J482040J609159R01862N95946
$$ 330635844 333368632 335978627 338158163 339870195 341352235 342961394 343863256 344459202
3606C44459202k84095j006126j913276k758452l896182m490120n091409n592842
$$ 344459202 344175107 343168981 341255705 338497253 334601071 330110951 325019542 319426700
3598C19426700n777249o031390n858214n925119n997731n982638o011612n855959
$$ 319426700 313649451 307618061 301759847 295834728 289836997 283854359 277842747 271986788
3590B71986788o021339o270972o249309o407579o555238o313799o177090n816544
$$ 271986788 265965449 259694477 253445168 247037589 240482351 234168552 227991462 222174918
3582B22174918n520016m833278m478036m238107m109637l581029l018846l134201
$$ 222174918 216654902 211821624 207343588 203105481 198995844 195414815 192395969 189261768
3574A89261768k995163k674817k492164k380102k265534k051821j829275j974093
$$ 189261768 186266605 183591788 181099624 178719522 176453988 174402167 172572892 170598799
3566A70598799j625457j640038j634241j413917j384969j469741j573521j261862
$$ 170598799 168973342 167333304 165699063 164285146 162900177 161430436 159856915 158595053
3558A58595053j572350j550114j505178j641604j595735j778251j710442j869954
$$ 158595053 157022703 155472589 153967411 152325807 150730072 148951821 147241379 145371425
3550A45371425j939370k029944k171370k223788k441681k578105k428148k676632
$$ 145371425 143432055 141402111 139230741 137006953 134565272 131987167 129559019 126882387
3542A26882387k692974k735205k888029k752834k594755k610502l107158k997056
$$ 126882387 124189413 121454208 118566179 115813345 113218590 110608088 107500930 104503874
3534A04503874k918068k712821k834580l202497l259659k909379k883924k617150
$$ 104503874 101585806 98872985 96038405 92835908 89576249 86666870 83782946 81165796
3526H1165796k932474k852870k677699k721534k536916k255995k113825k108253
$$ 81165796 78233322 75380452 72702753 69981219 67444303 65188308 63074483 60966230
3518F0966230k141875k047798j936452j841714j553586j525299j528192j653935
$$ 60966230 58824355 56776557 54840105 52998391 51444805 49919506 48391314 46737379
3510D6737379j402668j186719q92888j264842r78048q64586r84982o40530o52102
$$ 46737379 45334711 44147992 43255104 41990262 41012214 40147628 39162646 38522116 37870014
3501C7870014o18464p04279o64901n47179n90934n76987n29214o56841k66777
$$ 37870014 37251550 36547271 35882370 35335191 34744257 34167270 33638056 32981215 32714438
3492C2714438l98729l40654n37663o34661m45362n67405j73513n52863o02717
$$ 32714438 32315709 31975055 31437392 30802731 30357369 29789964 29616451 29063588 28460871
3483B8460871n47118o58203l11848k61490m99494m44574k21642m01675n13122
$$ 28460871 27913753 27255550 26943702 26682212 26182718 25738144 25516502 25114827 24601705
3474B4601705n35393l68875l61968l85478j19262m12977m23558m56293n2827k01868
$$ 24601705 24066312 23697437 23335469 22949991 22830729 22417752 21994194 21537901 21485074 21283206
3464B1283206o32893l72159j65881k29772l24330k57996M3717k44901k30907j8617
$$ 21283206 20650313 20278154 20112273 19882501 19558171 19300175 19343892 19098991 18868084 18849467
3454A8849467n3266k46469j64268k67226p357J9663j328n1878k39833J7209j03616
$$ 18849467 18796201 18549732 18385464 18118238 18110881 18130544 18129216 18077338 17837505 17854714 17751098
3443A7751098q5213j13384l4263J8249j89257j45969J76102J92078J93191J80274
$$ 17751098 17665885 17552501 17518238 17536487 17347230 17201261 17377363 17569441 17762632 17942906
3433A7942906R0827n9508j15807N20023N34914K30812K38573L32492L71827N70028
$$ 17942906 18033733 17974225 17858418 18378441 18913355 19144167 19382740 19715232 20087059 20657087
3423B0657087K20397L17405M09958M53340M68657M32118L40991M86178M46878
$$ 20657087 20877484 21194889 21604847 22058187 22526844 22958962 23299953 23786131 24233009
3414B4233009L02474O90726P71454O14228N93448N59864O26032O64403Q55810
$$ 24233009 24535483 25226209 25997663 26611891 27205339 27765203 28391235 29055638 29911448
3405B9911448O94055J046885R79795Q55383J422457J548036J855765J786405J991882
$$ 29911448 30605503 31652388 32632183 33487566 34910023 36458059 38313824 40100229 42092111
3396D2092111K404274L033683L199870M055647M756655N593450O469595P841847
$$ 42092111 44496385 47530068 50729938 54785585 59542240 65135690 71605285 79447132
3388G9447132Q475820Q885710Q907440Q151229N654930J254709l340074p304792
$$ 79447132 87922952 96808662 105716102 113867331 119522261 120776970 117436896 110132104
3380A10132104r138471r100995p768838o307909m797611l385283k213775j657614
$$ 110132104 100993633 91892638 84123800 77815891 73018280 69632997 67419222 65761608
3372F5761608r29751j26234J76844N92668J132604J656899K255887K630008K517373
$$ 65761608 64831857 64705623 64882467 65475135 66607739 68264638 70520525 73150533 75667906
3363G5667906K898919L460094M134661N479709O847013Q888132J0611222J3068829
$$ 75667906 78566825 82026919 86161580 91641289 98488302 107376434 117987656 131056485
3355A31056485J5286825J6265090J6853013J6014398J1320538K389197p559711
$$ 131056485 146343310 162608400 179461413 195475811 206796349 209185546 201625835
3348B01625835j5649730k0872518k0924482j7840005j4788937j1636309r199969
$$ 201625835 185976105 165103587 144179105 126339100 111550163 99913854 90713885
3341I0713885p141034n768703m541384l507404k777347k355050j727724j691131
$$ 90713885 83572851 77804148 73262764 69755360 66978013 64622963 62895239 61204108
3333F1204108j060823n80317k32525K47214P21748Q14101J815157K436588L135537
$$ 61204108 60143285 59562968 59330443 59577657 60299405 61113506 62928663 65365251 68500788
3324F8500788M210235N188954O160207O351177O727261O410607M705671J510281
$$ 68500788 72711023 77899977 84060184 90411361 97138622 103549229 108254900 109765181
3316A09765181k859066o570300r198478j0122367r428897p907908o396103n302498
$$ 109765181 106906115 100335815 91137337 81014970 71586073 63678165 57282062 51979564
3308E1979564l942718l260950k969984k379151j889191j766345j459786j482785
$$ 51979564 48036846 44775896 41805912 39426761 37537570 35771225 34311439 32828654
3300C2828654j126287r45874j168273p70722j031512q89397o97087p18120o48304
$$ 32828654 31702367 30756493 29588220 28817498 27785986 26896589 26199502 25481382 24833078
3291B4833078p87106o31663n12508m03559m70722j65963n15307l81007r8163k83172
$$ 24833078 24045972 23414309 22901801 22498242 22027520 21861557 21346250 20965243 20867080 20583908
3281B0583908n1759j85033p6581l0942l18593l7366J18338J24366J72503l3708
$$ 20583908 20532149 20347116 20270535 20239593 19921000 19883634 20001972 20126338 20298841 20265133
3271B0265133m2129J77132J94669k0741J91595J42168j46510L3120K20410J51160
$$ 20265133 20223004 20400136 20594805 20574064 20765659 20907827 20761317 20794437 21014847 21166007
3261B1166007N3513L37443N5511J69720R1000K16664J67295L6300J33294K36119
$$ 21166007 21219520 21556963 21612474 21782194 21873194 22089858 22257153 22293453 22426747 22662866
3251B2662866L12856J23873P50878M88023N14644M98169M61580N85857O09341
$$ 22662866 22975722 23099595 23850473 24338496 24853140 25351309 25812889 26398746 27008087
3242B7008087P24260N66134M96375M94785O28316Q44292Q36842R37844J182521
$$ 27008087 27732347 28298481 28794856 29289641 29917957 30762249 31599091 32536935 33719456
3233C3719456J332064J305740J564171J673706J885435K069848J807138J808767
$$ 33719456 35051520 36357260 37921431 39595137 41480572 43550420 45357558 47166325
3225D7166325J568181J720479J147827P30755K75208l49059q14468j257508j493222
$$ 47166325 48734506 50454985 51602812 52333567 52608775 52259716 51445248 50187740 48694518
3216D8694518j711746j772119j675858j566580j562320j735480j537845j311371
$$ 48694518 46982772 45210653 43534795 41968215 40405895 38670415 37132570 35821199
3208C5821199j154581j480390j351406j294517j297030j348673j060594j059068
$$ 35821199 34666618 33186228 31834822 30540305 29243275 27894602 26834008 25774940
3200B5774940j143361j226644r83028r86894j199529q90065j040158r61153o56655
$$ 25774940 24631579 23404935 22421907 21435013 20235484 19345419 18305261 17344108 16687453
3191A6687453q22775p52700m07840n84562n75676l67987o29004k45022k65698
$$ 16687453 15864678 15111978 14704138 14119576 13543900 13175913 12546909 12301887 12036189
3182A2036189m61164n03839n97921l76533p6978k90569l59508j76078k60684l01918
$$ 12036189 11575025 11071186 10473265 10096732 10019754 9729185 9369677 9193599 8932915 8630997
3172H630997l27256O648j92598k91756J61879K273q2286k28467j21559k30714
$$ 8630997 8303741 8310389 8117791 7826035 7987914 7990187 7907901 7679434 7557875 7327161
3162G327161j44995P8815r8844j83677k78114k7014k6236j15204k89200N6981
$$ 7327161 7182166 7260981 7162137 6978460 6700346 6673332 6647096 6531892 6242692 6299673
3152F299673q729j42424l12529m6824M868j59549k01417p9742p5569k52746l32165
$$ 6299673 6290944 6148520 5835991 5789167 5794035 5634486 5433069 5353327 5277758 5025012 4692847
3141D692847j55959j89341r6254j13327M9320k15129j86450j01089Q6284j09668
$$ 4692847 4536888 4347547 4251293 4137966 4187286 3972157 3785707 3684618 3770902 3661234
3131C661234K1384l8165q0393j13694J3327m4096M8824M9009J55046m8989j45864
$$ 3661234 3682618 3644453 3564060 3450366 3463693 3419597 3468421 3517430 3672476 3623487 3477623
3120C477623J59386J85037j86393m06163j4204j26984j13534J09437j33969P06
$$ 3477623 3637009 3822046 3635653 3229490 3215286 3088302 2974768 3084205 2950236 2950942
3110B950942n6970j56445j0162R2178q8861l4110r0668J29718R5096l96119J49107
$$ 2950942 2893972 2737527 2727365 2819543 2730682 2696572 2605904 2735622 2830718 2434599 2583706
3099B583706o0241J1577J17232q3027J08215o0269p8246o7346M33576L2064j90892
$$ 2583706 2523465 2535042 2652274 2569247 2677462 2617193 2538947 2471601 2905177 2937241 2746349
3088B746349l7865j44212l1124j19504Q7727j78559j15740Q5599L8715j67948
$$ 2746349 2708484 2564272 2533148 2413644 2501371 2322812 2207072 2292671 2331386 2163438
3078B163438J388k8860j05400J45501K10955k40154J54263j9688q5642m8071j2194
$$ 2163438 2164826 2135966 2030566 2176067 2387022 2146868 2301131 2281443 2195801 2147730 2135536
3067B135536K252P1197o267j3750J4798K46802R2979J30093j7314R8584O5375
$$ 2135536 2137788 2208985 2202718 2188968 2203766 2450568 2543547 2673640 2656326 2754910 2820285
3056B820285j95596p7812j09922j71891L3734j67560j31874j63246P1215r4528
$$ 2820285 2624689 2546877 2436955 2265064 2298798 2131238 1999364 1836118 1907333 1812805
3046A812805M0473J75059q2505j15438j31300m4271Q56M7198r3075K02447r7614
$$ 1812805 1853278 2028337 1945832 1830394 1699094 1654823 1655679 1702877 1609802 1812249 1714635
3035A714635q3321J64791K24670p8378p7296p2099K56354O8627l75224J29162
$$ 1714635 1631314 1796105 2020775 1942397 1865101 1793002 2049356 2117983 1742759 1871921
3025A871921j19717J58261p9977p4252Q974j33697n3157J39018k4456j03565J77072
$$ 1871921 1752204 1910465 1830488 1756236 1765210 1631513 1578356 1717374 1692918 1589353 1766425
3014A766425M06j30778k95349P2940N2523r9354J67005K49142l34824J32659P6008
$$ 1766425 1766831 1636053 1340704 1413644 1466167 1366813 1533818 1782960 1448136 1580795 1656803
3003A656803j09316J8015J13124N1074j14421j57974J14636O2560N4657M4960
$$ 1656803 1547487 1565502 1678626 1729700 1615279 1457305 1571941 1634501 1689158 1734118
2993A734118K38188j85652p8877L17204J4n2388O5020r0214j74719j832J49423
$$ 1734118 1972306 1786654 1707777 2024981 2024995 1972607 2037627 1947413 1772694 1770862 1920285
2982A920285p5413Q045R9291J8151K8364L2555L61840N3106k55052Q6791L5505
$$ 1920285 1844872 1852917 1952208 1970359 1998723 2031278 2393118 2446224 2191172 2277963 2313468
2971B313468M8487m3967J09567K99186o4560M4429J05839J27102R6258Q2818J92399
$$ 2313468 2361955 2317988 2427555 2726741 2662181 2706610 2812449 2939551 3035809 3118627 3311026
2960C311026j89307j98962L5459j67199J12287K09921N694J08904P6222j95993
$$ 3311026 3121719 2922757 2958216 2791017 2903304 3113225 3118919 3227823 3304045 3108052
2950C108052N1349L46209R0696J32509q3475J5204J58716K27569P6328o4327R9735
$$ 3108052 3159401 3505610 3596306 3728815 3645340 3660544 3819260 4046829 4123157 4058830 4158565
2939D158565Q1961R3089K63949K20498n1433M50725J40433M39593L9131K9300
$$ 4158565 4240526 4333615 4597564 4818062 4766629 5217354 5357787 5797380 5836511 5865811
2929E865811J92132n6106k9712K36709L68143L15980K19828K16975L75587L32316
$$ 5865811 6057943 6001837 5972125 6208834 6576977 6892957 7112785 7329760 7705347 8037663
2919H037663K39854L66924L26479P24030O04205O66413M69492P57738Q26790O25914
$$ 8037663 8277517 8644441 8970920 9694950 10299155 10965568 11435060 12192798 13019588 13645502
2909A3645502Q88571R00849J188735R87621Q08341M91252L88104O09539K90865
$$ 13645502 14534073 15434922 16623657 17611278 18419619 18910871 19298975 19908514 20199379
2900B0199379J27088j82702N2420r117n1483N8299n2131J24730J76243J83162
$$ 20199379 20326467 20143765 20196185 20187068 20135585 20193884 20141753 20266483 20442726 20625888
2890B0625888j43392o1545n0083L46909J45743M18031M95409L35831N68317Q47340
$$ 20625888 20482496 20420951 20370868 20717777 20863520 21281551 21776960 22112791 22681108 23528448
2880B3528448Q94305J208824J351157J598149J826954K058776J827426J461963
$$ 23528448 24422753 25631577 26982734 28580883 30407837 32466613 34294039 35756002
2872C5756002M07926q13501j547612k554986k573680k298795k216293j664806
$$ 35756002 36163928 35350427 33802815 31247829 28674149 26375354 24159061 22494255
2864B2494255j458449j364325j010950o89036n69398l97227k92976l59585m39826
$$ 22494255 21035806 19671481 18660531 17971495 17402097 17004870 16711894 16352309 15912483
2855A5912483j60027k31225j56451n8520K5397O85J72431L5368K18950M40711
$$ 15912483 15752456 15521231 15364780 15306260 15331657 15332342 15504773 15540141 15759091 16199802
2845A6199802J57115J01506K2020j69900m79384p12276o33715n57864p93956q21404
$$ 16199802 16356917 16458423 16480443 16310543 15831159 15118883 14485168 13927304 13133348 12311944
2835A2311944q51520q73657q49888o83791o57896l01936m61624n43627k38432
$$ 12311944 11460424 10586767 9736879 9053088 8395192 8093256 7631632 7088005 6849573
2826F849573n00831m7544k35418l19201j50101l64274l46550q9410l96766k57630
$$ 6849573 6348742 6301198 6065780 5746579 5596478 5232204 4885654 4796244 4399478 4141848
2816D141848k10162K4891k19164l02931L4751N3269r7645l56020o1451k28777
$$ 4141848 3931686 3956577 3737413 3434482 3469233 3522502 3424857 3068837 3007386 2778609
2806B778609j73238r7843J09833k6190l60004j32333j39760j3453J52083o1374
$$ 2778609 2605371 2507528 2617361 2591171 2231167 2098834 1959074 1945621 2097704 2036330
2796B036330M3505k22562Q5488J5552j63357J55379O6661j94808j41979j73667
$$ 2036330 2079835 1857273 1942761 1958313 1794956 1950335 2016996 1822188 1680209 1506542
2786A506542L0330j70195k97522m8001J59224K4495l9108N9358P8109m8990R6451
$$ 1506542 1536872 1366677 1069155 1021154 1180378 1204873 1165765 1225123 1303232 1254242 1350693
2775A350693r8977j63125j79490j35076J76926J7816j03785L1669l1927J54238
$$ 1350693 1251716 1088591 909101 774025 950951 968767 864982 896651 864724 1018962
2765A018962J00303r8742k22046O8183n7800j02839l1257J0590j80J1249J6129
$$ 1018962 1119265 1020523 798477 866660 808860 706021 674764 685354 685174 696423 712552
2754G12552J90037n7462j58620j12707K1017l2870j01554M666K6596L0568K17562
$$ 712552 902589 845127 686507 573800 594817 561947 460393 465059 491655 522223 739785
2743G39785j28562j91078J09131j61504j01330J20085J98695j16225k30617R6926
$$ 739785 611223 420145 529276 367772 266442 386527 585222 468997 238380 335306
2733C35306P9931M6522r199r3448o0898P2119l8438q1797R3733J97371m3482M5988
$$ 335306 415237 461759 452560 359112 298214 370333 331895 250098 343831 541202 497720 543708
2721E43708m834j85913P733m3345O0442k08163L8065l0054K1111l9691J09938
$$ 543708 538874 352961 360694 317349 377791 169628 207693 177639 198750 159059 268997
2710B68997L2829L3613k45945M0709J49759j73127J1255P3137J12728j31259P0175
$$ 268997 301826 335439 89494 130203 279962 106835 118090 191227 303955 172696 242871
2699B42871j0447j11675R629k2555J8044l9524J34282j83467L3950j44116M6812
$$ 242871 232424 120749 130378 107823 125867 86343 220625 37158 71108 -73008 -26196
2688b6196K26586L6617j21329P2685o0321m1956K597j5023J81972M1411j50317
$$ -26196 200390 237007 115678 188363 128042 86086 88683 73660 255632 297043 146726
2677A46726j56327q0925O1262Q6950p7247j3327L0153j21181J43569O7137j46090
$$ 146726 -9601 -90526 -29264 57686 -19561 -32888 -2735 -123916 19653 86790 -59300
2666e9300J4543K9535J5158K0M8897Q5712n1742j34486k6941k7502N4602j6604
$$ -59300 -44757 -15222 -64 -44 48853 134565 82823 -51663 -78604 -106106 -51504 -68108
2654f8108n7700p6992M4042J42466j75281K0744J02482p4144M7201J49858k6966
$$ -68108 -125808 -202800 -158758 -16292 -191573 -170829 -68347 -142491 -95290 54568 27602
2643B7602j47843J22973J011m1714J67650j4678k52910K5439K36964j92409j85161
$$ 27602 -120241 2732 3743 -37971 129679 115001 -137909 -112470 124494 -67915 -253076
2632b53076j07669J03900K72071r9526j60830J5166J56459J89694J96884k05056
$$ -253076 -360745 -256845 15226 -84300 -245130 -229964 -73505 116189 313073 108017
2622A08017j90207O6754O3710p7074M7366p5557l0720J17834j1141m7331j6375
$$ 108017 -82190 -15436 48274 -28800 18566 -56991 -87711 30123 18982 -28349 -44724
2611d4724j02615j65522m21J20580j0107L0659p0494K496J86614K8422j08459
$$ -44724 -147339 -312861 -313282 -192702 -202809 -172150 -242644 -240148 -53534 -25112 -133571
2600a33571N5894Q5567J56569q4539J9456o5031o2814J33777j37249j80536K87860
$$ -133571 -77677 7890 164459 79920 99376 34345 -28469 105308 -31941 -212477 75383
2589G5383N0161R3877J06913k75045j20514J53772J11220j91480Q1348J25541
$$ 75383 125544 219421 326334 51289 -69225 84547 195767 4287 85635 211176
2579B11176j96827k95440J93809J00058j55053K10670j5644k39849J42424J64875
$$ 211176 14349 -281091 -87282 12776 -142277 68393 52749 -187100 -44676 120199
2569A20199j42207J81057j22611q4091M5001j28517J57032l5165J56778N2716
$$ 120199 -22008 159049 36438 -47653 -2652 -131169 25863 -9302 147476 200192
2559B00192r3369j29236J51191j42987p6600J2149k7383J69475l317j20355j66822
$$ 200192 106823 -22413 128778 -14209 -90809 -78660 -106043 63432 60115 -60240 -227062
2548b27062N6968j10098O453l3587j56400J81544J19515j90734Q4600J48753O1713
$$ -227062 -170094 -280192 -273739 -307326 -463726 -282182 -162667 -353401 -268801 -120048 -58335
2537e8335p1250l2064q9538R874q5149R8609M5271N9085P9769n4823j35581P6074
$$ -58335 -129585 -161649 -251187 -241313 -326462 -227853 -182582 -123497 -43728 -98551 -234132 -158058
2525a58058o6396Q4097J98389j09056p6469j54153R5564q8994M0083j18696J08196
$$ -158058 -224454 -140357 58032 -51024 -127493 -281646 -186082 -275076 -234993 -353689 -245493
2514b45493J25755L260j71460J57058l1682n4087K3809O1154o2898M995R607J4439
$$ -245493 -119738 -116478 -287938 -130880 -162562 -216649 -192840 -131686 -194584 -189589 -179982 -165543
2502a65543M3741q437P3557n3351q4236m4395J00406n1821q6660n4886K6227J15314
$$ -165543 -121802 -130239 -56682 -110033 -194269 -238664 -138258 -190079 -276739 -331625 -305398 -190084
2490a90084m5832N2807J19408j30386j2959J5483M6956n4101J02064o0395K15587
$$ -190084 -235916 -183109 -63701 -194087 -207046 -191563 -144607 -198708 -96644 -157039 58548
2479E8548j48041j89775k2097J6117j101j29722k3982J13666O5268K9033J5813
$$ 58548 -89493 -279268 -301365 -285248 -286349 -416071 -440053 -326387 -261119 -232086 -216273
2468b16273M776R0612O2542J01266j30287m7607L2176m5501r7142r7828J48447
$$ -216273 -211497 -120885 -58343 42923 -87364 -134971 -102795 -148296 -245438 -343266 -194819
2457a94819j61845J34462J64739p5281o858j92721O4386o2222N5853l4081l8556
$$ -194819 -356664 -222202 -57463 -132744 -139602 -332323 -267937 -330159 -274306 -308387 -346943
2446c46943K6470K57522n4560O9367J0343m3271Q7615j07060j32569j74807L60
$$ -346943 -320473 -62951 -117511 -48144 -37801 -81072 6543 -100517 -233086 -407893 -407533
2435d07533L09032j1713m1371N3340j03649q9745J39960L8180o0797j68011m9265
$$ -407533 -98501 -110214 -151585 -98245 -201894 -291639 -151679 -113499 -174296 -342307 -391572
2424c91572J07290l0754j17009J00495m9582J8896J76001J02874J52888j76861
$$ -391572 -284282 -315036 -432045 -331550 -381132 -362236 -186235 -83361 69527 -107334
2414a07334j8709Q161k12722Q5388j83770K9935L59787p8632K8963p144j7817
$$ -107334 -126043 -117882 -330604 -245216 -428986 -399051 -39264 -117896 -88933 -96077 -113894
2403a13894m2474N8296j89503K17519J35623p8598J5989n699o4625M6489k7648
$$ -113894 -156368 -98072 -287575 -70056 65567 -13031 2958 -2741 -67366 -20877 -48525
2392d8525R1005k4131j31545o4233j70740k644M7671R917J65279M3894r9685j76051
$$ -48525 42480 18349 -113196 -177429 -348169 -350813 -303142 -293225 -127946 -84052 -183737 -359788
2380c59788J49104K71109m5854l05514R8527J36584R845j23110k49591J27928
$$ -359788 -210684 60425 14571 -290943 -192416 -55832 -45987 -169097 -418688 -290760
2370b90760k87350L06563K23395k47684j00803J27114J17880k37984J7421J41868
$$ -290760 -578110 -271547 -48152 -295836 -396639 -269525 -151645 -389629 -372208 -230340
2360b30340J48958k09983k2754J97649q6337J43626P7289j71073j69221L11364
$$ -230340 -81382 -291365 -314119 -116470 -202807 -59181 18108 -152965 -322186 -10822
2350a0822n5491j31846J45773L3365K1257r5100J96174m2010p9266J23437n2923
$$ -10822 -66313 -198159 -52386 -19021 2236 -92864 103310 61300 -17966 105471 52548
2339E2548J0172L01568J28246k29939j03803J7660j67391q5388J02762R9271j064
$$ 52548 62720 364288 492534 262595 158792 176452 9061 -76327 26435 125706 124642
2328A24642q6541n6399j37419J44967N1633Q1124N098J13153M767k4694j83619
$$ 124642 38101 -18298 -155717 -10750 40883 122007 127105 240258 245025 220331 36712
2317C6712o7474R3658J26100m2840q5083p5457l3682P2397k70334N0295Q8915
$$ 36712 -30762 62896 188996 146156 61073 -14384 -48066 24331 -246003 -195708 -106793
2306a06793J78847j75221k96120J51510r2773K36968J08842l00159j03653Q6877
$$ -106793 72054 -103167 -399287 -247777 -340550 -103582 5260 -294899 -398552 -311675
2296c11675M2006K35395L00942j76989n1450j22752J17790J75531o2512j61507
$$ -311675 -269669 -34274 266668 89679 38229 -84523 33267 208798 146286 -15221
2286a5221j22477L5163j49473j92132K25607l3832J29675m4406K12469N454k5240
$$ -15221 -137698 -102535 -252008 -444140 -218533 -252365 -122690 -167096 45373 50827 25587
2275B5587k8000J84613J39377k40874n3219O1626J21888r0884j00243j28641J62063
$$ 25587 -2413 182200 321577 80703 27484 89110 210998 120114 19871 -108770 53293
2264E3293J47496j53476m7479O6958q8361k91604L02510l5675j43386K60258j28462
$$ 53293 200789 47313 -166 66792 -21569 -313173 -10663 -46338 -189724 70534 -57928
2253e7928J26609R3074J5882q9299j9890J00163m9967m6084M254O3743l2341j77881
$$ -57928 68681 161755 177637 88338 68448 168611 118644 72560 76814 140557 108216 -69665
2241f9665K26926j14054j4882K52542M4715k53365q026q4412N4111J168j18544
$$ -69665 157261 43207 28325 280867 325582 72217 64191 -20221 33890 35058 -83486
2230h3486l1607l5687R6251K89348j28210n3339J5189J1926j9549J10907J727
$$ -83486 -115093 -150780 -54529 234819 106609 53270 68459 80385 60836 171743 173470
2219A73470j42114M25247K13j88891k87503n9029K01769K46053l1214q0848j3996
$$ 173470 31356 456603 456816 267925 -19578 -78607 123162 369215 338001 257153 243157
2208B43157L21351p9827k04672r8154J7071K7869j62686Q3611m9931J09531j16383
$$ 243157 564508 484681 280009 181855 198926 226795 64109 147720 97789 207320 90937
2197I0937M9725N6775N8567K12635p3598K9042l2585k20788k0153Q5435O2319
$$ 90937 140662 197437 256004 468639 395041 424083 391498 170710 150557 235992 298311
2186B98311J83978k13268J52377J61043o0273j57185J15369J76835M642l0570
$$ 298311 482289 269021 421398 582441 522168 364983 480352 657187 661829 631259
2176F31259q3498r3945k1404J28392J8268O636K1157P0770p5595P5692r6400J23667
$$ 631259 547761 453816 432412 560804 579072 585708 606865 677635 602040 677732 581332 704999
2164G04999J49894J40884M7637j03064j77507J96679o8482J37146J87899j18441
$$ 704999 854893 995777 1043414 940350 762843 959522 891040 1028186 1216085 1097644
2154A097644j4924N1022q6903J24794Q8569J53109q7691J4096J37349J5293J22357
$$ 1097644 1082720 1133742 1046839 1171633 1260202 1413311 1325620 1339716 1477065 1492358 1614715
2143A614715j41048P0102L58859m6717J11815J88330P7048m4289q6417r617J68932
$$ 1614715 1473667 1543769 1902628 1855911 1967726 2156056 2233104 2188815 2102398 2092781 2261713
2132B261713K56681p0468J89924o1574k42527j5302K1145O1176L76680j04481
$$ 2261713 2518394 2447926 2637850 2576276 2333749 2318447 2339592 2400768 2777448 2672967
2122B672967R0501P6357J94245J42655J55892k8589K44253J36814P5077J82222
$$ 2672967 2763468 2839825 3034070 3176725 3332617 3304028 3548281 3685095 3760172 3942394
2112C942394L24711K41270J42665l0861K42010N19886K72620L24011O7714R1035
$$ 3942394 4267105 4508375 4651040 4620179 4862189 5382075 5654695 5978706 6046420 6137455
2102F137455K28659L63396M13648L44187L71183L74469K91438M73936N80805P18189
$$ 6137455 6366114 6729510 7143158 7487345 7858528 8232997 8524435 8998371 9579176 10297365
2092A0297365M84424P37848R76220N80160J139637J240820J154619J186565J227372
$$ 10297365 10781789 11519637 12495857 13076017 14215654 15456474 16611093 17797658 19025030
2083A9025030J486998J837863J976049K690268L539850M259767N697709P348963
$$ 19025030 20512028 22349891 24325940 27016208 30556058 34815825 40513534 47862497
2075D7862497P785218P998741Q889242R652512O484041j671426p168018j0960766
$$ 47862497 55647715 63646456 72535698 82188210 88672251 87000825 79832807 68872041
2067F8872041j2933393j0644282p580934n972415m378231l243733k468780k018813
$$ 68872041 55938648 45294366 37713432 31741017 27362786 24119053 21650273 19631460
2059A9631460j457224j118682j114726r58747p13015p21252r65368j094690o84597
$$ 19631460 18174236 17055554 15940828 14982081 14269066 13547814 12582446 11487756 10803159
2050A0803159q66366r23398n94795n09317l97007k00094m49423l88477l18411
$$ 10803159 9936793 9013395 8418600 7909283 7512276 7312182 6862759 6474282 6155871
2041F155871l49199j81435n01524k86722k42712k42381k44251j45269k49891q4623
$$ 6155871 5806672 5625237 5123713 4836991 4594279 4351898 4107647 3962378 3712487 3627864
2031C627864O9869j49292k43665O8098l6601j08773j45144o8629l48818j5182
$$ 3627864 3697733 3548441 3304776 3372874 3336273 3227500 3082356 3013727 2664909 2649727
2021B649727J20901q0188k4377n9272J31733k39300j44992j48090k84476Q3924
$$ 2649727 2770628 2690440 2666063 2606791 2738524 2499224 2354232 2206142 1921666 2005590
2011B005590n8247O6000j65466o8799j82215K17196k33311j01350M1566n6935
$$ 2005590 1947343 2013343 1847877 1779078 1596863 1814059 1580748 1479398 1520964 1464029
2001A464029L8711k22173j97117j21533M2939j61573J31882j267K15396o1325
$$ 1464029 1502740 1280567 1083450 961917 1004856 843283 975165 973898 1189294 1127969
1991A127969N9309k2921L4468J26843L435j74083q2361J305r3381j83087R2386
$$ 1127969 1187278 1164357 1198825 1325668 1329103 1155020 1072659 1073964 980583 797496 889882
1980H89882M2799j82884P6160J9139j47468Q2568m821j50086j7050j44488l25852
$$ 889882 932681 749797 825957 845096 697628 780196 775375 625289 608239 463751 137899
1969A37899K18063K40929Q5805P9045o7079j26655M2930j30742m7266J97938p0161
$$ 137899 355962 596891 682696 761741 694662 568007 610937 480195 432929 630867 560706
1958E60706k56834J01236J49044J29047p3145j49514J65970j40830k02229j5040
$$ 560706 303872 405108 554152 683199 610054 460540 626510 485680 283451 268411
1948B68411L6951J00277J30715J8356j73406K809j18241M5456K69362n0986j97767
$$ 268411 305362 405639 536354 554710 381304 384113 265872 311328 580690 529704 331937
1937C31937J7332l3931Q5959o4750j08471J12171k03003M0504J09094L7614Q478
$$ 331937 349269 315338 401297 336547 228076 340247 137244 177748 286842 324456 332934
1926C32934K1608O245K9154j99080J16980N3747p3859j849j67743l5604k9070
$$ 332934 354542 360787 389941 190861 307841 361588 287729 285880 118137 82533 53463
1915E3463N4311J04006R4691J68190j57096k39075M8462K58885j85901r9687J8139
$$ 53463 107774 211780 306471 474661 317565 78490 126952 385837 199936 100249 118388
1904A18388o850k30944N6875K95245J34382j48465j64646m8747K04674q5730j36299
$$ 118388 111538 -119406 -62531 232714 367096 218631 53985 5238 209912 124182 -12117
1893a2117J42593n9592M0328K19248j50976j62587p1117J15956p0225J28475K22182
$$ -12117 130476 70884 111212 330460 179484 16897 -54220 61736 -8489 119986 342168
1882C42168k56752r9907K12626p5546q9708J54758j01549j7481j25739J19173
$$ 342168 85416 -14491 198135 122589 32881 187639 86090 68609 -57130 62043
1872F2043j74227m7129P8460P0985J22129j37952j25542O7499j66114J40773K4289
$$ 62043 -112184 -159313 -80853 -9868 112261 -25691 -151233 -83734 -249848 -109075 -84786
1861h4786M2916j05812J12105j7441J07377J19533j16220j47795J09936K60649
$$ -84786 -41870 -147682 -35577 -53018 54359 173892 57672 -90123 19813 280462
1851B80462K35907l26353j18473J02199q8668o0536J6349j49170m4330K83831
$$ 280462 516369 190016 71543 173742 85074 24538 40887 -108283 -152613 131218
1841A31218Q2709l5988k2909J09007r1207j81785O1692j7227J16271j24101j01464
$$ 131218 213927 177939 155030 264037 172830 -8955 52737 35510 151781 27680 -73784
1830g3784P6439K912L11146p971j6040k63824M0978j3416J81877l9983n7150O5326
$$ -73784 2655 5567 316713 308742 292702 28878 69856 56440 238317 198334 141184 206510
1818B06510O955j90690J34905N4196r0136N1908n3417j20995K08086n9544N2906
$$ 206510 213465 22775 157680 211876 121740 173648 120231 -764 207322 147778 200684
1807B00684Q8577k65K92654R4522k03234n8283J30097p1774j41286p6544k41234
$$ 200684 289261 288996 581650 676172 472938 414655 544752 472978 331692 255148 13914
1796A3914M3757o6288m5808J03075J32480l9465k1100N3604M210r0159r7042j33153
$$ 13914 57671 -8617 -54425 48650 181130 141665 120565 174169 178379 88220 -8822 -141975
1784a41975K43177j03843r3274J06016r745L3681k03708l5297l4031K7165J19539
$$ -141975 101202 -2641 -95915 10101 356 34037 -169671 -204968 -238999 -211834 -92295
1773i2295j36273J24878J3629j80591J04326p0108R6610J3486R7931n9591j21733
$$ -92295 -228568 -103690 -90061 -270652 -166326 -236434 -139824 -126338 -28407 -87998 -209731
1762b09731M9131O1740L782N7162q4388p3817Q0183J72801k58595R0970K4225
$$ -209731 -160600 -98860 -95078 -37916 -122304 -196121 -115938 56863 -201732 -110762 -86537
1751h6537K54035K45028r5572j66572m6202p1826J86127l9447Q623L6045j61071
$$ -86537 167498 412526 316954 150382 104180 32354 218481 179034 187657 223702 62631
1740F2631j68908j45060K10548K68957k94632p1587j2964j108J69408r8301R9036
$$ 62631 -106277 -251337 -40789 228168 -66464 -138051 -151015 -152123 17285 -81016 18020
1729A8020J19287k72636j13640K49576R5871r0216O3773j04780J47673o8392n243
$$ 18020 137307 -135329 -248969 607 96478 6262 70035 -34745 112928 44536 39293
1718C9293Q2158j15066J9136n7177o598N4765j27681q8609j3622r2522J01828
$$ 39293 121451 6385 25521 -31656 -38254 16511 -111170 -199779 -213401 -305923 -204095
1707b04095K6093l9798J01991R0040O8366j37325q8029J75901r0469n1956o8138
$$ -204095 -178002 -217800 -115809 -25769 42597 -94728 -182757 -6856 -97325 -149281 -217419
1696b17419m0784J65549j06578l8525J27030j50866K1374J25607j05042j15578
$$ -217419 -258203 -92654 -199232 -237757 -110727 -261593 -240219 -114612 -219654 -335232
1686c35232J88115P8498N3056k29935n0751K13096N3643j32475k7523Q8792O3976
$$ -335232 -147117 -68619 -15563 -245498 -296249 -83153 -29510 -161985 -189508 -100716 -36740
1675c6740J15205r1680j24631j78229R4860J86522O342P7650k70646k7292K16521
$$ -36740 78465 -13215 -137846 -316075 -221215 -34693 -28351 49299 -221347 -248639 -32118
1664c2118O751J01133O9999j65999M2293J0008l5108J14057m4516j82804M1194
$$ -32118 -25367 75766 145765 -20234 22059 32067 -3041 111016 66500 -116304 -75110
1653g5110n4295N6785L0376O767j9902k1035j35420N4195k5396K89331o2254q8737
$$ -75110 -129405 -72620 -42244 -35477 -55379 -76414 -211834 -157639 -183035 106296 44042 -44695
1641d4695k4009R3233q0006M3096P1318j98180P0262O5343p4285o0682M1164m5504
$$ -44695 -68704 24529 -55477 -12381 58937 -139243 -68981 -3638 -77923 -138605 -97441 -142945
1629a42945k4457L7566o9440O9434J95081p6320L0614j12184J01750J773q6059
$$ -142945 -167402 -129836 -199276 -129842 65239 -11081 19533 -92651 9099 10872 -75187
1618g5187k7228J2569q5529N9576P0617O0437j36680j9588K49139p6211l206J02468
$$ -75187 -102415 -89846 -175375 -115799 -45182 15255 -121425 -141013 108126 31915 28709 131177
1606A31177L354l0139k02128R9336j02491N3364p1872P3283P6610J37996K9619
$$ 131177 134531 104392 -97736 1600 -100891 -47527 -119399 -46116 30494 168490 198109
1595A98109j69664J846P0185L7313k39280K23494k3460j24814J6725l9470J05832
$$ 198109 28445 30291 100476 137789 -101491 122003 98543 -26271 -9546 -49016 56816
1584E6816L3311j75903n2400r2576L39088O5695j57286M8424M4551K8146r4633
$$ 56816 90127 -85776 -138176 -230752 108336 174031 16745 65169 109720 137866 43233
1573D3233P7020K034N4837n3056j39253Q881j50127j3611J4688J72662J19124
$$ 43233 120253 122287 177124 124068 -15185 -6304 -156431 -170042 -155354 17308 136432
1562A36432P0908l3846j57769N7251j2570l2502j10553j29579M5394J67998k2279
$$ 136432 207340 173494 15725 72976 60406 27904 -82649 -212228 -166834 1164 -21115
1551b1115P3645l1501P685L4286k57501p7818K5584J28835j06246K34176J31465
$$ -21115 52530 21029 28714 63000 -194501 -272319 -246735 -117900 -224146 10030 141495
1540A41495j93771j35010j98993J77190J20626L601K6063K16097j1856r9660k72444
$$ 141495 -52276 -187286 -386279 -209089 -88463 -84862 -58799 157298 145442 45782 -226662
1529b26662j42852J36510J68775r8210n0431r3639L94118q1297q8114k9845n6416
$$ -226662 -369514 -233004 -64229 -162439 -212870 -306509 87609 6312 -81802 -111647 -168063
1518a68063K04507N1723l0055L2306j33439o537J7242j13862J43928j66576l3361
$$ -168063 36444 88167 58112 90418 -43021 -49558 -32316 -146178 -2250 -168826 -202187
1507b02187J50956O6508n9967N6956j59037j4501k628j239J31346K7235n6574
$$ -202187 -51231 15277 -44690 12266 -146771 -161272 -163900 -165139 -33793 -6558 -63132
1496f3132l185o2651K9877M1396m2497Q646R5069M2938q0513M8152l1855j26724
$$ -63132 -66317 -128968 -99091 -57695 -100192 -91546 3523 46461 -34052 14100 -17755 -144479
1484a44479n9520J36643q6515l5248M8642q7279j10843l3750K71071Q2557J55745
$$ -144479 -203999 -67356 -153871 -189119 -140477 -227756 -338599 -372349 -101278 -18721 137024
1473A37024n8564k8476N4652j04974J38709J04511J1319j16550j98760N7482p5192
$$ 137024 78460 49984 104636 -338 138371 242882 254201 137651 -61109 -3627 -78819
1462g8819J23115l1521k26056j83106P0823L36472m3100q7373J0704p1099J90380
$$ -78819 44296 12775 -213281 -396387 -325564 10908 -32192 -119565 -108861 -179960 10420
1451A0420r4107k76169P3070J10611J63022L1307P5825j36477j28637p1334J05194
$$ 10420 -83687 -359856 -286786 -176175 -13153 18154 93979 -42498 -171135 -242469 -137275
1440a37275j4396J37476M9194r4691K1342l9405ql0079m2678r9034L3037J48353
$$ -137275 -151671 -14195 34999 -59692 -38350 -77755 -77763 -107842 -150520 -249554 -216517 -68164
1428f8164M5001p7793j10969n3084J37035J12790m7084p8977n1225j17613O2450
$$ -68164 -23163 -100956 -211925 -265009 -127974 -15184 -62268 -141245 -192470 -310083 -247633
1417b47633J57473j59853L9599J24651n5149l2826P2032j01356q8857K04222j86764
$$ -247633 -90160 -250013 -210414 -85763 -140912 -173738 -101706 -203062 -291919 -87697 -274461
1406b74461q4143K1251J54681J737M3567K99238M4775m35113r764L3133n9872
$$ -274461 -358604 -337353 -182672 -180935 -137368 161870 206645 -228468 -238232 -205099 -264971
1395b64971p6076J39812L24680J22208k24611j70803j18711J06550p4109l543
$$ -264971 -341047 -201235 123445 245653 21042 -149761 -268472 -161922 -236031 -239574
1385b39574L0268J87181K13707j97836O2034Q3736k7497j44021j53283Q0906M3216
$$ -239574 -209306 -22125 191582 -6254 55780 139516 112019 -32002 -185285 -104379 -61163
1374f1163O472J33495o9895K6272o3546j75546M6634J09747J3587L29212k33905
$$ -61163 -54691 78804 8909 35181 -28365 -203911 -157277 -47530 -33943 295269 61364
1363F1364j21919O6337N2855j31208o2889K6939j03516J06284m246P003K03024
$$ 61364 -60555 5782 58637 -72571 -135460 -108521 -212037 -105753 -109999 -102996 100028
1352A00028J10843k54884j18252J90568j449m0686r339M6467j9025m7219k3625
$$ 100028 210871 -44013 -162265 28303 26854 -13832 -23171 23296 4271 -42948 -66573
1341f6573r3932M7609J18719q3890q8199K80338J15574m1343k29798K5075L2441
$$ -66573 -160505 -112896 5823 -78067 -166266 114072 229646 188303 -41495 -16420 16021
1330A6021j70129J63384J41770q506k33691j10558L9555L2476J78686R6850r5138
$$ 16021 -154108 9276 151046 142540 -91151 -201709 -162154 -129678 49008 145858 50720
1319E0720m3821r1419q4630r406Q5439J10952o891j9094J56020P4588n0368j73299
$$ 50720 6899 -84520 -169150 -178556 -93117 17835 10944 -8150 147870 222458 172090 -1209
1307a209J6865L4036p9622n9316l9326K40935L4615j15766k9854m5769P9737o1840
$$ -1209 15656 49692 -29930 -89246 -128572 112363 146978 31212 1358 -44411 35326 -26514
1295b6514k09926m9266K04391l2201J02636O2123j47872j86730O1853J08237J4875
$$ -26514 -236440 -285706 -81315 -113516 -10880 51243 -96629 -283359 -221506 -113269 -98394
1284i8394r4144O8317J53052J25023m9454n9649J00345j64368m4064r1014M5497
$$ -98394 -192538 -124221 28831 153854 104400 44751 145096 -19272 -63336 -154350 -108853
1273a08853K1011o5203j02652J8842o3550J12498J06786q255k8155j0978N5937
$$ -108853 -87842 -153045 -255697 -236855 -300405 -187907 -81121 -89376 -117531 -128509 -72572
1262g2572n8966M1329L1599j3538k5632o5264J76320Q4253n6266q843o4938K64554
$$ -72572 -131538 -90209 -58610 -72148 -97780 -163044 13276 97529 41263 32420 -32518 232036
1250B32036j20237q2454o2925k05204k1825L6826J21171J68832j79986l8210K12038
$$ 232036 111799 29345 -33580 -238784 -260609 -223783 -102612 66220 -113766 -151976 60062
1239F0062j76566j25582N4736M3585K0268L19394j59966r6426K1593l0203L1381
$$ 60062 -116504 -242086 -187350 -143765 -123497 195897 35931 -60495 -38902 -69105 -37724
1228c7724K54410O1180j80199O5670j79866m0244L4705q4840P912K3885J72673
$$ -37724 216686 277866 97667 163337 -16529 -56773 -22068 -106908 -98996 -75111 97562
1217I7562J056j21240j86055J82617J06441N0035o7588k54968M0997J99003p5753
$$ 97562 98618 -22622 -208677 -26060 80381 130416 62828 -192140 -151143 47860 -27893
1206b7893j9432m501Q9730J51714r2675j38740o2720l6087j12904o4760L7993
$$ -27893 -47325 -51826 37904 189618 96943 -41797 -104517 -140604 -253508 -318268 -280275
1195b80275J35864J57346k3201L0650k0317r6934K29396J4800J09468j00721r8755
$$ -280275 -144411 12935 -10266 20384 67 -96867 132529 147329 256797 156076 57321
1184E7321l59699P9229L09307q3074k7195O6503L1296k30288N93J29940O9946
$$ 57321 -302378 -223149 86158 3084 -24111 42392 73688 -156600 -156007 -26067 43879
1173D3879Q4202j69007k09619q6429J58773p8493N9267K0452P649J27260p531
$$ 43879 128081 -40926 -250545 -336974 -178201 -256694 -197427 -176975 -169326 -42066 -49597
1162d9597J5376K24385N2056Q6364j90963J0258j2942j96715K43175j09832K9933
$$ -49597 -34221 190164 242220 328584 137621 147879 134937 -61778 181397 71565 101498
1151A01498m8240o5417K00431j52103O0034j8947q6785J27637j51238J08619L6992
$$ 101498 53258 -12159 188272 36169 96203 77256 -9529 118108 -33130 75489 112481
1140A12481j46242J0959K4774P7701j56287J2922J64991l0082R4129j86343L9092
$$ 112481 -33761 -22802 1972 79673 -76614 -63692 101299 71217 165346 -20997 18095
1129A8095J4220j12093l3642J21380p7189J07277L2790J07553j10364p5575J8832
$$ 18095 32315 -79778 -113420 7960 -69229 38048 70838 178391 68027 -7548 11284
1118A1284N0084N2151m1838p6060p9140o5484J05787L7552K5599j21840K4390
$$ 11284 61368 113519 71681 -4379 -83519 -149003 -43216 -5664 19935 -101905 -77515
1107g7515j80314q421J57242j67744m9040L21086J11824O9508p4536q2916k9168
$$ -77515 -257829 -266250 -109008 -276752 -325792 -4706 107118 176626 102090 19174 -9994
1096i994o7702K80942k26740J93379p173k18112p5410j4750J6658K0747Q7589
$$ -9994 -77696 203246 -23494 169885 162712 -55400 -130810 -145560 -128902 -108155 -20566
1085b0566J30813j8332k37603K7094J219J3741K29711j22805J83829M0567j9046
$$ -20566 110247 91915 -145688 -118594 -117375 -103634 126077 3272 187101 227668 208622
1074B08622P9295r3282j48644l8149p4151J09022M2499q5125J7807J37861k5546
$$ 208622 287917 194635 45991 7842 -66309 42713 85212 87 17894 155755 130209
1063A30209j76798p0130l8189j3453K7763N5598O0716P4556J0740m1575P0411
$$ 130209 -46589 -116719 -154908 -168361 -140598 -85000 -24284 50272 61012 19437 89848
1052H9848j74365L5981m1355k2477R5449q8906k23521j6692K60867N2273q748
$$ 89848 -84517 -48536 -89891 -112368 -16919 -105825 -329346 -346038 -85171 -32898 -41646
1041d1646q992K04396j39206P8643k27131j86275K9150R9465o988K1710O5702
$$ -41646 -50638 153758 14552 93195 -133936 -320211 -291061 -191596 -198584 -176874 -111172
1030a11172m284Q59p2897N7495R6330r357R274r6922n2508R4224J13561J45270
$$ -111172 -115456 -114597 -187494 -129999 -33669 -43026 -33752 -130674 -183182 -88958 24603 169873
1018A69873o8120m9545j85874K35483r3161K2945j21410N3555J11147r7592j3202
$$ 169873 101753 52208 -133666 101817 8656 31601 -89809 -36254 74893 -22699 -35901
1007c5901R2190j08213O2451N4584O8996j24976O2871J29398j95603R9787m1565
$$ -35901 56289 -51924 10527 65111 134107 9131 72002 201400 5797 105584 64019
996F4019j51852J05216J46167j01531p5977Q5268r825J00972j37087j5265j31434
$$ 64019 -87833 17383 163550 62019 -13958 71310 61485 162457 25370 10105 -121329
985a21329k1393K12039j06083N2262r5374l5060M6304J09397j24636J6772P9942
$$ -121329 -142722 69317 -36766 15496 -79878 -114938 -68634 40763 -83873 -67101 12841
974A2841j98080J09998J8599p8020m2718l3020K14155o7232J12447J31503k14111
$$ 12841 -185239 -75241 -56642 -134662 -177380 -210400 3755 -63477 48970 180473 -33638
963c3638k33762P6526O8880N0070l9695n0586Q3829J55480n8310O7576l44223
$$ -33638 -267400 -190874 -121994 -71924 -111619 -162205 -78376 77104 18794 86370 -257853
952b57853P2964J94145J41214j98408K11042m6524j59688k861K41986j9525j98597
$$ -257853 -184889 9256 150470 -47938 163104 116580 -43108 -45969 196017 176492 -22105
941b2105k15820P6890K03327Q0561j75166O5976j1076q8144J20109j36806k8735
$$ -22105 -237925 -161035 42292 122853 -52313 13663 2587 -85557 34552 -102254 -130989
930a30989J07808Q7993r5132L8104p4254P5040L14412j76820k37368L6495Q0392
$$ -130989 -23181 64812 -30320 7784 -66470 8570 322982 146162 -91206 -54711 25681
919B5681M3957l60536N0232J64545Q6119M5979j6744N9879P5485J8716J9014l02251
$$ 25681 69638 -290898 -240666 -76121 9998 55977 39233 99112 174597 193313 212327 -89924
907h9924p2004J10172O8520r4891J59205k38086k27950R6422K83131n8387J99076
$$ -89924 -161928 -51756 16764 -78127 81078 -157008 -384958 -288536 -5405 -63792 135284
896A35284J74873P4464k45931k33363K6436J58396J48812O3654j15729L6147j7898
$$ 135284 310157 384621 138690 -94673 -68237 90159 238971 302625 186896 223043 205145
885B05145j78566p3523M9659O8465o3873o197k6037L2378R1059j46008j73983
$$ 205145 26579 -46944 2715 71180 7307 1110 -24927 7451 98510 -47498 -221481
874b21481O7587J36339j34197n6746J0676J04648K06035j32457k02200J06038
$$ -221481 -153894 -17555 -151752 -208498 -197822 -93174 112861 -19596 -221796 -115758
864a15758J7817o3825J36447M65n7501j7749L15203L9180r5978J21731K8508L9240
$$ -115758 -97941 -161766 -25319 -24854 -82355 -100104 215099 254279 158301 280032 308540 347780
852C47780j82757l08798J5855K63412N7781j53171m049q2347P9212k2795M7466
$$ 347780 165023 -143775 -127920 135492 193273 40102 36053 -46294 32918 10123 57589
841E7589m7294Q7132N4034q8133j64750J80646L5135k2393J16750P5534k13087
$$ 57589 10295 97427 151461 63328 -101422 79224 114359 91966 208716 284250 71163
830G1163L4757J18198l4057M4392J2106k821k6465P818r1769O9448j04151P0849
$$ 71163 105920 224118 190061 234453 246559 243738 217273 225091 133322 202770 98619 169468
818A69468M1867M3470q5493j88118L3110J02470J6710n3711K36507l19262j15502
$$ 169468 211335 254805 169312 -18806 14304 116774 133484 79773 316280 -2982 -118484
807a18484M6894J43727K7596j36218Q4977Q3145N4659L9552J76473j85515j41564
$$ -118484 -71590 72137 99733 -36485 48492 131637 186296 225848 402321 216806 75242
796G5242n8196R8837j25727O501J45144j12044n7864M6300p9149K26054K4907
$$ 75242 17046 115883 -9844 -3343 141801 29757 -28107 18193 -60956 165098 190005
785A90005O5042j92615r7299j1119l9475P3235M3471K25190j10333j14391k72222
$$ 190005 255047 62432 -34867 -45986 -85461 -12226 31245 256435 146102 31711 -240511
774b40511K5220O6750J02078J1822p0J88710k16292J22936m4412j53112j15289
$$ -240511 -215291 -148541 -46463 -34641 -34711 153999 -62293 60643 16231 -136881 -252170
763b52170O7172R6813p1427k4571K05763Q0698J8007k38434P6216J96314o7413
$$ -252170 -184998 -88185 -159612 -184183 21580 102278 120285 -118149 -41933 154381 86968
752H6968m9323M3632J10504j81461o000J56433j17491j13320Q3295O0647J06517
$$ 86968 37645 81277 191781 10320 4320 160753 43262 -70058 13237 73884 180401
741A80401j38301j19817K07398J33711N5324q9921k06845j06611P7850J00458
$$ 180401 42100 -77717 129681 263392 318716 228795 21950 -84661 -6811 93647
731I3647j85142L1786M5505K46695j36839j34468J43081j36623q4038J45204J41961
$$ 93647 -91495 -59709 -14204 232491 95652 -38816 104265 -32358 -116396 28808 170769
720A70769m2980k97369J55850J2907j39943K0313N9372L5718J99735M4353j62006
$$ 170769 127789 -169580 -13730 -823 -140766 -120453 -61081 -25363 174372 218725 56719
709E6719N0140Q3297n5176j015q3532j00226m9479R2860Q8501P9610k33682r9336
$$ 56719 106859 190156 134980 133965 50433 -49793 -99272 -6412 82089 161699 -71983 -171319
697a71319j6176M7303J5950l3683J34333J57362m7379j22070Q5092n6986J25647
$$ -171319 -187495 -140192 -124242 -157925 -23592 133770 86391 -35679 49413 -7573 118074
686A18074P0247r1947O366m3596j99593l7993J32084O2454j71267l9373K24598
$$ 118074 188321 96374 102740 59144 -140449 -178442 -46358 16096 -155171 -194544 30054
675C0054J85585l9110k35433m0011p3157J59177p5067j04179K71745j09056J2688
$$ 30054 215639 176529 -58904 -98915 -172072 -12895 -87962 -192141 79604 -29452 -16764
664a6764j7978Q0523j3612n1355N6633J36594k33882o5529L3421P6892Q4702J1527
$$ -16764 -34742 45781 32169 -19186 37447 174041 -59841 -125370 -91949 -15057 69645 81172
652H1172p0745j72381J93275r3603N2153j33463K27909M4635j12876L34149n6095
$$ 81172 10427 -161954 31321 -62282 -10129 -143592 84317 128952 16076 350225 294130
641B94130l11196J46437O4575R5843K1330k24473j23728j32344R3101m6919J16884
$$ 294130 -17066 129371 193946 289789 311119 86646 -37082 -169426 -76325 -123244 -6360
630f360J72162l537l02509K22545j31764p9900J9209J14244J24942M7669j86370
$$ -6360 165802 162265 -140244 82301 -49463 -129363 -110154 4090 129032 176701 -9669
619i669j20310J34240m7278l5650J29165M5948O6919R8076k56935n3820J07052
$$ -9669 -129979 4261 -43017 -78667 50498 96446 163365 261441 4506 -49314 57738
608E7738q0641O0700r181R494j58255K4076P0945P0530J61666k49649o4994J83618
$$ 57738 -22903 37797 28616 38110 -120145 -96069 -25124 45406 207072 -42577 -107571 76047
596G6047j32087M2426k7972R5288K40580k52106j90994j58660L38336j210r6012
$$ 76047 -56040 -13614 -41586 53702 294282 42176 -148818 -307478 30858 29648 -66364
$$ [...]
##END NTUPLES=NMR SPECTRUM
##END=
