##TITLE=1H_TG-2368
 CDCl3
 8 sc, 
 14.12.2022
##JCAMPDX= 6.0         $$ Bruker NMR JCAMP-DX V2.0
##DATA TYPE= NMR SPECTRUM
##DATA CLASS= NTUPLES
##ORIGIN= UXNMR, Bruker Analytische Messtechnik GmbH
##OWNER= root
$$ XWIN-NMR		Version 3.5
$$ Wed Dec 14 14:16:54 2022 Russian Standard Time (UT+4h)  she@DPX200
##.OBSERVE FREQUENCY= 200.13135
##.OBSERVE NUCLEUS= ^1H
##.ACQUISITION MODE= SIMULTANEOUS
##.ACQUISITION SCHEME= undefined
##.AVERAGES= 8
##.DIGITISER RES= 18
##SPECTROMETER/DATA SYSTEM= spect
##.PULSE SEQUENCE= zg30
##.SOLVENT NAME= CDCl3
##.SHIFT REFERENCE= (INTERNAL, CDCl3, 0, 15.6808)
##AUDIT TRAIL= $$ (NUMBER, WHEN, WHO, WHERE, WHAT)
$$ ##TITLE= Audit trail, XWIN-NMR		Version 3.5
$$ ##JCAMPDX= 5.01
$$ ##ORIGIN= Bruker BioSpin GmbH
$$ ##OWNER= she
$$ F:/spectra/data/she/nmr/H-F/1/pdata/1/auditp.txt
$$ ##AUDIT TRAIL=  $$ (NUMBER, WHEN, WHO, WHERE, WHAT)
(   1,<2022-12-14 14:15:37.56 +0400>,<she>,<DPX200>,
      <created by zg, POWCHK disabled, PULCHK disabled
       configuration hash MD5:
       00 E9 B6 7A A2 85 ED C7 34 08 36 98 17 FE 4E 26
       data hash MD5: 16K
       11 65 1B E7 66 67 9D AD 88 1B 47 5A AD 48 D8 DE>)
(   2,<2022-12-14 14:15:42.09 +0400>,<she>,<DPX200>,
      <Start of raw data processing
       efp BC_mod = 2 LB = 0.24 FT_mod = 6 PKNL = 1 PHC0 = -19107.92 PHC1 = 11.80072 SI = 16K 
       data hash MD5: 16K
       BD 47 77 70 49 69 37 C8 68 41 43 33 6E 39 55 43>)
(   3,<2022-12-14 14:16:00.92 +0400>,<she>,<DPX200>,
      <pk PHC0 = -159.0686 PHC1 = 1.2 
       data hash MD5: 16K
       89 04 81 FD 5B 77 8D 89 BD CA 0B 03 56 0A 1F 03>)
(   4,<2022-12-14 14:16:04.23 +0400>,<she>,<DPX200>,
      <abs ABSG = 5 
       data hash MD5: 16K
       5F 91 C4 4C A5 5B 39 B4 ED F6 4C FF B8 22 E1 E6>)
$$ ##END=
$$ 
$$ hash MD5
$$ 51 2E 36 38 9B 80 34 1F DE 13 AB 4F C2 41 B6 34
##$RELAX= 
##$RELAX= 
##$RELAX= 
##$RELAX= 
##$RELAX= 
##$RELAX= 
$$ Bruker specific parameters
$$ --------------------------
##$DU= <F:/spectra>
##$EXPNO= 1
##$NAME= <H-F>
##$PROCNO= 1
##$TYPE= <nmr>
##$USER= <she>
##$AMP= (0..31)
100 100 100 100 100 100 100 100 100 100 100 100 100 100 100 100 100 100 
100 100 100 100 100 100 100 100 100 100 100 100 100 100 
##$AQSEQ= 0
##$AQ_mod= 1
##$AUNM= <au_zg>
##$AUTOPOS= <>
##$BF1= 200.13
##$BF2= 200.13
##$BF3= 200.13
##$BF4= 200.13
##$BF5= 200.13
##$BF6= 200.13
##$BF7= 200.13
##$BF8= 200.13
##$BYTORDA= 1
##$CFDGTYP= 0
##$CFRGTYP= 5
##$CHEMSTR= <none>
##$CNST= (0..31)
1 1 145 1 1 1 1 1 1 1 1 1 1 1 1 1 1 1 1 1 1 1 1 1 1 1 1 1 1 1 1 1 
##$CPDPRG= <>
##$CPDPRG1= <>
##$CPDPRG2= <>
##$CPDPRG3= <>
##$CPDPRG4= <mlev>
##$CPDPRG5= <mlev>
##$CPDPRG6= <mlev>
##$CPDPRG7= <mlev>
##$CPDPRG8= <mlev>
##$CPDPRGB= <>
##$CPDPRGT= <>
##$D= (0..31)
0 1.2 0 0 0 0 0 0 0 0.06 0 0.03 0 0 0 0 0.0002 0 0 0 0 0 0 0 0 0 0 0 0 
0 0 0 
##$DATE= 1671012936
##$DBL= (0..7)
120 120 120 120 120 120 120 120 
##$DBP= (0..7)
150 150 150 150 150 150 150 150 
##$DBP07= 0
##$DBPNAM0= <>
##$DBPNAM1= <>
##$DBPNAM2= <>
##$DBPNAM3= <>
##$DBPNAM4= <>
$$ [...]
##$SUBNAM3= <"">
##$SUBNAM4= <"">
##$SUBNAM5= <"">
##$SUBNAM6= <"">
##$SUBNAM7= <"">
##$SUBNAM8= <"">
##$SUBNAM9= <"">
##$SW= 18.05172834244
##$SWIBOX= (0..15)
0 0 2 0 0 0 0 0 0 0 0 0 0 0 0 0 
##$SW_h= 3612.71676300578
##$TD= 16384
##$TD0= 1
##$TE= 0
##$TE2= 300
##$TE3= 300
##$TEG= 300
##$TL= (0..7)
0 120 120 120 120 120 120 120 
##$TP= (0..7)
150 150 150 150 150 150 150 150 
##$TP07= 0
##$TPNAME0= <>
##$TPNAME1= <>
##$TPNAME2= <>
##$TPNAME3= <>
##$TPNAME4= <>
##$TPNAME5= <>
##$TPNAME6= <>
##$TPNAME7= <>
##$TPOAL= (0..7)
0.5 0.5 0.5 0.5 0.5 0.5 0.5 0.5 
##$TPOFFS= (0..7)
0 0 0 0 0 0 0 0 
##$TUNHIN= 0
##$TUNHOUT= 0
##$TUNXOUT= 0
##$USERA1= <user>
##$USERA2= <user>
##$USERA3= <user>
##$USERA4= <user>
##$USERA5= <user>
##$V9= 5
##$VALIST= <valist>
##$VCLIST= <CCCCCCCCCCCCCCC>
##$VD= 0
##$VDLIST= <DDDDDDDDDDDDDDD>
##$VPLIST= <PPPPPPPPPPPPPPP>
##$VTLIST= <TTTTTTTTTTTTTTT>
##$WBST= 1024
##$WBSW= 4
##$XGAIN= (0..3)
0 0 0 0 
##$XL= 0
##$YL= 0
##$YMAX_a= 439134
##$YMIN_a= -338920
##$ZGOPTNS= <>
##$ZL1= 120
##$ZL2= 120
##$ZL3= 120
##$ZL4= 120
##$ABSF1= 15.68959
##$ABSF2= -2.362259
##$ABSG= 5
##$ABSL= 3
##$ALPHA= 0
##$AQORDER= 0
##$ASSFAC= 0
##$ASSFACI= 0
##$ASSFACX= 0
##$ASSWID= 0
##$AUNMP= <proc_1d>
##$AZFE= 0.1
##$AZFW= 0.1
##$BCFW= 0
##$BC_mod= 2
##$BYTORDP= 0
##$COROFFS= 0
##$CY= -3
##$DATMOD= 1
##$DC= 0
##$DFILT= <>
##$DTYPP= 0
##$F1P= 0
##$F2P= 0
##$FCOR= 1
##$FTSIZE= 16384
##$FT_mod= 6
##$GAMMA= 0
##$GB= 0
##$INTBC= 1
##$INTSCL= 3.70164e-10
##$ISEN= 128
##$LB= 0.24
##$LEV0= 0
##$LPBIN= 0
##$MAXI= 10000
##$MC2= 0
##$MEAN= 0
##$ME_mod= 0
##$MI= 1.114404
##$NCOEF= 0
##$NC_proc= -6
##$NLEV= 6
##$NOISF1= 3.799351
##$NOISF2= 2.8
##$NSP= 0
##$NTH_PI= 0
##$NZP= 0
##$OFFSET= 15.68078
##$PC= 1
##$PHC0= -19266.99
##$PHC1= 13.00072
##$PH_mod= 1
##$PKNL= yes
##$PPARMOD= 0
##$PSCAL= 0
##$PSIGN= 0
##$REVERSE= no
##$SF= 200.130018163531
##$SI= 16384
##$SIGF1= 3
##$SIGF2= 2
##$SINO= 5.538805
##$SIOLD= 16384
##$SREGLST= <1H.CDCl3>
##$SSB= 0
##$STSI= 16384
##$STSR= 0
##$SW_p= 3612.71676300578
##$SYMM= 0
##$S_DEV= 0
##$TDeff= 16384
##$TDoff= 0
##$TI= <>
##$TILT= no
##$TM1= 0
##$TM2= 0
##$TOPLEV= 0
##$USERP1= <user>
##$USERP2= <user>
##$USERP3= <user>
##$USERP4= <user>
##$USERP5= <user>
##$WDW= 1
##$XDIM= 16384
##$YMAX_p= 360511676
##$YMIN_p= -237045
$$ End of Bruker specific parameters
$$ ---------------------------------
##NTUPLES= NMR SPECTRUM
##VAR_NAME=  FREQUENCY,     SPECTRUM/REAL,   SPECTRUM/IMAG
##SYMBOL=    X,             R,               I
##VAR_TYPE=  INDEPENDENT,   DEPENDENT,       DEPENDENT
##VAR_FORM=  AFFN,          ASDF,            ASDF
##VAR_DIM=   16384,         16384,           16384
##UNITS=     HZ,            ARBITRARY UNITS, ARBITRARY UNITS
##FACTOR=    0.220516191357247, 1,           1
##FIRST=     3138.19486842506, 0,            0
##LAST=      -474.521894580719, 0,           0
##MIN=       -474.521894580719, -237045,     0
##MAX=       3138.19486842506, 360511676,    0
$$ Real data points
##PAGE= N=1
##DATA TABLE= (X++(R..R)), XYDATA
$$ [...]
8898 1099225 1089823 1094735 1094013 1112157 1146632 1130429 1141958 1157962 1144187 1164652 1172077 1202407
8886 1202407 1191511 1212185 1260411 1306291 1321712 1312086 1305065 1260418 1267033 1246327 1229528 1223587
8874 1223587 1198907 1184640 1180862 1192115 1205698 1206203 1264792 1248530 1246790 1273794 1280193 1272410 1294490
8861 1294490 1378827 1401238 1405926 1403666 1394697 1347145 1330984 1366779 1378201 1373625 1393981 1414535
8849 1414535 1438636 1448421 1476631 1500367 1519495 1515951 1519402 1524233 1492680 1472167 1453597 1414054
8837 1414054 1362775 1338631 1362908 1366254 1345931 1363871 1350839 1349131 1376180 1392249 1387484 1422302
8825 1422302 1444815 1477341 1471697 1498756 1476374 1446084 1387463 1371252 1370671 1368848 1350939 1361442
8813 1361442 1357605 1319898 1341012 1333267 1365188 1397450 1398341 1390405 1397391 1404412 1432095 1514332 1569084
8800 1569084 1578406 1556321 1582580 1612648 1624438 1631874 1630737 1618050 1583844 1591054 1570173 1569280 1570577
8787 1570577 1592290 1628764 1624991 1623856 1652396 1682720 1732733 1778957 1789756 1791322 1822912 1844906
8775 1844906 1852826 1868580 1863434 1842733 1850647 1848266 1857836 1882966 1898275 1902271 1940012 2000672 2044773
8762 2044773 2057298 2105647 2139932 2170515 2206556 2274707 2318638 2360031 2378016 2421382 2464949
8751 2464949 2517084 2583150 2655669 2685941 2657620 2674394 2691735 2668739 2714186 2795857 2862364
8740 2862364 2939945 3016209 3050308 3083158 3076892 2977029 2874107 2790311 2665039 2562481 2533337
8729 2533337 2504879 2464160 2465654 2490499 2477317 2528417 2578273 2627499 2678807 2764340 2885101
8718 2885101 3000217 3050416 3150445 3246257 3289796 3313902 3372670 3415329 3535703 3729238 3899467
8707 3899467 4126840 4265110 4359054 4443950 4571092 4810862 5086528 5213145 5090199 4735166
8697 4735166 4333817 3974678 3700826 3514815 3339352 3168977 3108484 3041630 2970754 2937346
8687 2937346 2885855 2891663 2919362 2918105 2926137 2987984 3023781 3083841 3137295 3170476 3197640 3272680
8675 3272680 3368645 3437427 3544440 3678516 3849612 3982799 4179182 4358693 4487451 4401788
8665 4401788 4231971 4157633 4082250 4088515 4140626 4236156 4322343 4428524 4570439 4738374 4873867
8654 4873867 4948592 4948474 4990129 5072103 5155855 5264501 5432907 5637993 5860580 6144371 6536258
8643 6536258 7007537 7600245 8331624 9203521 9996398 10543086 10862280 10719208 10157914 9535188
8633 9535188 8898581 8390803 8021636 7898858 7894383 7988144 8059801 8141063 8303992 8595158
8623 8595158 9007154 9565701 10313823 11250797 12148653 12777255 13192899 13078134 12592998 11951312
8613 11951312 11363022 10903566 10637045 10617407 10825844 11212203 11740710 12505230 13475781 14587400
8603 14587400 15881867 17217202 18530912 19761628 20584151 20969466 20742684 19843870 18718521
8594 18718521 17612955 16788633 16283569 16052459 15810795 15412905 14974312 14439004 13752167
8585 13752167 13125165 12657754 12469401 12628899 13095500 13787344 14273988 14511832 14318322
8576 14318322 13580534 12375510 11202798 10244401 9384135 8790085 8410146 8189193 8047974
8567 8047974 7953814 7939597 8010149 8193879 8549012 8976817 9479041 10104264 10781064 11284178
8557 11284178 11567682 11660627 11434686 11006959 10553838 10105699 9794181 9666902 9730593 9896258
8547 9896258 10129367 10171559 10013016 9682880 9027484 8218686 7406674 6559683 5873120 5299874
8537 5299874 4848416 4504284 4213437 3995583 3800675 3692098 3558304 3507191 3491611 3471603
8527 3471603 3470993 3450295 3400528 3305465 3194293 3136404 3121939 3069632 3052836 3035924 3030978 3041582
8515 3041582 3047180 3041095 2999044 2935027 2857947 2774543 2704612 2618409 2552797 2543416 2538430 2535308
8503 2535308 2525256 2508544 2502082 2495944 2468626 2436563 2395401 2375759 2377111 2349432 2349053 2365607
8491 2365607 2388315 2422787 2426964 2414786 2435233 2472682 2461731 2434651 2425111 2360419 2319848 2304677
8479 2304677 2274648 2261483 2274598 2312300 2337509 2339732 2361125 2294824 2243093 2215464 2154959 2084763
8467 2084763 2030067 2006161 1969318 1950768 1932996 1913836 1901037 1917003 1937509 1922057 1873001
8456 1873001 1838920 1839236 1838802 1825639 1849243 1809937 1831439 1887416 1887912 1891312 1900656 1875906 1851488
8443 1851488 1812298 1780272 1792222 1813360 1820978 1841230 1846545 1865016 1904953 1921443 1855592 1787388
8431 1787388 1762071 1730701 1746822 1763529 1748903 1823880 1853065 1828955 1825515 1868245 1876387 1901287
8419 1901287 1942531 1954074 1977258 1980690 1982328 2031737 2054445 2098244 2108619 2124654 2141861 2155298
8407 2155298 2206368 2278410 2291974 2381191 2455504 2536567 2626652 2708753 2823711 2975695 3155496
8396 3155496 3288800 3500276 3714178 4018492 4352524 4774811 5296700 5874058 6449144 6923731
8386 6923731 7130901 6879820 6383393 5858726 5444833 5263121 5224242 5365221 5583150 5887611
8376 5887611 6195746 6369315 6338473 5932863 5336120 4744474 4257686 3943897 3727237 3613606
8366 3613606 3527511 3510793 3493402 3508142 3522189 3599728 3671617 3795715 3969317 4167358 4378955
8355 4378955 4631450 4932413 5322819 5765609 6282396 6928666 7639927 8359313 9012502 9431393
8345 9431393 9610639 9605972 9372123 8868282 8268995 7846053 7635878 7728819 7999564 8334025
8335 8334025 8613858 8652645 8390971 7938927 7262430 6399604 5508066 4790489 4290448 3908842
8325 3908842 3625436 3409490 3234711 3134414 3062295 2956877 2939849 2940537 2911457 2964101 2984493
8314 2984493 3054922 3157652 3310963 3473085 3680506 3956038 4271910 4632711 5000608 5359513
8304 5359513 5545754 5450754 5133666 4827571 4624355 4551893 4589883 4684402 4792536 4919215
8294 4919215 5009920 5025017 4878678 4427821 3835824 3333742 2950946 2718887 2541780 2439761
8284 2439761 2440111 2431512 2424402 2413829 2366943 2287360 2195886 2083929 1900493 1721816 1594779
8273 1594779 1547674 1492556 1401535 1369677 1359987 1328393 1284194 1264341 1271817 1290689 1293588 1323099
8261 1323099 1420819 1513913 1572949 1579164 1611165 1590275 1475592 1386682 1281536 1219557 1152317
8250 1152317 1090568 1078542 1075856 1084547 1140083 1158360 1229685 1261155 1349055 1369407 1384748 1375501
8238 1375501 1279624 1178010 1057216 1005841 919380 838379 764908 722253 708398 667839 612778
8227 612778 597970 570367 569829 559081 553265 538757 501663 473960 476741 427418 410616 399093
8215 399093 401933 431479 400325 403102 395644 360587 387944 414477 410895 358374 349240 379121 355021
8202 355021 328115 318536 313991 271570 340241 297555 283421 340763 380862 119224 -168479 119900
8190 119900 292687 325475 309525 254274 248575 252219 268061 211659 262655 311291 284921 271741
8178 271741 270216 254599 208133 192240 173747 187775 183798 149085 220224 232921 207062 189179
8166 189179 185292 186655 173130 156938 186599 161152 179896 171944 118515 159058 167232 219986
8154 219986 219731 148925 149859 129705 150530 182919 156045 170640 175932 186927 185747 144139 176498
8141 176498 181447 187519 208771 166654 179192 216073 226368 228688 216655 195878 192491 197359 216796
8128 216796 231919 219950 188338 196331 183441 187368 220239 199985 180169 184122 173615 179945
8116 179945 184376 188394 190538 177112 159819 168440 180419 150755 151485 180454 148282 156019 152671
8103 152671 173431 201175 208896 243504 248742 241774 260937 268826 276736 273955 263798 247436 229383
8090 229383 198110 226424 246467 236346 232997 238612 241629 218080 212475 222979 220607 208412 224540
8077 224540 226294 219787 205092 202276 183096 200331 215109 223170 218480 253145 239025 197720 174768
8064 174768 164856 202412 187658 175300 166035 155293 165241 188378 167826 160943 180176 190328
8052 190328 231218 248071 227201 194258 203368 226897 215146 235125 211193 203653 186174 186000
8040 186000 195529 211945 261760 254078 231872 234206 218668 228781 245363 236686 216056 208969 209739
8027 209739 209370 204969 194149 207143 216299 214018 210862 184460 196500 184964 185675 211984 209572
8014 209572 182272 166340 200232 220811 218293 201139 187697 188554 153293 157009 190811 173387
8002 173387 164413 124929 151381 145199 152221 151389 117728 102908 152959 117293 143940 116715 94931
7989 94931 158633 181723 179642 141962 121201 129957 127556 153701 161217 137746 148343 180099 178975
7976 178975 214608 188397 185315 184770 184759 202451 164239 178649 183279 181764 195499 180374 165050
7963 165050 177907 184972 189074 166803 165995 164582 148692 126119 114953 124222 159505 136723 92671
7950 92671 66674 70243 69579 87510 51677 78986 33692 55425 103222 107665 125281 118758 116590
7937 116590 110384 131601 144176 151467 107251 122298 118765 129649 109857 130159 133851 102780
7925 102780 114776 101610 128994 149408 111873 58238 50390 69888 89099 86223 95555 81421
7913 81421 81279 91067 83026 29395 18584 27205 29808 44094 58956 58826 25650 40527 34934 56577
7899 56577 62587 53038 63758 51779 48239 24032 11228 13388 29484 37398 46684 39175 27668
7886 27668 15045 26835 13569 -24878 -10097 -9784 -17721 -23209 -28952 -6428 -39165 -77848 -50407
7873 -50407 -39643 -41000 -29927 -1892 19793 4225 -11591 18154 8594 -34517 -26096 -11405
7861 -11405 -14077 -30748 -9586 -63247 -62068 -41826 -24824 -23087 -11995 -11909 -43769 -58621 -27581
7848 -27581 -43387 -22568 4068 -15254 -12524 -21615 -53416 -57933 -61234 -55384 -33984 -30882 3980
7835 3980 -16749 -60351 -69074 -43557 -48265 -39000 -26793 -34642 -30680 -45654 -43233 -27764 -40375
7822 -40375 -71336 -53894 -54242 -37441 -52240 -65289 -42904 -37889 -20488 -18092 21090 37307 97443
7809 97443 -237045 -205780 -87647 -55223 -73306 -117267 -46581 -44615 -65310 -77976 -61632 -30856
7797 -30856 -27980 -62568 -67156 -59026 -80146 -72588 -57565 -76602 -63552 -66093 -95546 -99142 -38012
7784 -38012 -64800 -90865 -106456 -90821 -72094 -97504 -118372 -97793 -76934 -65475 -78659 -63007
7772 -63007 -81665 -63887 -55832 -53511 -72333 -54688 -54689 -68741 -85256 -55755 -41353 -41583 -44340 -45232
7758 -45232 -63619 -86848 -88838 -68417 -75014 -51819 -38449 -58431 -47913 -49220 -41218 -34296 -50699
7745 -50699 -71978 -80367 -76035 -53596 -18795 -11120 -67310 -70257 -39378 -23924 -20635 -46152 -48700
7732 -48700 -11184 -38521 -39601 -5635 12590 4873 -7263 3899 -11520 -274 11171 29817
7720 29817 8949 -23056 5343 26482 46587 35710 15247 72593 59570 61223 55347 48596
7708 48596 35009 30284 33827 26300 56190 21820 19575 30874 40229 55429 71001 64057 53193
7695 53193 24101 27916 32245 11969 5740 -12923 -43318 -32144 3927 -8074 1460 21947 20065
7682 20065 37275 20704 386 26091 56576 5211 -15817 9970 -54 -4963 35639 61732
7670 61732 52407 46848 75567 63553 33158 59134 64522 65517 41349 28711 43350 61794 41348
7657 41348 49918 27764 12645 18723 9557 -6876 19787 37804 4310 3306 -18799 -22766 -5330
7644 -5330 -25723 -47163 -64416 -67002 -11980 -35700 -49896 -75201 -32699 -18059 -49491 -39476
7632 -39476 -46200 -21851 -15662 -42592 -47029 -8394 6271 -2203 -22535 -19120 -17578 -19674 -48361
7619 -48361 -47778 -69998 -76683 -30215 -25269 -33847 3115 -16620 -33594 -35591 -6415 -12228 -42479
7606 -42479 -21617 1147 4414 -60294 -47335 -40969 -15370 -25588 -39182 -42130 -55604 -62613 -58659
7593 -58659 -59798 -48824 -69323 -65661 -48165 -23948 -58235 -51037 -17829 -23786 -5325 -30797 -29135
7580 -29135 -24154 -8243 -5508 -26652 4342 176 -53091 -40705 3978 6532 -34247 -41827 -32802
7567 -32802 -38735 -28799 -45595 -47876 -73268 -27222 -8584 -30906 -5642 -21978 -41716 -53645
7555 -53645 -46023 -45876 -24806 -37794 -14633 2937 -18064 -59934 -84681 -91187 -63485 -80248 -63597
7542 -63597 -47773 -21179 -5500 -17094 -23842 -13605 -6135 -17623 -46801 -32032 -53101 -60330
7530 -60330 -70337 -45253 -44706 -37586 -46695 -45440 -11394 -17278 -44546 -62127 -57208 -16493 -19800
7517 -19800 -63016 -37317 -30662 -37134 -69184 -75861 -58781 -26862 -30259 -49449 -66201 -62916 -82152
7504 -82152 -26112 6116 -8351 -13619 -24283 19739 14962 12575 -21490 -31727 868 -410 -17223
7491 -17223 -16873 47492 30921 44188 8705 16070 3714 -7764 -30163 -64348 -59118 -7347 -767
7478 -767 -26711 -42993 -60124 -15674 -10207 8384 49525 72557 69108 54362 50538 27450 30654
7465 30654 29562 61623 44789 27565 21191 -1902 -2347 -12926 42218 93868 76293 40108 53068
7452 53068 10094 364 16981 14874 44811 32066 27459 19653 31860 11780 27484 49804 54010
7439 54010 16835 19340 18185 -13504 -14375 -32708 -16313 -29386 -5043 22993 2163 -41560 -42639
7426 -42639 -15457 6365 9330 27807 -2222 -27633 -39010 -11089 862 7191 -510 24218
7414 24218 13076 22308 17325 40804 26285 -3409 4771 -33625 -15555 15263 -12514 -17704 -25610
7401 -25610 -52260 -53366 -30340 -26649 -16246 -5645 -51570 -35214 -24790 -11149 -15999 -19170 -45514
7388 -45514 -31313 -25053 -6133 -12472 -2574 -4416 -38053 -40758 -44058 -11420 -134 3452 -55863
7375 -55863 -75917 -51954 -49984 -66239 -54617 -31443 -19026 -32551 -58870 -51720 -55033 -38630
7363 -38630 -21212 -25000 -4122 -29563 -40679 -36428 -41511 -29945 -29682 -21399 -35498 -46456 -61726
7350 -61726 -51138 -64273 -75461 -61220 -79816 -68042 -49077 -25426 -51066 -56887 -29798 -53586
7338 -53586 -40657 -28834 -42968 -49410 -37801 -5584 -38156 -38815 -37148 -30588 -16160 -27586 -19757
7325 -19757 -32419 -40683 -54783 -51141 -56047 -63769 -24910 -33643 -67767 -93294 -80973 -65305 -68573
7312 -68573 -52491 -35374 2978 -22696 -65546 -72078 -59215 -19142 -21004 -59192 -69521 -79042
7300 -79042 -52990 -18240 -14683 -42385 -48769 -21585 -34471 -71107 -33513 -57348 -62936 -52324
7288 -52324 -32528 -29028 -7045 -6308 -13581 11821 12801 17033 -19879 -57025 -42648 -44423 -60191
7275 -60191 -67893 -66014 -26025 -21383 -17647 -13473 -5454 10687 -10392 -20294 -26993 -38342 -15651
7262 -15651 5545 -5544 31320 71502 40562 9011 18876 35366 23931 -2440 21052 7436
7250 7436 -18136 6273 19150 22056 23567 20678 35114 43989 5472 686 -373 18082 -8528
7237 -8528 -38273 -27168 3648 11938 25094 24349 13116 22754 16651 24142 806 42959 108656
7224 108656 70620 51808 52354 64632 69231 45665 58709 82596 46573 59217 72469 72720 109590
7211 109590 103949 78497 78353 124786 122337 92785 71133 45751 60774 76185 91300 57012
7199 57012 80884 67204 66061 53399 34930 59701 65432 44039 46737 40141 31755 15613 56880
7186 56880 84930 56792 106070 74617 69034 65159 90571 98554 81361 78928 51936 30342 29871
7173 29871 59695 58758 57054 92475 95573 61600 30316 29426 21311 14356 19072 17866 2523 16927
7159 16927 29976 8319 11829 28261 51649 17665 20555 35693 22995 1941 25686 28164
7147 28164 -36667 -70946 -35092 -17787 -47641 -49315 -1026 21104 -11502 12452 -23171 -30500
7135 -30500 -39046 -46019 -45392 -16994 -46149 -46183 -23673 -23823 -36280 -57268 -60782 -47465 -50886 -55153
7121 -55153 -40662 -42596 -40037 -78943 -77954 -37835 -47974 -68464 -44521 -35573 -62423 -27117 -36734
7108 -36734 -72733 -81720 -47559 -25699 -77729 -82270 -84558 -81777 -96185 -61956 -65796 -69564 -53090
7095 -53090 -28190 -46897 -45540 -34072 -25981 -48445 -78561 -67492 -82965 -62630 -63145 -57512 -39294
7082 -39294 -32856 -66408 -34477 -12853 -5133 -39503 -81427 -74371 -84619 -62842 -34942 -41304 -35461
7069 -35461 -29613 -58806 -58437 -34846 -14786 -21373 -24476 3698 2403 -47859 -44722 -5669 7704
7056 7704 4304 -6077 -28991 -44241 -42834 -21352 -38355 -44720 -57888 -52500 -56712 -68289 -46934
7043 -46934 -24409 -40099 -35704 -35019 -66127 -52734 -31504 -12240 -24671 -43038 -48160 -43608 -12485
7030 -12485 -3168 2958 -7827 -39238 -29463 -56602 -66009 -37843 -59287 -55926 -68803 -54899 -45770
7017 -45770 -55148 -59126 -70539 -24231 -47705 -75405 -54519 -25231 -33574 -41345 -40204 -61185 -42996
7004 -42996 -71789 -54718 -67743 -74258 -48015 -60737 -59875 -60234 -60447 -29404 -36109 -62885 -46775
6991 -46775 -53216 -89265 -114921 -120283 -89682 -71428 -81082 -71151 -71699 -54557 -73018 -82764 -84705
6978 -84705 -74951 -58454 -51558 -50124 -7308 -37980 -42457 -49477 -61900 -89467 -84804 -133461 -128509
6965 -128509 -70268 -52794 -71993 -38855 -34676 -48987 -47592 -51911 -46949 -78387 -78162 -50390 -66502
6952 -66502 -93457 -99478 -105506 -98044 -65572 -78629 -67720 -56551 -71210 -29571 -22104 -28089 -65294
6939 -65294 -64852 -65968 -37667 -54787 -32781 -29761 -34047 -37983 -46033 -53404 -43847 -53185 -48085 -78998
6925 -78998 -80976 -45428 -5841 -36736 -30028 -64669 -71261 -79387 -82560 -36210 -37436 -40879 -32806
6912 -32806 -65614 -57162 -68842 -93465 -99316 -70393 -48532 -50597 -64371 -50927 -19210 -30675
6900 -30675 -9966 -43120 -89021 -126477 -87216 -77691 -67104 -88519 -94338 -106881 -76257 -28146
6888 -28146 -28182 -34543 -67125 -80094 -70893 -76145 -62575 -65953 -75130 -102229 -59783 -54847 -88387 -92848
6874 -92848 -68255 -63324 -85700 -86423 -91988 -81428 -87875 -82975 -68511 -59029 -74040 -53195 -59353
6861 -59353 -81243 -59655 -87972 -72055 -91044 -93404 -60598 -41126 -63057 -72880 -49840 -55573
6849 -55573 -26421 -47701 -33211 -20343 -21055 -42217 -40808 -32950 -59117 -14123 -38231 -47696 -31069
6836 -31069 -43970 -22350 -8024 -46942 -66042 -45234 -44315 -56358 -55913 -65931 -67881 -59188 -34573
6823 -34573 -6978 -3730 -11750 -48124 -66300 -62702 -35393 -51660 -46431 -43358 -35756 -9276 -51099
6810 -51099 -79321 -77646 -55842 -66126 -49383 -59628 -69938 -61137 -71700 -58713 -31254 -36221
6798 -36221 -35802 -9902 -26313 -29255 -23289 -40678 -51549 -41639 -49755 -41826 -36741 -67923 -69535 -49145
6784 -49145 -56698 -48027 -53600 -19770 -20326 -68173 -77852 -61771 -73863 -55164 -52398 -56904 -48282 -61175
6770 -61175 -48739 -43856 -39840 -70930 -100887 -79934 -72607 -84518 -100339 -91162 -91513 -77058 -79910
6757 -79910 -79963 -68752 -71225 -63202 -74242 -70577 -51757 -68357 -55802 -62712 -70722 -70752 -79920 -51018
6743 -51018 -43064 -42452 -27270 -5494 -5360 -50855 -42006 -6352 -28171 -44612 -43720 5258 17660
6730 17660 -5231 -62371 -59389 -51618 -9613 -2168 -4162 9233 35140 2533 -2329 -15000 -21743
6717 -21743 10328 -1152 10840 4186 1618 -10384 11910 13501 6801 -9708 -30731 -47134 -39833
6704 -39833 -30160 -3303 5766 -10076 -42238 -72941 -64096 -65050 -44031 -40126 -45525 -54018 -92166
6691 -92166 -91990 -52870 -42221 -47892 -47428 -40525 -72129 -103923 -72605 -57212 -78392 -68588 -43940
6678 -43940 -42454 -26280 -58301 -110411 -96715 -53131 -60978 -74176 -85865 -79670 -95278 -100293 -66669
6665 -66669 -18488 -20316 -62086 -33529 -5060 20191 -9146 -26164 -30688 -869 53602 31334
6653 31334 33036 8459 14495 41930 52368 21969 34415 52204 61921 43057 43525 48486 52757
6640 52757 47863 34505 26041 13137 29884 47637 40135 16593 12871 6008 -13746 743 -7149
6627 -7149 -8563 -9640 -30811 -36740 -17490 -23481 -39801 -51619 -60647 -60354 -63427 -48771 -49227 -19602
6613 -19602 -43676 -35599 -3662 1817 8180 8263 -25973 -23040 -220 34612 -13592 -11912 19080
6600 19080 29279 48131 44178 32169 -9103 -20309 -12544 -29587 -44750 -40897 -39350 -21272 -28167
6587 -28167 -36005 -52273 -22308 6092 -17201 -43391 -52166 -38692 -66137 -53051 -62450 -10884
6575 -10884 -22260 6729 2814 -48920 -67833 -85359 -95445 -79949 -71748 -75371 -59184 -51098 -47570
6562 -47570 -47163 -32242 -33890 -59927 -88657 -60804 -78163 -58051 -55817 -66404 -53999 -52075 -55838
6549 -55838 -40993 -56100 -83240 -80485 -58741 -44983 -47774 -46617 -59567 -30564 -40946 -44921 -38931
6536 -38931 -7654 -7530 -39071 -56060 -61254 -43061 -35605 -38622 -52356 -49614 -78917 -57503 -60731
6523 -60731 -54147 -48052 -36903 -67968 -89320 -72192 -71926 -61827 -37850 -24171 -27783 -44661 -66870
6510 -66870 -69691 -47698 -45223 -30304 -16928 -55991 -61150 -55390 -67215 -86261 -81580 -30881 -29989
6497 -29989 -24855 -16534 -17608 -44332 -31737 -53692 -84282 -54519 -63530 -43842 -43238 -29528 -29133
6484 -29133 -51599 -69336 -74696 -49762 -63494 -65958 -75968 -57730 -38598 -46175 -76850 -40667
6472 -40667 -7867 -16973 -49445 -41387 -7444 -27943 -24405 -32073 -29098 -59104 -49656 -26495 -17563
6459 -17563 -4486 -39671 -55500 -28991 -14486 -24446 1530 -443 -31253 -59924 -45641 -46529 -45867
6446 -45867 -26651 -61091 -74115 -31817 15627 3383 -23568 -29798 -29828 -12914 22298 7363 7673
6433 7673 5637 8235 -10058 -51010 -41650 -38382 -19302 16203 4535 -23775 -15591 3021 -9665
6420 -9665 10186 19244 10622 37104 47994 17967 10710 15503 24724 14084 16474 32467 10149
6407 10149 3620 23786 34223 26518 15735 45569 37022 43114 37567 -5806 -4120 25475 35789
6394 35789 56975 55133 21638 9202 26629 31520 65690 58405 71527 77506 40605 37119 68118
6381 68118 79651 63953 48875 45217 88418 85802 63351 60951 67449 67711 96651 81545 92161
6368 92161 98120 81465 108612 110797 108490 112526 117935 131615 152800 162242 141669 156967 163703
6355 163703 158828 158889 176224 174246 189494 202401 203999 222891 241805 214485 213424 245970 288512
6342 288512 319720 324310 315371 270376 307686 342031 365880 388462 410351 423714 441548 443129
6330 443129 464668 473694 512308 522284 551054 584668 617607 606075 598481 620753 676315 699714
6318 699714 704693 772348 840548 880755 852726 910863 940171 958782 987984 997921 1006948 1038182
6306 1038182 1018628 1009171 1026581 971967 950201 968387 910791 884372 881326 847129 804834 759783
6294 759783 735789 704627 654859 634212 611626 581899 538334 517379 463900 434818 414221 383609
6282 383609 405041 386434 356155 341091 311334 289976 269207 246866 235260 208827 182893 197749
6270 197749 199983 188891 190161 175828 123388 146363 149252 161485 175215 170573 137954 122441
6258 122441 128078 117177 104484 96956 80017 77564 91194 67134 82762 95163 78172 86896
6246 86896 50985 9269 26071 54665 39046 26806 61037 67101 88163 109394 86492 74500
6234 74500 56611 15892 45528 46968 16705 1745 20717 54036 47130 44163 -3503 -24822
6222 -24822 -7345 -5819 -5676 -23551 -38008 -27574 -11856 16208 16249 2280 24259 8867 1891
6209 1891 19474 27319 -9288 -5123 12502 11334 -10813 -25524 -40555 -26070 -50011 -49292 -46274
6196 -46274 -33154 -51966 -70822 -50820 -11013 -6307 -20690 -23242 -50399 -54859 -72646 -47438
6184 -47438 6979 -11355 2497 8323 -10028 -15832 -36128 -29223 -29805 -54775 -51520 -35521 -29939
6171 -29939 -48432 -55614 -48914 -46287 -32092 -10938 -21024 -23051 -44211 -39548 -14806 -31654 -2045
6158 -2045 4705 20763 21205 -21229 -26957 -35889 -50876 -51638 -34343 -18536 11758 1248 -37344
6145 -37344 -24561 -32790 -10956 -17351 -32954 -18822 -25906 -26414 -42830 -65478 -64755 -24496 -4990
6132 -4990 -17666 -59118 -31412 -22568 -23222 -15127 -13989 -33137 -37147 -54581 -28860 -15481 -10082
6119 -10082 -28787 -68847 -41133 -28461 -12112 -18738 -20383 -34926 -46442 -70682 -40129 -36837
6107 -36837 -50654 -53113 -51018 -44937 -7117 -43196 -43637 -38123 -50456 -64106 -41334 -36138 -22229
6094 -22229 -15196 466 -1808 17300 28159 50236 41990 40451 71206 83382 54925 92143 121967
6081 121967 144269 143440 154763 132995 121678 89087 59991 31713 30078 41417 41734 47671 -5603
6068 -5603 30747 30270 66307 77844 85603 58485 70512 76850 64831 136229 141295 125952 155788
6055 155788 178978 161195 170347 221624 259448 277115 264228 252690 197438 195870 186583 136893
6043 136893 121690 111897 72916 59308 58325 65815 8951 725 35877 46251 55925 45125 28196
6030 28196 45264 2185 8341 21199 28411 49542 74870 82578 80259 79629 113510 149599 154523
6017 154523 111832 99259 78872 43837 38735 11452 -15626 -17175 -11923 -11860 6489 -117 -22924
6004 -22924 -14144 -6215 -29625 -32941 -41326 -15661 -10405 -21562 -27142 -42878 -5088 -3438 -15850
5991 -15850 38534 4493 -24217 -47600 -53706 -30957 14965 33961 17510 -15171 -22784 14929
5979 14929 35466 369 -17085 -23065 -51521 -42514 -53463 -62983 -33354 -22431 -33998 -55074
5967 -55074 -17759 22212 13465 14130 -10363 -6746 -48000 -62280 -59411 -28246 -33926 -61121 -59818
5954 -59818 -24062 -8878 -21267 -25997 -12119 -30259 -60758 -41285 -39993 -32547 -26233 -27600 -27189
5941 -27189 -26372 -20560 -17412 -24601 -20323 -48702 -29338 -20080 -7823 -29242 -44990 -45453 -25744 -8374
5927 -8374 -36797 -49418 -49217 -30018 -17805 -14416 -30995 -39522 -31200 -22975 -49944 -51190 -21013
5914 -21013 18227 5432 -13811 7889 17736 7345 -39161 -49408 -65771 -48674 -55579 -68746
5902 -68746 -50123 -24082 5002 -4156 -31594 -28681 -4535 -32243 -50794 -16401 -14404 2728
5890 2728 29433 -17517 -41838 -41598 -58619 -39011 -36170 -53086 -34029 -44418 -49010 -29066 -64049
5877 -64049 -37721 -11704 14993 39275 -7746 8022 1461 -10491 16739 -17958 -12141 24377
5865 24377 54483 48714 24692 32544 32735 20956 580 14948 7667 -14251 4070 12516 65880
5852 65880 28075 12644 6115 30320 21811 24277 13196 -3185 -4483 -32469 -6750 7173 -40313
5839 -40313 -53542 -12516 10880 5367 -10376 -13475 -20434 -22502 -16812 -6095 -28802 -51509 -58444
5826 -58444 -19003 -23176 -14080 -34975 -5986 -51267 -56211 -63326 -47157 -13333 10960 8891 -6632
5813 -6632 -33144 -26534 11064 -18037 11008 41262 20314 -18189 -12688 2302 -40557 -25996
5801 -25996 -35959 -40429 -37498 -31626 -31287 17626 2443 -13935 -8733 -24052 6681 28378 30214
5788 30214 -10453 -31750 -16233 -4932 -31294 -33199 -11193 -3878 -20315 -103 3910 -16622
5776 -16622 -21635 -25394 -38984 -7643 -2085 3861 -7273 -37798 -41397 -3522 25702 12829 19421
5763 19421 13157 17907 -13113 26130 40490 5792 1618 -14240 -11314 -6033 20989 5759 16875
5750 16875 -758 -34171 -5840 -10243 -41607 862 -13828 -16789 -13716 -8508 -28050 -5697 -3061
5737 -3061 -8645 -17453 -34267 50 1565 11302 5301 -50644 -24512 -8702 -3566 3333 1280 -33521
5723 -33521 -20387 -22184 -23052 -130 10195 -42216 -74185 -43447 -39842 -49422 -44385 24929 17324
5710 17324 20246 170 -10290 -22495 4698 -22961 -24919 4654 -8619 20349 24083 5439
5698 5439 -47557 -51300 -8163 -1794 -9528 -1557 24016 -12048 -20870 -23360 -31951 -31234 -38647 -31478
5684 -31478 -17409 -25761 -22307 -38799 -39804 -11222 -45327 -39262 -5056 -5195 -9433 -408 3415 -23853
5670 -23853 -16897 7636 15662 -13240 -4985 12850 27746 25324 2169 1975 -15711 -33107 -34044
5657 -34044 -32410 -16693 -13127 -21296 -19415 -3349 -10609 -21818 -21687 -1387 13766 24832 103
5644 103 1892 23299 23183 38360 54101 7671 -15078 2127 7776 65280 45317 47336 43517
5631 43517 52587 13883 -26593 -13608 -1595 24452 40274 19475 10426 22862 33867 18933
5619 18933 16665 -2329 26279 55116 60847 62090 32079 25058 8044 16877 41501 46517 52405
5606 52405 45879 36134 33123 9211 8303 21695 -6707 -17714 -16967 27677 29595 22655 32968 5945
5592 5945 -18879 27199 50800 28558 34562 39203 40127 29761 19972 23524 53627 27009 46911
5579 46911 37147 44899 59467 76256 66952 49989 40392 53738 51026 86051 60312 52333 61060
5566 61060 24083 30430 2443 12515 15804 42020 57301 50615 59686 58008 69353 89126 74887
5553 74887 34739 71203 74360 62114 51798 35389 58732 70032 69906 72301 80138 85716 99321
5540 99321 106802 81353 84620 111031 133852 130964 60852 73284 68452 63898 69385 43955 29127
5527 29127 55055 75395 66592 43367 43696 76614 89312 83425 89672 75345 46337 54900 58472
5514 58472 62392 39295 20760 42308 46757 42416 58950 65301 28136 14197 50360 73556 71685
5501 71685 49046 52498 75183 42544 71198 69680 50250 30736 11884 42858 60777 43383
5489 43383 45544 36761 49527 36026 17839 26911 25629 11873 9559 57191 67686 81141 89655
5476 89655 64166 54591 29917 11372 25143 32478 22600 54439 51856 50020 39521 30924 32183
5463 32183 21189 52508 70623 58806 24278 44377 36849 36902 32206 31009 24528 33123 44058
5450 44058 60267 29974 38868 24451 18861 38123 46644 38039 37547 3780 -16910 22106 27522
5437 27522 35447 44284 5418 27745 53571 72157 91478 86657 76990 64624 74131 63791 60745
5424 60745 62702 25857 24034 44343 40099 37788 51835 109317 79622 71425 51484 40409 32790
5411 32790 42132 52367 58135 58867 73638 54250 53683 76931 53551 87294 74974 62726 71906
5398 71906 46966 51886 44580 35273 49602 53955 58139 44170 39140 18319 15233 62582 58876
5385 58876 75866 69946 73681 88166 75208 66335 44310 20405 -23562 1353 40124 2949
5373 2949 13698 9194 34550 76939 84463 38413 38126 82512 66636 68178 65553 51919 40417
5360 40417 41915 68102 61137 47498 86779 61602 33619 54442 51855 39376 23166 24423 33993
5347 33993 51499 39663 27758 18993 5040 38250 23970 33928 55656 40150 50219 57327
5335 57327 68286 54826 47859 86994 60802 56601 31770 7876 24539 8313 29717 76901
5323 76901 61839 63581 85609 65397 27778 62744 65714 51334 64244 45865 35253 51153
5311 51153 73382 95474 52816 46732 57614 70878 74582 72536 79206 63290 81997 34516 39050
5298 39050 56561 88601 93231 100820 85184 71471 80876 58316 56319 53272 63891 79305 76045
5285 76045 70385 77712 89605 79933 55989 50074 49031 32776 36388 30905 55680 53146 79578
5272 79578 76063 50698 55553 73098 65776 62060 75499 80412 120348 109968 88869 74122 72274
5259 72274 71174 80944 104857 134103 127315 115307 109070 92137 77732 112956 99561 118415 133738
5246 133738 136008 99759 60760 87162 105105 93614 91356 83120 86191 96723 110812 100026
5234 100026 106404 123002 84735 81730 91048 84520 84693 110690 77746 36418 67627 75094 75897
5221 75897 94407 93665 70176 81030 82323 66296 98237 86605 70303 47799 86615 102018
5209 102018 100785 117325 112885 102779 68547 73873 88515 93085 96893 110451 83658 82360 65501
5196 65501 65722 97602 72493 70548 65067 79553 101208 78499 91449 84995 68813 72771 95117
5183 95117 101842 99300 131670 117489 108030 98089 122466 97054 84324 101257 112253 99500 104227
5170 104227 129059 114751 112572 124287 106970 147117 155771 123724 135588 166310 148637 145328
5158 145328 167382 182344 173104 138976 120218 115714 144584 120024 106168 131759 123180 87878
5146 87878 104105 126422 109039 112271 102634 124014 137596 164104 125988 89988 130567 136943
5134 136943 121040 111819 125411 109281 108756 136875 161489 149912 175316 195804 182807 157237
5122 157237 140955 143782 143036 149943 168100 145048 127611 128025 147725 152468 174238 171766 142388
5109 142388 150748 176739 158497 171140 173537 150462 156133 166031 155228 149019 167742 185386 191872
5096 191872 194061 182634 171846 150142 156938 169052 183198 172426 200761 189612 176417 188128
5084 188128 149158 173985 174211 196340 193608 195814 206276 206768 216650 224698 231698 244709 233950
5071 233950 212137 205405 206153 180360 186891 227068 249302 258642 242537 226886 226318 216198 199233
5058 199233 213640 209634 243386 243667 236862 217166 235957 239644 221799 280043 279473 263260 255362
5045 255362 247745 268779 268691 260029 266032 276947 271925 235275 241266 251907 232657 256919 269609
5032 269609 246776 257169 264437 273609 267157 275609 279331 292756 288919 280607 296242 329808 318438
5019 318438 296771 306608 321760 307636 263964 270837 301329 295509 314320 313171 271698 255840
5007 255840 263003 275086 297281 318033 312812 342157 315440 290575 309439 300284 316657 317006 306326
4994 306326 322977 329268 316228 308973 310066 314347 309525 312486 331174 372714 391434 379312 371331
4981 371331 357737 365612 366800 368341 435646 447488 411196 377091 372890 363618 389340 424658 405220
4968 405220 444979 436231 428373 413814 405768 425304 420678 432646 443790 425554 422559 416312 396639
4955 396639 438262 450862 475938 441766 433113 440404 448819 452618 447739 444812 445264 455385 454241
4942 454241 445563 436923 458275 474173 494330 521288 518987 511010 521684 506151 488265 488583 517665
4929 517665 508104 519291 525489 530371 520054 533076 571564 601157 592042 605578 551888 571446
4917 571446 570069 564469 580359 581829 600768 586253 596741 602536 612121 572686 598525 629273 623412
4904 623412 627086 621895 602420 602202 653038 658038 647455 678592 674768 691309 670968 680864 692128
4891 692128 704943 716924 752823 761554 750450 779439 760213 755669 731147 740970 787784 825110
4879 825110 817365 804913 810712 857235 876671 916003 957028 957800 972260 957120 926298 926376 922284
4866 922284 915409 924440 958728 928594 927043 893772 871293 885869 910155 927410 913641 961125
4854 961125 949542 898217 933003 959977 963590 944565 908214 944129 984246 979456 1008013 1031911
4842 1031911 1057303 1090554 1077230 1070217 1021838 1020833 1032203 1070795 1068920 1075404 1085760 1061713
4830 1061713 1052606 1067822 1064483 1107764 1107769 1097502 1102087 1078326 1053161 1079464 1111484 1111652 1110663 1113378
4816 1113378 1091664 1106161 1134962 1151642 1162190 1178925 1176142 1147384 1142571 1152565 1201794 1197852
4804 1197852 1217218 1211860 1212352 1248474 1240502 1241114 1253543 1270282 1302228 1292621 1292136 1255472 1254587 1301443
4790 1301443 1322302 1281946 1293887 1349714 1346596 1385409 1395385 1403231 1417614 1438987 1442609 1464169
4778 1464169 1463362 1476735 1479889 1496473 1492161 1515586 1515079 1551631 1567113 1587098 1607383 1613861 1628962
4765 1628962 1647191 1669101 1701813 1737477 1740648 1805160 1796871 1808720 1804004 1800453 1821237 1840658
4753 1840658 1855421 1880937 1894571 1902618 1906557 1943957 1962836 1973682 1986196 2017591 2001233 2049898
4741 2049898 2043338 2035337 2082498 2101142 2109372 2111146 2151737 2177230 2208106 2240280 2248025 2243149 2250831
4728 2250831 2275682 2293672 2355016 2398685 2406472 2428233 2442859 2470371 2485155 2503767 2521958 2507070
4716 2507070 2545050 2589063 2581403 2612397 2646151 2664343 2705952 2740884 2770283 2797460 2811461 2839913
4704 2839913 2884640 2938410 2967593 3016236 3075331 3092552 3137321 3175874 3212294 3282577 3296126
4693 3296126 3296877 3381683 3416692 3432516 3442396 3492931 3539856 3549776 3574439 3608584 3612634 3609394 3643573
4680 3643573 3707316 3720154 3750997 3773630 3791930 3832028 3870593 3929407 3967233 4025621 4096155
4669 4096155 4119721 4147331 4174136 4221543 4245624 4262302 4305614 4332509 4382284 4406576 4443059
4658 4443059 4488809 4568371 4592657 4633869 4711819 4765827 4820715 4878156 4952224 5059263 5101903
4647 5101903 5192256 5285770 5381868 5440791 5551795 5675021 5797276 5925404 6049785 6113825
4637 6113825 6245214 6373992 6525635 6626812 6766177 6885458 7017709 7179358 7364631 7595494
4627 7595494 7794270 8043527 8319837 8567577 8851924 9212395 9589933 9983716 10439743 10955947
4617 10955947 11465615 12041684 12698369 13370419 14051608 14766544 15413489 15977292 16510979
4608 16510979 17067146 17627658 18237470 18795769 19271267 19626758 19803587 19882599 19873054 19807333
4598 19807333 19829906 19984023 20275067 20670343 21283879 22004906 22847176 23711206 24538192 25341741
4588 25341741 26161129 27059301 27978620 29011772 30006636 30803337 31417652 31824399 32118044
4579 32118044 32405408 32677976 32802664 32769613 32436695 31803570 31011788 30135041 29186586 28342675
4569 28342675 27650040 27142550 26813595 26645116 26513401 26477124 26494037 26627195 26832773 27147759
4559 27147759 27576065 28078581 28716292 29412311 30145674 30933134 31693336 32339271 32775055
4550 32775055 32964774 32850509 32412436 31670375 30877400 30239469 29709191 29255558 28526932
4541 28526932 27492795 26349726 25203867 24210376 23397459 22624739 21836145 21094644 20404896
4532 20404896 19752823 19230673 18800871 18553203 18490308 18480999 18487086 18474968 18342519 18084616
4522 18084616 17579518 16968943 16335371 15634646 14914292 14188263 13465016 12675898 11872281
4513 11872281 11057007 10266093 9543237 8924110 8471649 8042732 7680341 7294773 6924867
4504 6924867 6601553 6341205 6099285 5904706 5705583 5542238 5429442 5269504 5106885 4951436
4494 4951436 4857482 4772378 4643035 4527663 4473692 4438296 4359372 4299764 4225077 4140056 4081854
4483 4081854 4064054 4030568 3964652 3879238 3790850 3747420 3716679 3653975 3564704 3534845 3488708
4472 3488708 3439771 3410005 3380164 3318645 3271931 3248177 3236804 3203746 3090793 3044061 3022573
4461 3022573 3021346 2991341 2957155 2896558 2847891 2824650 2773132 2734334 2694327 2666060 2604992 2587994
4449 2587994 2608102 2558655 2602162 2583936 2553322 2543356 2510756 2480238 2473692 2473192 2432951 2406058
4437 2406058 2394888 2440505 2450233 2435225 2427083 2437038 2416778 2404941 2386094 2369150 2351844 2313997
4425 2313997 2263896 2278074 2289402 2282893 2293336 2324424 2324044 2316918 2310083 2273680 2263327 2217032
4413 2217032 2190371 2194799 2190177 2222208 2238648 2247445 2229731 2244599 2237506 2210459 2165546 2170869
4401 2170869 2149792 2140893 2116141 2067460 2073832 2109998 2071921 2083253 2083369 2107283 2086282 2032062
4389 2032062 2021965 2032093 2039325 2063181 2065449 2086873 2104818 2073968 2071139 2050547 2063743 2034612
4377 2034612 2018524 2017015 1998088 1977947 1997086 1991745 1978293 1974911 1988306 2014097 1997671 1987885
4365 1987885 1993803 1994694 1980522 1962958 2006064 2011060 1980144 1961594 1974115 1962129 1938410 1917553
4353 1917553 1915952 1874146 1861959 1854285 1802135 1739928 1727684 1741828 1707781 1714393 1691413 1676963
4341 1676963 1680682 1675915 1679073 1690330 1650169 1628820 1648969 1611732 1569875 1595412 1654604 1679077
4329 1679077 1698097 1663581 1680443 1683245 1689490 1708364 1670857 1683953 1707829 1714522 1733034 1694621
4317 1694621 1680894 1627032 1641336 1693999 1687512 1673731 1680442 1697369 1682251 1646697 1645144 1616683
4305 1616683 1652309 1678545 1690889 1694978 1699733 1700923 1694867 1721602 1768323 1764428 1775240 1786882
4293 1786882 1779796 1785817 1785589 1774493 1728521 1745002 1784266 1786082 1737467 1767214 1761848 1748910 1770498
4280 1770498 1764260 1730343 1757397 1812054 1805690 1839109 1856394 1849642 1895869 1889166 1907571 1976919
4268 1976919 2023401 2029449 2053986 2099429 2121685 2101212 2134974 2164015 2189664 2210670 2226654 2257216
4256 2257216 2275008 2269477 2262958 2277291 2323555 2333232 2343960 2345818 2373448 2401405 2386944 2376932
4244 2376932 2396419 2375716 2375867 2383413 2403033 2416980 2401932 2404696 2432097 2419210 2423768 2467941
4232 2467941 2460705 2442905 2455499 2453359 2478511 2481521 2462700 2462323 2487111 2485595 2480754 2482810 2461850
4219 2461850 2485221 2466532 2488578 2468806 2443993 2448611 2438586 2401324 2415555 2441629 2436984 2400809
4207 2400809 2403476 2386871 2434641 2430301 2433116 2410976 2436242 2485922 2504882 2530761 2529145 2536237
4195 2536237 2560026 2585650 2587768 2538565 2530872 2558805 2565957 2536166 2531911 2556756 2528653 2520781
4183 2520781 2524431 2552979 2523004 2527653 2545459 2603210 2590966 2593975 2573722 2561653 2580991 2567603
4171 2567603 2582651 2596923 2618030 2599449 2594868 2644666 2658327 2672416 2676057 2643585 2684768 2694679
4159 2694679 2666882 2708502 2745186 2791499 2814376 2845815 2838986 2828836 2858058 2868534 2850458 2833548
4147 2833548 2861469 2844753 2850272 2913248 2919976 2926116 2918456 2924870 2961489 2950315 2947204 2958022 2952398
4134 2952398 2953187 2917280 2918705 2964181 2978514 2987709 2976250 2971298 2974524 2949141 2942688 2948024 2954730
4121 2954730 2957890 2954936 2949717 2954405 2981785 3001707 3022697 3028166 3046069 3054714 3037124 3028701 3022319
4108 3022319 3050807 3057083 3062970 3070802 3095767 3114973 3086914 3077459 3091879 3135359 3170463 3162103
4096 3162103 3140044 3140164 3169858 3199025 3211322 3201542 3201187 3241128 3239241 3257820 3260655 3319963 3322521
4083 3322521 3326816 3350128 3322537 3289408 3318225 3354997 3392657 3381708 3406883 3404379 3424290 3407613
4071 3407613 3419573 3498516 3477722 3473766 3543713 3560320 3544925 3559391 3608052 3645246 3671467 3703171
4059 3703171 3756275 3813306 3853386 3882973 3894647 3947391 3989022 4063071 4082544 4134295 4139038 4132700
4047 4132700 4132261 4126594 4146213 4141498 4124932 4127718 4139076 4140023 4182931 4224749 4220839 4243738 4298803
4034 4298803 4359209 4398143 4430696 4447848 4530247 4567427 4606876 4671064 4808188 4873598 4909442
4023 4909442 4964778 5045881 5067329 5119164 5176296 5198846 5218426 5242129 5244910 5244760 5245578 5239286 5276655
4010 5276655 5288203 5321157 5311609 5329546 5327333 5336494 5368086 5394057 5426855 5451038 5485292 5562228
3998 5562228 5597758 5617749 5658996 5713449 5797555 5865857 5921821 5969303 6012624 6099897 6207821
3987 6207821 6310371 6391518 6492931 6562420 6607831 6683276 6742083 6801891 6863837 6911196 7010978
3976 7010978 7076446 7175379 7239097 7301650 7402249 7478942 7516584 7607548 7691275 7741663 7799011
3965 7799011 7855183 7888616 7954315 8052137 8122000 8183529 8217338 8268832 8363942 8427082 8481496
3954 8481496 8483309 8475970 8437232 8439992 8447386 8419762 8473546 8476074 8498207 8537248 8578821 8631175
3942 8631175 8713690 8804118 8907624 9026171 9173142 9306938 9436697 9577746 9720190 9895836
3932 9895836 10083029 10255840 10440000 10664552 10925886 11131912 11337752 11527030 11688834 11802294
3922 11802294 11922192 12016106 12123247 12229407 12380069 12513357 12655249 12839045 13053309 13310526
3912 13310526 13578411 13868023 14140229 14322511 14462715 14550515 14623444 14753282 14910471 15101733
3902 15101733 15297106 15507662 15708749 15943155 16208693 16507300 16820101 17143892 17493777
3893 17493777 17900080 18322390 18698191 18967623 19235463 19517608 19884349 20362362 21016194
3884 21016194 21782941 22594871 23337769 23914745 24373011 24650624 24867654 25141014 25474969
3875 25474969 25828750 26133624 26427138 26841633 27393581 28095720 28892285 29573067 30225373
3866 30225373 30986877 31904649 32933788 34163861 35535230 37044190 38511139 39670852
3858 39670852 40450059 40728301 40676353 40542800 40473467 40439244 40472258 40656977 40815468 40979132
3848 40979132 41252494 41433372 41212645 40775511 40514192 40461708 40675805 40874102 40656545 40032587
3838 40032587 39461236 39000875 38548426 38188233 37926071 37723624 37460768 37157309 36737824
3829 36737824 35791326 34286938 32731757 31329656 30098256 29010855 28097660 27410936 26906741
3820 26906741 26456173 26002141 25525759 24938175 24335825 23844231 23462959 23066574 22680756
3811 22680756 22305701 21944462 21615521 21268679 20827958 20292871 19647359 18980848 18385850
3802 18385850 17963658 17636721 17355812 17136131 16943394 16741861 16442439 16085385 15779621
3793 15779621 15524239 15330744 15197893 15086276 15021667 14978358 14988133 14964745 14969638 14984084 14958664
3782 14958664 14933593 14908130 14825816 14702424 14560571 14347816 14137583 13943552 13754363 13630280
3772 13630280 13545520 13483350 13441341 13377988 13351378 13327174 13267359 13242184 13213925 13158319 13123804
3761 13123804 13079361 13032650 12986215 12905891 12865525 12877455 12888240 12921007 12944281 12944434 12956983 12969106
3749 12969106 12972011 12969742 13049068 13091967 13144529 13219896 13284436 13318587 13387246 13481555 13573339 13677522
3737 13677522 13806192 13929274 14041175 14086729 14121452 14176305 14282691 14349151 14357943 14440054 14511270
3726 14511270 14616365 14693232 14780160 14839265 14949709 15055097 15129099 15183946 15261689 15311983 15384960
3715 15384960 15423208 15423191 15461082 15478080 15519318 15545587 15541698 15554170 15555819 15602969 15616284 15591529
3703 15591529 15579287 15565427 15536111 15505059 15519607 15530733 15543442 15570871 15592891 15625780 15637457
3692 15637457 15662031 15695804 15730721 15718416 15738785 15783557 15824426 15908655 15969146 16019689 16070417
3681 16070417 16113921 16180018 16257277 16359610 16457988 16556246 16694603 16780828 16869307 16931732 16994986
3670 16994986 17013131 17045894 17041051 17030676 17037352 16999708 16973621 16934483 16910094 16920034 16923742 16901944
3658 16901944 16948589 16971025 16982252 17006228 17018495 17034520 17028462 17062222 17055702 17001089 16931005 16894374
3646 16894374 16826720 16771916 16722453 16633607 16577919 16523212 16470406 16417371 16364168 16328530 16262216
3635 16262216 16220553 16141535 16052364 15959810 15931001 15870801 15782185 15760316 15718829 15676728 15656960
3624 15656960 15598605 15578910 15526446 15483340 15456569 15405914 15407586 15420076 15414033 15403509 15396059 15393998
3612 15393998 15417065 15409863 15415010 15405685 15460978 15556591 15588082 15615397 15649943 15679681 15719799 15755422
3600 15755422 15817515 15878043 15940066 16001217 16015569 16052149 16116519 16199026 16257119 16317822 16347478
3589 16347478 16380256 16472024 16505543 16537088 16595081 16613916 16591484 16595416 16613810 16649411 16692082
3578 16692082 16765674 16816732 16879388 16931342 16999844 17048309 17142175 17211323 17319384 17418670 17505265
3567 17505265 17616369 17733155 17780532 17871065 17936525 17996430 18095339 18177914 18263360 18342813 18434711
3556 18434711 18424449 18483127 18519116 18517699 18544041 18566412 18576894 18625649 18650244 18671773 18721291
3545 18721291 18776178 18868768 18925451 18992461 19090771 19149323 19221074 19329029 19416441 19516427 19597864
3534 19597864 19700679 19803436 19892544 19993127 20049048 20137071 20194573 20182908 20272817 20341662 20321933
3523 20321933 20317086 20300773 20291268 20294138 20295493 20293200 20320921 20324696 20400625 20461957 20484182 20555902
3511 20555902 20647418 20674503 20796083 20893926 20992576 21104907 21203097 21335772 21465603 21569121
3501 21569121 21683316 21769019 21841573 21940291 22019492 22104765 22150589 22200356 22245885 22278495 22314866
3490 22314866 22341799 22408066 22469261 22540284 22634972 22746462 22849128 22959532 23054764 23124420 23278552
3479 23278552 23424818 23524249 23626321 23777404 23892031 24014339 24140854 24290439 24429736 24592131
3469 24592131 24766899 24926627 25033047 25182785 25325695 25454556 25546649 25624702 25756553 25862187
3459 25862187 25988817 26093170 26238861 26394931 26483835 26606410 26740509 26873184 27051575 27210049
3449 27210049 27407098 27619668 27819010 28076438 28319738 28558812 28796419 29027186 29274677
3440 29274677 29516250 29736196 29989055 30274421 30552553 30794326 31052737 31330189 31643098
3431 31643098 31943405 32218134 32532404 32827366 33185209 33484356 33780242 34098806 34428736
3422 34428736 34762927 35063907 35405024 35759040 36092447 36428531 36783422 37160093 37523259
3413 37523259 37869012 38243128 38618223 39046141 39459459 39869651 40310096 40704641 41122056
3404 41122056 41596524 42058382 42494701 42996201 43482630 43997188 44518376 45006855 45436076
3395 45436076 45869936 46354776 46818569 47282564 47751889 48215857 48695956 49205111 49743694
3386 49743694 50286065 50857719 51442842 52040593 52645431 53278470 53934175 54587982 55264125
3377 55264125 55903283 56575968 57239276 57896984 58571325 59281039 59979601 60742636 61522369
3368 61522369 62316846 63182805 64053188 64922671 65760532 66559689 67303579 68028058 68796689
3359 68796689 69584203 70429786 71306419 72277432 73288641 74355548 75498096 76702825 77980206
3350 77980206 79284664 80610880 82003476 83512788 85025096 86531446 88097152 89686262
3342 89686262 91252044 92924065 94630739 96339104 98047301 99812619 101636585 103511291
3334 103511291 105455863 107425026 109437581 111496976 113597079 115795695 118040745 120404442
3326 120404442 122871393 125414599 128090183 130909171 133887848 137040660 140368622 143892587
3318 143892587 147702468 151728087 156050022 160705840 165791976 171320455 177296819 183776079
3310 183776079 190763961 198286712 206277761 214768566 223878951 233704570 244245999 255457611
3302 255457611 267264952 279579808 292205482 305021953 317691470 329868191 340993746
3295 340993746 350348759 357115750 360511676 359858126 354850096 345754217 333244082 318614356
3287 318614356 303162405 288001774 273788764 260741229 248907372 238242836 228698919
3280 228698919 220180882 212472170 205542947 199296722 193646383 188523026 183789992 179438968
3272 179438968 175449698 171766439 168313775 165055689 161942322 158929556 156043327 153225815
3264 153225815 150454430 147682954 144898765 142115585 139327335 136491511 133623041 130716603
3256 130716603 127835474 124927528 122063960 119225665 116445325 113747742 111129272 108630896
3248 108630896 106143235 103782909 101502354 99319906 97269009 95357535 93510780 91729113
3240 91729113 90041254 88440857 86904039 85458301 84027960 82685009 81419279 80160331
3232 80160331 78953974 77765935 76627873 75485956 74392559 73326866 72299683 71317564
3224 71317564 70369407 69425205 68488274 67597301 66773737 65969553 65198758 64426978 63654829
3215 63654829 62918050 62226142 61555931 60870829 60260743 59631425 59029130 58440175 57883641
3206 57883641 57357984 56812230 56332096 55830821 55323524 54821743 54316523 53854277 53392293
3197 53392293 52920657 52465076 52005526 51535462 51080488 50622549 50162341 49683951 49273553
3188 49273553 48891665 48442101 48027957 47590268 47179219 46798406 46444083 46083850 45716167
3179 45716167 45364860 44982028 44633369 44286541 43962905 43608139 43293065 43014895 42687225
3170 42687225 42401753 42201830 41966813 41733267 41513538 41279048 41051495 40853338 40612833
3161 40612833 40395373 40209226 39993594 39757086 39574395 39393314 39223040 39006031 38803980
3152 38803980 38636067 38473244 38321071 38141893 37969909 37809665 37702104 37523502 37338254
3143 37338254 37201301 37106702 37016626 36875575 36746832 36663777 36577087 36502025 36398681 36283514
3133 36283514 36161237 36031907 35886343 35693651 35546172 35376916 35183996 35016781 34807337
3124 34807337 34611721 34389032 34192806 33956289 33726613 33528326 33336798 33125422 32911884
3115 32911884 32726436 32547528 32338539 32159565 31993477 31856304 31739523 31626829 31492060
3106 31492060 31381850 31299480 31180717 31072826 30935845 30832415 30742294 30601868 30453552 30336883
3096 30336883 30189604 30032195 29842548 29661026 29440180 29277141 29078136 28861788 28652453
3087 28652453 28439028 28291645 28120384 27948996 27789377 27665260 27567253 27474717 27393316 27333178
3077 27333178 27272547 27223400 27159640 27111010 27079254 27061975 27085655 27092499 27085323 27132469 27160157 27221482
3065 27221482 27296301 27342410 27399858 27469815 27537206 27615668 27713242 27780422 27823565 27871569 27954359
3054 27954359 28066059 28192935 28286713 28366353 28542364 28712254 28905974 29130674 29332059 29520399
3044 29520399 29705880 29904638 30097230 30247421 30404417 30610603 30829717 31026856 31247580
3035 31247580 31491575 31772109 32056924 32358384 32737123 33046362 33433193 33825155 34223074
3026 34223074 34582634 34871893 35185697 35500256 35810732 36066459 36317259 36592403 36887566
3017 36887566 37214759 37553078 37889798 38271976 38667664 39031095 39381308 39792504 40146783
3008 40146783 40519971 40998883 41538053 42069191 42623887 43315114 44009581 44779319 45610379
2999 45610379 46489419 47423345 48429063 49441338 50521020 51651784 52848642 54120023
2991 54120023 55430456 56794873 58219866 59731791 61325867 62942265 64555379 66204139
2983 66204139 67819388 69400104 70855215 72188085 73426055 74494327 75429689 76236414
2975 76236414 77006478 77805642 78631798 79542961 80561525 81713786 83000743 84475477 86104222
2966 86104222 87986977 90108640 92461705 95101779 97960614 101044296 104372631 107912820
2958 107912820 111530809 115292819 119130350 122965473 126660935 129889845 132373307 133855710
2950 133855710 134103218 133036739 130754881 127611462 124115362 120760771 117993131 115907124
2942 115907124 114509575 113800137 113747035 114224492 115165247 116588484 118345742 120382705 122651920
2933 122651920 125088933 127574682 129955536 132291905 134509370 136472886 138074953 139168528
2925 139168528 139591258 139197474 137960177 135912884 133283830 130206346 126747418 122979893
2917 122979893 118911381 114802485 110885633 107502655 104690327 102483004 100703270 99359644
2909 99359644 98435586 97852901 97554190 97394917 97273870 97061738 96677813 96000244 95021309
2900 95021309 93651376 91896611 89772560 87340868 84506037 81297616 77919824 74443985
2892 74443985 71054106 67843398 64845513 62092747 59587667 57302819 55195705 53260932
2884 53260932 51488471 49886251 48426259 47104423 45866133 44750433 43739789 42800846
2876 42800846 41937231 41086129 40274510 39449813 38581059 37668865 36729020 35790154 34812706
2867 34812706 33867265 32931489 32027601 31171722 30357989 29599804 28897191 28231341 27537452
2858 27537452 26880389 26294945 25726429 25154950 24595143 24055865 23519259 23011749 22526209
2849 22526209 22096047 21691195 21346300 21000597 20688242 20371464 20097704 19869162 19654125
2840 19654125 19399638 19128319 18883761 18639533 18394151 18136919 17901786 17593660 17272237
2831 17272237 16988510 16634913 16286054 15984668 15641345 15308537 14984352 14622321 14334990
2822 14334990 14064753 13791925 13545367 13305357 13105461 12951648 12763410 12621037 12455262
2813 12455262 12309564 12167113 12010709 11903680 11780147 11637489 11484729 11324085 11112613
2804 11112613 10922544 10698528 10489500 10302302 10124711 9943674 9760363 9563484 9411371
2795 9411371 9249016 9084725 8907333 8743258 8610843 8478158 8331629 8195042 8048721 7934452
2785 7934452 7777165 7675285 7569369 7454061 7325894 7225015 7138315 7045578 6938865 6841474
2775 6841474 6762093 6673780 6590530 6524925 6412750 6307631 6255418 6217956 6164921 6091594 6008474
2764 6008474 5912600 5857298 5802885 5721933 5647455 5588746 5511671 5470622 5394557 5381750 5349601
2753 5349601 5285451 5251317 5223309 5193763 5137997 5080120 5052534 5025376 4964116 4920160 4878612
2742 4878612 4875642 4837558 4784570 4768904 4752664 4717142 4641986 4630737 4591368 4554861 4504256 4478880
2730 4478880 4428148 4375153 4349571 4322630 4279942 4253739 4204499 4170008 4142967 4109914 4104498 4097612
2718 4097612 4079968 4053564 4026208 4003456 4001379 3988958 3949738 3936721 3916783 3939994 3925238 3883618
2706 3883618 3867812 3865440 3829216 3817379 3810984 3806480 3826757 3798965 3729321 3715898 3742769 3729879
2694 3729879 3726641 3691351 3702528 3658758 3635700 3633076 3591549 3584529 3572289 3560546 3567256 3577854
2682 3577854 3604087 3619980 3605472 3565484 3577201 3564220 3572094 3575119 3566828 3579103 3602286 3596922
2670 3596922 3602146 3620677 3628855 3587355 3569285 3585887 3565957 3508142 3480386 3447118 3402095 3354025
2658 3354025 3354631 3350336 3329681 3329722 3270421 3272328 3264536 3291659 3295434 3302582 3331366 3393573 3404297
2645 3404297 3394991 3383147 3330140 3346524 3379599 3336762 3308437 3259599 3184579 3186207 3137230 3083902
2633 3083902 3056642 3007768 2999310 2982459 2941050 2904972 2867560 2852864 2837346 2851284 2847090 2814931
2621 2814931 2843144 2823347 2810488 2822257 2770195 2738817 2697293 2661773 2638752 2589649 2588180 2564621
2609 2564621 2507971 2477974 2462737 2421873 2351262 2310660 2248423 2249362 2224032 2215257 2197479 2119485
2597 2119485 2107921 2092142 2071334 2073653 2069234 2065583 2024590 1996302 1974364 1950643 1921651 1902916
2585 1902916 1909745 1908103 1907927 1879902 1837710 1826949 1803451 1780655 1787641 1799602 1787974 1770949
2573 1770949 1769761 1751768 1723631 1701794 1660091 1642536 1613575 1610200 1582902 1564859 1551576 1514706
2561 1514706 1513073 1486928 1494043 1461592 1446488 1456539 1440180 1418146 1406044 1369196 1361797 1370657
2549 1370657 1370239 1368816 1343916 1305034 1273708 1220284 1241396 1237310 1218737 1249802 1233066 1183649
2537 1183649 1202447 1200615 1174906 1189395 1209505 1167963 1163122 1165245 1163473 1149817 1134218 1147962
2525 1147962 1140510 1132560 1112647 1094118 1097334 1078080 1065107 1056872 1074583 1062664 1008913 1031159
2513 1031159 1001054 972088 980369 1015127 1004612 995980 945396 933396 930353 928384 903435 881788
2501 881788 864426 871122 877072 860536 839765 799024 804264 804351 795679 777893 761388 752813 747938
2488 747938 737370 724623 693226 705591 708886 703188 709062 699833 689558 695279 683645 652292 648747
2475 648747 617153 583322 584171 610606 640027 619397 600787 597707 599992 601566 603126 581928 564386
2462 564386 569101 579896 609266 584231 562647 563140 554706 526437 532429 530732 511524 522478 526279
2449 526279 491792 467085 465365 467616 490213 474587 444172 439345 465194 467305 441668 457552
2437 457552 463188 428611 458812 420127 368781 387867 376703 394734 409347 421244 400309 407059
2425 407059 421812 414154 405417 427199 436715 427966 426970 423540 407018 369121 348411 329691 340270
2412 340270 337014 346783 353187 366676 371391 340358 327349 330281 299696 302770 288297 306854 327178
2399 327178 310540 296981 280119 245512 239575 270003 290317 265270 249459 254799 271883 305458
2387 305458 304104 294739 265856 284442 273322 245521 239923 227289 248454 260265 273132 268721
2375 268721 259647 257491 211733 181641 217826 213618 205599 196974 241140 258417 234329 243962 222430
2362 222430 233334 224784 207436 194619 200697 191161 219819 257968 261664 244977 221652 242473
2350 242473 242862 211557 208331 240958 256510 223881 212341 218355 183140 217862 226777 173802 200313
2337 200313 206030 202794 199389 204488 175898 171310 177293 199896 192741 186770 157396 166466 209726
2324 209726 181147 167681 200548 203382 180268 172536 182406 215376 218621 211455 175711 188253 177733
2311 177733 163345 192454 160811 207694 236971 205218 204080 198660 202198 180883 168025 175900
2299 175900 177765 195440 182464 178673 195782 188355 191595 186252 228433 234436 218894 208624 200562
2286 200562 183582 168825 162259 185472 188387 171381 184927 190900 164124 177315 223473 217571
2274 217571 224640 233490 201956 172566 191407 219384 242068 232702 231019 222728 216908 213002 210580
2261 210580 219962 248846 234138 244481 255311 240217 266289 249032 246845 229553 276406 294836
2249 294836 306654 315995 309106 296424 267754 277591 283701 288225 273878 288849 276870 285222 315337
2236 315337 326204 293065 295970 297568 304596 338591 298594 263335 270315 275740 246596 303742 330029
2223 330029 336913 322761 316887 302896 314533 343920 350815 354715 340614 320516 309282 340651
2211 340651 348485 349852 373151 333156 351156 358584 354328 388826 414319 440949 470326 458930
2199 458930 474032 503379 532864 551610 589489 593507 597197 629984 628883 671494 690273 731769
2187 731769 745661 771857 782077 800187 865460 902281 937831 996312 1021534 1067706 1129991 1168665
2175 1168665 1204294 1308238 1383623 1436717 1564757 1703084 1840102 1996699 2181195 2343295
2165 2343295 2473271 2681086 2923652 3213915 3559910 3946983 4418145 4956084 5693062 6624712
2155 6624712 7748734 8781612 9711291 10720988 10624351 9411805 7670041 6217806 5182519
2146 5182519 4327731 3656174 3098288 2685269 2358815 2146492 1950601 1809383 1710829 1609796
2136 1609796 1482167 1383035 1275109 1155572 1070211 1003578 919377 901269 843728 791987 745521
2125 745521 694698 669915 647002 636800 592121 550004 545534 538324 533754 518507 489771 466455
2113 466455 479087 455247 428869 437268 413762 378582 391985 355703 360952 335319 348694 352691
2101 352691 328906 322270 284186 284143 284340 288052 304565 299102 282601 268452 290750 241236 205183
2088 205183 180934 202134 214016 224319 218340 216071 216098 198418 199145 179359 172279 157083 160731
2075 160731 144796 171905 155933 159438 180282 162208 147514 164706 151850 125445 152010 133347
2063 133347 149875 159042 147046 141176 112106 111776 116023 114212 117533 96007 93355 115147 98586
2050 98586 100924 91492 123827 172093 174822 122091 117169 111754 96347 110094 118768 95761 85147
2037 85147 83627 115039 84095 68081 115658 97935 83115 42845 50917 49031 28186 27119 48238
2024 48238 55951 52128 57384 71274 78764 67770 50098 45506 19863 22142 46342 34889 43772
2011 43772 79382 80101 69821 62053 14289 31651 46246 23154 39415 49953 31586 25218 23435
1998 23435 41949 42067 48957 63843 71934 49696 38810 45246 16917 13532 31142 20396 23784
1985 23784 27202 34819 38019 22694 26440 24297 33653 16489 28555 45519 38622 1716 20227
1972 20227 26128 1085 -6567 -22196 6634 19882 24752 60673 85594 53074 20363 2510
1960 2510 -16097 -4261 40439 51472 17807 -18267 -38480 -7498 29467 26283 4048 22601
1948 22601 33885 10704 23462 3241 10889 18319 -10371 -15043 -626 15623 21825 12097 1293
1935 1293 15086 28719 12246 5044 21694 48552 17933 11589 19163 43069 68684 67928 60968
1922 60968 47096 60062 38418 37278 12063 1248 8505 26121 22259 2599 -18824 -22439 -18000
1909 -18000 30729 32776 -25132 -22387 -17814 -1380 11671 -8838 -25617 -37981 -17712 22036
1897 22036 30499 12958 37145 19351 31284 28751 51727 79415 51064 72198 68965 91699
1885 91699 97832 138480 111767 72018 44649 40054 20334 22902 -757 1201 423 18767 37405
1872 37405 28576 46209 50843 56916 66779 37457 37808 49066 24699 38404 40614 19742 33832
1859 33832 49069 20454 22496 13477 4386 10868 15548 9516 -10667 5311 33891 19545 20726
1846 20726 34668 35866 19557 -2899 2382 -6710 -30718 -10935 394 24225 7661 3347 -23846
1833 -23846 -5759 20485 34741 361 -14725 9549 10563 -15391 13470 18835 -2939 -44047
1821 -44047 -5990 7981 -5989 5014 26105 33192 13808 6335 21091 37825 6509 21471
1809 21471 26801 27422 -1049 -15252 -38105 -18043 -24621 -47277 -25019 -28097 -36008 -31825 -16306
1796 -16306 1202 4904 15784 2363 32628 -574 -3464 14729 23346 9827 -21193 -43469
1784 -43469 -23062 -19828 -24765 -25017 -9559 -4669 23398 48125 21571 20896 -9342 -20374 -31854
1771 -31854 -14392 1943 -4686 -24520 -293 7779 -13924 -10295 -262 7774 -312 2234 6144
1758 6144 -25659 -28958 18411 11684 -23333 -36787 -44634 -51488 -32188 -6232 -13696 10814 12484
1745 12484 -14996 -9275 -11932 -43884 -35660 -9595 -18650 -20311 -36557 -39351 13210 -232 1535
1732 1535 -11637 -2776 -7343 766 20491 -8375 -14007 -11344 -20963 -11689 -424 -11057 -3111 -15349
1718 -15349 -15904 -2110 14320 -30711 -32790 -25194 -19478 -31073 -24881 -14104 -9029 -25046 -41758
1705 -41758 -20859 -26539 -20946 -6759 -10048 -6070 -22008 -26089 -41161 -31254 -21543 -42929 -40720
1692 -40720 -5755 -5790 -9102 18462 -13758 -40604 -25718 -24704 -34270 -45877 -64888 -45827 -51651
1679 -51651 -45610 -14918 2337 -1339 20593 6871 -50004 -60475 -25477 -29234 -25215 -29994 -37211
1666 -37211 -32576 -45722 -34425 -28627 -8366 -1559 -61018 -53560 -17579 -39627 -18068 -17007 -14385
1653 -14385 -2462 -32038 -49205 -4344 -9287 -34158 -38264 -12170 -12042 -38889 -36899 -31171 -21322
1640 -21322 -24956 -26465 -2048 -18042 -29119 -1052 20754 17022 1063 3109 -9898 -1710 -12963
1627 -12963 -11513 4896 12436 -37073 -8064 -12095 -45621 -18779 -14844 -27230 -3376 -13823 -19497
1614 -19497 -9684 -9943 -7298 6165 13998 -2675 2626 -18451 -6955 -20028 -22063 3629 44845
1601 44845 4844 -8609 3452 -16844 -7119 -7234 6779 13330 -31274 -17778 6023 9059 -23417
1588 -23417 -27370 9629 -18742 -7755 14056 -5315 -35518 -21816 -7056 -16778 -12653 -11773 -16867
1575 -16867 -12829 -19471 4391 3622 -9490 -22662 -16818 7628 17413 48323 57351 13849 -9385
1562 -9385 -12385 -2608 11896 20637 -15804 -20028 -6212 -18636 -6104 -8785 -25248 -24653 -44877
1549 -44877 -30016 -12942 -35821 -57164 -52315 -50375 -8263 5418 6196 10997 3934 -15210 -5097
1536 -5097 13713 -2841 -14187 -38014 -31387 -13951 -18140 -36358 -24520 -6731 10143 1181 -8551
1523 -8551 -12860 -55611 -48245 -900 -17636 -17290 -17661 -21780 -41213 -29868 -27595 -23279 -6590 751
1509 751 -4602 -626 -33758 -30392 6026 -17690 -7214 -27708 -70445 -45563 -32807 -13257 -23184
1496 -23184 -30890 -22835 -162 -7931 26716 29203 7633 -18962 -41664 -8089 -21807 -42586 -32812
1483 -32812 -13948 -31549 -13425 -29290 -46859 -24972 -17848 -4564 -12075 6919 -1059 -36299
1471 -36299 -29005 -4797 -15066 6826 16307 13969 -2249 -11799 -1411 -19041 -27433 -13830 -16281
1458 -16281 -38161 -45792 -31053 -5891 1201 -31627 -14347 -41008 -44038 -30277 -36247 -29900 -23338
1445 -23338 -31670 -26371 -4472 -7567 -16825 -26335 -7904 -10731 -8820 -14496 3641 -8898 -4059 -11456
1431 -11456 6267 -17539 -33010 -54242 -11916 -25869 -2582 7797 -14231 -36824 -1819 -19623
1419 -19623 -44471 2093 -1825 -25610 -13492 -3215 -7669 -16276 -27665 -14019 6736 11916 19409
1406 19409 10371 29753 12723 12188 7006 -14352 -12875 19028 42979 18107 6651 -66561 -64928
1393 -64928 -50493 -21792 -13019 -3136 -23175 -32283 -28084 -865 -4609 -19397 -40118 -5182 -13289
1380 -13289 -26486 -29283 -16438 1480 -27431 -11138 -10258 -5016 -11212 -16138 -10330 -15354 -17655 -35905
1366 -35905 -13965 -6264 -37544 4539 19588 68401 46541 5048 8981 -25000 -19057 8858
1354 8858 320 -35889 -27655 -2395 -27439 -32516 -2484 -28363 -12460 4287 -17281 -27206 -1931
1341 -1931 -3433 -16460 -26174 -1437 -35033 -32585 -33496 -56489 -42283 -20542 607 -17007 -11144
1328 -11144 858 4225 -14989 -46396 -21410 -4429 -13573 -21139 -3511 -24641 -32253 -24825 -29697
1315 -29697 -33186 -34427 -20427 -16650 -25317 -28332 -19245 -42437 -26877 -27602 -10634 -8835 -9942 10422
1301 10422 -11360 -42821 -5367 785 -2487 -4722 30516 -2198 1031 -1600 -29791 -44275 -46492
1288 -46492 -46055 -46734 -48573 -58668 -52400 -27889 5458 -5350 17900 8532 26950 4144 -37963
1275 -37963 -26108 -5917 -11312 7505 3798 1633 -14508 1751 55691 39266 12948 -12620
1263 -12620 9337 41938 21959 7951 -2629 -3101 -11876 -25508 -16568 1118 -8965 -11328 -17978
1250 -17978 13381 6255 9398 3748 1001 16223 19737 -11745 464 34588 -6987 15139 16145
1237 16145 57 -8481 -8298 14662 18723 3454 -6733 -9735 714 6211 7963 -12261 -29885
1224 -29885 2274 11820 10552 37152 16259 -39828 -51807 -38115 -32655 -28299 -6311 -7760 -10339
1211 -10339 -7105 -26874 -22167 -23441 -37398 -30180 -967 -401 -1385 -29260 -15215 -4180 7562
1198 7562 -4744 -30485 -26538 -18084 1899 -6790 -2582 27522 -20461 -41909 -9026 4660 -81
1185 -81 -12399 7746 5091 -16234 5476 -21165 -14063 57617 35233 -2955 5481 4762 1753 611
1171 611 30626 -6231 7085 -11668 -35830 -36963 -15690 -26257 -34055 -43526 -8533 -2750 -33878
1158 -33878 -17772 -41053 -29187 -48303 -59206 -30895 12628 12593 -2437 -10421 -4613 -7448 -31772
1145 -31772 -29023 -20248 -26142 -34689 -29059 -3116 13912 4713 -2357 25569 -12948 -47973 -24750
1132 -24750 -17414 -13453 -2995 -33748 -31374 -17160 13811 6561 4961 22900 27556 -16247 -13563
1119 -13563 5892 21006 -9293 -35018 -38644 -25354 -17369 -3624 -1178 2323 -9368 -12325 -18130
1106 -18130 -8177 -15519 19392 2094 1413 10361 17167 -4759 -20466 -38239 18666 3138 -44572
1093 -44572 13913 -5208 -10010 1348 20554 15406 3226 -26125 -17655 -19832 488 -12704 -141
1080 -141 6291 -38978 -6329 25069 -19858 -26165 12610 13630 35828 34341 -4995 22972 -710
1067 -710 -24390 -8350 5268 12888 9842 1032 8032 -31698 -13635 -142 -729 -16235 -44795
1054 -44795 -30677 -7784 5970 9073 -3894 -15626 -27588 -15474 -25695 10830 42078 27416
1042 27416 39366 20529 -25018 -44406 -14903 23850 -1964 3502 21904 -10987 -40418 -13570
1030 -13570 3701 -177 -17017 38278 10896 29735 17651 -23580 -13357 -17470 -3938 -7662
1018 -7662 -23734 -50808 -41115 -32150 -8078 18865 26086 28575 1155 26083 40623 13194 1538
1005 1538 -28371 -12145 -11946 -20328 -9004 8505 12601 19760 -18256 -23345 20437 24887 -31064
992 -31064 -28693 -42886 -10258 20510 12375 4629 23294 26898 25866 -9868 -15507 -19282 -32949
979 -32949 -15780 2532 14714 4115 34629 17364 370 -9118 -2784 12089 -6678 -948 -44326
966 -44326 -68528 -30249 -24381 -12456 1708 -13159 -32362 -33091 -18081 266 -13058 -35501 -20697
953 -20697 -25459 -29774 -10386 11947 11780 11441 -13106 -26049 -54132 -60355 -12440 -7653 -3831 -7308
939 -7308 1544 2762 -30963 -43800 -4701 -8694 -2402 16198 -5860 -24284 -17684 -21746 -32460
926 -32460 -2772 20878 58849 26605 12021 24692 -7055 -20958 -8917 -8790 -8806 8723 -2658
913 -2658 5454 24949 7855 14017 9832 7712 15578 -9738 -3518 15860 28720 8454 -21475
900 -21475 5377 9221 1981 30919 18279 -6086 -10170 20247 13366 -7810 3050 -9874 -11704
887 -11704 -7293 13459 29336 -15180 -49320 -30412 -15996 4707 11566 19885 -10601 11131 31296
874 31296 43380 31845 -9980 -4067 -16121 2332 3312 -4315 487 -3245 5311 -11520 -12828 -24893
860 -24893 -49190 -29644 -10338 -2800 -3792 -6776 7875 27110 33939 22765 -6273 16577 10325
847 10325 37544 -10448 -27233 -12789 -10730 17809 27303 22765 22827 -4323 -16878 -10848 13336
834 13336 33564 17270 618 -14373 2239 11854 24665 3413 -6292 2722 18784 -1635 -26106
821 -26106 24332 11448 4241 1957 11303 11105 1908 -11817 -8363 -24455 11170 8846 26794 17941
807 17941 17317 14268 -20568 -3784 -13858 -12883 -28005 -13117 -25802 4976 18546 17532 6536
794 6536 3564 -17249 -7236 7498 -16995 -46754 -44832 -17732 -5259 3615 28768 6050 -30368
781 -30368 -2002 1124 -21637 -3371 5586 25582 -16181 -342 25390 43594 9506 -1144
769 -1144 -14517 -25586 -40522 -16721 9505 -22712 -16438 -17972 1340 28264 7515 19339 8684
756 8684 45666 37724 -6168 -13668 -16984 -22432 -23094 19277 15361 17821 24834 -13207 -27507 9376
742 9376 -26563 -36203 -22268 1682 -3430 -1326 6436 24994 3541 2217 19206 11616 10137 5717
728 5717 -10645 8398 8189 -12866 -11891 -1831 7300 34984 51224 46806 31368 27923 -728 -5038
714 -5038 -3318 -2839 6251 27757 -549 1982 -352 6118 19512 -8573 -8269 -19944 -28089 -17254
700 -17254 -3803 4974 12868 14698 9791 -29138 -13387 -23968 -10904 26003 24548 22920 3000
687 3000 -10790 -9342 6609 6182 -12673 19520 7673 13354 17412 -4334 -17273 -20902 -7642
674 -7642 11840 10915 -8262 13786 4086 7749 237 -3826 18810 649 -3932 49162 30061 16057
660 16057 30161 14640 21294 12025 4576 12594 12595 6082 7881 -5401 13957 23054 28685 19938 9588
645 9588 18176 30003 24148 -1151 7792 4260 -393 -16453 -15793 20085 5640 1680 -9041 -2823
631 -2823 -38022 -31886 14652 -6574 -42164 -21976 -9247 5346 -11425 -26017 6870 13347 24776
618 24776 6305 30414 34354 3905 4912 16713 34753 21440 -4255 -18796 -32211 -35315 2704
605 2704 6134 10852 4089 20597 38572 34530 35015 -13046 -33 711 -1301 8171 12292 22716
591 22716 9344 -11468 -1333 6288 15151 33112 16175 16471 17752 24443 38828 17497 20863
578 20863 7688 10468 -3584 -2719 11855 6769 22641 43181 25627 -23238 -8881 188 10891
565 10891 2240 621 23853 4437 -5972 5775 8203 9998 14658 -9015 23632 16896 12951
552 12951 7490 10248 695 19822 16840 22227 39546 25209 6156 -2481 39159 52952 59785
539 59785 25862 27397 30247 7379 -13206 -9752 12456 6557 25870 26465 19886 33202 39317 -4222
525 -4222 21187 14487 12201 11139 37759 25004 33554 58353 35237 49824 56371 41262 11544
512 11544 26341 27426 32587 19005 39725 34041 40398 4541 -9125 -12901 -7283 -20776 -16393
499 -16393 -1121 -1477 -15626 -22181 -14011 -17602 -1440 43580 24517 -14725 -25217 143 6214
486 6214 18864 7418 14656 -5388 3308 -27227 -6513 39673 42949 29830 31632 44167 13691
473 13691 18339 -282 18179 -3597 -15692 1380 -3201 -17935 -8610 1523 -239 -2992 11602
460 11602 37235 70852 16686 3485 41149 57079 44505 18918 44081 39703 31999 31007 23387
447 23387 27862 11008 14953 13921 24819 28759 17256 42820 60277 62416 45914 5510 -4806
434 -4806 4686 24855 6875 33901 53544 14840 -18973 -544 23651 19169 17263 25159 23573
421 23573 5302 8539 3461 9253 -553 -3346 -16329 -8705 28591 18561 28712 23345 8889
408 8889 40269 26084 46638 34587 17303 28708 8375 -2063 8852 2032 -5968 -9107 9609
395 9609 39295 5038 1253 -16629 -27808 -14986 -29719 -4721 37801 14063 -20021 6225
383 6225 5000 11502 24629 44022 43525 13377 2169 -20364 10958 13944 -10959 -6915 39249
370 39249 11697 -891 4867 12902 13520 31806 18110 29861 33753 30697 26879 7490 3953 -4813
356 -4813 19938 29304 43342 14608 7006 -10973 -3698 1576 25871 42478 23047 39776 18440
343 18440 -5694 17262 28554 14582 1241 -8165 -14114 -517 -7124 25649 38073 14466 -13956
330 -13956 -17419 -20506 -18044 8717 6505 28083 15159 -2912 -15592 -6382 9463 7519 -14952
317 -14952 4893 16664 27283 52244 44245 11837 -4920 19789 3171 -1027 -9452 9617 9393
304 9393 5973 39964 48895 31913 20955 50840 43268 48609 52495 -6553 4956 28427 5804
291 5804 8936 13344 12998 25448 31572 31799 42845 46515 18709 13889 -1120 2633 9274 3782 26150
276 26150 15888 4375 4552 20791 19833 47702 59663 51129 23400 16267 25445 32283 35741 20550
262 20550 41086 28390 24981 20622 11341 -8885 -5939 -12740 5714 5910 19884 17303 39714 13425
248 13425 12249 -5880 -12052 21428 44012 45498 -152 -3629 2304 4315 18867 27550 24228 33941
234 33941 9894 13454 41065 17316 4307 31509 14908 26787 36710 36990 32411 18791 15225
221 15225 9593 22588 16368 2685 -29989 -13152 8943 5801 21991 15285 28003 15911 6664
208 6664 19420 18474 21139 22428 7068 11810 8734 30225 26653 19499 -6826 -10908 23223 29961
194 29961 18745 7094 -2424 18579 55177 44691 8001 29328 62065 61738 11021 26210 3053
181 3053 -13520 11978 31276 12521 29380 23842 12867 10700 -2805 16220 22358 35085 33398
168 33398 894 -8839 5943 25986 75122 43506 18310 10178 13132 11135 31680 21257 34023
155 34023 16068 -11091 21582 50482 26155 10925 17593 18009 18546 13584 31006 20529 13943
142 13943 14075 15125 8612 14669 35171 15667 22673 31266 31075 29351 30263 44026 25335 25514 29470
127 29470 -484 3370 16698 2933 18187 13709 1536 8525 20162 38770 51089 30740 23026
114 23026 31428 32171 32891 4942 -7908 17087 2408 34823 47844 57915 52623 36799 16144
101 16144 17472 16175 12242 4532 10649 57327 59481 55797 28243 15055 4607 2983 7680 48562
87 48562 59909 54073 32032 38900 40041 38029 12183 3734 4995 23162 26458 26007 18687 21064
73 21064 12141 19746 30978 20860 46112 34216 22662 24684 31230 19250 19290 30134 33469 31111
59 31111 30848 39518 40648 21822 16579 32387 25436 30849 39257 35242 38241 17526 4265 7403
45 7403 27059 9461 -4076 9015 32973 20019 19763 33253 33359 58809 41402 10026 3881
32 3881 25284 23505 38680 47120 33403 23693 4172 23262 33348 33017 25535 13167 22515 33469
18 33469 26708 24317 30102 2814 23325 28646 10841 9924 20584 18496 28982 27620 32666 40222
4 40222 33534 34676 52973 42879
0 42879
$$ Imaginary data points
##PAGE= N=2
##DATA TABLE= (X++(I..I)), XYDATA
16383 -2071776 -2064555 -2036430 -2004805 -1997935 -1964570 -1953342 -1937629 -1898924 -1888176 -1839512 -1786519 -1752670
16371 -1752670 -1736991 -1704400 -1675909 -1669490 -1668081 -1657892 -1615682 -1589505 -1580965 -1548151 -1532907 -1507112
16359 -1507112 -1472968 -1441936 -1433694 -1405557 -1367057 -1352583 -1330526 -1299644 -1292065 -1280481 -1222759 -1185834
16347 -1185834 -1176662 -1157858 -1150955 -1150759 -1133317 -1091852 -1054068 -1028856 -995671 -973374 -945357 -927543
16335 -927543 -906976 -883317 -868981 -829230 -803753 -777610 -747633 -742620 -745302 -714198 -695157 -671280
16323 -671280 -642539 -613609 -583825 -580662 -557746 -524489 -506102 -468356 -455489 -449321 -426201 -406190
16311 -406190 -397387 -382329 -354901 -335382 -318181 -293616 -270085 -239363 -236887 -238552 -207488 -195435
16299 -195435 -168413 -113629 -76542 -89542 -73183 -69922 -40318 -14744 10978 31208 57992 61448
16287 61448 79454 80478 109320 136725 148318 195150 245733 255682 250646 222945 234283 284562
16275 284562 294269 286399 338576 350287 359757 386159 381916 408309 442538 453393 481172 494953
16263 494953 493632 492577 518226 548436 576077 565014 567476 593320 596032 603595 621465 646614
16251 646614 646098 666789 678791 684061 709795 743015 753117 756592 783494 801345 789455 781610
16239 781610 811596 847191 850968 862747 881293 909122 918695 902149 924661 925908 924739 940524
16227 940524 975161 983977 983228 1010763 1011196 995587 980406 1030838 1027609 1057080 1072324 1107325 1121255
16214 1121255 1127780 1129897 1119954 1137625 1129668 1135045 1182089 1192243 1211578 1233040 1233074 1261465 1253086
16201 1253086 1232658 1250424 1257291 1260662 1262245 1277279 1288782 1306844 1277403 1309955 1321791 1337336
16189 1337336 1349374 1335828 1349801 1386863 1385537 1372468 1395157 1362415 1379211 1384526 1391831 1416236
16177 1416236 1419164 1451447 1473892 1438093 1450127 1424997 1449833 1460069 1440333 1447999 1479428 1493048
16165 1493048 1478802 1465675 1469955 1477449 1463094 1480251 1497512 1506002 1518294 1539794 1520444 1537072
16153 1537072 1535186 1540374 1575400 1590830 1577414 1553655 1564445 1566449 1556057 1584068 1594770 1602817
16141 1602817 1624551 1613669 1612099 1600345 1578138 1572922 1576293 1621169 1661508 1657496 1653153 1674375
16129 1674375 1655517 1625074 1629934 1636415 1639529 1634941 1668429 1674335 1641948 1649503 1650370 1674443 1678329
16116 1678329 1705053 1715087 1698395 1714796 1670809 1670379 1686065 1708861 1693682 1729280 1722984 1717490
16104 1717490 1710167 1699459 1671613 1667906 1703813 1702309 1687991 1686826 1710316 1713876 1713465 1724406 1732998
16091 1732998 1743610 1737921 1743480 1754598 1744361 1721584 1751634 1736729 1710500 1708634 1706835 1736398
16079 1736398 1727348 1723910 1723182 1755703 1761850 1755452 1753594 1784985 1737820 1735665 1752225 1734870 1760289
16066 1760289 1731740 1751549 1788044 1769464 1767939 1778123 1777335 1772417 1752921 1769263 1777818 1772282
16054 1772282 1749061 1730990 1756274 1771281 1816508 1804016 1796706 1769248 1762224 1742270 1759319 1762447
16042 1762447 1769877 1763690 1771713 1826848 1811720 1767834 1743100 1733625 1751483 1777678 1779897 1773605
16030 1773605 1764521 1800319 1778292 1792596 1773252 1778219 1785137 1808425 1817335 1774469 1769848 1767730
16018 1767730 1757797 1788838 1816343 1812071 1806086 1806149 1797870 1797592 1791870 1751040 1772640 1768677 1755725
16005 1755725 1766765 1796863 1802836 1799214 1818726 1820884 1772761 1779959 1792055 1783992 1788741 1769029
15993 1769029 1771672 1766746 1796586 1815611 1818926 1796582 1796023 1801003 1792112 1770913 1775313 1777414 1786043
15980 1786043 1804040 1808768 1781488 1772182 1790992 1810010 1791021 1791565 1789317 1798077 1813703 1799152
15968 1799152 1782910 1785313 1767327 1788665 1797110 1781420 1763821 1773052 1812331 1805973 1819593 1839981
15956 1839981 1826177 1807115 1764038 1756803 1773209 1781993 1788748 1806044 1843375 1817667 1793093 1785285
15944 1785285 1773584 1758679 1771458 1774176 1771401 1764085 1767451 1770610 1809239 1808230 1809213 1787438 1807956
15931 1807956 1798842 1783780 1815438 1848106 1827100 1829295 1792058 1786343 1782076 1784647 1825721 1802272
15919 1802272 1794371 1799542 1810832 1824289 1799528 1782486 1780528 1805660 1794061 1805645 1790447 1757364
15907 1757364 1776045 1788609 1782572 1805774 1825724 1820658 1805104 1797560 1801748 1830502 1839283 1806960
15895 1806960 1780462 1771441 1772222 1766630 1765669 1771512 1822635 1779269 1751377 1799968 1821420 1800065 1802033
15882 1802033 1831354 1834243 1809324 1801069 1792466 1816925 1842827 1822787 1825286 1815526 1798743 1807982
15870 1807982 1808905 1773291 1744910 1782369 1785885 1805256 1807535 1822815 1841766 1814746 1820614 1816792
15858 1816792 1806627 1794638 1775431 1844232 1835572 1807795 1817612 1813512 1802526 1822132 1806106 1788956
15846 1788956 1789713 1816131 1815709 1826728 1859675 1855776 1853081 1849801 1839531 1845625 1821573 1795610 1776011
15833 1776011 1778490 1803676 1790244 1797390 1788425 1766892 1769807 1812378 1807142 1798930 1805160 1793757 1810223
15820 1810223 1804251 1806104 1793198 1775730 1793685 1814741 1781311 1807652 1800937 1809856 1804370 1825980
15808 1825980 1837553 1799228 1774924 1785439 1775315 1788478 1817344 1820392 1815380 1806736 1833148 1819803
15796 1819803 1816122 1799848 1819127 1834842 1827774 1803323 1814277 1833884 1857108 1843331 1823644 1814648
15784 1814648 1842179 1830515 1812785 1821180 1814032 1819858 1833458 1812650 1851994 1816414 1797314 1819271
15772 1819271 1836639 1835240 1840865 1812754 1817022 1822757 1813346 1817389 1822629 1814917 1834614 1815417 1827742
15759 1827742 1858400 1830216 1832101 1836244 1842876 1822726 1830677 1854862 1869366 1840747 1809635 1794006
15747 1794006 1809601 1790432 1816550 1810867 1839842 1850496 1835626 1843925 1851855 1860044 1858670 1845956
15735 1845956 1821843 1816791 1833537 1814859 1814597 1834358 1852615 1862516 1857076 1843028 1845459 1848519 1818453
15722 1818453 1822106 1773757 1828847 1834732 1834521 1848456 1836312 1806073 1838162 1852780 1869946 1872969
15710 1872969 1882987 1878760 1855234 1826163 1801400 1806452 1808888 1827012 1816857 1832893 1841696 1823479
15698 1823479 1810762 1840658 1846285 1830480 1830278 1857334 1834889 1839938 1806903 1811994 1843159 1828000
15686 1828000 1811737 1806879 1829439 1828303 1839317 1847612 1853835 1862123 1851676 1846583 1847109 1817545 1795597
15673 1795597 1834532 1856272 1864307 1839383 1844000 1854637 1871665 1850520 1858257 1868677 1887036 1863977
15661 1863977 1842810 1850051 1869437 1875676 1836895 1847095 1872759 1857256 1868617 1856555 1836529 1855418
15649 1855418 1907594 1897886 1877443 1865935 1834595 1846797 1845305 1849050 1854866 1837074 1821760 1838356
15637 1838356 1845390 1847193 1861736 1828788 1831372 1862504 1824862 1794032 1822052 1847544 1834249 1821001
15625 1821001 1806577 1833486 1836161 1818179 1847324 1833805 1832205 1865753 1865131 1837298 1819692 1837463
15613 1837463 1837373 1870190 1866371 1845649 1833494 1829096 1836047 1867895 1860933 1819340 1832907 1857942 1832722
15600 1832722 1845729 1863893 1848916 1817763 1826699 1843057 1830283 1798692 1810344 1803502 1792835 1823552
15588 1823552 1827213 1808737 1832317 1847745 1851499 1831699 1814990 1861984 1875770 1889843 1865790 1853911
15576 1853911 1875735 1851651 1812687 1832055 1846547 1819352 1833089 1853975 1829348 1848295 1830743
15565 1830743 1824432 1810426 1830439 1853099 1866097 1843834 1827156 1850272 1831312 1847748 1835781
15554 1835781 1853603 1889231 1893047 1841243 1804195 1819356 1840894 1838598 1839372 1867400 1865893 1861936
15542 1861936 1873835 1891471 1853778 1852685 1855934 1845826 1875825 1854389 1881529 1889287 1890014 1853631
15530 1853631 1862164 1826083 1844338 1863192 1858671 1829710 1823696 1848043 1862877 1884108 1868997 1855236
15518 1855236 1866704 1868618 1867826 1842997 1873565 1927832 1906377 1912557 1896688 1877278 1873500 1890162
15506 1890162 1847994 1839176 1830787 1819762 1852808 1850927 1859694 1893390 1862652 1876821 1859515 1869438
15494 1869438 1859880 1893801 1884663 1851136 1856547 1869472 1836055 1846059 1843210 1866776 1846055 1846214
15482 1846214 1856193 1839597 1841905 1855125 1866583 1867664 1888067 1865346 1875253 1858124 1889604 1899472
15470 1899472 1876048 1878133 1862031 1863482 1877212 1878600 1887638 1857407 1882515 1897587 1884014 1863974
15458 1863974 1877132 1887915 1886815 1902529 1868399 1858209 1871694 1860523 1866577 1854467 1854788 1875390
15446 1875390 1882640 1862513 1871760 1886816 1899320 1891323 1877035 1876938 1866817 1842166 1857089 1860235 1832225
15433 1832225 1845794 1887146 1861924 1898316 1924139 1906253 1894207 1904676 1909179 1891749 1881869 1865404
15421 1865404 1869652 1891215 1879358 1901821 1893105 1894412 1872054 1865767 1889998 1891495 1870768 1875933
15409 1875933 1871556 1852468 1892055 1899912 1890459 1889334 1870103 1850094 1886491 1885297 1893253 1893995 1866668
15396 1866668 1880903 1906564 1883255 1894836 1884667 1917171 1906564 1889009 1847844 1869465 1870466
15385 1870466 1865674 1859009 1867353 1885189 1890041 1919980 1915271 1900571 1913567 1901906 1907393 1904915 1908528
15372 1908528 1880890 1899634 1920446 1922005 1915292 1913501 1912552 1885819 1875846 1903037 1916539 1890397
15360 1890397 1889533 1889421 1891155 1889323 1901623 1895742 1912894 1898731 1909903 1907270 1909236 1856995 1873520
15347 1873520 1884158 1874673 1904187 1893768 1893466 1898370 1864086 1865187 1888760 1907435 1897356 1873343
15335 1873343 1888747 1900211 1897718 1900801 1881269 1863542 1849486 1842252 1862810 1892666 1889363 1909335
15323 1909335 1944778 1915304 1888999 1900173 1920430 1905367 1909728 1885884 1868194 1859963 1842333 1891145
15311 1891145 1887629 1896608 1909398 1925088 1908157 1908546 1908505 1923349 1925747 1876041 1839197 1844834 1861883
15298 1861883 1874459 1900447 1879863 1906530 1917584 1900958 1897061 1887196 1939167 1972163 1920813 1909506
15286 1909506 1884003 1871030 1874731 1865822 1884135 1896290 1910418 1919551 1905484 1880441 1887913 1887349
15274 1887349 1901059 1916251 1922213 1888461 1903484 1915368 1883732 1881491 1885499 1885794 1881381 1894403
15262 1894403 1885298 1887081 1888853 1881909 1865253 1929088 1919623 1925575 1918460 1908159 1899533 1913739 1931369
15249 1931369 1933748 1911479 1869897 1900191 1934919 1921435 1915272 1923482 1927400 1933769 1928241 1926912 1895602
15236 1895602 1863561 1860776 1900654 1941691 1981865 1966285 1943765 1932677 1917438 1911970 1899820 1903248
15224 1903248 1931715 1917417 1938388 1952123 1933428 1894448 1881412 1894175 1889113 1904241 1915657
15213 1915657 1914840 1950631 1943352 1952546 1946541 1926286 1921102 1909824 1928673 1920412 1913678 1918761 1915651
15200 1915651 1909860 1889368 1881666 1870199 1897164 1930210 1925881 1941032 1942514 1932457 1938646 1943748
15188 1943748 1920458 1899563 1901804 1909526 1912868 1900994 1917326 1937898 1939863 1939368 1909717 1894537
15176 1894537 1870570 1884339 1921131 1943455 1928093 1923248 1923099 1921236 1929319 1953498 1940325 1954058
15164 1954058 1961916 1947204 1951248 1942912 1899967 1937375 1914423 1927801 1942396 1917650 1957327 1944217
15152 1944217 1930135 1938809 1918796 1926511 1938008 1939263 1924691 1887920 1926200 1943298 1924061 1947554
15140 1947554 1919265 1910762 1918914 1937839 1936899 1889657 1916238 1931895 1926834 1924426 1919383 1903410 1941911
15127 1941911 1932770 1930677 1938273 1910405 1923791 1945290 1934086 1923970 1930618 1919345 1909850 1954586
15115 1954586 1944009 1944607 1933306 1910637 1881659 1900518 1908786 1907725 1902388 1902568 1934474 1921563 1905732
15102 1905732 1909200 1910427 1933085 1893195 1879708 1921112 1927298 1925477 1923908 1932089 1945962 1932266
15090 1932266 1891325 1911254 1916399 1942236 1958271 1956131 1952290 1946702 1954550 1955877 1968314 1974644 1961289
15077 1961289 1967873 1955905 1953418 1959823 1953036 1942443 1937446 1919177 1901103 1914315 1916391 1949263
15065 1949263 1939073 1907884 1882084 1894164 1931465 1926710 1935491 1962468 1947865 1953306 1938253 1924673
15053 1924673 1940607 1928462 1954404 1955729 1953929 1952173 1914858 1934400 1904784 1931347 1959039 1939260
15041 1939260 1922025 1941941 1983459 1985381 1953766 1956145 1978397 1946897 1942682 1915350 1927863 1958455
15029 1958455 1959675 1924842 1919093 1919543 1949230 1940414 1926404 1930514 1953318 1964760 1954935 1960556 1969199
15016 1969199 1970414 1976434 1960640 1951183 1953366 1956065 1931474 1937996 1961683 1959182 1946439 1925021 1947016
15003 1947016 1923683 1933083 1957025 1966835 1956533 1958500 1937874 1937509 1932737 1921270 1937970 1977010
14991 1977010 1979455 1947247 1965285 1941982 1954859 1944233 1924528 1939020 1956300 1972837 1974506 1966952
14979 1966952 1987709 1997053 1997518 1949630 1965696 1992959 1979535 1964240 1961999 1980744 1998234 1998578
14967 1998578 1964013 1962795 1993669 1971761 1970702 1942260 1942973 1977651 1977315 1967163 1933770 1956568
14955 1956568 1971294 1984238 1979997 1982641 1980222 1973327 1980517 1987869 1958277 1913717 1915360 1922915 1980401
14942 1980401 1994598 1982590 1981158 1959460 1951173 1919110 1904600 1949233 1983824 1965652 1936598 1931558
14930 1931558 1955318 1956976 1981980 1975248 1987829 1994176 1983989 1960298 1999079 1987342 1937555 1984335
14918 1984335 1970058 1983229 1977523 1960405 1964751 1941048 1949624 1941996 1954468 1966041 1952867 1970418
14906 1970418 1982943 1963343 1988486 1976060 1969119 2006864 2003353 2001348 2027811 1971566 1945279 1951546
14894 1951546 1954867 1990339 1998859 1982174 1979883 1946199 1925725 1955275 1952365 1936124 1976604 1992675
14882 1992675 1983008 1995908 1975665 1968846 2004093 2019627 2000397 1998850 1974305 1995858 2008366 1976803
14870 1976803 1959595 1948901 1956451 1951479 1945422 1963583 1970520 1964146 1979442 1974465 1957778 1949304 1966078
14857 1966078 1963753 1971151 1978373 2003953 2004496 1996776 1977781 1974055 2004037 2025040 2000189 1949025 1948407
14844 1948407 1970182 1972690 1975908 1986026 1971779 1950869 1981828 1998673 1999331 1996878 1972152 1983052
14832 1983052 1996436 2025806 2011926 1975429 1987047 1983885 1993126 1983280 1973770 2008125 1987959 2000364
14820 2000364 1979079 1963638 1944910 1971011 1973042 1943094 1949611 1947939 1957700 1972643 1923983 1943331
14808 1943331 1965054 2002109 2011632 2009645 1996995 2002834 2001486 1998974 1981988 1973953 1983871 1992918 2002723
14795 2002723 1986152 1982247 2003113 1998120 1993621 2012746 1991574 1993449 1991511 1972671 1973569 1974920 1989644
14782 1989644 1997230 1987498 1978698 2008440 2003895 1978554 1996248 1996705 2027206 2003611 1974459 2001679
14770 2001679 1994246 2001960 2012244 2003192 1985932 1987065 1981946 1966852 1982508 1962927 1980530 1994120
14758 1994120 1996040 1982342 2004484 1973084 1975666 1991422 2018828 1997666 2021884 2040595 2000299 2007202
14746 2007202 2036518 2012291 1999909 1991792 2001367 2018917 1982031 2008149 1971143 1988136 2003673 1999383
14734 1999383 2020743 2004022 2001794 1989853 2002124 2022990 2011599 2016828 2045403 2022160 2005974 2045366
14722 2045366 1999131 1982185 2014410 1986013 1999600 2004900 2011404 2013463 1999984 1991856 2020843 2024532
14710 2024532 2010011 2046456 2028450 2042282 2002704 1969294 1990363 1990374 2020872 2012041 2024276 2058145
14698 2058145 2072497 2039884 2017034 2000691 2028652 2045346 2025350 1998323 2007422 2019374 2013533 2008916
14686 2008916 2021167 2005452 2017591 2023623 1977744 1985802 2008692 2034716 2037206 2026380 1993889 1993516
14674 1993516 1999621 2032808 2015596 2014351 2025255 2010593 2011286 2010280 2000795 1987214 1988363 2020710 2048865
14661 2048865 2074460 2034876 2004079 1994621 2013047 2051687 2045885 2044050 2008767 1977697 1996946 2028857
14649 2028857 2043743 2069223 2052889 2024883 2062757 2040560 1998315 2028892 2013676 2023657 2023566 2025259
14637 2025259 2029278 2034353 2032664 2027800 2021738 2001168 1997923 2028039 2051304 2041079 2020261 2024687 1998297
14624 1998297 1973709 2001293 2010587 2035049 2047676 2046386 2044155 2044688 2010395 2035745 2030609 2009252
14612 2009252 2011738 2025068 2035159 1979098 1983859 2036123 2031935 2021309 2021942 2007779 2028383 2029086 2015280
14599 2015280 2008122 1992596 2012387 2017778 1991322 2020425 2025408 2021229 2022673 2020495 2018319 2018101 2039715
14586 2039715 2025889 2020309 2017214 2036016 2042061 2025563 2041008 2027587 2012257 2014897 2019914 2035428
14574 2035428 2027609 2014379 2018336 2015218 2032046 2054751 2021259 2006070 2050070 2076167 2049295 2015753
14562 2015753 1998740 2019645 2046144 2046452 2036198 2037129 2027168 2021563 1999670 2021616 2033162 2039068 2002220
14549 2002220 2035238 2077433 2070602 2050279 2029047 2019241 2023434 2032171 2037886 2068507 2031252 2048941
14537 2048941 2046192 2046978 2052451 2030680 2040178 2022206 2035890 2069816 2043068 2036586 2033937 2038450 2052089
14524 2052089 2033456 2077589 2079548 2060675 2074655 2101658 2094620 2057457 2059489 2075351 2082850 2060737
14512 2060737 2057430 2066107 2033187 2012331 2048115 2047630 2057354 2045296 2050935 2047961 2047684 2075964 2056352
14499 2056352 2054773 2058577 2047625 2052512 2055337 2069614 2047120 2040178 2046155 2027452 2031886 2052906 2046474
14486 2046474 2025897 2052345 2052669 2051055 2041306 2069332 2060559 2023633 2048085 2024714 2069011 2069048 2040553
14473 2040553 2032831 2058124 2071064 2053244 2053637 2060668 2072366 2074794 2067580 2072824 2009560 2035762 2046000
14460 2046000 2061180 2076706 2040657 2078037 2060219 2064907 2053124 2082316 2061849 2049299 2060632
14449 2060632 2053939 2081503 2086545 2079349 2050468 2060940 2051515 2066925 2047917 2068740 2049650 2049349
14437 2049349 2038446 2052967 2074675 2059208 2077254 2063922 2065418 2103810 2075121 2045253 2073298
14426 2073298 2068802 2071339 2095684 2110480 2060791 2075701 2098929 2070188 2074085 2077113 2073958 2098820
14414 2098820 2085117 2054886 2030908 2064180 2107418 2103625 2049270 2053200 2062157 2080860 2064827 2081632
14402 2081632 2091896 2063895 2063833 2067491 2050074 2087289 2064983 2069967 2086013 2084432 2073975 2064446 2054020
14389 2054020 2053775 2070566 2075850 2102991 2101089 2100345 2122476 2101409 2105692 2093053 2043220 2067062 2089015
14376 2089015 2090856 2072653 2092460 2107752 2074235 2088110 2108532 2122254 2072682 2077950 2092627 2074821
14364 2074821 2061505 2068200 2084158 2061820 2049890 2068219 2089348 2062543 2094569 2102326 2103702 2096954
14352 2096954 2108864 2075260 2039456 2069246 2106887 2097638 2097966 2114051 2098110 2095587 2105004 2105812 2057893
14339 2057893 2040601 2068115 2103892 2106412 2101321 2135178 2139605 2123664 2093376 2066478 2069996 2085245
14327 2085245 2093741 2072672 2088508 2060908 2031056 2037812 2027324 2067559 2097888 2124638 2091182 2083564
14315 2083564 2104899 2097410 2119775 2111304 2099951 2098542 2110222 2108208 2073292 2085078 2074619 2077604
14303 2077604 2077149 2097450 2095352 2111940 2121979 2120743 2110559 2091173 2111029 2133342 2139023 2095915
14291 2095915 2075753 2102393 2111140 2071772 2074455 2102242 2103039 2071726 2077667 2089921 2071317 2076528
14279 2076528 2075850 2051831 2070264 2082861 2085303 2092321 2094334 2087387 2087073 2078535 2055819 2107016 2121086
14266 2121086 2115612 2116982 2096837 2121749 2099473 2104831 2115992 2095304 2107610 2107730 2126139 2090237
14254 2090237 2115611 2123174 2103849 2080459 2111793 2119939 2131896 2123697 2094036 2087481 2075476 2106143
14242 2106143 2142610 2137052 2128943 2114530 2093293 2111124 2142763 2133429 2107811 2108915 2114004 2121056
14230 2121056 2103879 2117931 2127100 2088290 2067648 2100617 2095041 2089445 2105701 2105244 2078187 2089112
14218 2089112 2092571 2125179 2116052 2088594 2104236 2083903 2051450 2076967 2124772 2113103 2121606 2091635
14206 2091635 2062506 2092066 2106627 2125977 2105395 2098510 2138484 2165460 2149432 2137815 2132550 2116510
14194 2116510 2108481 2080082 2098581 2104863 2090866 2082372 2100501 2127317 2065018 2071325 2116423 2131071
14182 2131071 2115413 2104612 2093220 2103840 2115692 2123693 2121769 2128613 2130564 2127496 2123129 2154263
14170 2154263 2168900 2143659 2111119 2116780 2130087 2150904 2115772 2100810 2100906 2090191 2088783 2121180
14158 2121180 2149116 2122554 2113487 2112230 2137413 2118923 2123785 2148787 2124068 2148515 2135453 2104145
14146 2104145 2123637 2116823 2135630 2130543 2124748 2150448 2147887 2151357 2142964 2158431 2154482 2135370 2168292
14133 2168292 2145785 2145864 2127004 2103725 2123568 2132160 2159347 2120650 2107436 2136108 2124538 2119941
14121 2119941 2106285 2136023 2134020 2115229 2115417 2115303 2131128 2155649 2191432 2180082 2143373 2135978
14109 2135978 2114988 2120034 2117787 2099907 2128518 2120723 2136776 2122065 2123683 2147605 2154594 2150247
14097 2150247 2139084 2147090 2132307 2132864 2136459 2150870 2147084 2163545 2146182 2129902 2110253 2125229
14085 2125229 2115006 2126675 2155543 2142108 2126071 2139619 2143771 2148503 2132368 2134103 2122683 2124670
14073 2124670 2122693 2120855 2105698 2134386 2178144 2160442 2155387 2154448 2158773 2138947 2108069 2148801
14061 2148801 2141657 2109272 2085508 2116599 2138526 2144166 2154908 2165147 2177216 2172965 2167738 2169675
$$ [...]
##END NTUPLES=NMR SPECTRUM
##END=
