##TITLE=1H_TG-2368-2
 CDCl3
 8 sc, 
 15.12.2022
##JCAMPDX= 6.0         $$ Bruker NMR JCAMP-DX V2.0
##DATA TYPE= NMR SPECTRUM
##DATA CLASS= NTUPLES
##ORIGIN= UXNMR, Bruker Analytische Messtechnik GmbH
##OWNER= root
$$ XWIN-NMR		Version 3.5
$$ Thu Dec 15 13:02:59 2022 Russian Standard Time (UT+4h)  she@DPX200
##.OBSERVE FREQUENCY= 200.13135
##.OBSERVE NUCLEUS= ^1H
##.ACQUISITION MODE= SIMULTANEOUS
##.ACQUISITION SCHEME= undefined
##.AVERAGES= 8
##.DIGITISER RES= 18
##SPECTROMETER/DATA SYSTEM= spect
##.PULSE SEQUENCE= zg30
##.SOLVENT NAME= CDCl3
##.SHIFT REFERENCE= (INTERNAL, CDCl3, 0, 15.7645)
##AUDIT TRAIL= $$ (NUMBER, WHEN, WHO, WHERE, WHAT)
$$ ##TITLE= Audit trail, XWIN-NMR		Version 3.5
$$ ##JCAMPDX= 5.01
$$ ##ORIGIN= Bruker BioSpin GmbH
$$ ##OWNER= she
$$ F:/spectra/data/she/nmr/H-F/1/pdata/1/auditp.txt
$$ ##AUDIT TRAIL=  $$ (NUMBER, WHEN, WHO, WHERE, WHAT)
(   1,<2022-12-15 13:01:07.56 +0400>,<she>,<DPX200>,
      <created by zg, POWCHK disabled, PULCHK disabled
       configuration hash MD5:
       00 E9 B6 7A A2 85 ED C7 34 08 36 98 17 FE 4E 26
       data hash MD5: 16K
       59 83 AA 3B A4 B9 8E 13 DB F3 68 24 D2 EC 8E A0>)
(   2,<2022-12-15 13:01:09.89 +0400>,<she>,<DPX200>,
      <Start of raw data processing
       efp BC_mod = 2 LB = 0.24 FT_mod = 6 PKNL = 1 PHC0 = -19266.21 PHC1 = 11.00072 SI = 16K 
       data hash MD5: 16K
       58 31 7C 53 28 93 F2 D5 4E 06 48 B7 A6 48 8E D3>)
(   3,<2022-12-15 13:01:28.14 +0400>,<she>,<DPX200>,
      <pk PHC0 = 155.0308 PHC1 = 5.2 
       data hash MD5: 16K
       22 A7 C8 57 6A 09 31 B8 B2 36 64 15 BA A9 7F C6>)
(   4,<2022-12-15 13:01:31.45 +0400>,<she>,<DPX200>,
      <abs ABSG = 5 
       data hash MD5: 16K
       32 05 C4 92 12 0F E2 09 1E 98 C5 9D 6F D7 60 49>)
(   5,<2022-12-15 13:02:24.10 +0400>,<she>,<DPX200>,
      <pk PHC0 = -3.044697 PHC1 = 3.399996 
       data hash MD5: 16K
       04 02 A1 6A 3F 1F FC F2 16 CF 09 2C EB 88 01 29>)
(   6,<2022-12-15 13:02:33.64 +0400>,<she>,<DPX200>,
      <abs ABSG = 5 
       data hash MD5: 16K
       11 56 D0 19 10 A2 6A 60 69 13 A9 0F 55 21 8C 59>)
$$ ##END=
$$ 
$$ hash MD5
$$ 9A 0B E3 26 76 BE 18 90 38 0D DF 15 59 20 6A 81
##$RELAX= 
##$RELAX= 
##$RELAX= 
##$RELAX= 
##$RELAX= 
##$RELAX= 
$$ Bruker specific parameters
$$ --------------------------
##$DU= <F:/spectra>
##$EXPNO= 1
##$NAME= <H-F>
##$PROCNO= 1
##$TYPE= <nmr>
##$USER= <she>
##$AMP= (0..31)
100 100 100 100 100 100 100 100 100 100 100 100 100 100 100 100 100 100 
100 100 100 100 100 100 100 100 100 100 100 100 100 100 
##$AQSEQ= 0
##$AQ_mod= 1
##$AUNM= <au_zg>
##$AUTOPOS= <>
##$BF1= 200.13
##$BF2= 200.13
##$BF3= 200.13
##$BF4= 200.13
##$BF5= 200.13
##$BF6= 200.13
##$BF7= 200.13
##$BF8= 200.13
##$BYTORDA= 1
##$CFDGTYP= 0
##$CFRGTYP= 5
##$CHEMSTR= <none>
##$CNST= (0..31)
1 1 145 1 1 1 1 1 1 1 1 1 1 1 1 1 1 1 1 1 1 1 1 1 1 1 1 1 1 1 1 1 
##$CPDPRG= <>
##$CPDPRG1= <>
##$CPDPRG2= <>
##$CPDPRG3= <>
##$CPDPRG4= <mlev>
##$CPDPRG5= <mlev>
##$CPDPRG6= <mlev>
##$CPDPRG7= <mlev>
##$CPDPRG8= <mlev>
$$ [...]
##$SUBNAM3= <"">
##$SUBNAM4= <"">
##$SUBNAM5= <"">
##$SUBNAM6= <"">
##$SUBNAM7= <"">
##$SUBNAM8= <"">
##$SUBNAM9= <"">
##$SW= 18.05172834244
##$SWIBOX= (0..15)
0 0 2 0 0 0 0 0 0 0 0 0 0 0 0 0 
##$SW_h= 3612.71676300578
##$TD= 16384
##$TD0= 1
##$TE= 0
##$TE2= 300
##$TE3= 300
##$TEG= 300
##$TL= (0..7)
0 120 120 120 120 120 120 120 
##$TP= (0..7)
150 150 150 150 150 150 150 150 
##$TP07= 0
##$TPNAME0= <>
##$TPNAME1= <>
##$TPNAME2= <>
##$TPNAME3= <>
##$TPNAME4= <>
##$TPNAME5= <>
##$TPNAME6= <>
##$TPNAME7= <>
##$TPOAL= (0..7)
0.5 0.5 0.5 0.5 0.5 0.5 0.5 0.5 
##$TPOFFS= (0..7)
0 0 0 0 0 0 0 0 
##$TUNHIN= 0
##$TUNHOUT= 0
##$TUNXOUT= 0
##$USERA1= <user>
##$USERA2= <user>
##$USERA3= <user>
##$USERA4= <user>
##$USERA5= <user>
##$V9= 5
##$VALIST= <valist>
##$VCLIST= <CCCCCCCCCCCCCCC>
##$VD= 0
##$VDLIST= <DDDDDDDDDDDDDDD>
##$VPLIST= <PPPPPPPPPPPPPPP>
##$VTLIST= <TTTTTTTTTTTTTTT>
##$WBST= 1024
##$WBSW= 4
##$XGAIN= (0..3)
0 0 0 0 
##$XL= 0
##$YL= 0
##$YMAX_a= 176471
##$YMIN_a= -294650
##$ZGOPTNS= <>
##$ZL1= 120
##$ZL2= 120
##$ZL3= 120
##$ZL4= 120
##$ABSF1= 15.76452
##$ABSF2= -2.28733
##$ABSG= 5
##$ABSL= 3
##$ALPHA= 0
##$AQORDER= 0
##$ASSFAC= 0
##$ASSFACI= 0
##$ASSFACX= 0
##$ASSWID= 0
##$AUNMP= <proc_1d>
##$AZFE= 0.1
##$AZFW= 0.1
##$BCFW= 0
##$BC_mod= 2
##$BYTORDP= 0
##$COROFFS= 0
##$CY= -3
##$DATMOD= 1
##$DC= 0
##$DFILT= <>
##$DTYPP= 0
##$F1P= 0
##$F2P= 0
##$FCOR= 1
##$FTSIZE= 16384
##$FT_mod= 6
##$GAMMA= 0
##$GB= 0
##$INTBC= 1
##$INTSCL= 3.70164e-10
##$ISEN= 128
##$LB= 0.24
##$LEV0= 0
##$LPBIN= 0
##$MAXI= 10000
##$MC2= 0
##$MEAN= 0
##$ME_mod= 0
##$MI= 1.114404
##$NCOEF= 0
##$NC_proc= -8
##$NLEV= 6
##$NOISF1= 3.799351
##$NOISF2= 2.8
##$NSP= 0
##$NTH_PI= 0
##$NZP= 0
##$OFFSET= 15.76452
##$PC= 1
##$PHC0= -19114.22
##$PHC1= 19.60072
##$PH_mod= 1
##$PKNL= yes
##$PPARMOD= 0
##$PSCAL= 0
##$PSIGN= 0
##$REVERSE= no
##$SF= 200.130001406277
##$SI= 16384
##$SIGF1= 3
##$SIGF2= 2
##$SINO= 5.538805
##$SIOLD= 16384
##$SREGLST= <1H.CDCl3>
##$SSB= 0
##$STSI= 16384
##$STSR= 0
##$SW_p= 3612.71676300578
##$SYMM= 0
##$S_DEV= 0
##$TDeff= 16384
##$TDoff= 0
##$TI= <>
##$TILT= no
##$TM1= 0
##$TM2= 0
##$TOPLEV= 0
##$USERP1= <user>
##$USERP2= <user>
##$USERP3= <user>
##$USERP4= <user>
##$USERP5= <user>
##$WDW= 1
##$XDIM= 16384
##$YMAX_p= 434922188
##$YMIN_p= -1042983
$$ End of Bruker specific parameters
$$ ---------------------------------
##NTUPLES= NMR SPECTRUM
##VAR_NAME=  FREQUENCY,     SPECTRUM/REAL,   SPECTRUM/IMAG
##SYMBOL=    X,             R,               I
##VAR_TYPE=  INDEPENDENT,   DEPENDENT,       DEPENDENT
##VAR_FORM=  AFFN,          ASDF,            ASDF
##VAR_DIM=   16384,         16384,           16384
##UNITS=     HZ,            ARBITRARY UNITS, ARBITRARY UNITS
##FACTOR=    0.220516191357247, 1,           1
##FIRST=     3154.95334802263, 0,            0
##LAST=      -457.763414983151, 0,           0
##MIN=       -457.763414983151, -1042983,    0
##MAX=       3154.95334802263, 434922188,    0
$$ Real data points
##PAGE= N=1
##DATA TABLE= (X++(R..R)), XYDATA
$$ [...]
7401F90897j24067j68722K77267j87191J82221j21143P1554J15220l89381l37243
$$ 690897 566830 398108 675375 488184 670405 549262 620816 736036 346655 9412
7391I412N4833j77820J19952J64243J97490j29923L32358J25509l92402K56737
$$ 9412 64245 -113575 6377 170620 368110 238187 570545 696054 303652 560389
7381E60389k01495K33288n2414k52664j1610o8995k46229L26091l3278L9531l00723
$$ 560389 358894 592182 539768 287104 275494 206499 -39730 286361 253083 292614 -8109
7370h109J53234K0128l30132K44441L44081J82537m37946K43969o674p7037K65026
$$ -8109 145125 165253 -164879 79562 423643 606180 168234 412203 405529 328492 593518
7359E93518k57370m2104K6382q9248L08063K86713l49755P5841k12590L26425
$$ 593518 336148 294044 320426 231178 539241 825954 476199 552040 339450 665875
7349F65875j20602K67472j46434k68680o1742m00885N06021J97288m59454k8304
$$ 665875 545273 812745 666311 397631 335889 -64996 441025 638313 178859 150555
7339A50555K95961J31307J49467k67745n6714n243L48315j13921L77837j47928
$$ 150555 446516 577823 727290 459545 402831 397588 745903 631982 1009819 861891
7329H61891N6623m5525K85044L70282m53774n01961J78223r3710J40103J44838
$$ 861891 918514 872989 1158033 1528315 1074541 572580 750803 657093 797196 942034
7319I42034J48410k5626j07601j01926K66082k44357j22881M09570L23341O1110
$$ 942034 1090444 1064818 957217 855291 1121373 877016 754135 1163705 1487046 1548156
7309A548156J18480j79998K80093L13237k46489J56696L83k34397j05684L25184
$$ 1548156 1666636 1486638 1766731 2079968 1833479 1990175 1990558 1756161 1650477 1975661
7299A975661K89537k43505N6912m4689R1992K39492Q5557m7339n36279M65624
$$ 1975661 2265198 2021693 2078605 2033916 2125908 2365400 2450957 2403618 1867339 2332963
7289B332963L27269P7062k29356J46021j21215j39135K19592j45460j64078K2195
$$ 2332963 2660232 2737294 2507938 2653959 2532744 2393609 2613201 2467741 2303663 2325858
7279B325858N76898J58450k57256j51547o3416J71641k03538K05064K66499K78073
$$ 2325858 2902756 3061206 2803950 2652403 2588987 2760628 2557090 2762154 3028653 3306726
7269C306726j02197k12297N1983J45752q509k80612k65918J10330J21141k30128
$$ 3306726 3204529 2992232 3044215 3189967 3181458 2900846 2634928 2745258 2866399 2636271
7259B636271J1860O79300k39904l68437j63908P0509M6562L99398J50494k44711
$$ 2636271 2648131 3327431 3087527 2719090 2555182 2625691 2672253 3071651 3222145 2977434
7249B977434o41709O8355j71971j42023L35585j43029J65870J80902K60593o1596
$$ 2977434 2335725 2404080 2232109 2090086 2425671 2282642 2448512 2629414 2890007 2828411
7239B828411k97276j73756J2529L6763o6186J68411K19073m10243l73454j16246
$$ 2828411 2531135 2357379 2369908 2406671 2340485 2508896 2727969 2317726 1944272 1828026
7229A828026K25167L800R3166j66979L9494P6131m11328J37475J01087m73941
$$ 1828026 2053193 2056993 2150159 1983180 2022674 2098805 1687477 1824952 1926039 1452098
7219A452098l26833l6889L6857j37455M77124l8764K49190k2976k12473J11390
$$ 1452098 1125265 1088376 1125233 987778 1464902 1426138 1675328 1652352 1439879 1551269
7209A551269J37116p6758l52082k51566J11246j81701J57276K87135k40173K0184
$$ 1551269 1688385 1611627 1259545 1007979 1119225 937524 1094800 1381935 1141762 1161946
7199A161946K2814l17683r2624N3976n0993j61046N54112j98593j42985R8925
$$ 1161946 1184760 867077 774453 828429 777436 616390 1170502 971909 828924 927849
7189I27849n4246q2134O1811N46j49051J28043O0194K20287J39434O2164j42330
$$ 927849 873603 791469 853280 853826 704775 832818 893012 1113299 1252733 1314897 1172567
7178A172567K35396o2532K52158J0676l23586k1819k5436k9415j44150K0235K79000
$$ 1172567 1407963 1345431 1597589 1608265 1284679 1262860 1237424 1208009 1063859 1084094 1363094
7167A363094j24535p1512J95480j33947J24857J5879J74882J83490k13580J03803
$$ 1363094 1238559 1167047 1362527 1228580 1353437 1369316 1544198 1727688 1514108 1617911
7157A617911n82614M02515K48704q03203K97551N46081j68006Q1235o865J21302
$$ 1617911 1035297 1437812 1686516 883313 1180864 1726945 1558939 1640174 1633309 1754611
7147A754611J39807l10336l06360L54753L1114L09973O20345l69268k10253O15086
$$ 1754611 1894418 1584082 1277722 1632475 1663589 1973562 2593907 2224639 2014386 2629472
7137B629472l07021m00650L4166k14768l43115J32356O39901l29598j35887M67377
$$ 2629472 2322451 1921801 1955967 1741199 1398084 1530440 2170341 1840743 1704856 2172233
7127B172233j22193k42391J75202n5335j07644k79941J37724k69350n1083J66037
$$ 2172233 2050040 1807649 1982851 1927516 1819872 1539931 1677655 1408305 1357222 1523259
7117A523259k93495j02331K38771o9221K35417K87467j09087r3066R4899K85577
$$ 1523259 1229764 1127433 1366204 1296983 1532400 1819867 1710780 1617714 1712613 1998190
7107A998190n71804K57843K91767q5807J3965o2038m47447m34862K4369K20067
$$ 1998190 1426386 1684229 1975996 1890189 1904154 1842116 1394669 959807 984176 1204243
7097A204243m7730j74323m11723M23410O22238k17165j16372K13409j13900m7463
$$ 1204243 1156513 982190 570467 993877 1616115 1398950 1282578 1495987 1382087 1334624
7087A334624k28520k93815k87208M67K88698J10149J3273J13719J31407j85166
$$ 1334624 1106104 812289 525081 525548 814246 924395 937668 1051387 1182794 997628
7077I97628l14195j81091j93661j24258K06685N25372m5980j05549j20414j06282
$$ 997628 683433 502342 308681 184423 391108 916480 870500 764951 644537 538255
7067E38255J09290k43811R7616L25881l097O677J39796l78761J55899j99869k62495
$$ 538255 647545 403734 501350 827231 824134 830811 970607 591846 747745 547876 285381
7056B85381J65184J05459L69067K13955J16558j02910j99237Q5317j90864J43968
$$ 285381 450565 556024 925091 1139046 1255604 1152694 953457 1038774 847910 991878
7046I91878j55167M2371k793J31391j82326J32277N4990k57043R4887J86844j25612
$$ 991878 836711 879082 876289 1007680 825354 957631 1012621 755578 850465 1037309 911697
7035I11697o3167K04983J9093k11362l97394K97430j10018J89364K57436L40708
$$ 911697 848530 1053513 1072606 861244 463850 761280 651262 840626 1098062 1438770
7025A438770l45723n39243K0127K86212j65469Q1880n9863K33156K93532k21764
$$ 1438770 1093047 553804 573931 860143 694674 776554 716691 949847 1243379 1021615
7015A021615O3956j01206L9631K61776k69407m5390J46761n58639L53648N2299
$$ 1021615 1085571 984365 1023996 1285772 1016365 970975 1117736 559097 912745 965044
7005I65044J75493J22628o3284m05614P8694J5829K84318K46133j70668O6149
$$ 965044 1140537 1263165 1199881 794267 872961 888790 1173108 1419241 1248573 1314722
6995A314722k01781o1274K3221k29798K76481J43238k31423m5066L33727K99464
$$ 1314722 1112941 1051667 1074888 845090 1121571 1264809 1033386 988320 1322047 1621511
6985A621511n2270l00747q9228J32053K1187j80639J95394K74782n0276l43502
$$ 1621511 1569241 1268494 1179266 1311319 1332506 1151867 1347261 1622043 1571767 1228265
6975A228265M03338L10261j98758k84116J37233N876L39233o1858m49343k55251
$$ 1228265 1631603 1941864 1743106 1458990 1596223 1602099 1941332 1879474 1430131 1174880
6965A174880K7512r2895R2601M0120j61817J68161O0933J87140K56570K19436
$$ 1174880 1202392 1109497 1202098 1242218 1080401 1248562 1309495 1496635 1753205 1972641
6955A972641m30059k0997L45316J54837k5315k23267m11969q485R7281L12854
$$ 1972641 1542582 1521585 1866901 2021738 1996423 1773156 1361187 1352702 1449983 1762837
6945A762837j91302P977q8355j98182M18345L37653j96759L99072J31661J65039
$$ 1762837 1571535 1579512 1491157 1292975 1711320 2048973 1852214 2251286 2382947 2547986
6935B547986J63542m45607j80166J63716K14468j15508j28283J40980q6259k05119
$$ 2547986 2711528 2265921 2085755 2249471 2463939 2348431 2220148 2361128 2274869 2069750
6925B069750j02565J99853j42594K28531k4174m31618n83631K46978K83870J92276
$$ 2069750 1967185 2167038 2024444 2252975 2228801 1797183 1213552 1460530 1744400 1936676
6915A936676K82109k6898J37156j90697M3699J76728K09702M18944L529L29253
$$ 1936676 2218785 2191887 2329043 2138346 2182045 2358773 2568475 2987419 2990948 3320201
6905C320201P0946k15143k2941R1592m28174p8585j38536J83363l13104J50262
$$ 3320201 3391147 3176004 3153063 3244655 2816481 2737896 2599360 2782723 2469619 2619881
6895B619881Q3455k12088J04829J78764o0660o7795k67341J26162J18905J03596
$$ 2619881 2703336 2491248 2596077 2774841 2714181 2646386 2379045 2505207 2624112 2727708
6885B727708k85649o5549j72741p3403M27117r8116p2725Q7411L72610L6173j80520
$$ 2727708 2442059 2376510 2203769 2130366 2557483 2459367 2386642 2474053 2846663 2882836 2702316
6874B702316m09123L75736k21315j81405k39676K07751K24615p9139l092k03569
$$ 2702316 2293193 2668929 2447614 2266209 2026533 2234284 2458899 2379760 2376668 2173099
6864B173099J64738k74051J34376J77343j2066R0254J40564L88962l21775J52530
$$ 2173099 2337837 2063786 2198162 2375505 2363439 2453693 2594257 2983219 2661444 2813974
6854B813974j09450K98268L8680M36424k57817j80616j87580L29326k88759J70772
$$ 2813974 2704524 3002792 3041472 3477896 3220079 3039463 2851883 3181209 2892450 3063222
6844C063222j92287j95180J04704N7150R1335j08138k70543K38571K1849r4987
$$ 3063222 2870935 2675755 2780459 2837609 2928944 2820806 2550263 2788834 2810683 2715696
6834B715696j91525l6474M36349k7783K20619J06388K35416q9833j08505j18301
$$ 2715696 2524171 2487697 2924046 2896263 3116882 3223270 3458686 3368853 3260348 3142047
6824C142047P9266J90109n3110J7833J25486m20928L00594q0506K2860K94303
$$ 3142047 3221313 3411422 3358312 3376145 3501631 3080703 3381297 3300791 3323651 3617954
6814C617954k60662K84166L05643j18954K28161M50616K04525k21325l34810k43068
$$ 3617954 3357292 3641458 3947101 3828147 4056308 4506924 4711449 4490124 4155314 3912246
6804C912246M4905O4743L99814q0675K6909j05011M8387J58838M67422j1735k36863
$$ 3912246 3957151 4021894 4421708 4341033 4367942 4262931 4311318 4470156 4937578 4925843 4688980
6793D688980L9564j45268k527k43592J96047j91743J24783K86115K06578N5702
$$ 4688980 4728544 4583276 4580749 4337157 4533204 4341461 4466244 4752359 4958937 5014639
6783E014639J5969k32066R3363L72697Q8350J43004j84928n7661L46680N45627
$$ 5014639 5030608 4798542 4891905 5264602 5352952 5495956 5311028 5253367 5600047 6145674
6773F145674J5549j01961R6606o1077K28036L51477k97841N62891J8442K00445
$$ 6145674 6161223 6059262 6155868 6094791 6322827 6674304 6376463 6939354 6957796 7158241
6763G158241N75229N70212J55463Q36214M90383L09841K41196l64355J18812K5640
$$ 7158241 7733470 8303682 8459145 9295359 9785742 10095583 10336779 9972424 10091236 10116876
6753A0116876l2246l45589J59383k45514Q4155L57651n13938J19487O85792L03673
$$ 10116876 10084630 9739041 9898424 9652910 9737065 10094716 9580778 9700265 10386057 10689730
6743A0689730M67418J39944N30591J026598P89166J190032J106502J458894J323695
$$ 10689730 11157148 11297092 11827683 12854281 13643447 14833479 15939981 17398875 18722570
6734A8722570J189165J938978O54514M17057M1305n58267j350300r58958j636075
$$ 18722570 19911735 21850713 22505227 22922284 22963589 22405322 21055022 20096064 18459989
6725A8459989j119064p06388m26981j88837k42032K69532r2829M20267K73418
$$ 18459989 17340925 16634537 16207556 16018719 15776687 16046219 15953390 16373657 16647075
6716A6647075J76827J62681P04899J095519J601394J512320J986230K480603J765685
$$ 16647075 16823902 16986583 17691482 18787001 20388395 21900715 23886945 26367548 28133233
6707B8133233K295352K301293R71940Q473j191652j846228k714288k545608k265538
$$ 28133233 30428585 32729878 33701818 33710291 32518639 30672411 27958123 25412515 23146977
6698B3146977k797543j385244j223880r42092r56873p16651j73714j04179q1176
$$ 23146977 20349434 18964190 17740310 16798218 15841345 15124694 14950980 14846801 14765625
6689A4765625K30554O85324L94909O02196Q66855J306904O96641J538545J600968
$$ 14765625 14996179 15681503 16076412 16678608 17545463 18852367 19549008 21087553 22688521
6680B2688521J174423R81403Q56402p5851q06288j317046j909339j648235j601734
$$ 22688521 23862944 24844347 25700749 25624898 24818610 23501564 21592225 19943990 18342256
6671A8342256j169056r67809r95226n61434n00233n74796o40763j21570m70851
$$ 18342256 17173200 16205391 15210165 14648731 14148498 13573702 12932939 12811369 12340518
6662A2340518k03288K8964P9711j76953l95743M29380K74160L21975L61398P78883
$$ 12340518 12137230 12166194 12245905 12068952 11673209 12102589 12376749 12698724 13060122 13839005
6652A3839005J95767k11794m93339o05509n75934l97489n91661r59768m71169
$$ 13839005 14034772 13822978 13329639 12724130 12148196 11750707 11159046 10199278 9728109
6643I728109l12112k49341p12220J02665P412k1569M75109l14575o5868j43145
$$ 9728109 9415997 9166656 8454436 8557101 8564513 8542944 9018053 8703478 8637610 8494465
6633H494465k78592J80201j69959j03649k63895q09779M10666j8257k47826J87077
$$ 8494465 8215873 8396074 8226115 8122466 7858571 7048792 7459458 7441201 7193375 7380452
6623G380452q0950L65361J75259k99158l09896k09375l75915j92781n41023l6713
$$ 7380452 7299502 7664863 7840122 7540964 7231068 7021693 6645778 6452997 5911974 5875261
6613E875261j90996o4501j93235n90487L2537K60204n25323N6509L52492k13321
$$ 5875261 5684265 5619764 5426529 4836042 4868579 5128783 4603460 4659969 5012461 4799140
6603D799140m83726l81198l04165J57591l29399L59915L36344l46839k97226j79162
$$ 4799140 4315414 3934216 3630051 3787642 3458243 3818158 4154502 3807663 3510437 3331275
6593C331275J02423j36380k9139n27k736m23358K94660l08085j26885l0073k92184
$$ 3331275 3433698 3297318 3268179 3267652 3264916 2841558 3136218 2828133 2701248 2671175 2378991
6582B378991J14163Q6282J3906j51104k89450J06361m5106k7579r0397M45936
$$ 2378991 2493154 2579436 2593342 2442238 2152788 2259149 2214043 2186464 2096067 2542003
6572B542003J34397j38782l70751K19561k13095J19517k40131K61203m2705j21665
$$ 2542003 2676400 2537618 2166867 2386428 2173333 2292850 2052719 2313922 2271217 2149552
6562B149552K80448L77702l74480n95634N18934N55269k86119k54415J79790j4205
$$ 2149552 2430000 2807702 2433222 1837588 2356522 2911791 2625672 2371257 2551047 2536842
6552B536842L88287j69656k81589k37346r116L59598j5889P5258K63383P2512
$$ 2536842 2925129 2755473 2473884 2236538 2227422 2587020 2571131 2646389 2909772 2982284
6542B982284k03534J77228P4027J59793o8014l14862L22174l2737m83401Q9583
$$ 2982284 2778750 2955978 3030005 3189798 3121784 2806922 3129096 3096359 2612958 2702541
6532B702541M76137k05996j11190K26376J47202O2425q7874k74410j2830M98011
$$ 2702541 3178678 2972682 2861492 3087868 3235070 3297495 3209621 2935211 2922381 3420392
6522C420392J70446m01723m7972k08245M67300K30520k25916L02284n5932J39815
$$ 3420392 3590838 3189115 3141143 2932898 3400198 3630718 3404802 3707086 3651154 3790969
6512C790969j14247k932N01563k54495n0056P5589J90927J15438K04947k91312
$$ 3790969 3676722 3673790 4175353 3920858 3870802 3946391 4137318 4252756 4457703 4166391
6502D166391R1465l0001J74805k97720k92994K51813K8531j7052N76543k87043
$$ 4166391 4257856 4227855 4402660 4104940 3811946 4063759 4092290 4075238 4651781 4364738
6492D364738L348m84166j20351N20363J43147k8229k02116j03491l0660P3017
$$ 4364738 4368086 3883920 3763569 4283932 4427079 4398850 4196734 4093243 4062583 4135600
6482D135600J27007K9048J5596L33311j06215q1685J46323K33707K29247N4981
$$ 4135600 4262607 4291655 4307251 4640562 4534347 4452662 4598985 4832692 5061939 5116920
6472E116920l09094o0450K22909J30296l77278O0651J79850P3978m2362n1483
$$ 5116920 4807826 4747376 4970285 5100581 4723303 4783954 4963804 5037782 4995420 4943937
6462D943937q428J98042R5881j39624j33915o4631K14831M85098j55303J67423
$$ 4943937 4935509 5133551 5229432 5089808 4955893 4891262 5106093 5591191 5435888 5603311
6452E603311K97993j77615l30668J32066N22892J47465n18780j02814K52542R8513
$$ 5603311 5901304 5723689 5393021 5525087 6047979 6195444 5676664 5573850 5826392 5924905
6442E924905N12249j09619J60069m77661K47350P08596L69476n76701L67985K16389
$$ 5924905 6437154 6327535 6487604 6009943 6257293 6965889 7335365 6758664 7126649 7343038
6432G343038j80925j29643O12369K81688Q7063O82490K48997J68546j48097M12366
$$ 7343038 7162113 7032470 7644839 7926527 8013590 8696080 8945077 9113623 8965526 9377892
6422I377892P7739L99086J98349M28883j36659L07839L33442P35057N40326K22489
$$ 9377892 9455631 9854717 10053066 10481949 10345290 10653129 10986571 11721628 12261954 12484443
6412A2484443J94714K77375j89985M0609j77703K59168K9118J70357l31069k57690
$$ 12484443 12679157 12956532 12766547 12807156 12629453 12888621 12917739 13088096 12757027 12499337
6402A2499337K50138J00154M12410l68366J93088M28952L0177L89299N12349j6701
$$ 12499337 12749475 12849629 13262039 12893673 13086761 13515713 13545890 13935189 14447538 14430837
6392A4430837L60279k81885k8764Q1311l03997j97928k09113l41222j45853N0621
$$ 14430837 14791116 14509231 14480467 14561778 14257781 14059853 13850740 13509518 13363665 13414286
6382A3414286n30513q60385j81157j7481n8237p49535l73859P5137k45401K07590
$$ 13414286 12883773 12023388 11842231 11824750 11766513 11016978 10643119 10718256 10472855 10680445
6372A0680445k57486j1101J77843K2677j02376j11556K02328K31660j15156l36606
$$ 10680445 10422959 10411858 10589701 10612378 10510002 10398446 10600774 10832434 10717278 10380672
6362A0380672q1835L79851p037K46309J04019r3213q6981K91192p4687Q0485m65083
$$ 10380672 10298837 10678688 10671651 10917960 11021979 10928766 10841785 11132977 11058290 11138775 10673692
6351A0673692j00914K51563J09807n3296Q3634K46116m51090j75350O4847j36923
$$ 10673692 10572778 10824341 10934148 10880852 10964486 11210602 10759512 10584162 10649009 10512086
6341A0512086O3238M47962K09840l26814j61890K11113k98564r6248j67228K33234
$$ 10512086 10575324 11023286 11233126 10906312 10744422 10955535 10656971 10560723 10393495 10626729
6331A0626729K31753K27845k10915j14045k04037l08764L6997K30331j08746k49303
$$ 10626729 10858482 11086327 10875412 10761367 10557330 10248566 10285563 10515894 10407148 10157845
6321A0157845j20875J89136n08031k56830K63394k83799k27012m8411l08048k30969
$$ 10157845 10036970 10226106 9718075 9461245 9724639 9440840 9213828 9165417 8857369 8626400
6311H626400m2668J19721j78441n61118J47455J19208l19364l52558k91341K9989
$$ 8626400 8583732 8703453 8525012 7963894 8111349 8230557 7911193 7558635 7267294 7297283
6301G297283k1429j20126J42768m1163o90360o3118L90218J64460J27797r1022
$$ 7297283 7275854 7155728 7298496 7257333 6566973 6503855 6894073 7058533 7186330 7095308
6291G095308J47577P2920m18486J2983l05531l36843M98303q1867j82022j82792
$$ 7095308 7242885 7315805 6897319 6910302 6604771 6267928 6766231 6684364 6502342 6319550
6281F319550j8033K42783O759O8294j88583k71910k35401L45900L58491J37008
$$ 6319550 6301517 6544300 6551059 6619353 6430770 6158860 5923459 6269359 6627850 6764858
6271F764858r5645o04246L82647Q21584n84887n72465L25622k45086k25041M21918
$$ 6764858 6669213 6064967 6447614 7269198 6684311 6111846 6437468 6192382 5967341 6389259
6261F389259J37305l99969p6129J16797j1750K06064J00365J83965j97739j69687
$$ 6389259 6526564 6126595 6050466 6167263 6155513 6361577 6461942 6645907 6448168 6278481
6251F278481R0051K25938P3383k32299J75977J01612k71890k88077k08813J04195
$$ 6278481 6368532 6594470 6667853 6435554 6611531 6713143 6441253 6153176 5944363 6048558
6241F048558L39845J16992m16099J22741L56719j0551q3897K77582L69320Q4770
$$ 6048558 6388403 6505395 6089296 6212037 6568756 6558205 6474308 6751890 7121210 7205980
6231G205980l4599K22938j14613p9343j40326k27601R6959K76119M317l99766
$$ 7205980 7171381 7394319 7279706 7200363 7060037 6832436 6929395 7205514 7209831 6810065
6221F810065k61778J27721j14233o83957K86511k27565L60728R0779o1972j24208
$$ 6810065 6548287 6676008 6561775 5877818 6164329 5936764 6297492 6388271 6326299 6202091
6211F202091N29364j63068J73303M01516K05083N42650Q4636O31456L06051L70052
$$ 6202091 6731455 6568387 6741690 7143206 7348289 7890939 7975575 8607031 8913082 9283134
6201I283134P43249J22871J20100n76673p31747k92341k77321J92711l12976k32362
$$ 9283134 10026383 10149254 10269354 9692681 8960934 8668593 8391272 8583983 8271007 8038645
6191H038645k01976J1264J96771L33180J76746o3323l01433L72546J87773O94314
$$ 8038645 7836669 7847933 8044704 8377884 8554630 8491307 8189874 8562420 8750193 9444507
6181I444507M75989L37303Q70413K44309K78158J80960R05448J241134N45207
$$ 9444507 9920496 10257799 11128212 11372521 11650679 11831639 12737087 13978221 14523428
6172A4523428K28625J44780k41850o4615p72974n22361J2708k30891j43244R613
$$ 14523428 14752053 14896833 14654983 14590368 13817394 13295033 13307741 13076850 12933606 12943219
6162A2943219j10404K38021K79702K00116L51084r3929N9918k13160k77687l51448
$$ 12943219 12832815 13070836 13350538 13550654 13901738 13807809 13867727 13654567 13376880 13025432
6152A3025432k28892j22553L82475R9704M45637M85295P40378O25297L77791M85137
$$ 13025432 12796540 12673987 13056462 13156166 13601803 14087098 14827476 15452773 15830564 16315701
6142A6315701M87951J46750l00573m44407m26261l99440K09420Q6285K17692P50799
$$ 16315701 16803652 16950402 16649829 16205422 15779161 15379721 15589141 15675426 15893118 16643917
6132A6643917O069j92934j30375l535n2575k5358o60861q79708m54851k73776
$$ 16643917 16649986 16457052 16326677 16323142 16270567 16245209 15584348 14704640 14249789 13976013
6122A3976013n59802k10790J25759k31786j94852j97927K16211j2393j27012K05189
$$ 13976013 13416211 13205421 13331180 13099394 12904542 12706615 12922826 12910433 12783421 12988610
6112A2988610Q79j33462L15307M13728k27033j33404k64295M91436K38771K41833
$$ 12988610 12989489 12856027 13171334 13585062 13358029 13224625 12960330 13451766 13690537 13932370
6102A3932370k92702m25322J14699j66903j049250q96748q6396m53727q75418
$$ 13932370 13639668 13214346 13329045 13162142 12112892 11216144 11129748 10676021 9800603
6093I800603j09725j94312m94043n60795L80431R457k66954j13503o06372l55922
$$ 9800603 9690878 9496566 9002523 8441728 8822159 8831616 8564662 8451159 7844787 7488865
6083G488865q2670J83195Q7668K69640K77513o2756J72842k5599J74821k54774
$$ 7488865 7406195 7589390 7677058 7946698 8224211 8161455 8334297 8308698 8483519 8228745
6073H228745m34742K60968n05506J42830m23598m6110l16758K18499K09967k52528
$$ 8228745 7794003 8054971 7549465 7692295 7268697 7222587 6905829 7124328 7334295 7081767
6063G081767l27268j30994q0783k10929j88523l21222k51972k00642M6796r5518
$$ 7081767 6754499 6623505 6542722 6331793 6143270 5822048 5570076 5369434 5416230 5320712
6053E320712M129l73667m5044k82M59251J6572r2638m45887j09307m687M3598
$$ 5320712 5324841 4951174 4906130 4905848 5365099 5381671 5289033 4843146 4733839 4729152 4772750
6042D772750J22845l18131J47683J73420L21588M2981k49896m7430J34371n17473
$$ 4772750 4895595 4577464 4725147 4898567 5220155 5263136 5013240 4965810 5100181 4582708
6032D582708K8392p2346M9573J16402J56058n23918J23631j80044j33620L09161
$$ 4582708 4611100 4538754 4588327 4704729 4860787 4336869 4460500 4280456 4146836 4455997
6022D455997N0435J15623k85049m26993L65429J08646J71531K79194l91743j03062
$$ 4455997 4506432 4622055 4337006 3910013 4275442 4384088 4555619 4834813 4443070 4340008
6012D340008J30302n9100K60980Q8258k36452J41212k91401k6712K29722L41258
$$ 4340008 4470310 4411210 4672190 4760448 4523996 4665208 4373807 4347095 4576817 4918075
6002D918075j36476k02507l77117j70259J39214K53859N4878R5819n47591P5428
$$ 4918075 4781599 4579092 4201975 4031716 4170930 4424789 4479667 4575486 4027895 4103323
5992D103323M76489N5560Q8147K28968j92767J22979L0702k08671K21656J31965
$$ 4103323 4579812 4635372 4723519 4952487 4759720 4882699 4913401 4704730 4926386 5058351
5982E058351k1402L07733j58209J20880L26567n61936l50140J50764J62871j570
$$ 5058351 5036949 5344682 5186473 5307353 5633920 5071984 4721844 4872608 5035479 5033909
5972E033909j72023J18795L59215m60786j03076j1490k34746K28781J42897J22328
$$ 5033909 4861886 4980681 5339896 4879110 4776034 4764544 4529798 4758579 4901476 5023804
5962E023804M18884M3849k4606j44522L02129J05868k92536O1427l95329J57026
$$ 5023804 5442688 5486537 5461931 5317409 5619538 5725406 5432870 5494297 5098968 5255994
5952E255994P8280J45434k00003K94552J07702l06265Q1740N28385J31186R561
$$ 5255994 5334274 5479708 5279705 5574257 5681959 5375694 5457434 5985819 6117005 6126566
5942F126566k4796m18191P62822M72356q1327Q9455j07369j70472M74566J75614
$$ 6126566 6101770 5683579 6446401 6918757 6837430 6926885 6819516 6649044 7123610 7299224
5932G299224L73274j63162L26121k8863R4227M51961O956K84529L69885N76357
$$ 7299224 7672498 7509336 7835457 7806594 7900821 8352782 8359738 8644267 9014152 9590509
5922I590509L23878M9947o8898M65545O87917M30841O07515J124186J144387R23614
$$ 9590509 9914387 9964334 9895436 10360981 11048898 11479739 12087254 13211440 14355827 15279441
5912A5279441Q96592J031553O11251R95674J187426O48411Q24266j15926j73870
$$ 15279441 16176033 17207586 17818837 18814511 20001937 20650348 21474614 21358688 21184818
5903B1184818l17630k20199l53605n21830k82858o40167k62897m83952j01995
$$ 21184818 20867188 20646989 20293384 19771554 19488696 18848529 18585632 18101680 17999685
5894A7999685l70227n16273l77943k42315m67346J74971m6419J94771N90666K54604
$$ 17999685 17629458 17113185 16735242 16492927 16025581 16200552 16154133 16348904 16939570 17194174
5884A7194174Q87720O68344P84436Q13664R93961R74870R98677R60594J080895
$$ 17194174 18081894 18750238 19534674 20348338 21342299 22317169 23315846 24276440 25357335
5875B5357335O03854L23432J03043M12965P34350l374K90786N15169L49471P59879
$$ 25357335 25961189 26284621 26387664 26800629 27534979 27531605 27822391 28337560 28687031 29446910
5865B9446910K24374M02734N44860n805J91981n6829L55967K55181J50271n74196
$$ 29446910 29671284 30074018 30618878 30613073 30805054 30748225 31104192 31359373 31509644 30935448
5855C0935448o65811j252205p39853j642408j608303j101236j263653p04068q23443
$$ 30935448 30269637 29017432 28277579 26635171 25026868 23925632 22661979 21957911 21134468
5846B1134468p65819n71782K0029j8429L43840M54046N44679J88817M67073J54255
$$ 21134468 20368649 19796867 19816896 19798467 20142307 20596353 21141032 21329849 21796922 21951177
5836B1951177N02509M48761N13238N96410O65006M68955N65392O52051J08999
$$ 21951177 22453686 22902447 23415685 24012095 24677101 25146056 25711448 26363499 26472498
5827B6472498O57027j60380n50081j60445j078420j417538q73756j333257j402951
$$ 26472498 27129525 26969145 26419064 26258619 25180199 23762661 22888905 21555648 20152697
5818B0152697o40141p96883p43157o25681m35191o30436m18090m53828k59245
$$ 20152697 19512556 18715673 17972516 17346835 16911644 16281208 15863118 15409290 15150045
5809A5150045J21851j28882k68519L8000L52729k19147m21372K77096k01365K19864
$$ 15150045 15271896 15143014 14874495 14912495 15265224 15046077 14624705 14901801 14700436 14920300
5799A4920300N12083j97537n19J18121J055220J013665J189294K025829K191159
$$ 14920300 15432383 15234846 15234327 15352448 16407668 17421333 18610627 20636456 22827615
5790B2827615L376914L161384L176340J407702o27494k080625k903122l017133
$$ 22827615 26204529 29365913 32542253 33949955 33322461 31241836 28338714 25321581
5782B5321581k555837j900029j432584o43719m34908p12863n71612p7213j30625
$$ 25321581 22765744 20865715 19433131 18789412 18354504 17641641 17070029 16992816 16862191
5773A6862191j74941J9909K14298k28058L0604k10154n10739k01546j73720j55295
$$ 16862191 16687250 16707159 16921457 16693399 16724003 16513849 16003110 15801564 15627844 15472549
5763A5472549K90336J75691K44713L2793L62468M03061M98433k38331o2023k5960
$$ 15472549 15762885 15938576 16183289 16216082 16578550 16981611 17480044 17241713 17179690 17153730
5753A7153730k26902p5915J28444l2923m5222L34530N63517j38719L18954Q16396
$$ 17153730 16926828 16850913 16979357 16946434 16901212 17235742 17799259 17660540 17979494 18795890
5743A8795890L30144L88791O19527L17411N28163N65342J09773K13150P01782
$$ 18795890 19126034 19514825 20134352 20451763 20979926 21545268 21655041 21868191 22569973
5734B2569973M20069q4777K39587N1239m29205j52406K02546k14724m50573k83442
$$ 22569973 22990042 22905265 23144852 23196091 22766886 22614480 22817026 22602302 22151729 21868287
5724B1868287l11157J08785N19773J46534J35820J84928K74218Q5201P85263Q28296
$$ 21868287 21557130 21665915 22185688 22332222 22468042 22652970 22927188 23012389 23797652 24625948
5714B4625948K6437j20727j6197J89988K62459N12534k59173J74917M63870N62261
$$ 24625948 24652385 24531658 24515461 24705449 24967908 25480442 25221269 25396186 25860056 26422317
5704B6422317L83807K19035O23473O13671P53182O19527N89004O25339P92842
$$ 26422317 26806124 27025159 27648632 28262303 29015485 29635012 30224016 30849355 31642197
5695C1642197O26746P2765K02897L79279m08553K54427K45193k16771l03353L54343
$$ 31642197 32268943 32341708 32544605 32923884 32515331 32769758 33014951 32798180 32494827 32849170
5685C2849170j34034q74524n85549O0068l88141m16054k38479l56761p8994O02411
$$ 32849170 32715136 31840612 31255063 31315131 30926990 30510936 30272457 29915696 29836702 30439113
5675C0439113r0641j60818l63404k07097L27950N58067P46415O0775J7300L25165
$$ 30439113 30348472 30187654 29824250 29617153 29945103 30503170 31249585 31310360 31327660 31652825
5665C1652825N33765Q59268M62767J5693P38520K05883J38081l53334o93411m24050
$$ 31652825 32186590 33045858 33508625 33524318 34262838 34468721 34606802 34253468 33560057 33136007
5655C3136007o6062n39187k98626j23441o05429m93388k94397o23855m15564O0660
$$ 33136007 33069945 32530758 32232132 32108691 31503262 31009874 30715477 30091622 29676058 29736718
5645B9736718p05070l82682L48166l75816l64268k19622j44631n9456n95895R985
$$ 29736718 29031648 28648966 28997132 28621316 28257048 28037426 27892795 27833339 27237444 27247429
5635B7247429m77741n98896k40087m87813j41518l85383n36000o78418m82963
$$ 27247429 26769688 26170792 25930705 25442892 25301374 24915991 24379991 23701573 23218610
5626B3218610k41105K13613N4121M02117R0705K50193P60766K09680N07131M49102
$$ 23218610 22977505 23191118 23245239 23647356 23738061 23988254 24749020 24958700 25465831 25914933
5616B5914933J56484J32328K87726K90710p7260N1835K97043l23214J63068p18535
$$ 25914933 26071417 26203745 26491471 26782181 26704921 26756756 27053799 26730585 26893653 26175118
5606B6175118n58323o59407n61807j58339r44309j097573l05045o83534o69549
$$ 26175118 25616795 24957388 24395581 24237242 23292933 22195360 21890315 21206781 20537232
5597B0537232p00271n69182M1947k66314l92854m38160l25268M9037k68107k71195
$$ 20537232 19836961 19267779 19309726 19043412 18650558 18212398 17887130 17936167 17668060 17396865
5587A7396865J40416j05524j10022K6856p3675q1234P6342K51412O62005J05968
$$ 17396865 17537281 17431757 17321735 17348591 17274916 17193682 17270024 17521436 18183441 18289409
5577A8289409J26270J00857j2497j43563J42142J99274L32765M43358n2530L0534
$$ 18289409 18415679 18516536 18504039 18360476 18502618 18701892 19034657 19478015 19425485 19456019
5567A9456019J90623m1055j95563O7508K92967K5020m06756k59066n02949J01059
$$ 19456019 19646642 19605587 19410024 19477532 19770499 19795519 19388763 19129697 18626748 18727807
5557A8727807M58300L47082Q0467j83205k29472k09224J91344P41472K6728J75230
$$ 18727807 19186107 19533189 19613656 19430451 19200979 18991755 19183099 19924571 19951299 20126529
5547B0126529P35939L42681L78894O80895N77201R08034J532560J544769K789032
$$ 20126529 20862468 21205149 21584043 22264938 22842139 23750173 25282733 26827502 29616534
5538B9616534K935941L553333M664645N538975M540225J712119j799029l420573
$$ 29616534 32552475 36105808 40770453 46309428 50849653 52561772 50762743 47342170
5530D7342170m130781l811248l773706l118395k085419o30613j216371m61322
$$ 47342170 43211389 39400141 35626435 32508040 30422621 29792008 28575637 28114315
5522B8114315r4715j10037N5076J15167j56756j20810M14051J98460M41960K97278
$$ 28114315 28019600 27909563 27964639 28079806 27923050 27802240 28216291 28414751 28856711 29153989
5512B9153989J79282K04372N19214K45557K74720J037987Q12654N13842K01072
$$ 29153989 29333271 29537643 30056857 30302414 30577134 31615121 32427775 32941617 33142689
5503C3142689O9329j9928m79570p53606k90482k59772r8998K92458M7860N15980
$$ 33142689 33212018 33192090 32712520 31958914 31668432 31408660 31309662 31602120 31649980 32165960
5493C2165960O39028M10085M70904J138436P28554N10782J18442M65053j31027
$$ 32165960 32804988 33215073 33685977 34824413 35552967 36063749 36182191 36647244 36516217
5484C6516217M00895M79045P75337N89472N10141L29490J65447P683K4465L87833
$$ 36516217 36917112 37396157 38171494 38760966 39271107 39600597 39766044 39773727 39798192 40186025
5474D0186025K84259l65065r1197j45671n18668J50357N35949L20165Q53628J007580
$$ 40186025 40470284 40105219 40014022 39868351 39349683 39500040 40035989 40356154 41209782 42217362
5464D2217362M83541m54431p91029q31897j797095j757310j112484j224509j055769
$$ 42217362 42700903 42246472 41455443 40623546 38826451 37069141 35956657 34732148 33676379
5455C3676379l97772m88739j89353k51890j94008J13279l25594l0467J82711P58599
$$ 33676379 33278607 32789868 32600515 32348625 32154617 32267896 31942302 31911835 32094546 32853145
5445C2853145j46802J10641O78035K88090O27778M66239o0656O8257J63416j59050
$$ 32853145 32706343 32816984 33495019 33783109 34410887 34877126 34816470 34884727 35048143 34889093
5435C4889093j36001m25386k42088r97325j488879j483399j287286j418116j030221
$$ 34889093 34753092 34327706 34085618 33088293 31599414 30116015 28828729 27410613 26380392
5426B6380392r12069p34177n39732n54758n14097k82363J4888J18802Q6631l3158
$$ 26380392 25468323 24734146 24194414 23639656 23125559 22843196 22858084 22976886 23063517 23030359
5416B3030359l37244J22265N09525M65963k09243p42638k44424m09019j02638
$$ 23030359 22693115 22815380 23324905 23790868 23581625 22838987 22594563 22185544 22082906
5407B2082906l96782m74584j65632n9141P1890o95166k54150J0079m62527l77745
$$ 22082906 21686124 21211540 21045908 20986767 21058657 20363491 20109341 20119420 19656893 19279148
5397A9279148p16555J93870l27106n86385k13963m66723k95135l71932J47396
$$ 19279148 18562593 18756463 18429357 17842972 17629009 17162286 16867151 16495219 16642615
5388A6642615N19997K9406j6417q0526K87522k74666n8797m3428r3392K14974
$$ 16642615 17162612 17192018 17175601 17095075 17382597 17107931 17049134 17005706 16912314 17127288
5378A7127288K75243M23620L45191O70639R05436O24662P11607J889007J906823
$$ 17127288 17402531 17826151 18171342 18841981 19747417 20372079 21083686 22972693 24879516
5369B4879516K162102J578860J630580J738574P48950J5246l19360p30656m10431
$$ 24879516 27041618 28620478 30251058 31989632 32738582 32753828 32434468 31703812 31293381
5360C1293381M3594q19558m91569N7889n88173o67431r97705q45741n49415n73677
$$ 31293381 31336975 30517417 30025848 30083737 29495564 28828133 27830428 26984687 26435272 25861595
5350B5861595l30125j05809O55043K96227Q1992O97888J404151K039448J789491
$$ 25861595 25531470 25425661 26080704 26376931 26458923 27156811 28560962 30600410 32389901
5341C2389901K804481K948608L438130L059175K502851K485279J437424R27726
$$ 32389901 35194382 38142990 41581120 44640295 47143146 49628425 51065849 51993575
5333E1993575P89500L17578Q46966Q60893J244474Q80680J810922R87060p38254
$$ 51993575 52783075 53100653 53947619 54808512 56052986 56933666 58744588 59731648 58993394
5324E8993394k786210l234474m116506m484867m027149k946921k309305j854524
$$ 58993394 56207184 52972710 48856204 44371337 40344188 37397267 35087962 33233438
5316C3233438j054974j168547p35102k6238M43334O45684J312564J158425J716496
$$ 33233438 32178464 31009917 30274815 30248577 30691911 31337595 32650159 33808584 35525080
5307C5525080J989530J762338J586792J106267J045553J367486J768599K091506
$$ 35525080 37514610 39276948 40863740 41970007 43015560 44383046 46151645 48243151
5299D8243151J558811J607303K72614j672952k753750l189088l574702l471372
$$ 48243151 49801962 51409265 51681879 50008927 47255177 44066089 40491387 37020015
5291C7020015k872813k472743j518160r77508j349332k98598o21289l45792M33435
$$ 37020015 34147202 31674459 30156299 29178791 27829459 27530861 26909572 26563780 26997215
5282B6997215P05129O65018J308534Q27478J226773J476658J048205N63409K47008
$$ 26997215 27702344 28367362 29675896 30503374 31730147 33206805 34255010 34818419 35065427
5273C5065427R7192R8230Q9545j73678R1489J117553J359244J303826J344066
$$ 35065427 35162619 35260849 35350394 35176716 35268205 36385758 37745002 39048828 40392894
5264D0392894J375566K031044L317332L730373L665572M009096K978185J176717
$$ 40392894 41768460 43799504 47116836 50847209 54512781 58521877 61500062 62676779
5256F2676779K04908l09148j051430j025133o46717l92999K01023n21344j083099
$$ 62676779 62881687 62572539 61521109 60495976 59849259 59456260 59657283 59135939 58052840
5247E8052840j510573j933145j657542q76534j222815n41287K25000L55127J422647
$$ 58052840 56542267 54609122 52951580 52075046 50852231 50310944 50535944 50891071 52313718
5238E2313718J790583K785489L036754K947505K663398K093679J618757L55131
$$ 52313718 54104301 56889790 59926544 62874049 65537447 67631126 69249883 69605014
5230F9605014p27116j042502l71044k86589M79108Q68262J236693N78422N31090
$$ 69605014 68877898 67835396 67464352 67177763 67656871 68525133 69761826 70340248 70871338
5221G0871338m39316j371645k378704k893696k653450k925052k826030k522972
$$ 70871338 70432022 69060377 66681673 63787977 61134527 58209475 55383445 52860473
5213E2860473k396281k788893k027949j837115j426980j001286j030048j125593
$$ 52860473 50464192 47675299 45647350 43810235 42383255 41381969 40351921 39226328
5205C9226328q14319m92866J03757K14363l509r0905L79459M23593P95353J022912
$$ 39226328 38412009 37919143 38022900 38237263 38233754 38142849 38522308 38945901 39741254 40764166
5195D0764166J628798K062454J901267K043543J260884L41628j368026m103646
$$ 40764166 42392964 44455418 46356685 48400228 49661112 50002740 48634714 44531068
5187D4531068m234365l709630l598647k952789k399774k012124j509884j061926
$$ 44531068 40296703 36587073 32988426 30035637 27635863 25623739 24113855 23051929
5179B3051929n99145r19322l63449j166182j12783l79427k70749J0880k3943j77320
$$ 23051929 22452784 21533462 21170013 20003831 19891048 19511621 19240872 19251752 19227809 19050489
5169A9050489n46748J21064L41139M04529L77618K87156Q53180O60109M63192
$$ 19050489 18503741 18624805 18965944 19370473 19748091 20035247 20888427 21548536 22011728
5160B2011728P08009Q27152K41532n16548j63528m43506p03947r61000r84903
$$ 22011728 22719737 23546889 23788421 23271873 23108345 22664839 21960892 20999892 20014989
5151B0014989r19355l50097m31253k63086m11310o44764l36496l76047n45004
$$ 20014989 19095634 18745537 18314284 18051198 17639888 16995124 16658628 16282581 15737577
5142A5737577l80933l91139K20342K69886j62398l61598J8662k69088p90503O5077
$$ 15737577 15356644 14965505 15185847 15455733 15293335 14931737 14950399 14681311 13890808 13955885
5132A3955885L35417j45923j07416O1123J9236j94585k81422Q0874J48458M35654
$$ 13955885 14291302 14145379 14037963 14099086 14118322 13923737 13642315 13723189 13871647 14307301
5122A4307301o6819l69276l4875M82068M77671J87089q582j1896K11049J01768
$$ 14307301 14240482 13871206 13836331 14318399 14796070 14983159 14974577 14962681 15173730 15275498
5112A5275498j91426K07409K92013M32487P5356K31699N30319M51775L62471J016208
$$ 15275498 15084072 15291481 15583494 16015981 16091337 16323036 16853355 17305130 17667601 18683809
5102A8683809J516197J327672K194549K963411L437982L903141M465545M803344
$$ 18683809 20200006 21527678 23722227 26685638 30123620 34026761 38492306 43295650
5094D3295650M794763M010719L390263J840309o04927l673445n135035n093340
$$ 43295650 48090413 52101132 55491395 57331704 56726777 53053332 47918297 42824957
5086D2824957m861108n345715m440849l822015k721250j938165j850829j991605
$$ 42824957 37963849 32618134 28177285 24355270 21634020 19695855 17845026 15853421
5078A5853421j530736q03039r62842p89178n17947j72636j01908n66606l77426
$$ 15853421 14322685 13519646 12556804 11767626 11249679 11077043 10975135 10408529 10031103
5069A0031103j94712k93440m32964n03538J15439k31503j29256J18393p38637
$$ 10031103 9836391 9542951 9109987 8606449 8721888 8490385 8361129 8479522 7740885
5060G740885k70704M01523J94102L08138m9106N35572O93395j98701j49854r84574
$$ 7740885 7470181 7871704 8065806 8373944 8324838 8860410 9553805 9355104 9205250 8220676
5050H220676j032360l14103q5587o56398l58470L51p8028j88512j86036M33099
$$ 8220676 7188316 6874213 6788626 6132228 5773758 5774109 5696081 5507569 5321533 5754632
5040E754632m56682k08239k35643N5858N36416k98978k31280R0539N0077l98595
$$ 5754632 5297950 5089711 4854068 4909926 5446342 5147364 4916084 5006623 5056700 4658105
5030D658105k05241j16135j23284K06967K49472J12260k99592l9472R8759k31579
$$ 4658105 4452864 4336729 4213445 4420412 4669884 4782144 4482552 4443080 4541839 4310260
5020D310260K24372k29875L97712N20650P9333l00872l35073j59879j01806J28647
$$ 4310260 4534632 4304757 4702469 5223119 5302452 5001580 4666507 4506628 4404822 4533469
5010D533469l9529j87883k72919K61374J25752l5491l96828J90000J88803j1269
$$ 4533469 4493940 4306057 4033138 4294512 4420264 4384773 3987945 4177945 4366748 4355479
5000D355479q5532q7019n4096L21413L47579M4355R6650p3098q1738M84684M37627
$$ 4355479 4269947 4182928 4128832 4450245 4797824 4842179 4938829 4865731 4783993 5268677 5706304
4989E706304L50937J31804n1619J41906K67851L4576o2096J25896n85527J9738
$$ 5706304 6057241 6189045 6137426 6279332 6547183 6581759 6519663 6645559 6060032 6079770
4979F079770k9120L9260K03033K35942K5982L27248l13210l13262J81024o6052
$$ 6079770 6050650 6089910 6292943 6528885 6554867 6882115 6568905 6255643 6436667 6370615
4969F370615P6904J4152L05786N2301L0144J32669M22637m47507m9057M05551
$$ 6370615 6447519 6461671 6767457 6819758 6849902 6982571 7405208 6957701 6908644 7314195
4959G314195M68325N96386M45346J81075O26807P46354K88972J00491n5303J97660
$$ 7314195 7782520 8378906 8824252 9005327 9632134 10378488 10667460 10767951 10712648 10910308
4949A0910308k2763J47355Q0821o9625n79804j72860n11424q35988K67995K2117
$$ 10910308 10887545 11034900 11115721 11046096 10466292 10293432 9782008 8946020 9214015 9236132
4939I236132L4535j96275m14857P3466K86291n15904K51545K36651L33777M42144
$$ 9236132 9270667 9074392 8659535 8733001 9019292 8503388 8754933 8991584 9325361 9767505
4929I767505L92138J97841J36485P09274O77600O83737R18439Q8718L60913O98804
$$ 9767505 10159643 10357484 10493969 11203243 11880843 12564580 13483019 13571737 13932650 14631454
4919A4631454O12511N51699P0656L15523N24288Q44622L93074p6715M8451r5694
$$ 14631454 15243965 15795664 15866320 16181843 16706131 17550753 17943827 17867112 17915563 17819869
4909A7819869J16718Q18069J80535L49332l61589o20026Q3613L89465M64141j99636
$$ 17819869 17936587 18754656 18935191 19284523 18922934 18302908 18386521 18775986 19240127 19040491
4899A9040491m32438o55377o34775l7448N44505J8544l58323J74078N43912L92527
$$ 19040491 18608053 17952676 17317901 17280453 17824958 17843502 17485179 17659257 18203169 18595696
4889A8595696L77388P66285P54493J213914J454603J377855N96313l40109L40104
$$ 18595696 18973084 19739369 20493862 21707776 23162379 24540234 25136547 24796438 25136542
4880B5136542O82524N73011M75540R16349O58544P14241J073800P16902P27401
$$ 25136542 25819066 26392077 26867617 27783966 28442510 29156751 30230551 30947453 31674854
4871C1674854K16028R7017k71866q59156k91244n23465r19405r89972q12220j193098
$$ 31674854 31890882 31987899 31716033 30856877 30565633 30042168 29122763 28132791 27320571 26127473
4861B6127473j256942k74178p97522J8752k11843l5058j31104J24779Q03125K52672
$$ 26127473 24870531 24596353 23798831 23817583 23605740 23570682 23439578 23564357 24367482 24620154
4851B4620154R34908P92188J016572J394269J598094J381268J089002J122434
$$ 24620154 25555062 26347250 27363822 28758091 30356185 31737453 32826455 33948889
4843C3948889J215983J613809J578407J967450J544505K542523K577684K753282
$$ 33948889 35164872 36778681 38357088 40324538 41869043 44411566 46989250 49742532
4835D9742532L672071M502388N878935Q389721J0764080J3678748J8750798K3399506
$$ 49742532 53414603 57916991 63795926 72185647 82949727 96628475 115379273 138778779
4827A38778779K8356452L4000699L4222297J3779011j4239283k7135796l1311782
$$ 138778779 167135231 201135930 235358227 249137238 234897955 207762159 176450377
4820A76450377l1622529k7989042k2226820j5891569j1316115q439782p010575
$$ 176450377 144827848 116838806 94611986 78720417 67404302 58964520 51953945
4813E1953945n612511m449504l995749k721051k404773k229679j950964j803228
$$ 51953945 46341434 41891930 37896181 35175130 32770357 30540678 28589714 26786486
4805B6786486j790832j427957j104578j159599o65167j74452p65943q43768n70449
$$ 26786486 24995654 23567697 22463119 21303520 20638353 20463901 19697958 18854190 18283741
4796A8283741p03738o97527l76206l38445p13711m71918r45246n43005l95744
$$ 18283741 17580003 16882476 16506270 16167825 15454114 14982196 14036950 13493945 13098201
4787A3098201j69883m9584k07234j94741n18489l44226k42759j02808l82447J36735
$$ 13098201 12928318 12878734 12671500 12476759 11958270 11614044 11371285 11268477 10886030 11022765
4777A1022765P8850J30585k41004k40132M737q5919O91323l37662K42734N9117
$$ 11022765 11101615 11232200 10991196 10751064 10755801 10669882 11361205 11023543 11266277 11325394
4767A1325394m44039j41369o5098k19195K8240L1227N0542k42217l86574l90267
$$ 11325394 10881355 10739986 10674888 10455693 10483933 10515160 10565702 10323485 9936911 9546644
4757I546644N15124q5086m28452p9889j90781r9019J12872K44493J33651L79879
$$ 9546644 10061768 9976682 9548230 9468341 9277560 9178541 9291413 9535906 9669557 10049436
4747A0049436K58222L97298J07182o5552j28918r9720J89242r6944r2393k81715
$$ 10049436 10307658 10704956 10812138 10746586 10617668 10517948 10707190 10610246 10517853 10236138
4737A0236138p3170N48748K05701L0595L31151L73461J53162J94277j35276j15944
$$ 10236138 10162968 10711716 10917417 10948012 11279163 11652624 11805786 12000063 11864787 11748843
4727A1748843J47267O4606j20099J66273j51127N22863K10820Q2015N60216Q06830
$$ 11748843 11896110 11960716 11840617 12006890 11855763 12378626 12589446 12671461 13231677 14038507
4717A4038507P53764N08164O83419P35614P14813O61234O48767P69481N07451
$$ 14038507 14792271 15300435 15983854 16719468 17434281 18095515 18744282 19513763 20021214
4708B0021214J048183Q07348J112954R53071N51266j05615L11971R1766n98267
$$ 20021214 21069397 21876745 22989699 23942770 24494036 24388421 24700392 24792158 24193891
4699B4193891r0122j75976J20313k02615J23705J25361M05024n9794M59027N13726
$$ 24193891 24103769 23927793 24048106 23845491 23969196 24094557 24499581 24439787 24898814 25412540
4689B5412540N42053M97805Q80405M22423Q66438J106920J243143J262820J287399
$$ 25412540 25954593 26452398 27332803 27755226 28621664 29728584 30971727 32234547 33521946
4680C3521946J406968J477014J717298K075591K030904J986191J993016J888273
$$ 33521946 34928914 36405928 38123226 40198817 42229721 44215912 46208928 48097201
4672D8097201J463021J706449K206528J315264J556664J641888J110403J459900
$$ 48097201 49560222 51266671 53473199 54788463 56345127 57987015 59097418 60557318
4664F0557318J161121J115290J858369J652974K270627K502627L255528L434182
$$ 60557318 61718439 62833729 64692098 66345072 68615699 71118326 74373854 77808036
4656G7808036M749431O056917P933152J0505170J3945914J8528274K3795676L0041921
$$ 77808036 82557467 88614384 96547536 107052706 120998620 139526894 163322570 193364491
4648A93364491L5560679M1543558M9071251N3050104M5346072J6986033j4075573
$$ 193364491 228925170 270468728 319539979 372590083 417936155 434922188 420846615
4641D20846615l1926400m0836221m6960946m8101294m1710830l4290816k6732317
$$ 420846615 388920215 348083994 301123048 253021754 211310924 177020108 150287791
4634A50287791k0470632j5491589j2794780j0654464q978575p192329n977477
$$ 150287791 129817159 114325570 101530790 90876326 81897751 74705422 68727945
4627F8727945m819358m509786m020399l616086l134951k616292k098927k363998
$$ 68727945 63908587 59398801 55378402 51762316 48627365 46011073 43912146 41548148
4619D1548148j342283j200909j081707o64335j185981j036070o52941r87722j500332
$$ 41548148 40205865 39004956 37923249 37258914 36072933 35036863 34383922 33396200 31895868
4610C1895868p81356q73907p52914p96667r76690j90528p89525n51328m7888j036023
$$ 31895868 31114512 30240605 29487691 28691024 27714334 27523806 26734281 26182953 26135065 25099042
4600B5099042l33410m23512k59012J85945o21029o21826n0707k30372l04897k08995
$$ 25099042 24765632 24342120 24083108 24269053 23648024 23026198 22975491 22745119 22440222 22231227
4590B2231227l22245m89100k12947q32747j22331o67081m58565l79562o48468
$$ 22231227 21908982 21419882 21206935 20374188 20251857 19584776 19126211 18746649 18098181
4581A8098181q36329j54382m58521o51166p47888p75757k74263J32300n45004
$$ 18098181 17261852 17107470 16648949 15997783 15249895 14474138 14199875 14332175 13787171
4572A3787171J94499O9908l22670j50801o7462l86125R9704l1227l49580N95983
$$ 13787171 13981670 14051578 13728908 13578107 13510645 13124520 13224224 13192997 12843417 13439400
4562A3439400k23026l71851n31967K39992k07881j45656j67910O46798J58170
$$ 13439400 13216374 12844523 12312556 12552548 12344667 12199011 12031101 12677899 12836069
4553A2836069o2649P4102L76469K02747j8992l539L30810J03955j25973O0598
$$ 12836069 12773420 12847522 13223991 13426738 13407746 13404207 13735017 13838972 13712999 13773597
4543A3773597J75518q7306j87287k30869l68375Q5731K47643L08671N00246J07114
$$ 13773597 13949115 13861809 13674522 13443653 13075278 13161009 13408652 13717323 14217569 14324683
4533A4324683O1894N39971P52724L76771N02230L22724L58146J177659P13737
$$ 14324683 14386577 14926548 15679272 16056043 16558273 16880997 17239143 18416802 19130539
4524A9130539J7076K31744k121M14768j12418q43046r5146l86904l17892n38888
$$ 19130539 19147615 19379359 19377238 19792006 19679588 18836542 18741396 18354492 18036600 17497712
4514A7497712m53344n3322r1317l19447L53474K55352M65788M20279K69912K4584
$$ 17497712 17044368 16991046 16899729 16580282 16933756 17189108 17654896 18075175 18345087 18369671
4504A8369671j85728K79776N18802L55020R50481J97665K97640J12712J50738
$$ 18369671 18183943 18463719 18982521 19337541 20288022 20485687 20783327 20896039 21046777
4495B1046777k73638m85526k35510r94776Q2414m83514n03306m65255J735p85917
$$ 21046777 20773139 20287613 20052103 19057327 19139741 18656227 18152921 17687666 17689401 16903484
4485A6903484m52691M5973p02186J30412R7616J16800O78498L36896M08894M60567
$$ 16903484 16450793 16496766 15794580 15924992 16022608 16139408 16817906 17154802 17563696 18024263
4475A8024263O07482M93770M35046J35755P91151P7850J49087N12828O1893K84519
$$ 18024263 18631745 19125515 19560561 19696316 20487467 20565317 20714404 21227232 21289125 21573644
4465B1573644J39308J94634J36775M32103K98686K42352Q36668M17561j66161
$$ 21573644 21712952 21907586 22044361 22476464 22775150 23017502 23854170 24271731 24105570
4456B4105570p91760j525069j428327j098806o88639n33085l9248l14364l55493
$$ 24105570 23313810 21788741 20360414 19261608 18572969 18039884 18000636 17686272 17330779
4447A7330779j3318j0839L7213n5414j35282k6520J10037k115m04425l17170m04359
$$ 17330779 17317461 17306622 17343835 17288421 17153139 17126619 17236656 17234541 16830116 16512946 16108587
4436A6108587l29011k30423O1435l62793o14581l81960l46150l57989p98822m91383
$$ 16108587 15779576 15549153 15610588 15247795 14633214 14251254 13905104 13547115 12748293 12256910
4426A2256910j49620k17050m14517L01186L69171l385o0614N1540M8963L38423
$$ 12256910 12107290 11890240 11475723 11776909 12146080 12142695 12082081 12133621 12182584 12521007
4416A2521007Q0599j39405j31990J45078n4904k31876J93521k11060L082j55048
$$ 12521007 12601606 12462201 12330211 12475289 12420385 12188509 12382030 12170970 12174052 12019004
4406A2019004k89729j3425k02291K28552K20937j01378J41281l20945K71681K43138
$$ 12019004 11729275 11715850 11513559 11742111 11963048 11861670 12002951 11682006 11953687 12196825
4396A2196825K16624r7887m35373m68232j72381J96881J43955K61026J3866j15614
$$ 12196825 12413449 12315562 11880189 11411957 11239576 11436457 11580412 11841438 11855304 11739690
4386A1739690q0885J94094L71318L40400O74463N20640P27686J55395O35952K27228
$$ 11739690 11658805 11852899 12224217 12564617 13239080 13759720 14487406 14642801 15278753 15505981
4376A5505981N03285M11243J37584J75474l32063m17865q82060p19974r48507
$$ 15505981 16009266 16420509 16558093 16733567 16401504 15983639 15101579 14381605 13433098
4367A3433098j102834l57432m22157l43118k47959j41551o39650m01654K03312
$$ 13433098 12330264 11972832 11550675 11207557 10959598 10818047 10178397 9776743 9980055
4358I980055n8108n89932j46879j65047j61244J28887m53988K52159n0370J44930
$$ 9980055 9921947 9332015 9185136 9020089 8858845 8987732 8533744 8785903 8735533 8880463
4348H880463m57586o361M02003O37410J54289L2286K91173M22697K13746K83008
$$ 8880463 8422877 8416516 8818519 9455929 9610218 9642504 9933677 10356374 10570120 10853128
4338A0853128M22012K94239J09579l3764L28233o89874m45300k75661q32117o39753
$$ 10853128 11275140 11569379 11678958 11645194 11973427 11283553 10838253 10562592 9730475 9090722
4328I090722k24303j88289l55680m08272m81452K10640k60181j69368q8736k71757
$$ 9090722 8866419 8678130 8322450 7914178 7432726 7643366 7383185 7213817 7125081 6853324
4318F853324j61881j75843l21489j7366L32874l12047M4229J02534M9344l23178
$$ 6853324 6691443 6515600 6194111 6176745 6509619 6197572 6241801 6344335 6393679 6070501
4308F070501K35156M63986R3013l78667m91069N42304K0881k08200j01203J69257
$$ 6070501 6305657 6769643 6862656 6483989 5992920 6535224 6556105 6347905 6246702 6415959
4298F415959R8248j39553N4249J66386K26910L47967k1862m09323J08169K76727
$$ 6415959 6514207 6374654 6428903 6595289 6822199 7170166 7148304 6738981 6847150 7123877
4288G123877J94899R948K23428m17419q4525M28780M21906l3707k64664K31373
$$ 7123877 7318776 7328724 7552152 7134733 7050208 7478988 7900894 7867187 7602523 7833896
4278G833896J52800J58836l18946N21870O37511K35154l00451k0463K2825J56358
$$ 7833896 7986696 8145532 7826586 8348456 8985967 9221121 8920670 8900207 8923032 9079390
4268I079390r2464j88356P7888m4567K32711M83517M20243k12325J61994M58227
$$ 9079390 8986926 8798570 8876458 8831891 9064602 9548119 9968362 9756037 9918031 10376258
4258A0376258P2462o9220K84561J55137P5838K11723L10432P63142K36535N01058
$$ 10376258 10448720 10379500 10664061 10819198 10895036 11106759 11417191 12180333 12416868 12917926
4248A2917926j38373O38683P65489q950M91322L91331L32381K29594P42047O72859
$$ 12917926 12779553 13418236 14183725 14174775 14666097 15057428 15389809 15619403 16361450 17034309
4238A7034309O17717L23030M96445O75901Q37688O80185P99085O10906M08736
$$ 17034309 17652026 17975056 18471501 19147402 19985090 20665275 21464360 22075266 22484002
4229B2484002n2905K83268R51069N18825Q89297M99503L25656M33636J28866M70491
$$ 22484002 22431097 22714365 23665434 24184259 25073556 25573059 25898715 26332351 26461217 26931708
4219B6931708O13420P77093l5771N36476R54319L27291N77435K45461J86537J69581
$$ 26931708 27545128 28322221 28286450 28822926 29777245 30104536 30681971 30927432 31113969 31283550
4209C1283550L41293J03972K59981L06247O0760M58415j30064J96183j64018k10507
$$ 31283550 31624843 31728815 31988796 32295043 32355803 32814218 32684154 32880337 32716319 32505812
4199C2505812j01617l93094j74815l69460l86969k88622l67169l98675m59859
$$ 32505812 32404195 32011101 31836286 31466826 31079857 30791235 30424066 30025391 29565532
4190B9565532l67765l88801K37624m05951k53007L87734p99784m8778o2640k30948
$$ 29565532 29197767 28808966 29046590 28640639 28387632 28775366 27975582 27926804 27864164 27633216
4180B7633216J16030k57721J6941m50027O6577K13019j11325j04058M58306M41786
$$ 27633216 27749246 27491525 27508466 27058439 27125016 27338035 27226710 27122652 27580958 28022744
4170B8022744n53129J03530J86145o6013Q9428L92673K00328J33433J15420m81482
$$ 28022744 27469615 27573145 27759290 27693277 27782705 28175378 28375706 28509139 28624559 28143077
4160B8143077k15581P1356L71781N42745L61408K94754K78890L24223j80360N02382
$$ 28143077 27927496 27998852 28370633 28913378 29274786 29569540 29848430 30172653 29992293 30494675
4150C0494675L12877j84010K74037L92767M70040L36088N06359L65217k7127J97215
$$ 30494675 30807552 30623542 30897579 31290346 31760386 32096474 32602833 32968050 32940923 33138138
4140C3138138R69220K53685K6885L10274J22160O31280M82943O40931K24927m1809
$$ 33138138 34107358 34361043 34387928 34698202 34820362 35451642 35934585 36575516 36800443 36758634
4130C6758634L88851J145390P35068Q12273R38361O09487R58219J233073J040554
$$ 36758634 37147485 38292875 39027943 39840216 40778577 41388064 42346283 43579356 44619910
4121D4619910R75828J299827J139369J203008J367882J425571J436431J733813
$$ 44619910 45595738 46895565 48034934 49237942 50605824 52031395 53467826 55201639
4113E5201639J542918J706791K054342J895560J517820K095489J871812J591595
$$ 55201639 56744557 58451348 60505690 62401250 63919070 66014559 67886371 69477966
4105F9477966J372713J626144J790854J718811J617365J435183J418495J409993
$$ 69477966 70850679 72476823 74267677 75986488 77603853 79039036 80457531 81867524
4097H1867524J251626J359597J277457J211672R46730O20640P70287Q0388L80005
$$ 81867524 83119150 84478747 85756204 86967876 87914606 88535246 89305533 89385921 89765926
4088H9765926m9563N3230n35486m03403j075398j193454j91931n59325j138866
$$ 89765926 89716363 89769593 89234107 88830704 87755306 86561852 86369921 85810596 84671730
4079H4671730j151385j408623j427772j114581j658831j781329j466300j302191
$$ 84671730 83520345 82111722 80683950 79569369 77910538 76129209 74662909 73360718
4071G3360718j569509j212276j397905j049537j554587j432837p41686q84564
$$ 73360718 71791209 70578933 69181028 68131491 66576904 65144067 64402381 63517817
4063F3517817j058666p46162j071875q61839l70287q00234l22204n22868J7799
$$ 63517817 62459151 61712989 60641114 59779275 59408988 58608754 58286550 57763682 57781481
4054E7781481n91674k23945m44530l72705N2000n62665m3874K66129O0314J16929
$$ 57781481 57189807 56965862 56521332 56148627 56200627 55637962 55594088 55860217 55920531 56037460
4044E6037460L58996K85609O66353Q8963j75504N59296R50079Q25974Q26117N25293
$$ 56037460 56396456 56682065 57348418 57437381 57261877 57821173 58771252 59597226 60423343 60948636
4034F0948636J159784M26040J096462R96303M95184O05846Q41865P97465R64978
$$ 60948636 62108420 62534460 63630922 64627225 65122409 65728255 66570120 67367585 68332563
4025F8332563J198575J230663J390370J171431J507503J702209J478942J790237
$$ 68332563 69531138 70761801 72152171 73323602 74831105 76533314 78012256 79802493
4017G9802493J953042J629124J937170K179819J914880K055060K655781K757735
$$ 79802493 81755535 83384659 85321829 87501648 89416528 91471588 94127369 96885104
4009I6885104L241597L142874K809821L282174L693419L016545L778486L411080
$$ 96885104 100126701 103269575 106079396 109361570 113054989 116071534 119850020 123261100
4001A23261100L305184L370641L434382L141761L045725K838639K755041K220811
$$ 123261100 126566284 129936925 133371307 136513068 139558793 142397432 145152473 147373284
3993A47373284K088139K535012K183516J760236K084373J560186J550338P44341
$$ 147373284 149461423 151996435 154179951 155940187 158024560 159584746 161135084 161879425
3985A61879425J158770J181790O66819O38675j7428N0642k03736k22230m79248
$$ 161879425 163038195 164219985 164886804 165525479 165508051 165558693 165354957 165132727 164653479
3976A64653479m33556q17369r94572j154208r31331j271357j685539k214241k076090
$$ 164653479 164219923 163402554 162407982 161253774 160322443 159051086 157365547 155151306 153075216
3967A53075216j901281k437725k499075k646671l234021k900218l633218l665353
$$ 153075216 151173935 148736210 146237135 143590464 140356443 137456225 133823007 130157654
3959A30157654l530321m175523m210831l853023l615273l874836m111022l315316
$$ 130157654 126627333 122451810 118240979 114387956 110772683 106897847 102786825 99471509
3951I9471509l573542l390535l210417l057634k945426l025235k873704k558440
$$ 99471509 95897967 92507432 89297015 86239381 83293955 80268720 77395016 74836576
3943G4836576k030335k234524j605550k049369k258461j705547j495465j685899
$$ 74836576 72806241 70571717 68966167 66916798 64658337 62952790 61457325 59771426
3935E9771426j495507j290987r58734j469978j282321j049384j139844j230299
$$ 59771426 58275919 56984932 56026198 54556220 53273899 52224515 51084671 49854372
3927D9854372j465549j246651j525922j206971j488517j260397j172932r07507
$$ 49854372 48388823 47142172 45616250 44409279 42920762 41660365 40487433 39579926
3919C9579926j054891j144502o93168n54458n90264o40924j24973m15919q81371
$$ 39579926 38525035 37380533 36687365 36132907 35542643 34901719 34776746 34360827 33479456
3910C3479456n32219J2595j45124m70170k27094l42862k97975Q7398O85950o7317
$$ 33479456 32947237 32959832 32814708 32344538 32117444 31774582 31476607 31564005 32249955 32182638
3900C2182638K78682R0856L77684N36706Q91398p3410K6091L33072M21148Q40296
$$ 32182638 32461320 32552176 32929860 33466566 34357964 34284554 34310645 34643717 35064865 35905161
3890C5905161L11145L12718Q05324N01505N74006M91520L15253R77578J41679
$$ 35905161 36216306 36529024 37334348 37835853 38409859 38901379 39216632 40194210 40335889
3881D0335889M51163n8071K22181M52676j6869K27569L62599m14884M20021O26309
$$ 40335889 40787052 40728981 40951162 41403838 41386969 41614538 41977137 41562253 41982274 42608583
3871D2608583L87280j41371j8908K00686q1089m84632l92742k78315K13947K61050
$$ 42608583 42995863 42854492 42835584 43036270 42955181 42470549 42077807 41799492 42013439 42274489
3861D2274489k11724M1780r7126k47622K99682M06693P50386Q27687M61991O56672
$$ 42274489 42062765 42104545 42007419 41759797 42059479 42466172 43216558 44044245 44506236 45162908
3851D5162908J011935J070565Q96302N04535J282342J174870J013011J242854
$$ 45162908 46174843 47245408 48141710 48646245 49928587 51103457 52116468 53359322
3843E3359322J239182J616677J859225J385089R90789Q77557J046559J450017
$$ 53359322 54598504 56215181 58074406 59459495 60450284 61327841 62374400 63824417
3835F3824417O57877L27923L82272K60792K44457j85710J66841j84263L4556K67860
$$ 63824417 64482294 64810217 65192489 65453281 65697738 65512028 65678869 65494606 65529162 65797022
3825F5797022j82437J21295o01956n60254p40811j057997j150376j049463j437807
$$ 65797022 65614585 65735880 65133924 64573670 63832859 62774862 61624486 60575023 59137216
3816E9137216j213942j020359j246238j558326j148091r56513j160268j065758
$$ 59137216 57923274 56902915 55656677 54098351 52950260 51993747 50833479 49767721
3808D9767721j043558m48861p27139q30283m10959n15231l6417o63162p18956
$$ 49767721 48724163 48275302 47548163 46717880 46306921 45791690 45755273 45092111 44373155
3799D4373155l07533l91330k52060o37070n22230m71010m79999n6805k86777o82101
$$ 44373155 44065622 43674292 43422232 42785162 42262932 41791922 41311923 41255118 40968341 40286240
3789D0286240j48910L3471m7223k34068N4852k64840J51823K79522j08120J33109
$$ 40286240 40137330 40170801 40123578 39889510 39944362 39679522 39831345 40110867 40002747 40135856
3779D0135856r6484j19623J01014m0558l37747J71197L22950R656Q7236M42751
$$ 40135856 40039372 39919749 40020763 39980205 39642458 39813655 40136605 40146261 40233497 40676248
3769D0676248L34538M6607K20611M15928L38947L42927j04868O66767L80972M38222
$$ 40676248 41010786 41057393 41278004 41693932 42032879 42375806 42270938 42937705 43318677 43756899
3759D3756899R52431N90438M01848M28154O06871N28747L52598L40931L35474
$$ 43756899 44709330 45299768 45701616 46129770 46736641 47265388 47617986 47958917 48294391
3750D8294391k2568N27609O08648p9006K71466O90979O59496Q16191K72582K06562
$$ 48294391 48271823 48799432 49408080 49329074 49600540 50291519 50951015 51767206 52039788 52246350
3740E2246350O02724J073254P95065R08506O54257R20241J056977N70947J039934
$$ 52246350 52849074 53922328 54717393 55625899 56280156 57200397 58257374 58828321 59868255
3731E9868255J742468J642121J384288J703298J781882K492783K244066K659277
$$ 59868255 61610723 63252844 64637132 66340430 68122312 70615095 72859161 75518438
3723G5518438K911322K856117L280090M278389M292890M709603M969684N059778
$$ 75518438 78429760 81285877 84565967 88844356 93137246 97846849 102816533 107876311
3715A07876311N559902N421834M825814M872662L930304L657491K885258K441534
$$ 107876311 113436213 118858047 123683861 128556523 132486827 136144318 139029576 141471110
3707A41471110J906760J609169J791779K087561K016519J974258K573734K182092
$$ 141471110 143377870 144987039 146778818 148866379 150882898 152857156 155430890 157612982
3699A57612982K728399K904543K550304K362158K978205J888930Q95565Q65262
$$ 157612982 160341381 163245924 165796228 168158386 171136591 173025521 173921086 174786348
3691A74786348m97974r24441j113437j944090k553796k492007j499820k241925
$$ 174786348 174288374 173363933 172250496 170306406 167752610 165260603 163760783 161518858
3683A61518858j872092j293347r74488j170789j170467j022230j243798j709602
$$ 161518858 159646766 158353419 157378931 156208142 155037675 154015445 152771647 151062045
3675A51062045j464589k780742l129952l652936l876632m016920m380239m078582
$$ 151062045 149597456 146816714 143686762 140033826 136157194 132140274 127760035 123681453
3667A23681453l645625l244437k770439k185808k024945j244031j700437j394780
$$ 123681453 120035828 116791391 114020952 111835144 109810199 108566168 106865731 105470951
3659A05470951l37891k39092K71481N54815M96054L16661J531552K093859K087418
$$ 105470951 105133060 104893968 105165449 105720264 106216318 106532979 108064531 110158390 112245808
3650A12245808K575677K322831K461463K954173K605971K920798L013621L198293
$$ 112245808 114821485 117144316 119605779 122559952 125165923 128086721 131100342 134298635
3642A34298635L946070L554362L834352L789104M416463M365087L796400M096208
$$ 134298635 138244705 141799067 145633419 149422523 153838986 158204073 162000473 166096681
3634A66096681M077590M112526M186696L329682L335961L368399L641094K914393
$$ 166096681 170174271 174286797 178473493 181803175 185139136 188507535 192148629 195063022
3626A95063022K820631K919135K814573K161747J891186K029312K111236J776704
$$ 195063022 197883653 200802788 203617361 205779108 207670294 209699606 211810842 213587546
3618B13587546J175368J152658J238146J536594J151172Q38452J169281J320320
$$ 213587546 214762914 215915572 217153718 218690312 219841484 220679936 221849217 223169537
3610B23169537J338969J595319J824010K028499K168370L230544L189474L261763
$$ 223169537 224508506 226103825 227927835 229956334 232124704 235355248 238544722 241806485
3602B41806485M614578M985522M794954N609633N513431N571032N565699M728466
$$ 241806485 246421063 251406585 256201539 261811172 267324603 272895635 278461334 283189800
3594B83189800M372045M313688L908703L746165L581867L303968L188468L045729
$$ 283189800 287561845 291875533 295784236 299530401 303112268 306416236 309604704 312650433
3586C12650433L070831K756361K129938J460552J127320O62358k33287j621366
$$ 312650433 315721264 318477625 320607563 322068115 323195435 323857793 323624506 322003140
3578C22003140k417535l280087m116146m897329n115708n880519o100778o156561
$$ 322003140 319585605 316305518 312189372 307292043 302176335 296295816 290195038 284038477
3570B84038477n987495n948277n845746n131123n622270n089445m462459m608361
$$ 284038477 278050982 272102705 266256959 261125836 255503566 250414121 245951662 241343301
3562B41343301n009601m570933l904089l764082l771155l400921k235456j830559
$$ 241343301 236333700 231762767 227858678 224094596 220323441 216922520 214687064 212856505
3554B12856505j660992n38552k60725j5364Q96604J791091J218775J516103K139526
$$ 212856505 211195513 210656961 210396236 210380872 211277476 213068567 214287342 215803445 217942971
3545B17942971K133976K450928J993788K879459K819313K454334K254824K312224
$$ 217942971 220076947 222527875 224521663 227401122 230220435 232674769 234929593 237241817
3537B37241817K180839J827254J687586J332646Q73683N83910j29096m34383n00591
$$ 237241817 239422656 241249910 242937496 244270142 245143825 245727735 245598639 245164256 244663665
3528B44663665j071265j973274k289502k028373k891515l168246l406622m144818
$$ 244663665 243592400 241619126 239329624 237301251 234409736 231241490 227834868 223690050
3520B23690050l969056m146917l707298m100056l885204l639398m117928m117570
$$ 223690050 219720994 215574077 211866779 207766723 203881519 200242121 196124193 192006623
3512A92006623l877167m061817l433993l023597l136576k866777k425319j468134
$$ 192006623 188129456 184067639 180633646 177610049 174473473 171606696 169181377 167713243
3504A67713243j210611k94131J86544R11476J427138K736539L162104M004872
$$ 167713243 166502632 166208501 166395045 167306521 168733659 171470198 174632302 178637174
3496A78637174M569820M598442N087371M667231M508442M114987L765295L182407
$$ 178637174 183206994 187805436 192892807 197560038 202068480 206183467 209948762 213131169
3488B13131169L462553L678222L880092M475950N093675O381799P370628Q087490
$$ 213131169 216593722 220271944 224152036 228627986 233721661 240103460 247474088 255561578
3480B55561578R328783J0552296J0341386J1476856J1942936J1182860J0041353
$$ 255561578 264890361 275442657 285784043 297260899 309203835 320386695 330428048
3473C30428048R274326P137727M990315K285126P28902m11984k242031k282821
$$ 330428048 339702374 346840101 351830416 354115542 354844444 354432460 352190429 349907608
3465C49907608k534142k301623j698840j031664o14181m83657j137765k328901
$$ 349907608 347373466 345071843 343373003 342341339 341727158 341243501 340105736 337776835
3457C37776835m067419o711261q862837j1497196j2829265j3980784j5428962
$$ 337776835 333709416 326998155 318135318 306638122 293808857 279828073 264399111
3450B64399111j4790276j4157948j3147805j1852475j1016195r666974r115033
$$ 264399111 249608835 235450887 222303082 210450607 199434412 189767438 180652405
3443A80652405p862406p270339o714341o488737o038762n171489n068771m262255
$$ 180652405 172789999 165519660 158805319 152316582 146277820 141106331 136037560 131775305
3435A31775305l427746l502390l447374k706738j836754k176803k082790j014953
$$ 131775305 128347559 124845169 121397795 118691057 116854303 114677500 112594710 111579757
3427A11579757j203037j353342j236449j411081j293410o15283j024433j273247
$$ 111579757 110376720 109023378 107786929 106375848 105082438 104467155 103442722 102169475
3419A02169475j160253j477019j253572r25871j517120j712810j562929j699924
$$ 102169475 101009222 99532203 98278631 97352760 95835640 94122830 92559901 90859977
3411I0859977j501993k138292j762568j683384k377095k423058k055454j381174
$$ 90859977 89357984 87219692 85457124 83773740 81396645 78973587 76918133 75536959
3403G5536959j837205j819999k046113j812288k185126j941616j598912j356020
$$ 75536959 73699754 71879755 69833642 68021354 65836228 63894612 62295700 60939680
3395F0939680j676112j367361j904778j125164j193492q99079r61662m28280m57549
$$ 60939680 59263568 57896207 55991429 54866265 53672773 52773694 51812032 51383752 50926203
3386E0926203k93767o0822M2971J38640J27221K69790M25389M76520N35525N83331
$$ 50926203 50632436 50571614 50614585 50753225 50880446 51150236 51575625 52052145 52587670 53171001
3376E3171001L44351L99046N38653L78088K73720K12262N0383N8136J80191j00158
$$ 53171001 53515352 53914398 54453051 54831139 55104859 55317121 55367504 55425640 55605831 55505673
3366E5505673L46132P1519k97723o25454r24296l83667r76334r98743j095962
$$ 55505673 55851805 55923324 55625601 55000147 54075851 53692184 52715850 51717107 50621145
3357E0621145m77955j017993j045861j348511n48666j540027j102270n35076l62233
$$ 50621145 50143190 49125197 48079336 46730825 46182159 44642132 43539862 43004786 42642553
3348D2642553r35869j648957j411842j084260j180823j118519n58238j162996
$$ 42642553 41706684 40057727 38645885 37561625 36380802 35262283 34704045 33541049
3340C3541049r71909n23285p76874n44841o13846n88928k04413p4750J29629j55621
$$ 33541049 32569140 32045855 31268981 30724140 30110294 29521366 29316953 29242203 29371832 29216211
3330B9216211K5446J61173J05105J21719J1530l24308m54394j06546Q9628J42830
$$ 29216211 29241657 29402830 29507935 29629654 29641184 29316876 28862482 28755936 28845564 28988394
3320B8988394N6208K89400J99228O16376O0787k84822K21253K83034K32928K28882
$$ 28988394 29044602 29334002 29533230 30149606 30210393 29925571 30146824 30429858 30662786 30891668
3310C0891668K6757n74577J29664j26251o99047n936N1513m40878L7120n981j51411
$$ 30891668 30918425 30343848 30473512 30347261 29648214 29642278 29693791 29252913 29290033 29284052 29132641
3299B9132641p0232k79095o39414k68183j62533p4075M48425j93298N7178P7381
$$ 29132641 29062409 28783314 28143900 27875717 27713184 27639109 28087534 27894236 27951414 28028795
3289B8028795M43060J64794j60828J21039M4287n56468q59466m99373m78286o28300
$$ 28028795 28471855 28636649 28475821 28596860 28641147 28084679 27225213 26725840 26247554 25619254
3279B5619254n25281m0369k50549J24875M77735j25633O18173P56761L78463J026125
$$ 25619254 25093973 25053604 24803055 24927930 25405665 25280032 25898205 26654966 27033429 28059554
3269B8059554P95193J50288P4182K2022l78303p32346j46655r2832M7211L9445
$$ 28059554 28854747 29005035 29079217 29101239 28722936 27990590 27843935 27751103 27798314 27837759
3259B7837759n23978J42988J51013q3538p8631N31729P32605L04676K79512L14661
$$ 27837759 27313781 27456769 27607782 27524244 27445613 27977342 28709947 29014623 29294135 29608796
3249B9608796P22068K43153Q28499N39577K83824M30024Q18881J351881O26491
$$ 29608796 30330864 30574017 31402516 31942093 32225917 32655941 33474822 34826703 35453194
3240C5453194J150086O09683Q06111J762331J182260J380261J586117K057537
$$ 35453194 36603280 37212963 38019074 39781405 40963665 42343926 43930043 45987580
3232D5987580K011887J753833J547727J517724J838958J382545J645819J847345
$$ 45987580 47999467 49753300 51301027 52818751 54657709 56040254 57686073 59533418
3224E9533418K395945L023916K986276L604548M381725M655829N014203N123498
$$ 59533418 61929363 64953279 67939555 71544103 75925828 80581657 85595860 90719358
3216I0719358M667583L374074K697332J077228j814753l879849n229979n992817
$$ 90719358 95386941 98761015 101458347 102535575 100720822 96840973 91610994 85618177
3208H5618177o104689o107668n140376n135391m286095l439212k815028k262319
$$ 85618177 79513488 73405820 68265444 63130053 58843958 55404746 52589718 50327399
3200E0327399k026184k597467k688556k685106k700640k519432k123256j976661
$$ 50327399 48301215 45703748 43015192 40330086 37629446 35110014 32986758 31010097
3192C1010097j636662r85081l48169q45533p07246M21527N5469J32158O47412
$$ 31010097 29373435 28388354 28040185 27194652 26487406 26908933 26964402 27096560 27743972
3183B7743972J074393Q82927J042982J425336K127297K839082R17747k96016j131358
$$ 27743972 28818365 29701292 30744274 32169610 34296907 37135989 38053736 37757720 36626362
3174C6626362j635437j613636j457405j014996k82045j47035m87959p43194j023640
$$ 36626362 34990925 33377289 31919884 30904888 30622843 30475808 29987849 29244655 28221015
3165B8221015j337819j371177j317967q94478o16313p81312o16067k06706L6868
$$ 28221015 26883196 25512019 24194052 23299574 22683261 21901949 21285882 21079176 21116044
3156B1116044j18232K68182O97031J211194J614548K204496K768021M076805M533558
$$ 21116044 20997812 21265994 21963025 23174219 24788767 26993263 29761284 33838089 38371647
3147C8371647N343057M664428J240551k551190l413296m409299m794558l996047
$$ 38371647 43714704 48379132 49619683 47068493 43655197 39245898 34451340 30455293
3139C0455293l304668k925907j928452j364924j063759j157778j530432j137414
$$ 30455293 27150625 24224718 22296266 20931342 19867583 18709805 17179373 16041959
3131A6041959r59580p68813m5747n35498n65743j95864M2031K37098k71664J43041
$$ 16041959 15082379 14313566 14267819 13732321 13166578 12970714 13012745 13249843 12978179 13121220
3121A3121220N11522N12961P76870J534757J652598K220638K097841J483979K23870
$$ 13121220 13632742 14145703 14922573 16457330 18109928 20330566 22428407 23912386 24136256
3112B4136256j139968j784118k381275k019891k095643j913296j387426j063637
$$ 24136256 22996288 21212170 18830895 16811004 14715361 12802065 11414639 10351002
3104A0351002q90237l04714m58583m46975k5106l48819j117601j69012k8334q6822
$$ 10351002 9460765 9156051 8697468 8250493 8225387 7876568 6758967 6589955 6561621 6474799
3094F474799j89318l57946j37148p72426P0631J58859L35195l73018l87788J52194
$$ 6474799 6285481 5927535 5790387 5017961 5088592 5247451 5582646 5209628 4821840 4974034
3084D974034p4657k45154q3621J12216m90519l00979j00660J51967J94431j54467
$$ 4974034 4899377 4654223 4570602 4682818 4192299 3891320 3790660 3942627 4137058 3982591
3074C982591o60357l53080j02159L34229J3186k04091O1430q4277j5732j73697
$$ 3982591 3322234 2969154 2866995 3201224 3214410 3010319 3071749 2987472 2971740 2798043
3064B798043j03419P5542K96370N467Q3064K37258r1402m72509n88607j36217
$$ 2798043 2694624 2770166 3066536 3072003 3155067 3392325 3300923 2828414 2239807 2103590
3054B103590K04997k7310L90565L49519M8087m73553k67760J38764j28371k47121
$$ 2103590 2308587 2281277 2671842 3021361 3069448 2595895 2328135 2466899 2338528 2091407
3044B091407j17227o1072j08565L15330K10581r9791K13593j91169J12973J16220
$$ 2091407 1974180 1913108 1804543 2119873 2330454 2230663 2444256 2253087 2366060 2482280
3034B482280l77008q4467R1564k70906J96807L97986j91964j09229K03760P3094
$$ 2482280 2105272 2020805 2112369 1841463 2038270 2436256 2244292 2135063 2338823 2411917
3024B411917m04107k42490j60963N98257j6626k62990j23701j82843L0490O5655
$$ 2411917 2007810 1765320 1604357 2202614 2185988 1922998 1799297 1616454 1646944 1712599
3014A712599J61017J42323R6894k33501k39639J88233L6542l17384J59861l6136
$$ 1712599 1873616 2015939 2112833 1879332 1639693 1827926 1864468 1547084 1706945 1670809
3004A670809k02564k5166J4877n15865K23635j38085L05143K19349j29720j09965
$$ 1670809 1468245 1443079 1457956 942091 1165726 1027641 1332784 1552133 1422413 1312448
2994A312448J08061J60580j43299j55651K37452m4233L26937q1897j87261l5962
$$ 1312448 1420509 1581089 1437790 1282139 1519591 1475358 1802295 1720398 1533137 1497175
2984A497175Q667M51973j37313J03433J30822L16899m06712j90134j66926k76081
$$ 1497175 1505842 1957815 1820502 1923935 2054757 2371656 1964944 1774810 1607884 1331803
2974A331803M11296M6457j67684j87085j6805K80220j68126O6327k8557L17810
$$ 1331803 1743099 1789556 1621872 1434787 1417982 1698202 1530076 1596403 1567846 1885656
2964A885656N6806J54521l93841k35965L73529l2148K01676m19767l00788J17284
$$ 1885656 1942462 2096983 1703142 1467177 1840706 1808558 2010234 1590467 1289679 1406963
2954A406963J06903p6472j11323M49941r672j09081j31334M9027K77011J06930
$$ 1406963 1513866 1437394 1326071 1776012 1766340 1657259 1525925 1574952 1851963 1958893
2944A958893m1441l47841M8404L08327j52469O06818m03046k31026L64092J41923
$$ 1958893 1917452 1569611 1618015 1926342 1773873 2380691 1977645 1746619 2110711 2252634
2934B252634n48047q2366K85261k6766j23546p4005L33838l2125J5538j23902
$$ 2252634 1704587 1622221 1907482 1880716 1757170 1683165 2017003 1984878 2000416 1876514
2924A876514K87428k4520M35191J96624j74983K37977K827l46341K31237k6801
$$ 1876514 2163942 2139422 2574613 2771237 2596254 2834231 2837058 2490717 2721954 2695153
2914B695153J19602J59722J55588P497j22246K58737J36891q2602L83094J91227
$$ 2695153 2814755 2974477 3130065 3137562 3015316 3274053 3410944 3328342 3711436 3902663
2904C902663K80112p5303M16823J73746L43184L2789j18486K74739l7987J05146
$$ 3902663 4182775 4107472 4524295 4698041 5041225 5074014 4955528 5230267 5192280 5297426
2894E297426m54530J2817M88872O812R1756j5152l02458L71983j29311l9901Q1793
$$ 5297426 4842896 4855713 5344585 5351397 5443153 5428001 5125543 5497526 5368215 5328314 5410107
2883E410107O0077O02862K25425L34044Q0744J29506J097222N13955Q55492K30347
$$ 5410107 5470184 6073046 6298471 6632515 6713259 6842765 7939987 8453942 9309434 9539781
2873I539781n94835n50756k79521p81109p47387r9664m89424l40106m02428j44689
$$ 9539781 8944946 8394190 8114669 7333560 6586173 6486509 5997085 5656979 5254551 5109862
2863E109862j67096m35373k54773l99345j24376P2943P2034L8928J35321J81031
$$ 5109862 4942766 4507393 4252620 3853275 3728899 3801842 3873876 3912804 4048125 4229156
2853D229156P8623O5679j13811p59308L67645J95648N10420L32103k39495k52435
$$ 4229156 4307779 4373458 4259647 3500339 3867984 4063632 4574052 4906155 4666660 4414225
2843D414225J03629j51616j42168P1033l72756l42650m61336m51637K09000R3515
$$ 4414225 4517854 4366238 4224070 4295103 3922347 3579697 3118361 2666724 2875724 2969239
2833B969239K47286k57558o59546r1940o0139R3408K06486N7509m52738l74158
$$ 2969239 3216525 2958967 2299421 2207481 2147342 2240750 2447236 2504745 2052007 1677849
2823A677849k00549R0118L29178k4222O274k03041p0462p4819K05126L23804n20052
$$ 1677849 1477300 1567418 1896596 1872374 1878648 1675607 1605145 1530326 1735452 2059256 1539204
2812A539204M6808Q9728J01024k39527K217j45584K0634n54304l91449m6950J11593
$$ 1539204 1586012 1675740 1776764 1537237 1539454 1393870 1414504 860200 468751 421801 533394
2801E33394j20151n128m11922K73831J204K48330O95242K633j24208m46145Q9483
$$ 533394 413243 408115 -3807 270024 271228 519558 1214800 1217433 1093225 647080 736563
2790G36563K8557k33196k9503k86560K37808J43723j57505L78509k56603k70642
$$ 736563 765120 531924 502421 215861 453669 597392 439887 818396 561793 291151
2780B91151P4123L62197K8598j34913N0912N5471M26681Q1571m88177l65449K35302
$$ 291151 365274 727471 756069 621156 672068 727539 1154220 1235791 747614 382165 617467
2769F17467j06586m91523N1568M2316K01043L09454l46594k22347L00556j83501
$$ 617467 510881 19358 70926 113242 314285 623739 277145 54798 355354 171853
2759A71853O4836L92724k20716r3873J13502J66458R6196m02321N7087k25342
$$ 171853 236689 629413 408697 314824 428326 594784 690980 288659 345746 120404
2749A20404k90074K5656J66531K69019j66900k15010k78971L12050m3155n5178
$$ 120404 -169670 -144014 22517 291536 124636 -90374 -369345 -57295 -100450 -155628
2739a55628K42022R3258K0944K8677m08408L45613P4503l92376L84100M1955l00236
$$ -155628 86394 179652 200596 229273 -179135 166478 240981 -151395 232705 274660 -25576
2728b5576L33439j8317j14877r4885j27997K62805k3021L57903o195k1642l35707
$$ -25576 307863 289546 174669 79784 -48213 214592 191571 549474 543279 521637 185930
2717A85930k7660K05981r3748l32533J95202r6498j59703k18856o5275o3252N53713
$$ 185930 158270 364251 270503 -62030 133172 36674 -123029 -341885 -407160 -470412 83301
2706H3301q7784J47400r7445m54168O06817Q2090k3547j9618m56327J66387j81088
$$ 83301 -4483 142917 45472 -408696 198121 280211 256664 237046 -219281 -52894 -233982
2695b33982p2136j06030r173J28040j78223J42182J90669R1908k14519J73452
$$ -233982 -306118 -412148 -421321 -293281 -471504 -329322 -138653 -46745 -261264 -87812
2685h7812j43536J86452P8332q5517M7194j29952p5906K02328J02581j68922k40942
$$ -87812 -231348 -44896 33436 -52081 -4887 -134839 -210745 -8417 94164 -74758 -315700
2674c15700l2476K24155J86004l1761j58329K9492K08882k11031K14188l2874
$$ -315700 -348176 -124021 61983 30222 -128107 -98615 110267 -100764 113424 80550
2664H0550j26975l1150M0874j10842N13064J18724l43179k43469j63269K74157
$$ 80550 -46425 -77575 -36701 -147543 365521 484245 141066 -102403 -265672 8485
2654H485L45740k7703m26302l7484J2729K2370J66761K54280j9201m75188k84652
$$ 8485 354225 326522 -99780 -137264 -124535 -102165 64596 318876 299675 -175513 -460165
2643d60165J5336L22463L52159M5877j96474j35295J65112K12414m61073j94036
$$ -460165 -444829 -122366 229793 275670 79196 -56099 109013 321427 -139646 -333682
2633c33682L26667m5231L4121o1328k25304K31997j34817j54162L90607J44452
$$ -333682 -7015 -52246 -18125 -79453 -304757 -72760 -207577 -361739 28868 173320
2623A73320j61007M4970K3213r0609J91712l37320J53921l36708L70481K19753
$$ 173320 12313 57283 80496 -10113 181599 -155721 -1800 -338508 31973 251726
2613B51726K6170m48171l1641L48962J06168m31626k3494M36437m34878J50587
$$ 251726 277896 -170275 -201916 147046 253214 -178412 -201906 234531 -200347 -49760
2603d9760j22599N6020L24716Q679J6679j20536l01758l2317m61753M32791r5493
$$ -49760 -172359 -116339 208377 217056 233735 113199 -188559 -220876 -682629 -249838 -345331
2592c45331K32270L47217j5062J15073j16588O2616n4118M0404l70903L33169
$$ -345331 -113061 234156 219094 334167 217579 280195 226077 266481 -104422 228747
2582B28747R8607L946j37387R229k52447O893K13945j621l01599j03452J56957
$$ 228747 327354 331300 193913 203142 -49305 -42412 171533 169912 -131687 -235139 -78182
2571g8182O0453K38657k34178j61163J88286l30685l43428M84879K22341j71587
$$ -78182 -17729 220928 -13250 -174413 13873 -316812 -660240 -175361 46980 -124607
2561a24607J67338k15215k9437k39826J1469M79321l18555q2019j62531N518p324
$$ -124607 42731 -172484 -201921 -441747 -430278 49043 -269512 -351531 -514062 -508544 -515868
2550e15868L23053K17818k95849j60907K49289K34510j95274q4217R5503l05787
$$ -515868 -192815 25003 -270846 -431753 -182464 52046 -143228 -227445 -131942 -437729
2540d37729L42426J93735j60203j56843l006k65114k84021M16004J74704O9100
$$ -437729 -95303 98432 -61771 -218614 -221620 -486734 -770755 -354751 -180047 -110947
2530a10947J73931L9727J56647l1828k15110K5518n3876j07671J23602j51978
$$ -110947 62984 102711 259358 227530 12420 37938 -15938 -123609 -7 -151985
2520a51985J53152p9699o2670J015j44545r5851M07684q3205j48622K36081P0895
$$ -151985 1167 -78532 -141202 -140187 -284732 -380583 27101 -56104 -204726 31355 102250
2509A02250j75095l1803Q4603M10305l4947l33790j01068j64421J98116K05901
$$ 102250 -72845 -104648 -20045 390260 355313 21523 -79545 -243966 -45850 160051
2499A60051m0065k15704l9180L18453k6718k15167k21761J4700J13805J07639
$$ 160051 119986 -95718 -134898 183555 156837 -58330 -280091 -265391 -151586 -43947
2489d3947K97703m75689j5196L6043J76497j85158R3714J43902j82153J85099
$$ -43947 253756 -221933 -237129 -201086 -24589 -209747 -116033 27869 -154284 30815
2479C0815j82838J74940N7456k18223r06K20683l50087k99384O20088L62083m37584
$$ 30815 -152023 22917 80373 -137850 -138756 81927 -268160 -567544 52544 414627 -22957
2468b2957J56988N90174m78473N7723j05649m22590N4083m5070L24309l95061
$$ -22957 134031 724205 245732 303455 197806 -224784 -170701 -215771 108538 -286523
2458b86523M1173r04j86298M10524J34130j88539J55823n884k09033P5548k59780
$$ -286523 -245350 -246254 -432552 -22028 112102 -76437 79386 73502 -135531 -59983 -319763
2447c19763j93137K31301M15150n12540k83173J67806L09308j83531J38067j64795
$$ -319763 -512900 -281599 133551 -378989 -662162 -494356 -185048 -368579 -230512 -395307
2437c95307K54267J44194k68924J29117L96067m43106Q4839j30281N6976N9361
$$ -395307 -141040 3154 -265770 -136653 259414 -183692 -98853 -229134 -172158 -112797
2427a12797Q6961n9046k81054J34152J98426K54709J15101K55683k50890L069
$$ -112797 -25836 -84882 -365936 -231784 -33358 221351 336452 592135 341245 344314
2417C44314j62675q0063j6386j14863n0871P0436j31004J43791J18600o7748l4312
$$ 344314 181639 101576 85190 -29673 -80544 -10108 -141112 2679 121279 53531 19219
2406A9219K58008j12762k48201j48672K42901j14292n1034j85760k79113O86917
$$ 19219 277227 164465 -83736 -232408 10493 -103799 -154833 -340593 -619706 67211
2396F7211j28529k01972J19224L7275L00020l1532k97968L19039k48175m53481
$$ 67211 -61318 -263290 -144066 -106791 193229 161697 -136271 182768 -65407 -518888
2386e18888M6195M87100q5909q9027k32231J33328Q9329l84293K28395M35394
$$ -518888 -472693 14407 -71502 -160529 -392760 -259432 -170103 -554396 -326001 109393
2376A09393J10508N442m630k07964k44381J93447J93665K51301L5148o537l46985
$$ 109393 219901 225343 220713 12749 -231632 -38185 155480 406781 441929 435392 88407
2365H8407j24637L57002j3893l45615J6888K90988k59120k11135J79758K20371
$$ 88407 -36230 320772 306879 -38736 -21848 269140 10020 -201115 -21357 199014
2355A99014m62957R1791J92419N2884L24638p4823k36217J27426k90569P24331
$$ 199014 -263943 -172152 20267 73151 397789 322966 86749 214175 -76394 647937
2345F47937L67573N7518p1447J33420j69728m85580q0720k0584O498J5253k17633
$$ 647937 1015510 1073028 1001581 1135001 965273 479693 398973 378389 384887 400140 182507
2334A82507N06268j56887J37547n41647J18850K59955k90224l39627K10201Q8091
$$ 182507 688775 531888 669435 127788 246638 506593 216369 -123258 86943 175034
2324A75034J13581r0676P3828R0070k95918j71064k13775P9119R4493l461K39478
$$ 175034 288615 197939 271767 361837 65919 -105145 -318920 -239801 -145308 -148769 90709
2313I0709J12280n3676q6656k77627K83332K08890J497l33600P9577j61744J4957
$$ 90709 202989 149313 62657 -214970 68362 277252 278749 -54851 24726 -137018 -122061
2302a22061J87560J04814M4316j33640k7185l8075J1221J91656N1335J79848k58719
$$ -122061 65499 170313 214629 80989 53804 15729 26950 218606 269941 449789 191070
2291A91070m9351l2283K63884R2201m27134r4159K67198j0461j15045J5777Q846
$$ 191070 141719 109436 373320 465521 38387 -55772 211426 200965 85920 101697 110543
2280A10543p5431r1441q3841l33651K25929J74885j75654L91192L69172l54536
$$ 110543 35112 -56329 -140170 -473821 -247892 -73007 -248661 142531 511703 157167
2270A57167J18655O3082l35057j94751J78835K91195o2854K51333j56911J73790
$$ 157167 275822 338904 3847 -190904 -12069 279126 216272 467605 310694 484484
2260D84484j0830j28230n02106L8959k43591K50598k6764P2984K19052K37911
$$ 484484 473654 345424 -156682 -117723 -361314 -110716 -137480 -64496 154556 392467
2250C92467j80037k21944J16134j81252R6274K7067k58278L95042J05847O9150
$$ 392467 212430 -9514 106620 -74632 21642 48709 -209569 185473 291320 360470
2240C60470j67972j09201m6093J31229J17455k15377r4486N1237L4867J55669
$$ 360470 192498 83297 37204 168433 285888 70511 -23975 27262 62129 217798
2230B17798L6875j03504l28643Q3257K48277M8277j36040L3006L59437N140j45716
$$ 217798 254673 151169 -177474 -94217 154060 202337 66297 99303 458740 463880 318164
2219C18164l083K46130M50333m72403o46466L70190N82884o7360J88384O6895
$$ 318164 315081 561211 1011544 539141 -107325 262865 845749 778389 966773 1033668
2209A033668n26650K91815J62374k42281q4364N180j89901L72718J09289j73187
$$ 1033668 507018 798833 961207 718926 634562 639742 449841 822559 931848 758661
2199G58661J02190k53059k50022J54378K32068p016l65583N42930m45913Q5418
$$ 758661 860851 607792 357770 512148 744216 737200 371617 914547 468634 554052
2189E54052N20194J57328r2596m05684j46600J38124J63217M53881J10669J34486
$$ 554052 1074246 1231574 1138978 733294 586694 724818 888035 1341916 1452585 1587071
2179A587071k13973m25452k03639J13468l52173q725J99349K23702R0492l37578
$$ 1587071 1373098 947646 744007 857475 505302 496577 695926 919628 1010120 672542
2169F72542j50682N15213O1147K21812j07786J0556J18688j43942l0764j60021
$$ 672542 521860 1037073 1098220 1320032 1212246 1222802 1341490 1197548 1166784 1006763
2159A006763N2116J71578j83053o4148R8217k3406L46523J7798j49044J37734
$$ 1006763 1058879 1230457 1047404 983256 1081473 1058067 1404590 1422388 1273344 1411078
2149A411078L12811p6447q9166L37215J44664j45763j01739k1677L23947O10933
$$ 1411078 1723889 1647442 1558276 1895491 2040155 1894392 1792653 1770976 2094923 2705856
2139B705856M8007k42486L4388L28132j53593J7113j36745P3082K19803k7348
$$ 2705856 2753863 2511377 2545765 2873897 2720304 2737417 2600672 2673754 2893557 2866209
2129B866209J36739j93195J72408J2843k58863K13835P5384J5915M23123K36690
$$ 2866209 3002948 2809753 2982161 2995004 2736141 2949976 3025360 3041275 3464398 3701088
2119C701088m9836M75757N6328K2289J94108R5635L87395N7568M08568M77850
$$ 3701088 3651252 4127009 4183337 4205626 4399734 4495369 4882764 4940332 5348900 5826750
2109E826750N3282L73332M08919J21161M42579N23386P61028L39385M86965N48203
$$ 5826750 5880032 6253364 6662283 6783444 7226023 7749409 8510437 8849822 9336787 9884990
2099I884990P25560J010639P45870J084924J030915J202482J142335J508391R59537
$$ 9884990 10610550 11621189 12367059 13451983 14482898 15685380 16827715 18336106 19295643
2090A9295643P42712J134569J378894K087841K319605M300430O005393Q364605
$$ 19295643 20038355 21172924 22551818 24639659 26959264 31259694 37265087 45629692
2082D5629692J0391975J3098600J5643371J9873187K4018231K3639477J636920
$$ 45629692 56021667 69120267 84763638 104636825 128655056 152294533 153931453
2075A53931453j4941282j6995351j8622608j9595221j6718914j2538679r832732
$$ 153931453 138990171 121994820 103372212 83776991 67058077 54519398 44686666
2068D4686666o401982m894171l460847l395613k027947j491805j221845j184369
$$ 44686666 38284684 33390513 29929666 26534053 24506106 23014301 21792456 20608087
2060B0608087j413387j729238j659112j501324j471029j112506p62547p18976
$$ 20608087 19194700 17465462 15806350 14305026 12833997 11721491 10958944 10239968
2052A0239968o39095p59861n51435m15946k52542k01000o2958m19527q71863j07441
$$ 10239968 9600873 8841012 8289577 7873631 7621089 7420089 7357131 6937604 6065741 5958300
2042E958300k73776k70482n910m33321j61484m20121L77606p1437J8345m55019
$$ 5958300 5684524 5414042 5408132 4974811 4813327 4393206 4770812 4699375 4717720 4262701
2032D262701n36793j60615j11621k02886r609q2198J80860l01155K43381j9700
$$ 4262701 3725908 3565293 3453672 3250786 3241177 3158979 3339839 3038684 3282065 3262365
2022C262365k77944j64086L48395m43150k51131K24863k36263m3180O0791J11924
$$ 3262365 2984421 2820335 3168730 2725580 2474449 2699312 2463049 2419869 2480660 2592584
2012B592584k52229m76497r9082Q8772l1670R6548k67696j1139j68139J05888
$$ 2592584 2340355 1863858 1764776 1853548 1821878 1918426 1650730 1639591 1471452 1577340
2002A577340q5641j06027K38693j02836j31768L04065R9293K03741p00043k15254
$$ 1577340 1491699 1385672 1624365 1521529 1389761 1693826 1793119 1996860 1296817 1081563
1992A081563O6449j08327n8509r8656K81421N336J66341j29062k80112J96640
$$ 1081563 1148012 1039685 981176 882520 1163941 1169277 1335618 1206556 926444 1123084
1982A123084l71645k13749M22910j72941k72616k94820J49575L23043k22308l52334
$$ 1123084 751439 537690 960600 787659 515043 220223 369798 692841 470533 118199
1972A18199K60877J45662k72843R8459K83956Q262k4070L646m23167M29109K23319
$$ 118199 379076 524738 251895 350354 634310 642572 618502 622148 198981 628090 851409
1961H51409r8199j28693R0333O0683k48947L3825q3529j25557m26160L19575L18658
$$ 851409 753210 624517 714850 775533 526586 560411 476882 351325 -74835 244740 563398
1950E63398J85872M5443m52135j20779J02529n64561K07395J37987n7906l3907
$$ 563398 749270 794713 342578 221799 324328 -240233 -32838 105149 47243 13336
1940A3336L10961K5023R2103k9525L3489R3670j17780r7496j75101k21431L29503
$$ 13336 324297 349320 441423 411898 445387 539057 421277 323781 148680 -72751 256752
$$ [...]
##END NTUPLES=NMR SPECTRUM
##END=
