##TITLE=1H_TG-2368-1
 CDCl3
 8 sc, 
 14.12.2022
##JCAMPDX= 6.0         $$ Bruker NMR JCAMP-DX V2.0
##DATA TYPE= NMR SPECTRUM
##DATA CLASS= NTUPLES
##ORIGIN= UXNMR, Bruker Analytische Messtechnik GmbH
##OWNER= root
$$ XWIN-NMR		Version 3.5
$$ Wed Dec 14 14:22:44 2022 Russian Standard Time (UT+4h)  she@DPX200
##.OBSERVE FREQUENCY= 200.13135
##.OBSERVE NUCLEUS= ^1H
##.ACQUISITION MODE= SIMULTANEOUS
##.ACQUISITION SCHEME= undefined
##.AVERAGES= 8
##.DIGITISER RES= 18
##SPECTROMETER/DATA SYSTEM= spect
##.PULSE SEQUENCE= zg30
##.SOLVENT NAME= CDCl3
##.SHIFT REFERENCE= (INTERNAL, CDCl3, 0, 15.726)
##AUDIT TRAIL= $$ (NUMBER, WHEN, WHO, WHERE, WHAT)
$$ ##TITLE= Audit trail, XWIN-NMR		Version 3.5
$$ ##JCAMPDX= 5.01
$$ ##ORIGIN= Bruker BioSpin GmbH
$$ ##OWNER= she
$$ F:/spectra/data/she/nmr/H-F/1/pdata/1/auditp.txt
$$ ##AUDIT TRAIL=  $$ (NUMBER, WHEN, WHO, WHERE, WHAT)
(   1,<2022-12-14 14:21:41.75 +0400>,<she>,<DPX200>,
      <created by zg, POWCHK disabled, PULCHK disabled
       configuration hash MD5:
       00 E9 B6 7A A2 85 ED C7 34 08 36 98 17 FE 4E 26
       data hash MD5: 16K
       76 A4 2D 41 D0 AE A6 E2 29 C4 99 94 AF F4 2C E3>)
(   2,<2022-12-14 14:21:44.51 +0400>,<she>,<DPX200>,
      <Start of raw data processing
       efp BC_mod = 2 LB = 0.24 FT_mod = 6 PKNL = 1 PHC0 = -19266.99 PHC1 = 13.00072 SI = 16K 
       data hash MD5: 16K
       A0 7F F3 0B 31 AF 21 53 CB 09 9A 38 72 18 2B 3D>)
(   3,<2022-12-14 14:21:59.18 +0400>,<she>,<DPX200>,
      <pk PHC0 = 2.583317 PHC1 = -3.6 
       data hash MD5: 16K
       27 86 E3 90 C2 CE 86 C0 DC F2 A0 F4 2F D8 93 51>)
(   4,<2022-12-14 14:22:02.56 +0400>,<she>,<DPX200>,
      <abs ABSG = 5 
       data hash MD5: 16K
       77 6F 39 05 A8 3D B3 9D A3 59 F2 FB CC F8 9D BC>)
$$ ##END=
$$ 
$$ hash MD5
$$ 80 B0 56 DD BB 8E 28 6C C2 38 0C 31 2B 6E 36 E9
##$RELAX= 
##$RELAX= 
##$RELAX= 
##$RELAX= 
##$RELAX= 
##$RELAX= 
$$ Bruker specific parameters
$$ --------------------------
##$DU= <F:/spectra>
##$EXPNO= 1
##$NAME= <H-F>
##$PROCNO= 1
##$TYPE= <nmr>
##$USER= <she>
##$AMP= (0..31)
100 100 100 100 100 100 100 100 100 100 100 100 100 100 100 100 100 100 
100 100 100 100 100 100 100 100 100 100 100 100 100 100 
##$AQSEQ= 0
##$AQ_mod= 1
##$AUNM= <au_zg>
##$AUTOPOS= <>
##$BF1= 200.13
##$BF2= 200.13
##$BF3= 200.13
##$BF4= 200.13
##$BF5= 200.13
##$BF6= 200.13
##$BF7= 200.13
##$BF8= 200.13
##$BYTORDA= 1
##$CFDGTYP= 0
##$CFRGTYP= 5
##$CHEMSTR= <none>
##$CNST= (0..31)
1 1 145 1 1 1 1 1 1 1 1 1 1 1 1 1 1 1 1 1 1 1 1 1 1 1 1 1 1 1 1 1 
##$CPDPRG= <>
##$CPDPRG1= <>
##$CPDPRG2= <>
##$CPDPRG3= <>
##$CPDPRG4= <mlev>
##$CPDPRG5= <mlev>
##$CPDPRG6= <mlev>
##$CPDPRG7= <mlev>
##$CPDPRG8= <mlev>
##$CPDPRGB= <>
##$CPDPRGT= <>
##$D= (0..31)
0 1.2 0 0 0 0 0 0 0 0.06 0 0.03 0 0 0 0 0.0002 0 0 0 0 0 0 0 0 0 0 0 0 
0 0 0 
##$DATE= 1671013301
##$DBL= (0..7)
120 120 120 120 120 120 120 120 
##$DBP= (0..7)
150 150 150 150 150 150 150 150 
##$DBP07= 0
##$DBPNAM0= <>
##$DBPNAM1= <>
##$DBPNAM2= <>
##$DBPNAM3= <>
##$DBPNAM4= <>
$$ [...]
##$SUBNAM3= <"">
##$SUBNAM4= <"">
##$SUBNAM5= <"">
##$SUBNAM6= <"">
##$SUBNAM7= <"">
##$SUBNAM8= <"">
##$SUBNAM9= <"">
##$SW= 18.05172834244
##$SWIBOX= (0..15)
0 0 2 0 0 0 0 0 0 0 0 0 0 0 0 0 
##$SW_h= 3612.71676300578
##$TD= 16384
##$TD0= 1
##$TE= 0
##$TE2= 300
##$TE3= 300
##$TEG= 300
##$TL= (0..7)
0 120 120 120 120 120 120 120 
##$TP= (0..7)
150 150 150 150 150 150 150 150 
##$TP07= 0
##$TPNAME0= <>
##$TPNAME1= <>
##$TPNAME2= <>
##$TPNAME3= <>
##$TPNAME4= <>
##$TPNAME5= <>
##$TPNAME6= <>
##$TPNAME7= <>
##$TPOAL= (0..7)
0.5 0.5 0.5 0.5 0.5 0.5 0.5 0.5 
##$TPOFFS= (0..7)
0 0 0 0 0 0 0 0 
##$TUNHIN= 0
##$TUNHOUT= 0
##$TUNXOUT= 0
##$USERA1= <user>
##$USERA2= <user>
##$USERA3= <user>
##$USERA4= <user>
##$USERA5= <user>
##$V9= 5
##$VALIST= <valist>
##$VCLIST= <CCCCCCCCCCCCCCC>
##$VD= 0
##$VDLIST= <DDDDDDDDDDDDDDD>
##$VPLIST= <PPPPPPPPPPPPPPP>
##$VTLIST= <TTTTTTTTTTTTTTT>
##$WBST= 1024
##$WBSW= 4
##$XGAIN= (0..3)
0 0 0 0 
##$XL= 0
##$YL= 0
##$YMAX_a= 136681
##$YMIN_a= -110331
##$ZGOPTNS= <>
##$ZL1= 120
##$ZL2= 120
##$ZL3= 120
##$ZL4= 120
##$ABSF1= 15.68078
##$ABSF2= -2.371069
##$ABSG= 5
##$ABSL= 3
##$ALPHA= 0
##$AQORDER= 0
##$ASSFAC= 0
##$ASSFACI= 0
##$ASSFACX= 0
##$ASSWID= 0
##$AUNMP= <proc_1d>
##$AZFE= 0.1
##$AZFW= 0.1
##$BCFW= 0
##$BC_mod= 2
##$BYTORDP= 0
##$COROFFS= 0
##$CY= -3
##$DATMOD= 1
##$DC= 0
##$DFILT= <>
##$DTYPP= 0
##$F1P= 0
##$F2P= 0
##$FCOR= 1
##$FTSIZE= 16384
##$FT_mod= 6
##$GAMMA= 0
##$GB= 0
##$INTBC= 1
##$INTSCL= 3.70164e-10
##$ISEN= 128
##$LB= 0.24
##$LEV0= 0
##$LPBIN= 0
##$MAXI= 10000
##$MC2= 0
##$MEAN= 0
##$ME_mod= 0
##$MI= 1.114404
##$NCOEF= 0
##$NC_proc= -8
##$NLEV= 6
##$NOISF1= 3.799351
##$NOISF2= 2.8
##$NSP= 0
##$NTH_PI= 0
##$NZP= 0
##$OFFSET= 15.72596
##$PC= 1
##$PHC0= -19264.41
##$PHC1= 9.400721
##$PH_mod= 1
##$PKNL= yes
##$PPARMOD= 0
##$PSCAL= 0
##$PSIGN= 0
##$REVERSE= no
##$SF= 200.130009122904
##$SI= 16384
##$SIGF1= 3
##$SIGF2= 2
##$SINO= 5.538805
##$SIOLD= 16384
##$SREGLST= <1H.CDCl3>
##$SSB= 0
##$STSI= 16384
##$STSR= 0
##$SW_p= 3612.71676300578
##$SYMM= 0
##$S_DEV= 0
##$TDeff= 16384
##$TDoff= 0
##$TI= <>
##$TILT= no
##$TM1= 0
##$TM2= 0
##$TOPLEV= 0
##$USERP1= <user>
##$USERP2= <user>
##$USERP3= <user>
##$USERP4= <user>
##$USERP5= <user>
##$WDW= 1
##$XDIM= 16384
##$YMAX_p= 341893346
##$YMIN_p= -660459
$$ End of Bruker specific parameters
$$ ---------------------------------
##NTUPLES= NMR SPECTRUM
##VAR_NAME=  FREQUENCY,     SPECTRUM/REAL,   SPECTRUM/IMAG
##SYMBOL=    X,             R,               I
##VAR_TYPE=  INDEPENDENT,   DEPENDENT,       DEPENDENT
##VAR_FORM=  AFFN,          ASDF,            ASDF
##VAR_DIM=   16384,         16384,           16384
##UNITS=     HZ,            ARBITRARY UNITS, ARBITRARY UNITS
##FACTOR=    0.220516191357247, 1,           1
##FIRST=     3147.23647380395, 0,            0
##LAST=      -465.480289201834, 0,           0
##MIN=       -465.480289201834, -660459,     0
##MAX=       3147.23647380395, 341893346,    0
$$ Real data points
##PAGE= N=1
##DATA TABLE= (X++(R..R)), XYDATA
$$ [...]
6473G92699N3359n9335j36872N3155L9438K9892n664P625j58662l0406O4769j28280
6461E21718p1325J05623m2236P0463O1907o9710j21270j0538K53256n431j10925
6450E81532M3180m8642J0988K01475q8046j22056k0147N7080J4359K5189q9967
6439E64945m400J82714J5421j93214o9039Q9153Q6182R189J27289k06145R3321
6428F95416j2877j35215M6458J13512J2160j08801J37233m6275q2226R8583j14437
6417F03531K1280j745O2199l0783J9984L1378N2431L5178j05202N0835o4117N3088
6405G28057l552Q526o0566J10677m1367r7195L4451K39206J9804J8043n6613m8998
6393H50473k0436J22551n2191o0626K1042J8228j25033o7915j2119j1211L3887
$$ plain form
6473 792699 846058 786723 649851 703006 742444 772336 766672 774297 615635 585229 649998 521718
6461 521718 450393 556016 513780 584243 646150 576440 455170 444632 697888 692457 581532
6450 581532 624712 576070 587058 788533 700487 578431 558284 615364 629723 654912 564945
6439 564945 560545 743259 758680 565466 496427 585580 671762 680951 808240 602095 695416
6428 695416 682539 547324 593782 707294 719454 610653 747886 701611 619385 717968 603531
6417 603531 624811 623066 685265 654482 674466 705844 758275 793453 688251 739086 674969 728057
6405 728057 724505 733031 672465 783142 741775 644580 679031 918237 938041 956084 899471 850473
6393 850473 830037 952588 900397 839771 860813 879041 754008 686093 673974 662763 696650
6382F96650J00055p04p3677l4287J40924q4861K9980M6864n1818j46640k9813
6371E92673N1773n07J10783p0392N0930q1808L1965R4428k6363n8934J2673p6351
6359F30870J6720l0345J2862q6754m7029R0191N4541J31095r4496p7663M3901
6348F43893P253n6223n1514j3720j72136J52740N3983O2656O3428r4876k6902
6337E68582O8539N5794q4203J6283j9842j07094o0037J37577J7952N0706M9486
6326F93743j56956M0770k1374m6321P8174j17437N7566n8738r9719J78512k3218
6315E25002n3895L1908N2309l7954k4753L3256j3542j4540j4941P9389J57675
6304G19914k15771l1992K13343j12244q1061J52837J8946j08446o2664P8838N693
$$ plain form
6382 696650 796705 796001 722324 688037 828961 744100 774080 820944 769126 622486 592673
6371 592673 644446 643939 754722 684330 735260 653452 685417 779845 753482 694548 707221 630870
6359 630870 647590 617245 630107 543353 496324 586515 641056 772151 677655 599992 643893
6348 643893 651146 594923 543409 529689 357553 510293 564276 626932 690360 595484 568582
6337 568582 637121 692915 608712 624995 605153 498059 438022 575599 593551 644257 693743
6326 693743 536787 577557 556183 509862 588036 470599 528165 469427 369708 548220 525002
6315 525002 471107 503015 555324 517370 492617 525873 512331 497791 482850 562239 719914
6304 719914 504143 472151 685494 573250 492189 645026 663972 555526 492862 571700 577393
6293E77393k2207l1003M5581K702J0968O818q1728J2134Q997k9881J29510J2642
6281F41926J1066J659R3125M3515j05369j64964l9326O9313j2687M5606N3900
6270F37764O8325q9134L3789J01100k6697o9991j01287L4355J59311j3930l0859
6259G02746p9576O7801M0890n7644p0097P6789L5749k2767p794L8306P7169J2471
6247H14043P068o9145N9123K4408j4139m0806m6464J8549O6707L5064l1083N3554
6235H76879K7132m2277O9586J42374J45204m5490j06943K1224l6016R0185p5252
6224A066606K7995M5895r9093J07063K52558L4891j31734Q3355J22795K33396
6214A743727J8272J52926J62580O9228l0885P1216k2322j46872j75246l638O555
$$ plain form
6293 577393 555186 524183 569764 572466 583434 590252 508524 520658 529655 499774 629284 641926
6281 641926 652992 654651 747776 791291 685922 520958 481632 550945 538258 583864 637764
6270 637764 706089 616955 650744 751844 725147 655156 553869 588224 747535 733605 702746
6259 702746 623170 690971 731861 674217 604120 680909 716658 693891 686097 724403 801572 814043
6247 814043 821111 751966 811089 835497 821358 780552 734088 752637 819344 854408 823325 876879
6235 876879 904011 861734 931320 1073694 1218898 1173408 1066465 1087689 1051673 1141858 1066606
6224 1066606 1094601 1140496 1041403 1148466 1401024 1435915 1304181 1387536 1510331 1743727
6214 1743727 1761999 1914925 2077505 2146733 2115848 2187064 2164742 2017870 1842624 1838986 1845541
6203A845541o3809O754M947P3385o6148M7685M2133K4288J59804K58093O8740
6192B401413J68885J87657J95060K17455M10742L51734N01457N74895N48610N13380
6182F071288J81461j90963m10630l84406k50917m26529m90920l98987k59459j51203
6172C288735q1473k5043r2446p5660K432P4934J30615L5336J06665J54312K24690
6161C743097K66228K95328M12983O08847N03678Q86950Q33745Q28741O19193m7167
6151H951623n77403p16553p60870q68600p33208o36915m87661m18826k57855j41994
6141C351738q7492m3810r4880j35840M5221K8276N8261J89299J69001P2294K35766
6130C787834K85384K85203L81928M95794M98286O05986M58717R1156k30422m92192
$$ plain form
6203 1845541 1781732 1788486 1793433 1866818 1800670 1848355 1890488 1914776 2074580 2332673 2401413
6192 2401413 2570298 2757955 2953015 3170470 3581212 3932946 4434403 5009298 5557908 6071288
6182 6071288 6252749 6061786 5651156 5266750 5015833 4589304 4098384 3699397 3439938 3288735
6172 3288735 3207262 3182219 3089773 3014113 3016545 3091479 3222094 3257430 3364095 3518407 3743097
6161 3743097 4009325 4304653 4717636 5326483 5830161 6717111 7550856 8379597 8998790 8951623
6151 8951623 8374220 7657667 6896797 6028197 5294989 4658074 4170413 3751587 3493732 3351738
6141 3351738 3264246 3220436 3125556 2989716 3034937 3063213 3121474 3310773 3479774 3552068 3787834
6130 3787834 4073218 4358421 4740349 5236143 5734429 6340415 6799132 6890288 6659866 6167674
6120F167674n64330o68637o87600m83296m22787k25656k20363k62486l50154j54283
6110B128082p7770L6863l1753j48430m5009j1727o7895j9728O4684l7023M5222
6099A835516J21037K15236K54547m742J12967J558r1344k52727p1818j98763j60492
6088A760975j76826j19372r6223l5450q9974q0838L6056j20738j30033K6944j7643
6077I56878M8398j34623q8739O7515p2757R2266l304N4231q4056j26403M801n2009
6065F62198l1307J4185l6349N2925L2309J99697J6456p5887p1945J3594L0788
6054H06664j06302j4851r9924M9942J64313q9234K5153L8193j43642O1896j0996
6043F81212p1949O0414O4044K0218O5066Q5117n7924j96345k359J30573K7367
$$ plain form
6120 6167674 5603344 4934707 4247107 3763811 3341024 3115368 2895005 2632519 2282365 2128082
6110 2128082 2050312 2087175 2055422 1906992 1861983 1850256 1782361 1762633 1827317 1790294 1835516
6099 1835516 1956553 2171789 2426336 2421594 2534561 2536119 2444775 2192048 2120230 1921467 1760975
6088 1760975 1584149 1464777 1368554 1333104 1243130 1162292 1198348 1077610 947577 974521 956878
6077 956878 1005276 870653 781914 849429 776672 868938 865634 919865 835809 709406 714207 662198
6065 662198 630891 645076 608727 661652 693961 893658 910114 834227 762282 775876 806664
6054 806664 700362 685511 585587 635529 799842 710608 735761 773954 630312 692208 681212
6043 681212 609263 669677 733721 753939 819005 904122 846198 649853 647494 778067 805434
6032H05434l7399n1403P3024r7961K0436r487P6843p9578J7888N6194P3808N8421
6020I06220J8467n0908o0139l1144j7579J58269O3449j18934o034p1448j30986
6009F59233j0806K545K32650J19493m0899O3491K5224j56657r8758R3171j6874
5998H71813o8210k2903O3304L5453J1920j9836K33588l2740m1351m1827J9834
5987A009045J72289j964J5369Q41o0342j3491O0845r3355J6361j19197j09526
5976H76875N450j17192J50278J07352j8777R2834J35454l4695j18620O9038r7727
5965A050270O363O4603J81970r2516P2723Q1083P444p896k7069R2402Q0678J4335
5953A524390m4438j10029K9354M8000k44443k4585M2006L2984K8664p4340J4695
$$ plain form
6032 805434 768035 716632 789656 691695 712131 702644 779487 699909 717797 773991 847799 906220
6020 906220 924687 873779 813640 782496 764917 923186 986635 867701 861667 790219 659233
6009 659233 648427 650972 883622 1003115 962216 1025707 1050931 894274 795516 888687 871813
5998 871813 803603 780700 844004 879457 891377 871541 1105129 1072389 1031038 989211 1009045
5987 1009045 1181334 1179370 1194739 1195580 1135238 1121747 1182592 1089237 1105598 986401 876875
5976 876875 882325 765133 915411 1022763 1003986 1096820 1232274 1197579 1078959 1147997 1050270
5965 1050270 1056633 1121236 1303206 1210690 1283413 1364496 1371940 1364044 1336975 1429377 1510055 1524390
5953 1524390 1479952 1369923 1399277 1447277 1202834 1178249 1220255 1253239 1281903 1207563 1222258
5942A222258M2452j22296q419K1197L7014Q5211L5376q654k5530Q8759j1043q712
5930A347613O6207L5728n6682q7260J23521L6301n7859q0714O2528m0142N2932
5919A402173L7034Q2136j57567r847R9293p1143M0508K6237n4362L1059J78041
5908A603562J3143K851j4848k4552m7428J947J8313n5561L3234J15458j9585N6731
5896A683265R7270M2067k2916j8206J0809L5054L2607P1493o3871P8744N6626
5885B002942J5091p0109Q4099Q5236K7023M4840j4795L635L3542j62345j1738
5874B037421M6663k2973L933k4921R6451q8120K5531J05172p1168J36522O3336
5863B307847l0102m2358n3282J14629J15352P4679l7665l3361L3507J603M3572
$$ plain form
5942 1222258 1264710 1142414 1133995 1155192 1192206 1277417 1312793 1304139 1278609 1367368 1356325 1347613
5930 1347613 1413820 1449548 1392866 1305606 1429127 1465428 1407569 1326855 1389383 1349241 1402173
5919 1402173 1439207 1521343 1363776 1353929 1453222 1382079 1422587 1448824 1394462 1425521 1603562
5908 1603562 1616705 1619556 1604708 1580156 1532728 1534675 1552988 1497427 1530661 1646119 1626534 1683265
5896 1683265 1780535 1822602 1799686 1781480 1792289 1827343 1859950 1931443 1867572 1946316 2002942
5885 2002942 2018033 1947924 2032023 2117259 2144282 2189122 2174327 2177962 2211504 2049159 2037421
5874 2037421 2084084 2061111 2065044 2040123 2136574 2048454 2073985 2179157 2107989 2244511 2307847
5863 2307847 2277745 2235387 2182105 2296734 2412086 2486765 2449100 2415739 2449246 2450849 2494421
5852B494421R7205j4992J3965m598L1281p7505J58869J3816l8744R886J1772J80125
5840B875501o7308J40019m0460o2249j12980K02049P7686J083J74726J44044J24433
5829C456544R4096N7159Q7056J798K31839J2813J00442K84929J99929K13823J96833
5818D937261L19468L23949M66532N45167N44754P93483J004037J257210J724749
5809A1916610J788611J734611M60542o05016j221809j531371j443285j557325
5801I541568j183482q44031q17270n14440k56998j18792p5793j68967k10127J59325
5791E510993j1100K662j42744r3071J70192J4479j14589j70217k14477j55802
5781D796326k18702k27909j88836j47220m7508q9503M0750j11977j62225J85684
$$ plain form
5852 2494421 2591626 2576634 2590599 2586001 2617282 2539777 2698646 2712462 2673718 2683604 2695376 2875501
5840 2875501 2808193 2948212 2907752 2845503 2732523 2934572 3012258 3013341 3188067 3332111 3456544
5829 3456544 3550640 3607799 3694855 3696653 3928492 3941305 4041747 4326676 4526605 4740428 4937261
5818 4937261 5256729 5580678 6047210 6592377 7137131 7930614 8934651 10191861 11916610
5809 11916610 13705221 15439832 15900374 15295358 14073549 12542178 11098893 9541568
5801 9541568 8358086 7514055 6696785 6182345 5925347 5806555 5730762 5561795 5351668 5510993
5791 5510993 5499893 5502555 5359811 5266740 5436932 5451411 5336822 5166605 4952128 4796326
5781 4796326 4577624 4349715 4160879 4013659 3966151 3876648 3917398 3805421 3643196 3828880
5771C828880l0373r4191k39227J13506J3328P6534m2872P0158m9892j01234m9891
5760C494726P9178K52498k5958l5252o2139j01671J8260J20994N4620o8463r926
5749C716867J30784j5316m8570J6601O5324J38884N9341m4727O4709M229m6429
5738D041697J70955J46976o6690L7419l5484K6072J74388Q0083L0057Q1244m4161
5727D642556J78295J1239P2890J82710n5762p9533J36277J62368J67873N9809
5717E478722J51685J26069J88779J12485J01756K13222N2099J36035J45750J43441
5707F850043N0321K66046K78257J47286K19039J34520K66936K21078L14905K41578
5697H990009L07706M01152M24959M17482M42971N50568P78566O75928P78339R59721
$$ plain form
5771 3828880 3798507 3704316 3465089 3578595 3591923 3668457 3625585 3695743 3645851 3544617 3494726
5760 3494726 3573904 3826402 3800444 3765192 3703053 3601382 3619642 3740636 3795256 3726793 3716867
5749 3716867 3847651 3832335 3783765 3800366 3865690 4004574 4063915 4019188 4083897 4088126 4041697
5738 4041697 4212652 4359628 4292938 4330357 4294873 4320945 4495333 4575416 4605473 4686717 4642556
5727 4642556 4820851 4832090 4904980 5087690 5031928 4952395 5088672 5251040 5418913 5478722
5717 5478722 5630407 5756476 5945255 6057740 6159496 6372718 6424817 6560852 6706602 6850043
5707 6850043 6900364 7166410 7444667 7591953 7810992 7945512 8212448 8433526 8748431 8990009
5697 8990009 9297715 9698867 10123826 10541308 10984279 11534847 12313413 12989341 13767680 14727401
5687A4727401J042088J244193J583814J616943J947111K092820K253612J986398
5679B8494380J746697J148049M28648p7857n69647m16104m96157n06583o64726
5670B9086700o66071o91630p46682r70336o58155n37588m71200j31850k6473M12948
5660B4599663Q52157J058422J254571J663893J986761K123797K288561K232904
5652C8060729K113597K143401K291825K541460K924361K790059K534583J663718
5644E7063733L54827r99298k001340k791070l246649l234502k944437k535450
5636C9665814k517883k466451k098585k026231j869159j585935j313213j074097
5628B4714260o44654l81379j91988N0632K79158O31271R47665J204214J194015
$$ plain form
5687 14727401 15769489 17013682 18597496 20214439 22161550 24254370 26507982 28494380
5679 28494380 30241077 31389126 31817774 31739917 31170270 30754166 30258009 29751426 29086700
5670 29086700 28420629 27728999 26982317 26011981 25353826 24816238 24345038 24213188 24186715 24599663
5660 24599663 25451820 26510242 27764813 29428706 31415467 33539264 35827825 38060729
5652 38060729 40174326 42317727 44609552 47151012 50075373 52865432 55400015 57063733
5644 57063733 57418560 56419262 54417922 51626852 48380203 45145701 42201264 39665814
5636 39665814 37147931 34681480 32582895 30556664 28687505 27101570 25788357 24714260
5628 24714260 24069606 23688227 23496239 23546871 23826029 24457300 25404965 26609179 27803194
5619B7803194J273746J225823J075941R69715R61714J048333R95689O22010J39251
5610C6115416q94768j546086k135576k504043k562849k458786k260658j960167
5602A9792483j723006j462424j343855j004921p85900p04040o13131p03844m38385
5593A1012977l19733l21370l86529k48875j44763j55121j00003k00519j67247
5584H968817R7317O0462j27602j84548J8505J59808n3786J44122K39473Q9331
5574I411899J93015M28022N77776N23574P45783R46020R95965J292490J852315
5565A6966859K276179K994806K646986J054097p42701j775315k310079k507268
5557A8603564k293708k108985j495026j023651j089633n72711l77339l81672l67110
$$ plain form
5619 27803194 29076940 30302763 31378704 32348419 33310133 34358466 35354155 35976165 36115416
5610 36115416 35220648 33674562 31538986 29034943 26472094 24013308 21752650 19792483
5602 19792483 18069477 16607053 15263198 14258277 13472377 12768337 12155206 11451362 11012977
5593 11012977 10693244 10371874 9985345 9736470 9591707 9436586 9336583 9136064 8968817
5584 8968817 9066134 9126596 8998994 8814446 8832951 8992759 8938973 9083095 9322568 9411899
5574 9411899 9604914 10032936 10610712 11134286 11880069 12826089 13822054 15114544 16966859
5565 16966859 19243038 22237844 24884830 25938927 25196226 23420911 21110832 18603564
5557 18603564 16309856 14200871 12705845 11682194 10592561 10019850 9642511 9260839 8893729
5548H893729k58818j62961p5933k17169q6972l0772K8772J58028l8381J24703
5538H334226K90073K03437R9367J28562L94895l7624k15623j34283k64213k46123
5528H552694k10963k61277j63177j82129k70192j34061l8522N2781P337J16066
5518G468557P0998L3140J012P6658J0351M3280L3499J39543j4322J30501J05789
5507H099006j844J7342J28189L0768L6641j0003J85710q0554L0198K94878L6592
5496H766923J67278J36073l8880J43853K61578J61669J98559J01380K08709K57068
5486A0364210K71520K79469L29472M09994L23623N29886N57402M26800M84719
5477A3977095O14349P87443Q73811J019343R30782J249876J532650J794623J994072
$$ plain form
5548 8893729 8634911 8471950 8396017 8178848 8091876 8061104 8089876 8247904 8209523 8334226
5538 8334226 8624299 8827736 8927103 9055665 9450560 9412936 9197313 9063030 8798817 8552694
5528 8552694 8341731 8080454 7917277 7735148 7464956 7330895 7292373 7345154 7352491 7468557
5518 7468557 7539555 7572695 7573707 7650365 7660716 7703996 7737495 7877038 7862716 7993217 8099006
5507 8099006 8097162 8114504 8242693 8273461 8310102 8300099 8485809 8405255 8435453 8730331 8766923
5496 8766923 8934201 9070274 9031394 9175247 9436825 9598494 9797053 9898433 10107142 10364210
5486 10364210 10635730 10915199 11244671 11654665 11978288 12508174 13065576 13492376 13977095
5477 13977095 14591444 15378887 16252698 17272041 18202823 19452699 20985349 22779972 24774044
5468B4774044K264383K566039K777378K833462K466930J759200Q16586k56568
5460D0001454m74032o83284p75010r36545r11826j040196j441094j245931j169353
5451C1324183j116969r27587n98353l80224j77207L14121P36847R56104J269085
5442C1400000J695733K290447K559167K750596L168803L240383L355863L723235
5434E4184227L635790L703152L256694K420888R62782o92328k163790k949948
5426F2357467l368206l546581l307365l275134l153443l131476l001819k654493
5418C6918950k326488k005992j555924j095749p42298l80593n2390M69100P91301
5409C0019917J288797J594311J969449K118264K264142K078836J411774O94614
$$ plain form
5468 24774044 27038427 29604466 32381844 35215306 37682236 39441436 40258022 40001454
5460 40001454 39527422 38844138 38069128 37132583 36220757 35180561 33739467 32493536 31324183
5451 31324183 30207214 29279627 28681274 28301050 28123843 28437964 29174811 30130915 31400000
5442 31400000 33095733 35386180 37945347 40695943 43864746 47105129 50460992 54184227
5434 54184227 57820017 61523169 64779863 67200751 68163533 67471205 65307415 62357467
5426 62357467 58989261 55442680 52135315 48860181 45706738 42575262 39573443 36918950
5418 36918950 34592462 32586470 31030546 29934797 29192499 28811906 28759516 29228616 30019917
5409 30019917 31308714 32903025 34872474 36990738 39254880 41333716 42745490 43440104
5401D3440104L89715M96996N36410M56211L07p59486j421580k457902l382622
5392C7298153l449373l300607l029573k712628k323964j913062j506722j167797
5384A7894427j073009o48572m98977m43138l73756k4773M2892Q9527L15257M38394
5374A5718272M26597J64052J25610J08715K30177J58476K95998M80398N92518
5365A8300813R6030l42255o72231p36509p13268o51605p62571m31983l26968l12180
5355A3447273m38566l42828m61275n55419k99375j78198l61505k66951k43066
5346A0300090k37341l39735k68742k83062k35376K08k8872q590K5773J28835J69233
5335I222421K12647J97511K53770M36058N92699P91484P50969N27273O06439L80913
$$ plain form
5401 43440104 43829819 44326815 44863225 45319436 45319743 44560257 43138677 40680775 37298153
5392 37298153 33848780 30548173 27518600 24805972 22482008 20568946 19062224 17894427
5384 17894427 16821418 16172846 15673869 15230731 14856975 14832202 14875094 14964621 15279878 15718272
5374 15718272 16144869 16308921 16434531 16543246 16773423 16931899 17227897 17708295 18300813
5365 18300813 18396843 18054588 17382357 16645848 15932580 15280975 14518404 14086421 13759453 13447273
5355 13447273 13008707 12665879 12204604 11649185 11349810 11171612 10810107 10543156 10300090
5346 10300090 10062749 9723014 9454272 9171210 8935834 8936042 8907170 8898580 8924353 9053188 9222421
5335 9222421 9435068 9632579 9886349 10322407 10915106 11706590 12457559 12984832 13591271 13972184
5325A3972184K70845K16305N2645j2289L7350J39156J68786K93065O1460l10546
5315A4888961m71467o79872q28806r85222q64108p62447o14489l47090k77326
5306I058134j02348r1774N9714M2759k7692L20766L49758M47519L41035L69607
5296A0767478M79778K26724J41489K29018L84451L60738K56292Q8585j81695l20950
5286A2431908m89836o88382p26251p28802n16472m88358n13809l22592j57493
5277G799913k6913p2383l18742q1383K26571L6130R8999k359R6164J41582K08784
5266H106363K05370L66988M79309L97416N91051P13515P19737Q11717Q19442O80036
5256A3890944J18632J27092M5859j61037k2232O7367K77195L61833L85598M36897
$$ plain form
5325 13972184 14243029 14459334 14511979 14499690 14537040 14676196 14844982 15138047 15199507 14888961
5315 14888961 14417494 13737622 12908816 11923594 11059486 10297039 9682550 9335460 9058134
5306 9058134 8955786 8864012 8923726 8966485 8938793 9259559 9609317 10056836 10397871 10767478
5296 10767478 11247256 11473980 11615469 11844487 12228938 12589676 12845968 12934553 12752858 12431908
5286 12431908 11942072 11253690 10527439 9798637 9282165 8793807 8279998 7957406 7799913
5277 7799913 7773000 7700617 7381875 7300492 7527063 7563193 7662192 7659833 7755997 7897579 8106363
5266 8106363 8311733 8678721 9158030 9555446 10146497 10860012 11579749 12391466 13210908 13890944
5256 13890944 14009576 14136668 14182527 14021490 13999258 14066625 14343820 14705653 15091251 15528148
5246A5528148O96452R94081R53585J085898J042840P78106J29772m64132m27029
5237B0317721l33104k50979n2341L45117L00957L32282j915m98580m89076p61694
5227A8908388o35231n24865l54091k52349k99221j49381j53263J06587K76723
5218A6923297K78692M72046N60829O47116R63338J014417Q25793K81237o2821
5209B1903944l08205n64349m56048l80081q4275N312L2723m43274p73911j050902
5199A7880934j260193j049006j123828r14569p67643m50692k87275l57588l70814
5190A1299326m39531m73086k86570j60982j94025l880R7981P5438J18148J56622
5180A0189441J43898j02360K7018J67366L59080L65122J29737l95939m33204o70514
$$ plain form
5246 15528148 16224600 17218681 18172266 19258164 20301004 21079110 21208882 20744750 20317721
5237 20317721 19984617 19733638 19681297 20026414 20327371 20659653 20657738 20159158 19670082 18908388
5227 18908388 18273157 17748292 17394201 17141852 16842631 16693250 16539987 16646574 16923297
5218 16923297 17201989 17674035 18234864 18881980 19845318 20859735 21685528 21966765 21903944
5209 21903944 21595739 21031390 20575342 20195261 20110986 20116298 20149021 19705747 18931836 17880934
5199 17880934 16620741 15571735 14447907 13533338 12765695 12315003 12027728 11670140 11299326
5190 11299326 10859795 10386709 10100139 9939157 9745132 9741252 9839233 9914671 10032819 10189441
5180 10189441 10333339 10230979 10257997 10425363 10784443 11149565 11279302 10883363 10450159 9779645
5170I779645p88801q07312o58825p02742m70144l45379m43347j49260k16391j65334
5160E032110j76380j70868j63310o0415j32121j52276p6365k1680k6548n0357
5150D001790j3615j18376l8781J350j29731l4899L9253m4875q6629j00792j10308
5139C364387J62979m7742p2334q8621r5007o3191o7637j42240Q8325J009K9813
5128C069741L3164M228Q2139j71505O0695R3018q4858J7191J25294J2220k410
5117C238917p8236P8062j77726o1480N7182L4402j63579k9012J49147m5723M392
5106C006346j15191j52611Q267J49842q211J5091p5226J35754k6859r5258L6464
5095B878408K15249O7093j61983N066N3420O8662R5993J3713J56942K1972J39522
$$ plain form
5170 9779645 8990844 8183532 7524707 6821965 6351821 6006442 5563095 5413835 5197444 5032110
5160 5032110 4855730 4684862 4521552 4461137 4329016 4176740 4100375 4078695 4052147 4001790
5150 4001790 3988175 3869799 3831018 3832368 3702637 3667738 3706991 3662116 3575487 3474695 3364387
5139 3364387 3527366 3479624 3407290 3318669 3223662 3160471 3092834 2950594 3038919 3039928 3069741
5128 3069741 3102905 3107133 3189272 3017767 3078462 3171480 3086622 3103813 3229107 3241327 3238917
5117 3238917 3160681 3238743 3061017 2999537 3056719 3091121 2927542 2898530 3047677 3001954 3006346
5106 3006346 2891155 2738544 2746811 2896653 2888442 2903533 2828307 2964061 2937202 2841944 2878408
5095 2878408 3093657 3160750 2998767 3003833 3057253 3125915 3221908 3235621 3392563 3414535 3554057
5084C554057R5442J6276n1412o5890j69601L4062j30209l5865j2510R27q6788
5073C148489j21305L4060M9711n2950m2888N258j6538L5041j10267k2890J29796
5062C035517J66277p6610J01841j3115J64368M6626M0644O5685P0804j65501p8644
5051C357892K6861k8459J9656n3072j89972J08067m4472j27546k02059j02775
5041B764121j02637Q0843k6823j79892k12961m3632J41912p654j38160K8231l2397
5030B270951j3414K241O379l4815J8403l5258q67l0196J26189O4364l292L0897
5018B401582r3669l678m7327j62818k5071j16796r9450l3974Q3526j6829n8253
5007A827243J11947o9644m7150n4860j04611k5062J21306p0195j3066P9100M1377
$$ plain form
5084 3554057 3649499 3665775 3614363 3548473 3378872 3412934 3282725 3246860 3234350 3235277 3148489
5073 3148489 3027184 3061244 3110955 3058005 3015117 3020375 3003837 3038878 2928611 2905721 3035517
5062 3035517 3201794 3125184 3227025 3213910 3378278 3424904 3465548 3531233 3602037 3436536 3357892
5051 3357892 3384753 3356294 3375950 3322878 3132906 3240973 3196501 3068955 2866896 2764121
5041 2764121 2661484 2742327 2715504 2535612 2322651 2279019 2420931 2413277 2275117 2303348 2270951
5030 2270951 2257537 2259778 2266157 2231342 2249745 2214487 2213620 2183424 2309613 2373977 2370685 2401582
5018 2401582 2307913 2304235 2256908 2094090 2069019 1952223 1852773 1818799 1902325 1885496 1827243
5007 1827243 1939190 1869546 1822396 1767536 1662925 1637863 1759169 1688974 1675908 1755008 1796385
4996A796385j03337k0507o532J14153q0226p9427j01478l9787N0933P103j539
4985A535741J28486O9713p7012j2453R8713n1427J2790L3023J68292k2381N7543
4974A941028j81502N0441k1503M7372L4461r3556n1490K02592L5749j15377M1880
4963A890095J27061P5099Q0081o4150n4185m6054K5092J9426l7580K4992m0473
4952A999404J3463j03707J42139n156o5077J17826L8806j6164N4720K9915N5354
4941B261523J0404J89907O2242N1776m1583J01093J88018Q2448J43416J45494
4931C194738J89268J13764L50015L64864L23297L57326M87507N57096L09563O7894
4921F315332j84922m02485l54705l68521n45932m65041l33524k35881j68716j51531
$$ plain form
4996 1796385 1693048 1672541 1666009 1780162 1699936 1620509 1519031 1479244 1530177 1537280 1535741
4985 1535741 1664227 1733940 1656928 1644475 1743188 1691761 1704551 1737574 1905866 1883485 1941028
4974 1941028 1759526 1809967 1788464 1835836 1870297 1776741 1725251 1927843 1963592 1848215 1890095
4963 1890095 2017156 2092255 2172336 2108186 2054001 2007947 2033039 2052465 2014885 2039877 1999404
4952 1999404 2012867 1909160 2051299 2046143 1981066 2098892 2137698 2121534 2176254 2206169 2261523
4941 2261523 2271927 2461834 2524076 2575852 2534269 2635362 2823380 2905828 3049244 3194738
4931 3194738 3384006 3497770 3847785 4212649 4535946 4893272 5380779 5937875 6247438 6315332
4921 6315332 6130410 5727925 5373220 5004699 4458767 3993726 3660202 3424321 3255605 3104074
4911C104074q50J228p7005K1890o2337j25097l1105J2666r6036J1061k768j8757
4899B736964L1522n7281R468M9493L1552o1535O9295l4508M0946k7667n1610J25205
4887B861844k4607K41009M2697m8010M3658j4745M2793J51718J30594Q4187n6822
4876C454316J99977J58041J04182L201M6584J16625K23421J12802K30816Q4286
4866D734251P5872K73556J11114J16521K11751J77189N15508K88541J33888K30507
4856F868698L6408K83291L53144L24994M34480M65930O54429P60567R47358J092496
4846A2221795J289991J465324J981474K540362K948895L640092M815561N863730
4838C6767224N950953J868131k493944m035361m497701m348992n106628m143930
$$ plain form
4911 3104074 3103224 3104452 3027447 3049337 2987000 2861903 2830798 2843464 2747428 2758489 2755721 2736964
4899 2736964 2768486 2711205 2720673 2770166 2801718 2740183 2809478 2774970 2815916 2788249 2736639 2861844
4887 2861844 2837237 3078246 3120943 3072933 3116591 3101846 3144639 3296357 3426951 3511138 3454316
4876 3454316 3654293 3812334 3916516 3919717 3966301 4082926 4306347 4419149 4649965 4734251
4866 4734251 4810123 5083679 5194793 5311314 5523065 5700254 6215762 6504303 6638191 6868698
4856 6868698 6905106 7188397 7541541 7866535 8301015 8766945 9421374 10181941 11129299 12221795
4846 12221795 13511786 14977110 16958584 19498946 22447841 26087933 30903494 36767224
4838 36767224 42718177 44586308 42092364 38057003 33559302 29210310 24103682 19959752
4830A9959752l076851k488493j753238j393139r95353p12136o06878p41125m38645
4821G753894l86065l98882j97322l61602k86839k05241j9836l43709n3614p4313
4811E426471j78112q1014j09950k08264j49098J4939o2027j65942j96227o4444
4801D226332k03578r0325P0457O388O1341M8151o2781n4410Q3989R8069m1112
4790D142521k03931j64428J21332p279j57022r3237j2203m1740O683J2855L2163
4779C635714m9215q5852J34502j48085K0991p8815m2456M9478L3820J15982K184
4768C588248l7360j8586J68056J29990o6445m2401p19L8552l8468k7705k02336
4757C490826m9424J18417O1236M5761P0834k5386P6307j00260K3677J21863P8934
$$ plain form
4830 19959752 16882901 14394408 12641170 11248031 10252678 9540542 8933664 8192539 7753894
4821 7753894 7367829 6968947 6771625 6410023 6123184 5917943 5898107 5554398 5500784 5426471
4811 5426471 5248359 5167345 5057395 4849131 4700033 4714972 4652945 4487003 4290776 4226332
4801 4226332 4022754 3932429 4002886 4009274 4070615 4118766 4055985 4001575 4085564 4183633 4142521
4790 4142521 3938590 3774162 3895494 3888215 3731193 3637956 3625753 3584013 3590696 3603551 3635714
4779 3635714 3586499 3500647 3635149 3487064 3508055 3429240 3386784 3436262 3470082 3586064 3588248
4768 3588248 3550888 3532302 3700358 3830348 3763903 3721502 3720783 3759335 3720867 3693162 3490826
4757 3490826 3441402 3559819 3621055 3666816 3737650 3712264 3788571 3688311 3711988 3833851 3912785
4746C912785J0031N0659m3410q1817K5685J19247J4089N7911p120P643K00735
4735D266438j3005j53309j6094O2964M5784K1168j3J46130Q827j4807n8018M0937
4723D337002N3019J14843J07170M0347n8609r5778l0617Q0216J27669K33983j4756
4712D894489o9621K28394K92554J17404J64901Q3565J61879R1849M1846m8245
4702E959015q1066j33010j56709l02058j911p0713j51323N1955j00162M7037l8374
4691E022681q0595O89Q521J00510n6612l098J65654q317q9687o1717J3631j0853
4679E000807o0629O8068p8721J48J67518p830J07768r2194M5218P0318J53595
4668E374066o0953j66267J31679Q6616K5620k3884n4331Q347J11715n7952O3148
$$ plain form
4746 3912785 3922816 3973475 3930065 3848248 3873933 3993180 4007269 4065180 4058060 4065703 4266438
4735 4266438 4253433 4100124 4084030 4146994 4192778 4213946 4213933 4360063 4368890 4354083 4296065 4337002
4723 4337002 4390021 4504864 4612034 4652381 4593772 4497994 4467377 4547593 4675262 4909245 4894489
4712 4894489 4824868 5053262 5345816 5463220 5628121 5711686 5873565 5965414 6007260 5959015
4702 5959015 5877949 5744939 5588230 5286172 5284261 5213548 5062225 5114180 5014018 5061055 5022681
4691 5022681 4942086 4942775 4951296 5051806 4995194 4992096 5157750 5149433 5059746 4998029 5011660 5000807
4679 5000807 4940178 5008246 4929525 4929673 5097191 5089361 5197129 5104935 5150153 5220471 5374066
4668 5374066 5313113 5146846 5278525 5365141 5390761 5366877 5312546 5320893 5432608 5374656 5437804
4657E437804J75939J44360M5540p7096L2804j6474p053N3108O3342J75576j02867
4646E924983J43505J69072J55699m3369J48143J35388M396J42950m096j63179
4636F613492J07262J23210J31660J41513P7957J6777j1537K3311J03446K23088
4626G550179Q2766P8850Q5080M3874R6070K23020N1305O4449J11135Q7855J04727
4615H579310K46259P8415J59710J38346O2375J87199J51367K30789K10588J02897
4605A0147255K03809K65545K31187K05855J51790L30848L70616J66652K05858
4596A2279415M10229M68615L37606N03473O18751L67971M99251P12717P48467
4587A6946495N93094N73479R30899R17555J116662J112600J256974J235792J431644
$$ plain form
4657 5437804 5613743 5758103 5803643 5726547 5759351 5742877 5735824 5788932 5852274 6027850 5924983
4646 5924983 6068488 6237560 6393259 6349890 6498033 6633421 6637817 6780767 6776671 6613492
4636 6613492 6720754 6843964 6975624 7117137 7195094 7211871 7200334 7223645 7327091 7550179
4626 7550179 7632945 7711795 7796875 7840749 7936819 8159839 8211144 8275593 8386728 8474583 8579310
4615 8579310 8825569 8903984 9063694 9202040 9264415 9451614 9602981 9833770 10044358 10147255
4605 10147255 10351064 10616609 10847796 11053651 11205441 11536289 11906905 12073557 12279415
4596 12279415 12689644 13158259 13495865 13999338 14618089 14986060 15485311 16198028 16946495
4587 16946495 17539589 18113068 19043967 19961522 21078184 22190784 23447758 24683550 26115194
4578B6115194J346665J464160J478791J430233J328714J206144J025371J077410
4570C6472682Q75230M71686L61077M49787L38506J97140K14140K49081L97641
4561D0026970L50480N55762P09913R30258J142850J504477J600210J961901J971781
4552E0754602K061137K272762K663458K505588K257699K100522J865214J668181
4544F8149163J167226Q22689L29931p5621l15537p19002q92432j012206j294782
4535F6159429j143404r56789j046156q11299n48363n36660l54446o7405j65733
4526F0529174J7401L11384K10063M10803M82296N45404O37111P88357Q64789R45916
4516F5742698J007742J095797J102790R51046P46535N67458K99980m0302l96900
$$ plain form
4578 26115194 27461859 28926019 30404810 31835043 33163757 34369901 35395272 36472682
4570 36472682 37347912 37819598 38180675 38630462 38968968 39166108 39380248 39629329 40026970
4561 40026970 40377450 40933212 41643125 42573383 43716233 45220710 46820920 48782821 50754602
4552 50754602 52815739 55088501 57751959 60257547 62515246 64615768 66480982 68149163
4544 68149163 69316389 70139078 70469009 70393388 70077851 69358849 68466417 67454211 66159429
4535 66159429 65016025 64059236 63013080 62201781 61653418 61116758 60762312 60694907 60529174
4526 60529174 60546575 60857959 61068022 61478825 61961121 62506525 63143636 63931993 64796782 65742698
4516 65742698 66750440 67846237 68949027 69900073 70646608 71214066 71514046 71473744 71076844
4507G1076844n99090j002399j584812k007001k168956k453765k600003k670782
4499E5990036k444654k200688k127014j840451j784239j487706j023236r57699
4491D2124349p91816n10650k94844k78790j93426j92333k30399k02528m96778
4482C8932785o22988m98741q55470j226304j209830j350161j461846j703287j799433
4473B8204725j802903j696383j541280j435751j320935j096712j182594j141934
4465A6986233r92378p36496p55028q45421n54460m33294m83003l91116m38562
4456A1356475l84603k65420k99455l32787k52679l06753j83801j83419k96226
4447H851332k60990k65350j69602p7612k59750j40291j95180j11647p7554j52463
$$ plain form
4507 71076844 70477754 69475355 67890543 65883542 63714586 61260821 58660818 55990036
4499 55990036 53545382 51344694 49217680 47377229 45592990 44105284 43082048 42124349
4491 42124349 41332533 40821883 40527039 40248249 40054823 39862490 39632091 39429563 38932785
4482 38932785 38309797 37811056 36955586 35729282 34519452 33169291 31707445 30004158 28204725
4473 28204725 26401822 24705439 23164159 21728408 20407473 19310761 18128167 16986233
4465 16986233 15993855 15257359 14502331 13656910 13102450 12669156 12186153 11795037 11356475
4456 11356475 10971872 10706452 10406997 10074210 9821531 9514778 9330977 9147558 8851332
4447 8851332 8590342 8324992 8155390 8077778 7818028 7677737 7482557 7370910 7293356 7140893
4437G140893j03264j42874j58614J9153j25827j93897J1231k00773q691j03391
4427F133946j39984j08056p734r32k54430j30326K1429j72599l7723k5774o4901
4416E212916n9385o3474o7896m8484o5009m341p4580j59614J5037K5576m5094
4405D665652j5131j43947k04490Q7721m4228N1816K4569j02526J08106n4059L0404
4394D403887o4700j22401M655n116l6598j6361Q9017l8302n5469k1239j8741j53383
4382C965249R8132Q0814o6273q6182n9070M8522P0340J0280K0442J53809K4157
4371D260220j65482r2470J08635q0656l2884J5494J3514J3865j8506J10463r0096
4360D042097j15738l702J45934l3162K0105K4965l236K1596p6116j59046N0043
$$ plain form
4437 7140893 7037629 6894755 6736141 6755294 6629467 6435570 6446801 6246028 6237337 6133946
4427 6133946 5993962 5885906 5878172 5877240 5622810 5492484 5513913 5341314 5303591 5277817 5212916
4416 5212916 5153531 5090057 5022161 4973677 4908668 4904327 4829747 4670133 4685170 4710746 4665652
4405 4665652 4650521 4506574 4302084 4389805 4345577 4397393 4421962 4319436 4427542 4373483 4403887
4394 4403887 4339187 4216786 4221441 4216325 4179727 4163366 4252383 4214081 4158612 4137373 4118632 3965249
4382 3965249 4063381 4144195 4077922 3991740 3932670 3981192 4051532 4061812 4082254 4236063 4260220
4371 4260220 4094738 4002268 4110903 4030247 3997363 4012857 4026371 4040236 4021730 4132193 4042097
4360 4042097 3926359 3922657 4068591 4035429 4055534 4080499 4077263 4098859 4022743 3863697 3913740
4349C913740N6771j01656L4393R2949p495j2620J06621o0117N7433j8906o7425
4338C993688j40822R1809J49785k9071Q7331Q4931j1933n9250q8347j35461L5510
4327C978170L2774p5356P6502o2342j12569L9043R0030j63577J39715J81665n4303
4316D069752J8465o5236j4144R3763n1710o4751O304N32j9745L4826l2754n044
4304C970258K42761J02648q1298j2579m5474O8310K0965m0856J08391K5802k0579
4293D338349o0405j7378O9623O8708P9207N9418J05952Q9136k1805l4407J25744
4282D802142J06303n4447Q8721k4027j12226J03676J24667j17767l4981N3828
4272D935889J100m7167m463n1739K1687M9208l616K32663r4698l2173J48517J71112
$$ plain form
4349 3913740 3970511 3868855 3903248 3996197 3988702 3976082 4082703 4022586 4080019 4061113 3993688
4338 3993688 3852866 3944675 4094460 4065389 4152720 4237651 4225718 4166468 4078121 3942660 3978170
4327 3978170 4010944 3935588 4012090 3949748 3837179 3876222 3966252 3802675 3942390 4124055 4069752
4316 4069752 4088217 4022981 4008837 4102600 4050890 3986139 3992443 3992975 3973230 4008056 3975302 3970258
4304 3970258 4213019 4315667 4234369 4221790 4176316 4244626 4265591 4224735 4333126 4358928 4338349
4293 4338349 4277944 4260566 4330189 4398897 4478104 4537522 4643474 4732610 4710805 4676398 4802142
4282 4802142 4908445 4853998 4942719 4918692 4806466 4910142 5034809 4917042 4882061 4935889
4272 4935889 4936989 4889822 4885359 4833620 4855307 4904515 4900899 5133562 5038864 5006691 5155208 5326320
4260E326320p318j49777J20435J34352J34003q428N1390Q8823K2728K17493P1120
4249F001141O2320P3423M8657Q5954l3843P1168L6209k130j38471j35415N9659
4238F128672P5319m4846j2335L3345J51488P8998j5074O4370J10515J59734l9331
4227F690855j63054R4090J23033m9876j22115P360J19735Q3829O959L766Q7340
4216F881922M9425q9416J44039M0401O8425J28503n7759n4237o0630l5822J18468
4205G133319J08168p2128R0002q6496J20260K07290Q5019J56709J29810J53542
4195H025495J99027J9320r116K8849p9971j89565j47335r4674j89866m0840m3148
4184G478176M5452m2337j64135n7166L5145J9371Q6896Q8447K4791R567J9570
$$ plain form
4260 5326320 5319002 5169225 5289660 5424012 5558015 5549587 5600977 5689800 5712528 5930021 6001141
4249 6001141 6063461 6136884 6185541 6271495 6237652 6308820 6345029 6342899 6204428 6069013 6128672
4238 6128672 6203991 6159145 6146810 6180155 6331643 6410641 6395567 6459937 6570452 6730186 6690855
4227 6690855 6527801 6621891 6744924 6695048 6572933 6580293 6700028 6783857 6790816 6794582 6881922
4216 6881922 6931347 6841931 6985970 7026371 7094796 7223299 7165540 7111303 7050673 7014851 7133319
4205 7133319 7241487 7169359 7259361 7172865 7293125 7500415 7585434 7742143 7871953 8025495
4195 8025495 8224522 8243842 8234726 8263575 8183604 7994039 7846704 7752030 7562164 7521324 7478176
4184 7478176 7523628 7481291 7317156 7259990 7295135 7314506 7401402 7489849 7514640 7524207 7543777
4173G543777N1903Q5008K49280J19847L3224O7385J16626J64575L4213K51789
4163H717627J61916J32027K13734M0983j6981J26756j34544j86574o937m5707
4153I002300J06674M8880j13695j09775l7704J23575M3122R6374R2123J4945k1007
4142I245812j21965r8628J51292J43168J14311R8666L426J96724q494J00289L45758
4131A0170359J06113O0414q1946J13317K30444q2739J08288J42281J5671J57029
4121A0939231J55970Q9238J47267P4271K30040K27898K03864j9225P0203K28009
4111A2346766L37063K02812K45606J66445L38098L68191K5052L11076K54770K43640
4101A4839519L88837K90657L72510L71834L59907N53638M94425M88201O43813
$$ plain form
4173 7543777 7595680 7680688 7929968 8049815 8083039 8150424 8267050 8431625 8465838 8717627
4163 8717627 8879543 9011570 9225304 9266287 9249306 9376062 9241518 9054944 9048007 9002300
4153 9002300 9108974 9157854 9044159 8934384 8896680 9020255 9063377 9159751 9251874 9266819 9245812
4142 9245812 9123847 9025219 9176511 9319679 9433990 9532656 9536082 9732806 9724312 9824601 10170359
4131 10170359 10276472 10336886 10254940 10368257 10598701 10515962 10624250 10766531 10782202 10939231
4121 10939231 11095201 11184439 11331706 11405977 11636017 11863915 12067779 12048554 12118757 12346766
4111 12346766 12683829 12886641 13132247 13298692 13636790 14004981 14030033 14341109 14595879 14839519
4101 14839519 15228356 15519013 15891523 16263357 16623264 17176902 17671327 18159528 18803341
4092A8803341O28537O87110O55960N99496O51117P90723Q94898Q65145J035401
4083B5611728J052191J274662J054723J139294J501330J230794J282010J354795
4075C5501527J546204J639105J514643J566292J856338J853835J767565J854168
4067D9099677J989133K011964K033696J996796K087932K165823K193218K044713
4059F5622952K082177K025026K004860K020024J815757J729285J695289J451739
4051H0447109J686136J509320J358076J519304J220405J145743R24798Q12375
4043I0623266R17179O71333L08431J24665J71005L861k49635j60627l27881k83412
4033I1798185k07355n20616n79829n11951o44926p18321r81172r80818j170745
$$ plain form
4092 18803341 19431878 20118988 20774948 21374444 22025561 22816284 23711182 24576327 25611728
4083 25611728 26663919 27938581 28993304 30132598 31633928 32864722 34146732 35501527
4075 35501527 37047731 38686836 40201479 41767771 43624109 45477944 47245509 49099677
4067 49099677 51088810 53100774 55134470 57131266 59219198 61385021 63578239 65622952
4059 65622952 67705129 69730155 71735015 73755039 75570796 77300081 78995370 80447109
4051 80447109 82133245 83642565 85000641 86519945 87740350 88886093 89810891 90623266
4043 90623266 91540445 92211778 92520209 92644874 92815879 92819740 92570105 92409478 92081597 91798185
4033 91798185 91590830 91070214 90490385 89978434 89333508 88615187 87634015 86653197 85482452
4024H5482452j107694r75221r51720j082106r22410j064194j006261j085137j045154
4015G6242555j036777q46586j064967j108937r12565j004415r92500j000516r60460
4006F7314832r98590r17933j073201j086923r81255j012920j123615j024334j193995
3997E7902066j180015j070564j158766j258149j006360j214099j252299j243455
3989D8518359j058453j181985j312152j368641j271287j335677j321874j187422
3981C8480868j263998j116736j160660j171651j145664j038945j061963q81517
3973B9639734q68769j040825j067255r53279r11395p95839q01534m73797o95065
3964B2031976o79412n12177n26220n59123n60429n07276m32810k98028m75952
$$ plain form
4024 85482452 84374758 83399537 82447817 81365711 80443301 79379107 78372846 77287709 76242555
4015 76242555 75205778 74359192 73294225 72185288 71272723 70268308 69275808 68275292 67314832
4006 67314832 66316242 65398309 64325108 63238185 62256930 61244010 60120395 59096061 57902066
3997 57902066 56722051 55651487 54492721 53234572 52228212 51014113 49761814 48518359
3989 48518359 47459906 46277921 44965769 43597128 42325841 40990164 39668290 38480868
3981 38480868 37216870 36100134 34939474 33767823 32622159 31583214 30521251 29639734
3973 29639734 28770965 27730140 26662885 25709606 24798211 24002372 23200838 22727041 22031976
3964 22031976 21352564 20840387 20314167 19755044 19194615 18687339 18254529 17956501 17480549
3955A7480549m63320k49610k71444l77568j66374k69613k11906j74836j19309
3946A5176569j9954j17536k37461j67719m1750r9968M1113J33819k7616k31752
3936A4407745p0289l663n734o2004j6708R952l0025m124J0668O1913Q3984n1839
3924A4329876j46480R9076K07719J51139J101j18950O1837K41295R9231N8580
3914A4984424j1641K21771J78701J96491K2345K01897L04018J12893J23153K31658
3904A6565710K29260L26724M66969L50766L99109N32768M94991L07814K11199
3895A9885310L61615L95420M45616K62704L22195M13789K60350K99170M21979
3886B3068148N51280M77109M55957O38868N39588N28863O45325N86685N03978
$$ plain form
3955 17480549 17017229 16767619 16496175 16118607 15952233 15682620 15470714 15295878 15176569
3946 15176569 15156615 15039079 14801618 14633899 14592149 14492181 14533294 14667113 14639497 14407745
3936 14407745 14337456 14333793 14328059 14266055 14249347 14259299 14229274 14225150 14235818 14297731 14381715 14329876
3924 14329876 14183396 14282472 14490191 14641330 14642431 14523481 14585318 14826613 14925844 14984424
3914 14984424 14972783 15194554 15373255 15569746 15592091 15793988 16098006 16210899 16334052 16565710
3904 16565710 16794970 17121694 17588663 17939429 18338538 18871306 19366297 19674111 19885310
3895 19885310 20246925 20642345 21087961 21350665 21672860 22086649 22346999 22646169 23068148
3886 23068148 23619428 24096537 24552494 25191362 25730950 26259813 26905138 27491823 27995801
3877B7995801K88488L50328L11876M43237K56871L68448M06918L72153K41546
3868C1035666L84836M80590L01924M64445M75986K41962M08236M14693M63931
3859C4672269O38100N89586Q48817Q89321Q36300J059485Q05998N85466N62040
3850D1487382M59483K47277K54395K77956L40403J66859K51415K23089K54685
3841D3962944K94277K84160N21524K42311K18043M70980L29158K50503L67581
3832D6941481M55322N38924P65211J124543J361826J244291J318097J536684J328916
3823E6615295J350319Q92907R09607R43080P88287N64821M63509M59316J57404
3814F3144545J35865J85490J05987R4997j50400N1142p1360j78222J1130K21653
$$ plain form
3877 27995801 28284289 28634617 28946493 29389730 29646601 30015049 30421967 30794120 31035666
3868 31035666 31420502 31901092 32203016 32667461 33143447 33385409 33793645 34208338 34672269
3859 34672269 35310369 35899955 36748772 37638093 38474393 39533878 40339876 40925342 41487382
3850 41487382 41946865 42194142 42448537 42726493 43066896 43233755 43485170 43708259 43962944
3841 43962944 44257221 44541381 45062905 45305216 45523259 45994239 46323397 46573900 46941481
3832 46941481 47396803 47935727 48700938 49825481 51187307 52431598 53749695 55286379 56615295
3823 56615295 57965614 58858521 59768128 60711208 61499495 62064316 62527825 62987141 63144545
3814 63144545 63280410 63465900 63571887 63666884 63516484 63567626 63496266 63318044 63329174 63550827
3804F3550827q7265M0156n1908k76311K3752j39426j73332o4112m1032M5984J5438
3793F2842771K39611K04856K17842J29250P660o0591j92983m00980l23508l02055
3783F2361873n91423n99048p62923r56154r20242r12390j121172j439691j464240
3774E3594590j415178j393398j278297r87366p22770n14472l26290j88829k13914
3765D6554076j30414r7724l57628K970j43381k43839m31405l67768l60779m72254
3755D3951854l01677k17609k14085j29912k45184j05051k76200o53073q78820
3746D0930243p47497q87713p14186p07431o57095m11937l54016k60433l82049
3737C5807886k87634k95277m18427j81630j71730n1665j85278q9399q1511J7384
$$ plain form
3804 63550827 63463562 63503718 63451810 63175499 63199251 63059825 62886493 62822381 62781349 62827333 62842771
3793 62842771 63082382 63287238 63505080 63634330 63641990 63581399 63388416 62987436 62663928 62361873
3783 62361873 61770450 61171402 60408479 59452325 58532083 57619693 56498521 55058830 53594590
3774 53594590 52179412 50786014 49507717 48520351 47797581 47283109 46956819 46767990 46554076
3765 46554076 46423662 46325938 45968310 45971280 45827899 45584060 45152655 44784887 44424108 43951854
3755 43951854 43650177 43432568 43218483 43088571 42843387 42738336 42462136 41809063 40930243
3746 40930243 40182746 39295033 38580847 37873416 37216321 36804384 36450368 36189935 35807886
3737 35807886 35520252 35224975 34806548 34624918 34453188 34401523 34216245 34126846 34045335 34062719
3727C4062719k9969O4124J024K54j56466n4416Q3166n0384Q6635k42372J2375
3716C3776690J84254L23466K84816K94899M61682M69888N64338Q08241P18226
3707C7886500O17094P13511Q38147O86215O25843N21583O49261M64933M56722
3698D3459809P25821O46906O08439O09344N58041N41486O08709N35766O56183
3689D8950504M46275L15773L33282J62282K13824J84239K82369K44260K65263
3680E1398071J81487L65967N46189O42488L91408M47827N83574N35638O87792
3671E5780441P65051N29802P97962R03802R45835J107076J089803J255356J332544
3662F4507672J716220J850488J934344J986662J986814K299815K416968K554906
$$ plain form
3727 34062719 34032750 34096874 34097898 34098152 33941686 33887270 33970436 33920052 34006687 33764315 33776690
3716 33776690 33960944 34284410 34569226 34864125 35325807 35795695 36360033 37168274 37886500
3707 37886500 38503594 39217105 40055252 40741467 41367310 41888893 42538154 43003087 43459809
3698 43459809 44185630 44832536 45440975 46050319 46608360 47149846 47758555 48294321 48950504
3689 48950504 49396779 49712552 50045834 50208116 50421940 50606179 50888548 51132808 51398071
3680 51398071 51579558 51945525 52491714 53134202 53525610 53973437 54557011 55092649 55780441
3671 55780441 56545492 57075294 57873256 58777058 59722893 60829969 61919772 63175128 64507672
3662 64507672 66223892 68074380 70008724 71995386 73982200 76282015 78698983 81253889
3654H1253889K590843K732423K791406K873386K951739K970240K850989K859345
3646A03874260K857205K986188K897698K848741K986323L116251L006959K940739
3638A27514364K784458K809139K644716K254457K358374K047711K010777J908989
3630A46332985J728378J696687J783164J875225K119173K283239K484563K828480
3622A63131894L093162L302436L476032L467676L529648L528929L610609L554241
3614A90694627L831213L848900L967719M222941M772630N289277N920499O556871
3606B29104677P204033P790904Q540886R098020R689820J0023689J0318983J0028315
3598C01799327R898849R102004P939943O402969M227962K260939K61353j387875
$$ plain form
3654 81253889 83844732 86577155 89368561 92241947 95193686 98163926 101014915 103874260
3646 103874260 106731465 109717653 112615351 115464092 118450415 121566666 124573625 127514364
3638 127514364 130298822 133107961 135752677 138007134 140365508 142413219 144423996 146332985
3630 146332985 148061363 149758050 151541214 153416439 155535612 157818851 160303414 163131894
3622 163131894 166225056 169527492 173003524 176471200 180000848 183529777 187140386 190694627
3614 190694627 194525840 198374740 202342459 206565400 211338030 216627307 222547806 229104677
3606 229104677 236308710 244099614 252640500 261738520 271428340 281452029 291771012 301799327
3598 301799327 311698176 320800180 328740123 335143092 339371054 341631993 341893346 340505471
3590C40505471k728660l573510m029684m056195m125005l826822l821481m083214
3582C10260900m925398n576102p152641q666217j0158252j1551537j2608929j3050565
3574B36571259j3009279j2641577j1692777j0713165r731269q494380p284705
3567A63004107o229755n447550m667396l860133l338464k864085k617045k542054
3559A31437625k459058k494584k481550k327784k362730k404275k485945k315279
3551A12106420k434325k380649k297551k407857k317330k374743k177797k263035
3543I3453133k230573k371861k480170k481626k433349k516062k591774k461784
3535G3885934k089508k046458j836020j726774j742962j371684j384865j281321
$$ plain form
3590 340505471 337776811 334203301 330173617 326117422 321992417 318165595 314344114 310260900
3582 310260900 305335502 299759400 292606759 283940542 273782290 262230753 249621824 236571259
3574 236571259 223561980 210920403 199227626 188514461 178783192 170288812 163004107
3567 163004107 156774352 151326802 146659406 142799273 139460809 136596724 133979679 131437625
3559 131437625 128978567 126483983 124002433 121674649 119311919 116907644 114421699 112106420
3551 112106420 109672095 107291446 104993895 102586038 100268708 97893965 95716168 93453133
3543 93453133 91222560 88850699 86370529 83888903 81455554 78939492 76347718 73885934
3535 73885934 71796426 69749968 67913948 66187174 64444212 63072528 61687663 60406342
3527F0406342j038659r63647q47480o43256n53383l84086m64631k50380m2395
3518E5218425k2242M9526J14118K81618N12078N24584Q39641R31018J287620J442450
3508F1178836J537115J978970K230549K367554K682501L034463L410283L873587
3500H2293858M402623M845601N249355N460469N579357N537252N203938M710456
3492A23282909L912253K863131J726493Q02825j22237q96373j278098j436985
3484A28853918j477486j392104j228605j168880j398212j809849k185778l024221
3476A15168783m059251m846084n816197o245663o694756o783073o571311o266828
3468F7885620n720277n046918m385227m002358l495357k973165k436998k232870
$$ plain form
3527 60406342 59367683 58404036 57556556 56913300 56359917 55975831 55511200 55260820 55218425
3518 55218425 55196183 55245709 55359827 55641445 56153523 56678107 57517748 58448766 59736386 61178836
3508 61178836 62715951 64694921 66925470 69293024 71975525 75009988 78420271 82293858
3500 82293858 86696481 91542082 96791437 102251906 107831263 113368515 118572453 123282909
3492 123282909 127195162 130058293 131784786 132587611 132465374 131569001 130290903 128853918
3484 128853918 127376432 125984328 124755723 123586843 122188631 120378782 118193004 115168783
3476 115168783 111109532 106263448 100447251 94201588 87506832 80723759 74152448 67885620
3468 67885620 62165343 57118425 52733198 48730840 45235483 42262318 39825320 37592450
3460C7592450k000368j789525j647544j572316j283872j150303j084598j041480
3452B6022444j081994q47815o67755n44396p69343p84724n94747m92815n54465
3443A9684390o64425m96391l32717l33167l94852m05471l48722k72749l77437
3434A6058459l29851l38626j99568l71068k01952j05749l34671j27057l23340
3425A3726577k93627k89445k55445k24711k51559j55275l07305j80731L0929j36649
3415A1662759j26200k07638k31161j83267j37728j15632r3944n5730j17929p1927
3405A0321603j17585j14403L1376j91290j92116J1436j46583r7706m2098j01279
3395I361355q014n408q9343m3289j04676j26695j98851k3153J00387p0585l4788
$$ plain form
3460 37592450 35592082 33802557 32155013 30582697 29298825 28148522 27063924 26022444
3452 26022444 24940450 24092635 23424880 22880484 22111141 21326417 20731670 20238855 19684390
3443 19684390 19019965 18523574 18190857 17857690 17462838 17057367 16708645 16435896 16058459
3434 16058459 15728608 15389982 15190414 14819346 14617394 14511645 14176974 14049917 13726577
3425 13726577 13432950 13143505 12888060 12663349 12411790 12256515 11949210 11768479 11799408 11662759
3415 11662759 11536559 11328921 11097760 10914493 10776765 10661133 10567189 10511459 10393530 10321603
3405 10321603 10204018 10089615 10120991 9929701 9737585 9749021 9602438 9504732 9462634 9361355
3395 9361355 9353341 9347933 9258590 9215301 9110625 8983930 8785079 8761926 8862313 8791728 8756940
3384H756940j12889j6885k4028J9924o7739j0771j0084Q6369K3402n0134n9120
3373H534985K0546N6712j11775j4845o2402n6409J19669N890r6292m2391q499
3362H345189N4605J18979Q6432J67148J4355j6633P5708l5560K3566R6162q6617
3351H843334o4995K51756K2380p7853M5972Q7079P4486J45664j6979J19842J69670
3340I600356k9258n8978N0143Q4341J98584M3203P8275J50543J97611J08348J20946
3329A0544114J42955q0215J237l5543J56323j5201J05022R2398Q4867K11839L10875
3318A1518671J64795J88275P9419J30776K39027P8579J15544K49866L59072Q0060
3308A3204084K50720J45969K72122K84997J53032J85443L37779K39226L67730
$$ plain form
3384 8756940 8644051 8627166 8603138 8623062 8555323 8544552 8534468 8620837 8644239 8594105 8534985
3373 8534985 8555531 8612243 8500468 8485623 8423221 8366812 8486481 8492371 8396079 8353688 8345189
3362 8345189 8399794 8518773 8605205 8772353 8786708 8770075 8845783 8810223 8833789 8929951 8843334
3351 8843334 8778339 9030095 9052475 8974622 9020594 9107673 9182159 9327823 9310844 9430686 9600356
3340 9600356 9571098 9512120 9562263 9646604 9845188 9888391 9966666 10117209 10314820 10423168 10544114
3329 10544114 10687069 10606854 10608091 10572548 10728871 10713670 10818692 10911090 10995957 11207796 11518671
3318 11518671 11683466 11871741 11951160 12081936 12320963 12399542 12515086 12764952 13124024 13204084
3308 13204084 13454804 13600773 13872895 14157892 14310924 14496367 14834146 15073372 15441102
3299A5441102L01975K52848K63996J48215J64256J89707K55893J92527K62891
3290A7473410K74190K16592M02081K19358L69723M49244N00900M66398M04798
3281B0776694M58327L22519M90515M34695M40518M55789M96465M18826P02597
3272B4996945Q16835P36384P72519Q41577O94923Q18118J082320J077280J250228
3263C3087129J173758J439834J756022J902185J951320K274396K516239K626839
3255D8727722K950657L175067L411964L355438L358597K903989K141738P64815
3247G0789987n63940k168064l603879m457938m907435n045894m664494m110523
3239D1267820l751794l461371k868831k465203k156273j856407j459033j365438
$$ plain form
3299 15441102 15743077 15995925 16259921 16408136 16572392 16762099 17017992 17210519 17473410
3290 17473410 17747600 17964192 18366273 18585631 18955354 19404598 19905498 20371896 20776694
3281 20776694 21235021 21557540 22048055 22482750 22923268 23379057 23875522 24294348 24996945
3272 24996945 25813780 26550164 27322683 28164260 28859183 29677301 30759621 31836901 33087129
3263 33087129 34260887 35700721 37456743 39358928 41310248 43584644 46100883 48727722
3255 48727722 51678379 54853446 58265410 61620848 64979445 67883434 70025172 70789987
3247 70789987 70226047 68057983 64454104 59996166 55088731 50042837 45378343 41267820
3239 41267820 37516026 34054655 31185824 28720621 26564348 24707941 23248908 21883470
3231B1883470j259101j016154r49610p47156o64265o52358o32687n62042m42850
3222A4957247m45989m81770l96347n20067l97092l67006l49240k57906k65724
3213A1476106k40527k77087k57351j67214j12264j94472n00535k49952k09891
3204I266813k91050p4630j52895l75251j72545j77142k35699k9226j61758j63967
3194G432650r4917j86381L4648k55624j60079j48305r0181j40563k19392o1127
3184F110729k01718j39136j9550j51729k20343o3238j339j44838r5796N4673j9229
3173E108486M7218j37029k69076j82877l9771l1180k35711o3906j41140K6197
3163D081211J07560l1527j82538j33850m8857l8343J33087j01272j04252P8566
$$ plain form
3231 21883470 20624369 19608215 18658605 17911449 17247184 16594826 15962139 15400097 14957247
3222 14957247 14511258 14029488 13633141 13113074 12715982 12348976 11999736 11741830 11476106
3213 11476106 11235579 10958492 10701141 10533927 10421663 10227191 9726656 9476704 9266813
3204 9266813 8975763 8901133 8748238 8372987 8200442 8023300 7787601 7758375 7596617 7432650
3194 7432650 7337733 7151352 7186000 6930376 6770297 6621992 6531811 6391248 6171856 6110729
3184 6110729 5909011 5769875 5750325 5598596 5378253 5315015 5313676 5168838 5073042 5127715 5108486
3173 5108486 5155704 5018675 4749599 4566722 4526951 4495771 4260060 4196154 4055014 4081211
3163 4081211 4188771 4157244 3974706 3840856 3791999 3753656 3886743 3785471 3681219 3759785
3153C759785j21623l181j01406O219r1621j47063n0389J24722q8150j09213j9106
3142C158974j4291p1169j30164J31037q9869O8151j11016M489o9957m6074O599
3131B836710N1985m3010p9445q3314o3486j66626M6263Q1822J28335j13325j31139
3120B464770L1174o2234m2566J0354j35548j7724O4331m6864r7939K9453J04688
3109B301895m1459L7636K3141o9440o582K5827j14840l8364M4641L5664j6993
3098B181126o0366Q3758j0264j14270r5718N6608k9850m8045N2765n8200L5067
3087A992611O6398M1041j00717L8701K530k10221M5190J58927j54692j41812M1761
3076A779717J03699j04380M8650L2172m6523N0511j15782O2665N640M5465n3245
$$ plain form
3153 3759785 3638162 3634981 3533575 3539794 3448173 3301110 3250721 3375443 3287293 3178080 3158974
3142 3158974 3144683 3073514 2943350 3074387 2984518 3052669 2941653 2946142 2876185 2830111 2836710
3131 2836710 2888695 2845685 2766240 2682926 2619440 2452814 2499077 2580899 2709234 2595909 2464770
3120 2464770 2495944 2433710 2391144 2401498 2265950 2248226 2312557 2265693 2167754 2197207 2301895
3109 2301895 2260436 2298072 2321213 2251773 2245191 2271018 2156178 2117814 2162455 2198119 2181126
3098 2181126 2120760 2204518 2194254 2079984 1984266 2040874 2011024 1962979 2015744 1957544 1992611
3087 1992611 2059009 2100050 1999333 2038034 2040564 1830343 1875533 2034460 1879768 1737956 1779717
3076 1779717 1883416 1779036 1827686 1859858 1813335 1863846 1748064 1810729 1816369 1861834 1808589
3065A808589j39123P758Q6960m3664p0965k4846k9407n4304p3862J21685R3053
3054A681874K1971q9311j1200M9224o1960R860l2395p7560J4225N9584p6932o6649
3042A420731M3389j59035L858J51475L4366R8699j40298j6375J1194N1749Q6332
3031A586085j38892K4163o8464l9630R2419J63203j38275j45369N9311K03240
3021A597791j02071L5618J08664m1963O5395K4261j1414k8826r4691N906P949
3010A566619M8427P961n707j37396J20382J62247n9722l0446N260N360J29858
2999A812843J43347q6746m3204Q9115J2343j57295j1982J15989L9012M77K1720
2988A935619n6491P1652J48638j13469j5273J03324J55429L095p3002J32138r4675
$$ plain form
3065 1808589 1669466 1677224 1764184 1720520 1649555 1624709 1595302 1540998 1467136 1588821 1681874
3054 1681874 1703845 1614534 1603334 1652558 1590598 1600458 1568063 1490503 1504728 1564312 1487380 1420731
3042 1420731 1464120 1305085 1308943 1460418 1494784 1593483 1453185 1436810 1448004 1499753 1586085
3031 1586085 1447193 1471356 1402892 1363262 1455681 1618884 1480609 1335240 1394551 1597791
3021 1597791 1495720 1531338 1640002 1598039 1663434 1687695 1676281 1647455 1552764 1558670 1566619
3010 1566619 1615046 1623007 1617300 1479904 1600286 1762533 1702811 1672365 1677625 1682985 1812843
2999 1812843 1956190 1869444 1826240 1915355 1927698 1770403 1758421 1874410 1913422 1913899 1935619
2988 1935619 1879128 1950780 2099418 1985949 1970676 2074000 2229429 2232524 2159522 2291660 2196985
2977B196985O3252Q7780O2334P8377M265J93591Q5895N050N6707Q2140J90498
2966C106874M0503R7502K22566J55790K77393L18518K87850K4976p8464k13606
2956D239902j79451j43197j65633k9764J55916N6344p0736J24645N8896J41113
2946D188035J5644J55116K74452J52285J02055J88668K75991K25536O6756K48054
2936E892592J19654L4349K45667K48897J07013K54294Q1392j54968j24586j11471
2926F592833j00087j77144j77642J14724N3887o809M3374J29657J40192J67127
2916F780112K76730K34404K26882L26281M89356L36971K38227N8900p3387k15923
2906H678553l51748n88938n04207l32425m37131k97668k15748k54420j07845k4418
$$ plain form
2977 2196985 2260237 2348017 2410351 2488728 2492993 2686584 2772479 2777529 2834236 2916376 3106874
2966 3106874 3147377 3244879 3467445 3623235 3900628 4219146 4506996 4531972 4453508 4239902
2956 4239902 4060451 3917254 3751621 3721857 3877773 3934117 3863381 3988026 4046922 4188035
2946 4188035 4203679 4358795 4633247 4785532 4887587 5076255 5352246 5577782 5644538 5892592
2936 5892592 6012246 6046595 6292262 6541159 6648172 6902466 6983858 6828890 6704304 6592833
2926 6592833 6492746 6315602 6137960 6252684 6306571 6299762 6343136 6472793 6612985 6780112
2916 6780112 7056842 7291246 7518128 7844409 8333765 8670736 8908963 8967863 8894476 8678553
2906 8678553 8326805 7737867 7233660 6901235 6464104 6166436 5950688 5696268 5588423 5564005
2896E564005r1408j08971j36442P2623M11M2636J25261J03501p298L9693Q1860
2885E685871j2543R9314J65939L7070j9356o8395p6647q1754j51274j60847k75020
2874E142358k49163j59101j51843j77566l22715j64019P261j29376p048o3416
2864C725372o9177j33399j25781n10p7875J1745r9677j79646Q3585j24638j74349
2853B835650o5403r1862j8603j02472n745n5805k21109j28001K4316n7298k40031
2842A873637q2344O9635m9672j8180j36494p8864L2879r5892o3596K1131o0232
2831A412008R2800l409J8614n5460q0763q6092m2798n3099j00520k0607r3100
2820I87574K15490j80697M9101O6450o5494P2987l5491o2590k9019k0154N3807
$$ plain form
2896 5564005 5472597 5363626 5227184 5299807 5300218 5342854 5468115 5571616 5564318 5604011 5685871
2885 5685871 5673328 5772642 5938581 5975651 5956295 5887900 5811253 5729499 5578225 5417378 5142358
2874 5142358 4893195 4734094 4582251 4404685 4081970 3917951 3925212 3795836 3788788 3725372
2864 3725372 3656195 3522796 3397015 3396505 3318630 3330375 3230698 3051052 3134637 3009999 2835650
2853 2835650 2770247 2678385 2659782 2557310 2551565 2495760 2274651 2146650 2170966 2113668 1873637
2842 1873637 1791293 1860928 1811256 1793076 1656582 1577718 1610597 1514705 1451109 1472240 1412008
2831 1412008 1504808 1501399 1520013 1464553 1383790 1297698 1254900 1201801 1101281 1080674 987574
2820 987574 1203064 1022367 1071468 1137918 1072424 1145411 1109920 1047330 1018311 998157 1051964
2809A051964m3249j03092m1952n8746Q4658o2132r9183k4044k1879K6494j67505
2798E41334J20498O7749l2887j15826M4509j9829J06328N3531J8406j48599k9666
2787F05548L6589o4690n0030p6038l3771k6933M9228Q0681O8223J3272m4352j64325
2775C93402N3589J8430l1453l5312O7121N4096J3743n9127K8192m4540q8823n3734
2763C15584K5821J17562j01256p2381J77385L138q7407l2890J7800M1242j42740
2752B61858l5987J43263j42358l6566O4473M4613Q5455o222j67816M6722N2510
2741C09945n1457k1765K0385L7795r6818L6148N620R716p6507j80507J33126K9294
2729A54975L4957R2354R8519j48515n4119Q4659M2843j5983j76015k1832O3902
$$ plain form
2809 1051964 1008715 905623 863671 804925 889583 827451 728268 704224 682345 708839 541334
2798 541334 661832 729581 696694 580868 625377 605548 711876 765407 783813 635214 605548
2787 605548 642137 577447 527417 451379 417608 390675 439903 520584 588807 602079 557727 393402
2775 393402 446991 465421 433968 398656 465777 519873 533616 474489 502681 458141 369318 315584
2763 315584 341405 458967 357711 285330 462715 465853 378446 345556 363356 404598 261858
2752 261858 225871 369134 226776 190210 254683 299296 384751 378529 210713 257435 309945
2741 309945 258488 236723 257108 294903 198085 234233 239853 249569 173062 -7445 125681 154975
2729 154975 189932 282286 380805 232290 178171 262830 305673 289690 113675 91843 155745
2718A55745J8640j29865J9867L385l0844J43788J60538O6473j39764j13824J14039
2707B68178j48687r9718M6093n5994J52321j4387N141L4583k2999q3931J22475
2696B03075M191L5351P215J1442j17505k09619M4475J30098O1614n0757j63341
2685d3761l8101J68289J25042k2515J9822J75807r3888p1080J8484l2007q652
2674A97440m4829m1174o6473M0440l8070k0711Q6227J9153M3263n3613n8246p7096
2662a3689J9248R338K6330O1806N2629k557n4459o402n3469j39480J46297K9173
2650G4765j6232K04329M3746p8807m5702q0946J3345P5324K0826j3335o1166j13793
2638B2354l377Q0360J2330n3956N8401j03152O0604K5808Q7233j36824k6330n6532
$$ plain form
2718 155745 174385 44520 64387 67772 36928 180716 341254 407727 267963 154139 268178
2707 268178 119491 19773 65866 9872 162193 147806 152947 187530 164531 80600 203075
2696 203075 207266 242617 249832 261274 143769 -65850 -21375 108723 170337 119580 -43761
2685 -43761 -81862 86427 211469 188954 208776 384583 290695 219615 238099 206092 197440
2674 197440 152611 111437 44964 85404 47334 26623 112850 132003 175266 121653 63407 -13689
2662 -13689 5559 14897 41227 103033 155662 153105 98646 92244 38775 -100705 45592 74765
2650 74765 58533 262862 306608 227801 182099 101153 114498 189822 210648 197313 136147 22354
2638 22354 18977 99337 111667 57711 116112 12960 73564 99372 186605 49781 23451 -33081
2626c3081J9931M818l2973Q4402N8845m0077M4078M5786o7003k0123N1230O0471
2614A76304m7687l2965J18253J33922k43532R361q7896O670J40354M1738o3361
2603A51161P9964j16743O649J17204k4784L3351l4229K1006m3931k11762L2932
2592A0818r739o237M0887l4921n9694J00558Q4735l5558j15254K2107L1118L904
2580C2724p9522J0374J05472N0861p7139k9599L4734j20136N2342k4561J6554
2569b7896J12382l7190q2509M6782q8061j13905K05439P3321l3615M7516P738
2558A10002l5707M9247R6977j41596r929J11428n7048j15879j1867l0707J47801
2547A12722k9349r192O3473L227R977q7025j13125J9810J74660j34879q995P3360
$$ plain form
2626 -33081 -13150 -8332 -41305 43097 101942 61865 105943 151729 84726 64603 115833 176304
2614 176304 128617 95652 213905 347827 104295 113656 25760 32430 172784 214522 151161
2603 151161 231125 114382 121031 238235 213451 246802 212573 233579 189648 -22114 10818
2592 10818 1079 -5158 35729 808 -58886 41672 126407 90849 -24405 -2298 28820 32724
2580 32724 -46798 -36424 69048 119909 42770 13171 47905 -72231 -19889 -44450 -27896
2569 -27896 84486 47296 -35213 11569 -76492 -190397 15042 88363 54748 102264 110002
2558 110002 74295 123542 220519 78923 68994 180422 123374 7495 -4372 -35079 112722
2547 112722 83373 74181 137654 140881 150858 63833 -49292 -29482 145178 10299 1304 74664
2535G4664l7994j6094J2024N7206J46666m1235l4064k4032j04764m7539j31845
2524a47007l488R7145K3403k19596Q1292J08375Q3605k1308o0559R0071J03181
2513A35114q5094l2893l8739P7532J25352j48247p4914k0022P7561p2959q3862
2502a41171J25615K4579l1826r4244Q6827Q636M5191J0083J13606K5037j88827
2491a6494m7598P4396p6478M9694J09953R9345p001q4550l096n815L8833R0268
2479B21457j9714j77675K1710J6226N1496K2682m1333j09110n9041j02278J07474
2468f8106J24827m0827K1068K1299j11842M0971M191n7158j0Q7342K5914n4113
2456f444l5952K62672j25463r58l969K0209j336q1204J4088q5254O8735l4977
$$ plain form
2535 74664 36670 20576 32600 89806 236472 195237 161173 137141 32377 -15162 -147007
2524 -147007 -150495 -53350 -29947 -249543 -168251 -59876 23729 2421 -58138 31933 135114
2513 135114 50020 17127 -21612 55920 181272 33025 -41889 -61911 15650 -57309 -141171
2502 -141171 -15556 9023 -22803 -117047 -30220 -21584 23607 33690 147296 172333 -16494
2491 -16494 -64092 10304 -66174 -16480 93473 192818 185817 101267 98171 92356 131189 221457
2479 221457 201743 24068 45778 62004 113500 136182 94849 -14261 -73302 -175580 -68106
2468 -68106 56721 15894 36962 58261 -53581 -12610 -8419 -65577 -65587 21755 47669 -6444
2456 -6444 -42396 220276 94813 93855 89886 110095 108759 27555 41643 -43611 25124 -9853
2444i853j1766l0473J9400O3949n8406N1994o1615j3149K41222j08488j96794
2433a13979N4309M9273P7636J5080R6326j01384j15094O6106N8081j04752n0134
2422f8532L286K8196J299n8593O9787J36130q879N988M4779j62331J70175K4511
2410A85816j6165n0188m9749m0647M959m6385P330J46478l0155N0656P9927n7976
2398A83901M9708k7688J8957j21777n370R422j57640J18986J1208L0333J01305
2387B11345J596r6353L7047K6935L5383K4017k3563J9499M1894Q1759o1850P772
2375C05481p3783j0661n8319P454L7838o0704M7015p3758n4349J70064q0539r0771
2363F4968L9810n4976J5574R5413l7225k8534l5740l8727K5735K9114l1099j7911
$$ plain form
2444 -9853 -21619 -52092 -32692 31257 -27149 24845 -36770 -49919 191303 82815 -113979
2433 -113979 -59670 -10397 67239 82319 178645 77261 -37833 28273 86354 -18398 -68532
2422 -68532 -65246 -37050 -35751 -94344 -24557 111573 102694 108682 153461 -8870 161305 185816
2410 185816 169651 119463 69714 29067 34026 -12359 -5029 141449 111294 161950 241877 183901
2398 183901 233609 205921 224878 103101 97731 107153 -50487 68499 79707 110040 211345
2387 211345 212941 116588 153635 180570 215953 239970 216407 235906 277800 359559 297709 305481
2375 305481 231698 221037 162718 170172 208010 147306 194321 120563 66214 236278 155739 64968
2363 64968 104778 49802 65376 160789 123564 95030 59290 20563 46298 75412 44313 26402
2351B6402J14761o546o6908j2446J10103j49786N5111p028J6909n2947l8688M1366
2339C0303M5984J11580j62623N5277l2005L5416L6452R801M8793r5543k9979K83
2327E3739P7565r4517M4083J34353q4624k3002k1204K7258J6446N2456p0292k8139
2315H4122J48692q253L6802K4189n513L0996j25259p6606L5464R9351o8638m8417
2303A26930m1930q597o5792J35123P5788L4957r0367q440j2653p9974M6034J07216
2291B18295n7082L9900k0067j59335R8941N2518M8065n2191l5928O6654n63r5751
2279A03456K9571J24141j5149r9844J15436m8366j11602q8222P7090J26943L1684
2268B45138k2683j0164J1265j2133J8042P1743k3455n7944K1503P5400L670k4178
$$ plain form
2351 26402 141163 134617 67709 55263 165366 15580 70691 63663 80572 27625 -11063 30303
2339 30303 76287 187867 25244 80521 48516 83932 120384 130185 178978 83435 53456 53739
2327 53739 131304 36787 80870 215223 130599 107597 86393 113651 130097 182553 112261 84122
2315 84122 232814 224561 261363 285552 280039 311035 185776 109170 144634 243985 175347 126930
2303 126930 85000 76403 10611 145734 221522 256479 166112 157672 145019 65045 111079 218295
2291 218295 161213 201113 181046 21711 120652 173170 221235 169044 133116 199770 199207 103456
2279 103456 133027 257168 242019 142175 257611 209245 97643 9421 86511 213454 245138
2268 245138 222455 212291 223556 211423 229465 301208 277753 219809 241312 316712 320382 296204
2256B96204J779K1842P877P2853k4542q1047O2547j08933J8259M6031R7175j42718
2244B67327R8916J44619P4320K3329o8287j8527o8019j7705K3107J0734l5759
2233D34055N7931j09123Q6259m3063j020P7598J2502o326m0030l6536L4851n8287
2221D08811l2588O4814l3168q8606N1127J9147J26234R2505O955j93245L6264
2210D58250J15032J77383M1613j13963j05798Q0612J03073J65766l744j63543
2200G54681Q4192K6803o9747K08636L2127m748J04458j77647o8551J65478O5338
2189A121020n435P4761p2403p3459L9072J03033k3299n9548R4188L2837M9994
2178A280761R4435J08143n4850j00118o79J2025j20901l9272J29261L3929O2769
$$ plain form
2256 296204 297983 319825 327702 400555 376013 294966 357513 248580 266839 312870 410045 267327
2244 267327 366243 510862 585182 608511 540224 521697 453678 435973 459080 469814 434055
2233 434055 491986 382863 469122 426059 425039 502637 515139 508813 468783 432247 467098 408811
2221 408811 376223 441037 407869 319263 370390 389537 515771 608276 615231 421986 458250
2210 458250 573282 750665 792278 678315 572517 653129 756202 921968 918224 754681
2200 754681 838873 865676 795929 1004565 1036692 1031944 1136402 958755 890204 1055682 1121020
2189 1121020 1115585 1190346 1117943 1044484 1083556 1186589 1163290 1103742 1197930 1230767 1280761
2178 1280761 1375196 1483339 1428489 1328371 1327692 1339717 1218816 1179544 1308805 1342734 1405503
2167A405503j0818L5530R5045L1796m4654M8816R0435J16279Q0929O2525J8291
2156A929677J62312R6991J9040J15399o6693J03808L32940K30158J65893N9879
2146C149404J46512J2967P9353J93225J51821K63295J71344R4950J60833K20689
2136D644393L76331K40775K41692L45853M53448L47623L32534N15032N67227N91385
2126H656293Q60761Q14504Q54233R79396J150957J159140J554378J993140K893501
2117B0916303L548736M196994M753029O674763Q847045R049250J085546m397713
2109E4673953o327198o232677o122153p315047n229687m088251k865226k297957
2101A4195757j641384j387031p61703o11627m81934p01139o03684q26534n26108
$$ plain form
2167 1405503 1394685 1430215 1525260 1557056 1512402 1561218 1651653 1767932 1848861 1911386 1929677
2156 1929677 2091989 2188980 2208020 2323419 2256726 2360534 2693474 2923632 3089525 3149404
2146 3149404 3295916 3308883 3388236 3581461 3733282 3996577 4167921 4262871 4423704 4644393
2136 4644393 5020724 5261499 5503191 5849044 6302492 6650115 6982649 7497681 8064908 8656293
2126 8656293 9517054 10331558 11185791 12165187 13316144 14475284 16029662 18022802 20916303
2117 20916303 24465039 28662033 33415062 40089825 48936870 57986120 59071666 54673953
2109 54673953 48346755 42114078 35991925 28676878 23447191 19358940 16493714 14195757
2101 14195757 12554373 11167342 10405639 9794012 9312078 8610939 8007255 7180721 6654613
2092F654613n54960m20068m09768l73348j77776k78451j55410k21534k95955p6913
2082C690430k22119k10749p4141m330k35278k17495j49052l9009k24796j37259
2072B176202j3213n6761j56376l5954j27161M6072o8490j18493j15280l9629J0902
2061A501819O4586J22088k26051j24395q9119L846R9833j25522k24731j20780
2051H81574O9994J08371j07991p8887p3505j07832N0228j55666M1667M1089J8789
2040F87831l1479Q5357L2006n356j2823r0727m2591j0268O8244l245J24578j29254
2028F72273M1160j11462R173J19222k47396r0057R3926M307k869J672p1294k8389
2016C90266Q6920r989P1395k9759l2517L1862m5522j12042M6548L7343j03460
$$ plain form
2092 6654613 6099653 5679585 5269817 4896469 4718693 4440242 4284832 4063298 3767343 3690430
2082 3690430 3468311 3257562 3183421 3179091 2943813 2726318 2577266 2538257 2313461 2176202
2072 2176202 2162989 2106228 1949852 1913898 1786737 1832809 1764319 1645826 1530546 1490917 1501819
2061 1501819 1566405 1688493 1462442 1338047 1248928 1252774 1352607 1227085 1002354 881574
2051 881574 951568 1059939 951948 873061 799556 691724 741952 586286 627953 669042 687831
2040 687831 656352 741709 773715 768359 755536 664809 622218 611950 680194 676949 801527 672273
2028 672273 713433 601971 611144 730366 482970 392913 486839 491146 488277 489949 418655 390266
2016 390266 477186 467197 538592 508833 476316 508178 462656 350614 397162 434505 331045
2005C31045O9719M6950j02289q4206M9528m2136P240J2517J0999j8029O5445J09517
1993D56300j45884k1075j9827j05131j57810J75301j5823N9296L6589j4902m2828
1982B04206j2962J8328P5061l5512L4196j59948n9901J03222j688m608p0276K7606
1970A17724O395P8404J54078k0047q6990j1679J1759r1809l7792R8793q1684p483
1958A29669K3075n3143Q7461L2330n7684j21900P4374J32150l3345n3310L4417
1947A94094k3114j21452J75701n3923j05738m6395K0558K8874K9456l0997O0779
1936A27843N6148r4681j3064K8756k3783j8279l7203Q537K2010P3938O765K4557
1924A61544o5853J46155j29666k9207M4439q521m2115k6562j0177l4702m2709
$$ plain form
2005 331045 400764 447714 345425 261219 310747 268611 275851 288368 299367 281338 346783 456300
1993 456300 310416 289341 269514 164383 6573 181874 166051 225347 261936 247034 204206
1982 204206 191244 209572 284633 249121 283317 123369 63468 166690 165002 160394 90118 117724
1970 117724 124119 202523 356601 336554 249564 237885 249644 157835 120043 218836 137152 129669
1958 129669 152744 99601 187062 219392 161708 39808 114182 246332 212987 159677 194094
1947 194094 170980 49528 225229 171306 65568 19173 39731 68605 98061 67064 127843
1936 127843 183991 89310 76246 105002 81219 62940 25737 34274 56284 130222 136987 161544
1924 161544 95691 241846 112180 82973 127412 118891 76776 50214 40037 5335 -37374
1913c7374N9871P9447k2874m0543j89541j4183J27525N744n2381N7743j36960
1902a63526n3368M2078Q961J05732J60596o2067l5572L643l08Q8237o3176O3547
1890I4777m6931n5001R49M4468R9845j22940m1715Q3442Q461r4272J37804j0790
1878I8097J00419m0184j25649j6789R0412n7929m7179K8699p3827J84486K6356
1867A66912j68270L0145J8363m6882P7689o2784j00651J7610L0899J87032n0636
1856I9427l0273l1032j3018l3697P8842L7702m3403n1792Q2791J12878o047J41763
1844C44141m7466K22O1401P6685j40960k9597r8736o0634q0461L1012N350K2181
1832H3138l8582J1918J54514j97344R808l7413N923N6923l2843j96184Q2562L6038
$$ plain form
1913 -37374 22497 101944 79070 38527 -151014 -165197 -37672 -31928 -84309 -26566 -163526
1902 -163526 -216894 -174816 -165855 -60123 100473 38406 2834 6477 6169 94406 31230 94777
1890 94777 47846 -7155 -6206 38262 138107 15167 -26548 56894 65355 -28917 108887 98097
1878 98097 198516 158332 32683 15894 106306 48377 1198 29897 -43930 140556 166912
1867 166912 -1358 28787 47150 268 77957 15173 -85478 -67868 -36969 150063 99427
1856 99427 69154 38122 25104 -8593 70249 107951 64548 12756 95547 208425 202378 344141
1844 344141 296675 296897 358298 434983 294023 264426 165690 105056 24595 55607 60957 83138
1832 83138 44556 56474 210988 13644 23452 -13961 -8038 48885 16042 -180142 -97580 -61542
1820f1542j8571K04964O9869o1755o5257q6476K1771O6405j37296n9789J3443
1809a14234k6213P1330N1036r6929k517L0954n3855q3106L0502K4161J6739L6733
1797a15399J22855m0874K4543l5042L3923N9228j28941k6304k320l9033J08010
1786c9354J72653m4209r0791J01989k3672j99503J486P6983l6123N5929M9329
1775B4717j12323J23840m0108j05609k1962O4640N1213q6659j3661k3331Q3058
1764e6185M6634Q3884l1273l3003j83882M0201P5059p3100O1420j3470J9350O2633
1752a732o1144k4731N3641k0238J6857l3517r8995K04874J06044j32794m2935
1741c4670N394L6507j5220p7767N8494O7634k6369m8187l5829J17067Q8802l4918
$$ plain form
1820 -61542 -80113 124851 194720 132965 67708 -18768 3003 69408 -67888 -127677 -114234
1809 -114234 -140447 -69117 -18081 -115010 -117527 -86573 -140428 -223534 -193032 -168871 -152132 -115399
1797 -115399 7456 -33418 -8875 -43917 -9994 49234 -79707 -106011 -108331 -147364 -39354
1786 -39354 133299 89090 -1701 100288 76616 -122887 -121401 -44418 -80541 -24612 24717
1775 24717 -87606 36234 -3874 -109483 -131445 -66805 -15592 -102251 -115912 -139243 -56185
1764 -56185 -9551 74333 43060 10057 -173825 -133624 -58565 -131665 -70245 -83715 -64365 -1732
1752 -1732 -62876 -87607 -33966 -54204 -37347 -70864 -169859 35015 141059 8265 -34670
1741 -34670 -29276 7231 -7989 -85756 -27262 40372 14003 -34184 -70013 47054 135856 100938
1729A00938j35844k7559R256o6070J93513r64p6921l4899k0562L0443l6948k1662
1717h7279J30068J84867r3339r0069j00734j5317R2629n6805r9753J02345k0845
1706e4232K8492M0784o8807p4644Q1678N7334o3715l0155l9770n568k0658J09726
1694c9535L0831l3550N1140n951n1664J10010n7195p0400K2640Q5k3314j16725
1682a83628J48970k598R904o4114Q3556L5114k08961K23429J807k29432p5636
1671b61589J30317K19403m457L6756j32668M9213m2014o1181j6754M7990L246
1660c1738J6412j6853J6527L9269j4505k7186r9799m956P2884k3474J09330l0759
1648E152j28210J20850R8603j22133n7488p1091j9095l5934N9849J95946Q8367
$$ plain form
1729 100938 -34906 -62465 -53209 -119279 74234 73270 -3651 -38550 -59112 -28669 -65617 -87279
1717 -87279 42789 227656 134317 44248 -56486 -71803 20826 -35979 -135732 -33387 -54232
1706 -54232 -25740 15044 -53763 -128407 -46729 10605 -53110 -83265 -123035 -128603 -149261 -39535
1694 -39535 -8704 -42254 8886 2935 -48729 61281 4086 -66314 -43674 -43589 -66903 -183628
1682 -183628 -34658 -37256 -27352 -91466 -7910 27204 -181757 41672 43479 -185953 -261589
1671 -261589 -131272 88131 83674 120430 -12238 36975 -5039 -66220 -82974 -34984 -31738
1660 -31738 -15326 -32179 -15652 23617 9112 -18074 -117873 -122829 -49945 -73419 35911 5152
1648 5152 -123058 -2208 96395 -25738 -83226 -154317 -173412 -209346 -149497 46449 134816
1637A34816j07159j24393j7089M889J43358L2209J8083j02639r8988l5721J4839
1626a37795J10140Q9103q0270n8939j07167P5057O9518O752j213j1111j63923
1615b09848J21701P8842o8600N689J0111L0843K6796m3241n7964J3492N7100j2861
1603d7940m1490J2336l9490L7705P9507j20841o083L4985J06500J842m0212r8089
1591a21270N9462K3489o163k1801N1156M8938j9979j04028k1362N9563j46925
1580a98920Q9173J7987J16489o9454j504K1796o4637P9732q153k5315j5275L1524
1568b6557m3735R9214N686k3442k0907M1846q4029o2069p8152J24995J25510r2126
1556c3766O2825M8K2250J7901J06680j47825j16330J19271O9440m1058j29977
$$ plain form
1637 134816 27657 -96736 -113825 -108936 34422 66631 84714 -17925 -116913 -152634 -137795
1626 -137795 -27655 61448 -18822 -77761 -184928 -109871 -40353 -33601 -34814 -45925 -209848
1615 -209848 -88147 -9305 -77905 -72216 -62105 -31262 -4466 -47707 -105671 -92179 -35079 -47940
1603 -47940 -89430 -77094 -116584 -78879 628 -120213 -126296 -91311 15189 17031 -23181 -121270
1591 -121270 -61808 -38319 -44482 -66283 -15127 33811 13832 -90196 -111558 -51995 -198920
1580 -198920 -109747 -91760 24729 -44725 -46229 -24433 -89070 -9338 -17491 -42806 -58081 -26557
1568 -26557 -70292 28922 34608 11166 -9741 32105 -51924 -113993 -192145 -67150 58360 -33766
1556 -33766 29059 29107 51357 69258 175938 28113 -88217 31054 100494 59436 -70541
1545g0541r351O0254q8664p7304J7535J44384O4489K6187j93383k6973j04542
1534b57909N0803R0580R9155N6130n5517L4483Q9758m3662k2460M4168K1867n0667
1522E6729q8396Q5011K1693R3613q6124k5792o0398j0706Q6285Q4313m5939j32695
1510b2406M9697p0097r925K5538J07642j6124l4051j34779k2502J44231O6291
1499H3515n7908j66029O9003j7277m3903L9454M1259M6659L5493L1305J3941j46546
1487g1034K2209q6283Q3860J37015j34935k4911J5310M9977p5367o520j57513
1476b48192J06157R9323J26005k7294j32977J6630P2056J17168j6577j06181j13695
1465a07577J33442L2054j55390j6732J36975R3258m1896n3765J7824m6095K0427
$$ plain form
1545 -70541 -79892 -19638 -108302 -185606 -168071 -23687 40802 66989 -126394 -153367 -257909
1534 -257909 -207106 -116526 -17371 38759 -16758 17725 107483 63821 41361 85529 107396 56729
1522 56729 -31667 53344 75037 168650 82526 56734 -3664 -14370 71915 156228 110289 -22406
1510 -22406 27291 -42806 -52731 -27193 80449 64325 30274 -104505 -127007 17224 83515
1499 83515 25607 -140422 -71419 -88696 -132599 -93145 -51886 -5227 30266 61571 75512 -71034
1487 -71034 -48825 -135108 -51248 85767 -49168 -74079 -58769 -8792 -84159 -90679 -248192
1476 -248192 -142035 -42712 83293 55999 -76978 -60348 11708 128876 112299 6118 -107577
1465 -107577 25865 57919 -97471 -114203 22772 116030 74134 20369 38193 -7902 12525
1454A2525Q605j999k0656Q9785n4095p7911Q5002k8275p6257J6758Q5095P4725
1442A13302j48686j2629q5405j2020k095j06408J43538J73899j83021J9850n1751
1431a51426Q0168P7708K9129Q9274m2908p5273n2537L6042o1561K3345n7342M2100
1419f3281M8121j4750N778l8691j27537r008J57943J6401J0305r4725J457M9850
1407e8137q318Q9836O2343r6505j5657K9972j44812k489O3312O8685O3570n6004
1395d204q382J4499q3328k2561L6238J27066r0019L7406r1631K5528k6788M715
1383h1461O7099K0680k23924J121Q1533l6262R2698L9745m7253q6689K5642k3860
1371a70931Q8908P6486q5229n840O9804N1991r8086N852j6813Q520p2832j15623
$$ plain form
1454 12525 21130 19131 -1525 88260 34165 -43746 41256 12981 -63276 -46518 38577 113302
1442 113302 -35384 -48013 -133418 -145438 -147533 -253941 -110403 63496 -119525 -99675 -151426
1431 -151426 -71258 6450 35579 124853 81945 6672 -45865 -9823 -71384 -48039 -105381 -63281
1419 -63281 -15160 -29910 -24132 -62823 -190360 -199368 -41425 -25024 -14719 -109444 -107987 -58137
1407 -58137 -66455 23381 85724 -10781 -26438 3534 -141278 -143767 -80455 -11770 51800 -4204
1395 -4204 -12586 1913 -81415 -103976 -67738 59328 -30691 6715 -84916 -59388 -86176 -81461
1383 -81461 -14362 6318 -217606 -216485 -134952 -171214 -78516 -38771 -86024 -172713 -147071 -170931
1371 -170931 -82023 -5537 -90766 -96606 -26802 25189 -72897 -67045 -83858 -75338 -148170 -263793
1359b63793P4309L806J02943K1082p8954L98L5370q651j0218N9829M1046m0864
1347f3697P6713J13827p1524j20149K9226N7892J09609K5424q1993n2055M0968
1336F4241j59959Q681k2706J0524O8459m6204j48078J29879J83009q8107j36806
1325a37067R8250J55338p4087L6556J08501j28051o3201P132o7124N6103j3860
1314b1510J7647K6286m4919q7748k167O3095N0118N3495j15810j50209l1607J24894
1302a18435J12448j20479J7142K9916N2673L1820k717q447o2459O578L0655N7657
1290B6352j5475k1978M7186j3148r560N1912K8335j6974n6745M1198j53740P056
1278h5581J8914j89222J4659J21117O9102J66947j05162m3736m8279m5242R7233
$$ plain form
1359 -263793 -189484 -185678 -82735 -61653 -140607 -140209 -104839 -113490 -123708 -63879 -22833 -63697
1347 -63697 13016 126843 55319 -64830 -35604 22288 131897 157321 75328 23273 64241
1336 64241 -95718 -87037 -109743 -99219 -30760 -76964 -225042 -95163 87846 -261 -137067
1325 -137067 -38817 116521 42434 78990 187491 59440 -3761 3371 -63753 -7650 -21510
1314 -21510 -3863 22423 -22496 -110244 -112411 -49316 802 54297 -61513 -211722 -243329 -118435
1302 -118435 -5987 -126466 -109324 -79408 -26735 5085 2368 -6079 -68538 -61960 -31305 26352
1290 26352 10877 -11101 36085 22937 13377 65289 93624 76650 19905 61103 -92637 -85581
1278 -85581 -66667 -255889 -241230 -120113 -51011 115936 10774 -32962 -81241 -126483 -29250
1267b9250k8720k3323J13853P273k9010Q1259k1286l569q5424K502j75129J24958
1255f5866P3701j17671J28303J01027r5246m7909J2048P2113q2855m3422J94252
1244A28475r283j06627r271P576o0204q3866J22608Q0761k5399j03813O2675k346
1232A286r3016Q8083J02268j94340q3058P3507n9496j1501N8279M6974j2369N9199
1220b4184k8567j03795P423l9640m4920K03932J12686K9105n2969l1656K7607
1209E5022K3133j28337k0097j8757K3184J3121j20592N9290P9925k6146L4043
1198b6211l9663l8898K2047K2890Q1472K6487j27749O5859Q5507l916j47535P7047
1186b663N4699l6712K44957n6023k81662J00833K7075N2904Q3525L5116j75140
$$ plain form
1267 -29250 -57970 -81293 32560 39833 10823 92082 70796 67227 -18197 -15695 -190824 -65866
1255 -65866 7835 -109836 18467 119494 24248 -23661 -11613 60500 -22355 -65777 128475
1244 128475 119192 12565 3294 10870 -49334 -133200 -10592 70169 44770 -59043 3632 1286
1232 1286 -91730 -3647 98621 -95719 -178777 -105270 -164766 -176267 -117988 -71014 -83383 -24184
1220 -24184 -52751 -156546 -149123 -188763 -233683 -29751 82935 112040 59071 27415 55022
1209 55022 78155 -50182 -70279 -89036 -65852 -52731 -173323 -114033 -34108 -60254 -26211
1198 -26211 -65874 -104772 -82725 -59835 21637 48124 -79625 -13766 71741 67825 -79710 -2663
1186 -2663 52036 15324 260281 204258 -77404 23429 50504 103408 186933 222049 46909
1175D6909j60465R4292j58497P2657P5169J8155L7519J0168r5213P5270n5633
1164c9669R3088j07136J1383k5437m091J27073k4527j29869O9078K5554Q885M386
1152H718n1969L7633k8429l3531J01229N7129j69514k110J20913j12382q5493
1141a57806R3607k3254J04712J3610j7648j64019M8986K3797l4458q572L5436
1130h5609j05045n8958K56747J12280q6802N3503p9818o9190j7341j6153l3404
1119a29790l0429M6579J0368L4435N6615M3770p104p9353j7005k4682n5796N4663
1107i7729Q1794q6046M9343J07503J13785j88282p8259K11186q3257l5730p9775
1096h5467M9958Q3019N9582N5611m0370k448j38002j2539l6670O2410J17952m9217
$$ plain form
1175 46909 -113556 -19264 -177761 -105104 -29935 -11780 25739 35907 -59306 15964 -39669
1164 -39669 53419 -53717 -42334 -67771 -71862 55211 30684 -99185 -30107 -4553 4332 8718
1152 8718 -43251 -5618 -34047 -67578 33651 90780 -78734 -80844 40069 -72313 -157806
1141 -157806 -64199 -87453 17259 30869 13221 -150798 -101812 -78015 -112473 -121045 -85609
1130 -85609 -190654 -249612 7135 119415 32613 86116 6298 -62892 -80233 -96386 -129790
1119 -129790 -160219 -113640 -103272 -68837 -12222 31548 24444 -54909 -71914 -96596 -152392 -97729
1107 -97729 -15935 -101981 -52638 54865 168650 -19632 -97891 113295 30038 -5692 -85467
1096 -85467 -35509 47510 107092 162703 122333 119885 -18117 -30656 -67326 -4916 113036 63819
1084F3819M8802j20937r5210l8569K1142J1786J48467o10m5982P0010j43869j21065
1072b02216J18883J08976M835r9560k0034R9002j28443L2046k7335l0662L6350
1061a08158o5991Q7696N424J8923K09310L6183j29865p2533K6773n5780q1874
1050a29892R5890m4576R5404J696L7321R377l1741n5176J05036j2780j38432J39816
1038G1943k851p9086k8335O3673J41275L5310j73050l4969k6828K0998P5560o3037
1026F03n3440j4274K7425K7014o391K9318Q550o1725j4810M5234J05224m4718
1014D8010J5251l5800k9572K9583L141P1809K3240J02171p4818r7739m7188P0265
1002G8353L1971q2878Q3852p8375j3254R3747p6072k6128k5390k5484M9358m3530
$$ plain form
1084 63819 112621 -8316 -103526 -142095 -120953 -109167 39300 38690 -7292 62718 -81151 -202216
1072 -202216 -83333 25643 30478 -69082 -89116 9886 -118557 -86511 -113846 -144508 -108158
1061 -108158 -174149 -86453 -81029 -62106 147204 183387 53522 -19011 7762 -48018 -129892
1050 -129892 -34002 -78578 16826 18522 55843 65220 33479 -21697 83339 70559 -67873 71943
1038 71943 69092 -9994 -38329 25344 166619 201929 28879 -6090 -32918 -11920 63640 603
1026 603 -52837 -67111 -39686 -12672 -19063 10255 18805 -42920 -57730 -12496 92728 48010
1014 48010 63261 27461 -2111 27472 30613 102422 125662 227833 153015 55276 8088 78353
1002 78353 110324 27446 111298 32923 19669 113416 37344 11216 -14174 -39658 9700 -33830
990c3830q9743l401P4453r616r8415P8487p975K67952J6610j71830j4506p3464
978f5278o313j583k5592P3047j3762k2987J06J33262M1573j26186o0775k6953
966a01441m3173J36710j1323n7858j2239N2068K7220r1143J09613L8790J7515
955F4739n1843M4453p3249m4398M3573K0204p9677j345J11052j2365k8114k5084
943c2054N3565J0659K3877N739r7757J8983j9472J59341j01278j587R456P6446
931A05918j2674K7393l4086m9855Q2077p1495j24257L8024M916r0435J24005l1026
919c1495j38312Q865J82423r2525j9077J37999K6583l4376n0455q9228Q2538L1934
907A4874n6605J14641M9522r2810Q412M0282Q9128n0922p8959q4920J29210N8060
$$ plain form
990 -33830 -123573 -126974 -52521 -62137 -160552 -82065 -90040 177912 194522 22692 8186 -65278
978 -65278 -71591 -73174 -98766 -25719 -39481 -62468 -62362 70900 112473 -13713 -74488 -101441
966 -101441 -144614 -7904 -19227 -77085 -89324 -37256 -10036 -101179 8434 47224 64739
955 64739 12896 57349 -15900 -60298 -16725 3479 -76198 -77543 33509 21144 -6970 -32054
943 -32054 21511 32170 56047 61786 -35971 -16988 -36460 122881 21603 20016 29472 105918
931 105918 93244 120637 86551 36696 118773 47278 -76979 -38955 -34039 -124474 -469 -31495
919 -31495 -169807 -160942 21481 -71044 -90121 47878 74461 40085 -10370 -99598 -17060 14874
907 14874 -41731 72910 122432 29622 38034 78316 167444 116522 37563 -47357 81853 139913
895A39913l7013j1848o7322p1363J0097O3898n8793J8278j15824k0573M5794l7002
883a41758L5394P5322k6546K3926M4425L2132K4687N271O9693p7084n752N0095
871A09805q6298R6922j5149l2423m3658l5892l437j7259N4240j15376N1176J01979
859F4630p80J09809l1285o0687r2189L9873o4646r848J38626p4712Q242o4963
847c7930k061P6323J23599r0721j25541P4901J059q2326l6453J13443O6329j5175
835F5447j09420l6646R7376J06887j05701m8339O9687L3690P4228j74656j11844
824a39291P2421q350N3737O1085J7801r5781L5062J0777j41568N0628J75390J208
812I3119j74161j0889m5854J5774J8542J58845L8718k1334M5956j6133q6814J7308
$$ plain form
895 139913 102900 91052 23730 -47633 -37536 26362 -32431 -14153 -129977 -150550 -104756 -141758
883 -141758 -106364 -31042 -57588 -33662 10763 42895 67582 72853 142546 65462 59710 109805
871 109805 23507 120429 105280 72857 29199 -6693 -10130 -27389 26851 -88525 -37349 64630
859 64630 63850 173659 142374 81687 -10502 29371 -35275 -45123 93503 18791 27033 -37930
847 -37930 -39991 36332 159931 69210 -56331 18570 19629 -62697 -99150 14293 80622 65447
835 65447 -43973 -80619 16757 123644 17943 -30396 39291 72981 147209 -27447 -139291
824 -139291 -66870 -75220 -21483 39602 57403 -38378 -3316 7461 -134107 -83479 91911 93119
812 93119 -81042 -91931 -137785 -122011 -103469 55376 94094 72760 118716 102583 15769 33077
800C3077O1474j2986J03281p2629r2564K7191n8508n5779l3623J4522p7393J31634
788c2303k8093l2623J02215q5269n2840o6727J53096J4511l0906j3590N7308L7276
776B2055j45113l370J2418M4593K0557K8609R2962q6034j61126J07069J08409
765D1029P8585p1427r8565L2521j26130J09653j69620n5566J67458L1032P9972
754A8942m5318l8238J71971k6069r5465q4901n9124J98228m2888j3508K3401L313
742A0344r3842j0562K1980R2448j06398L8814K0843Q0731N5470p9745P9466j07465
730B084M3293j8748M7686q5453R8269p4481p4094p5229J22062R1403j53906r078
718h6192l4011M5389N0473k6399m6348r3830R73P1644J28480M6348j16302J04686
$$ plain form
800 33077 94551 81565 184846 112217 19653 46844 -11664 -67443 -101066 -86544 -163937 -32303
788 -32303 -60396 -93019 9196 -76073 -128913 -195640 -42544 -28033 -58939 -72529 -15221 22055
776 22055 -123058 -126428 -114010 -69417 -48860 -20251 72711 -13323 -174449 -67380 41029
765 41029 119614 48187 -50378 -17857 -143987 -34334 -203954 -259520 -92062 -61030 18942
754 18942 -26376 -64614 107357 81288 -14177 -99078 -158202 40026 -2862 -16370 7031 10344
742 10344 -83498 -94060 -72080 20368 -86030 -47216 -26373 54358 109828 30083 109549 2084
730 2084 45377 26629 74315 -11138 87131 12650 -61444 -136673 -14611 76792 -77114 -86192
718 -86192 -120203 -74814 -24341 -50740 -97088 -190918 -189945 -118301 10179 56527 -59775 44911
706D4911P7278k1621o4721k4485o254m5281O2543k2956q0063j8463R0024J49745
694A40657p5165m3361p135j02501M9373N6368l1741m4287J4554O1191L0594O1411
682A09958K9685J2637n355j10312O9537m3881m8609Q2332j0445k797j59034l0629
670a06913K7219P3323P5418m8857k9503L0651R4620m7192j3555M5371k9222k6152
658D5208O5759K9235q959n0844j14632R5673n273P8289n0124M2758J01768k8244
646B00614q6476m879Q2560N5184j14803k7880l8107j18141Q9853l8205m1413R437
634c2256L0343n7175L5180m2209n8861J27737Q9060M0610j18762p3331n7442J9034
622i8072M2236P8273j5184K7672J2925j21032j11591M1304J56492k6138P5275
$$ plain form
706 44911 122189 100568 35847 11362 5108 -40173 22370 -586 -80649 -99112 -9088 140657
694 140657 65492 22131 14996 -87505 -38132 18236 -13505 -57792 -43238 17953 48547 109958
682 109958 139643 152280 146925 36613 106150 62269 13660 95992 85547 82750 -76284 -106913
670 -106913 -79694 -6371 69047 20190 -9313 21338 115958 68766 55211 100582 71360 45208
658 45208 110967 140202 131243 80399 -34233 61440 56167 134456 84332 127090 228858 200614
646 200614 114138 109259 191819 247003 132200 104320 66213 -51928 37925 -280 -41693 -32256
634 -32256 -1913 -59088 -23908 -66117 -124978 2759 91819 132429 13667 -59664 -117106 -98072
622 -98072 -55836 22437 7253 34925 47850 -73182 -184773 -143469 13023 -13115 62160
611F2160Q4087p1512j57351J51490M4855K9112j28855P567k1586K7778Q2494P5211
599A85450J640j48439j02113M7939O8370M8204j06768j09141Q6394l7364O8964
588C136R1907l5306j21970J7830J21939J0780m659o2371l656P2991q3107j42458
576a34944O2153N7553k6907J0763J9152L9786o9888L868o9482N3490K3592P4824
564D3960l3765l113P1003O0340j4657r8787m9741J68817l6873m8220r2526O453
552b7109J15497j9915p4774j52019J02916N5809K4577K6463m7793j7585K4664
541A0731M9355N0294N7072o9327o7863J31756L0611j03165M3201K8785J4477r0364
529H5563R7352j50937r352O7007P257J2360j9758m9942P5160k1123j10778L45968
$$ plain form
611 62160 146247 74735 -82616 68874 113729 142841 13986 21553 -33 27745 110239 185450
599 185450 187090 38651 -63462 -15523 52847 101051 -5717 -114858 -28464 -65828 3136
588 3136 95043 59737 -62233 -44403 77536 88316 83657 21286 17630 90621 7514 -134944
576 -134944 -72791 -15238 -42145 -31382 -12230 27556 -42332 -38464 -107946 -54456 -30864 43960
564 43960 10195 7082 78085 138425 123768 24981 -24760 144057 107184 58964 -33562 -27109
552 -27109 88388 68473 -6301 -158320 -55404 405 24982 51445 3652 -13933 10731
541 10731 60086 110380 167452 98125 30262 162018 192629 89464 132665 161450 175927 85563
529 85563 182915 31978 22626 89633 96890 109250 89492 39550 114710 93587 -17191 328777
517C28777j68910j08259J03299L5305j5078M5089r6618O3094J8815j37349q0549
506a2384J13644l0027j41692p1951l3045P2043J24687p7171L5310n5698K4143
495e2141k8096m1105R7767p1122N738J52112R5330m2046J3j77914j3670r3333
483a68467J2254J45516Q6424q5237J63093j7485M657j44165o4403J18803Q653
472E9643j013o9735J03300J2168j28149k8342P8025l2598K2996L2149p9385j06730
460a37671l1482J6494Q0128J3749J9143K2599L4719l8679J56281n0035j9183R2061
448A58124j0558j14872J03700N4619j16680K771k2842j45782k6555J76226J6344
437G4495l2892n5114k1331Q9006J454q6363k9517J29891K4590n3679q1465p7277
$$ plain form
517 328777 159867 51608 154907 190212 175134 220223 123605 186699 205514 68165 -12384
506 -12384 101260 71233 -70459 -142410 -175455 -103412 21275 -55896 -20586 -76284 -52141
495 -52141 -80237 -121342 -23575 -94697 -88959 63153 158483 116437 116450 -61464 -75134 -168467
483 -168467 -156213 -10697 75727 -9510 153583 136098 140755 -3410 -67813 50990 59643
472 59643 58630 -11105 92195 104363 -23786 -52128 25897 -6701 16295 48444 -30941 -137671
460 -137671 -169153 -152659 -72531 -58782 -39639 -17040 17679 -21000 135281 85246 66063 158124
448 158124 147566 32694 136394 191013 74333 77104 54262 -91520 -118075 58151 74495
437 74495 41603 -13511 -34842 54164 55618 -30745 -60262 69629 94219 40540 -40925 -118202
425a18202N9764o442R9179n2199q6105J05737j11375J395J32263J69781j76443
$$ plain form
425 -118202 -58438 -64880 34299 -17900 -104005 1732 -109643 -108248 24015 193796 17353
$$ [...]
##END NTUPLES=NMR SPECTRUM
##END=
