##TITLE=1H_TG-2367
 CDCl3
 8 sc, 
 12.12.2022
##JCAMPDX= 6.0         $$ Bruker NMR JCAMP-DX V2.0
##DATA TYPE= NMR SPECTRUM
##DATA CLASS= NTUPLES
##ORIGIN= UXNMR, Bruker Analytische Messtechnik GmbH
##OWNER= root
$$ XWIN-NMR		Version 3.5
$$ Mon Dec 12 13:59:25 2022 Russian Standard Time (UT+4h)  she@DPX200
##.OBSERVE FREQUENCY= 200.13135
##.OBSERVE NUCLEUS= ^1H
##.ACQUISITION MODE= SIMULTANEOUS
##.ACQUISITION SCHEME= undefined
##.AVERAGES= 8
##.DIGITISER RES= 18
##SPECTROMETER/DATA SYSTEM= spect
##.PULSE SEQUENCE= zg30
##.SOLVENT NAME= CDCl3
##.SHIFT REFERENCE= (INTERNAL, CDCl3, 0, 15.7039)
##AUDIT TRAIL= $$ (NUMBER, WHEN, WHO, WHERE, WHAT)
$$ ##TITLE= Audit trail, XWIN-NMR		Version 3.5
$$ ##JCAMPDX= 5.01
$$ ##ORIGIN= Bruker BioSpin GmbH
$$ ##OWNER= she
$$ F:/spectra/data/she/nmr/H-F/1/pdata/1/auditp.txt
$$ ##AUDIT TRAIL=  $$ (NUMBER, WHEN, WHO, WHERE, WHAT)
(   1,<2022-12-12 13:57:48.79 +0400>,<she>,<DPX200>,
      <created by zg, POWCHK disabled, PULCHK disabled
       configuration hash MD5:
       00 E9 B6 7A A2 85 ED C7 34 08 36 98 17 FE 4E 26
       data hash MD5: 16K
       DB 87 F8 C1 6C E4 18 60 26 E1 54 A7 D7 9E 69 27>)
(   2,<2022-12-12 13:57:51.00 +0400>,<she>,<DPX200>,
      <Start of raw data processing
       efp BC_mod = 2 LB = 0.24 FT_mod = 6 PKNL = 1 PHC0 = -18746.67 PHC1 = 4.200714 SI = 16K 
       data hash MD5: 16K
       20 8D 5D 78 22 8B B7 6F 56 69 D2 DC 77 61 45 D3>)
(   3,<2022-12-12 13:58:16.65 +0400>,<she>,<DPX200>,
      <pk PHC0 = -3.990036 PHC1 = 2.2 
       data hash MD5: 16K
       F4 E3 0A 22 B8 8A 6C 75 7C CC 24 56 CF 82 30 47>)
(   4,<2022-12-12 13:58:19.75 +0400>,<she>,<DPX200>,
      <abs ABSG = 5 
       data hash MD5: 16K
       C3 A5 E2 46 C3 B6 6A 72 FA 3B 66 B4 8E D9 36 B0>)
(   5,<2022-12-12 13:58:37.53 +0400>,<she>,<DPX200>,
      <pk PHC0 = 4.233688 PHC1 = -6 
       data hash MD5: 16K
       EC 85 02 6F 4C BE 92 AF 06 20 00 36 12 F4 35 73>)
(   6,<2022-12-12 13:58:40.25 +0400>,<she>,<DPX200>,
      <abs ABSG = 5 
       data hash MD5: 16K
       C5 13 18 E9 BA 37 32 4D 71 BB 95 6D 4D FD E4 B4>)
$$ ##END=
$$ 
$$ hash MD5
$$ 3B AB 09 1C B1 27 4F F4 7E 10 2B C9 81 4C 5F DC
##$RELAX= 
##$RELAX= 
##$RELAX= 
##$RELAX= 
##$RELAX= 
##$RELAX= 
$$ Bruker specific parameters
$$ --------------------------
##$DU= <F:/spectra>
##$EXPNO= 1
##$NAME= <H-F>
##$PROCNO= 1
##$TYPE= <nmr>
##$USER= <she>
##$AMP= (0..31)
100 100 100 100 100 100 100 100 100 100 100 100 100 100 100 100 100 100 
100 100 100 100 100 100 100 100 100 100 100 100 100 100 
##$AQSEQ= 0
##$AQ_mod= 1
##$AUNM= <au_zg>
##$AUTOPOS= <>
##$BF1= 200.13
##$BF2= 200.13
##$BF3= 200.13
##$BF4= 200.13
##$BF5= 200.13
##$BF6= 200.13
##$BF7= 200.13
##$BF8= 200.13
##$BYTORDA= 1
##$CFDGTYP= 0
##$CFRGTYP= 5
##$CHEMSTR= <none>
##$CNST= (0..31)
1 1 145 1 1 1 1 1 1 1 1 1 1 1 1 1 1 1 1 1 1 1 1 1 1 1 1 1 1 1 1 1 
##$CPDPRG= <>
##$CPDPRG1= <>
##$CPDPRG2= <>
##$CPDPRG3= <>
##$CPDPRG4= <mlev>
##$CPDPRG5= <mlev>
##$CPDPRG6= <mlev>
##$CPDPRG7= <mlev>
##$CPDPRG8= <mlev>
$$ [...]
##$SUBNAM3= <"">
##$SUBNAM4= <"">
##$SUBNAM5= <"">
##$SUBNAM6= <"">
##$SUBNAM7= <"">
##$SUBNAM8= <"">
##$SUBNAM9= <"">
##$SW= 18.05172834244
##$SWIBOX= (0..15)
0 0 2 0 0 0 0 0 0 0 0 0 0 0 0 0 
##$SW_h= 3612.71676300578
##$TD= 16384
##$TD0= 1
##$TE= 0
##$TE2= 300
##$TE3= 300
##$TEG= 300
##$TL= (0..7)
0 120 120 120 120 120 120 120 
##$TP= (0..7)
150 150 150 150 150 150 150 150 
##$TP07= 0
##$TPNAME0= <>
##$TPNAME1= <>
##$TPNAME2= <>
##$TPNAME3= <>
##$TPNAME4= <>
##$TPNAME5= <>
##$TPNAME6= <>
##$TPNAME7= <>
##$TPOAL= (0..7)
0.5 0.5 0.5 0.5 0.5 0.5 0.5 0.5 
##$TPOFFS= (0..7)
0 0 0 0 0 0 0 0 
##$TUNHIN= 0
##$TUNHOUT= 0
##$TUNXOUT= 0
##$USERA1= <user>
##$USERA2= <user>
##$USERA3= <user>
##$USERA4= <user>
##$USERA5= <user>
##$V9= 5
##$VALIST= <valist>
##$VCLIST= <CCCCCCCCCCCCCCC>
##$VD= 0
##$VDLIST= <DDDDDDDDDDDDDDD>
##$VPLIST= <PPPPPPPPPPPPPPP>
##$VTLIST= <TTTTTTTTTTTTTTT>
##$WBST= 1024
##$WBSW= 4
##$XGAIN= (0..3)
0 0 0 0 
##$XL= 0
##$YL= 0
##$YMAX_a= 800148
##$YMIN_a= -1069471
##$ZGOPTNS= <>
##$ZL1= 120
##$ZL2= 120
##$ZL3= 120
##$ZL4= 120
##$ABSF1= 15.7524
##$ABSF2= -2.299449
##$ABSG= 5
##$ABSL= 3
##$ALPHA= 0
##$AQORDER= 0
##$ASSFAC= 0
##$ASSFACI= 0
##$ASSFACX= 0
##$ASSWID= 0
##$AUNMP= <proc_1d>
##$AZFE= 0.1
##$AZFW= 0.1
##$BCFW= 0
##$BC_mod= 2
##$BYTORDP= 0
##$COROFFS= 0
##$CY= -3
##$DATMOD= 1
##$DC= 0
##$DFILT= <>
##$DTYPP= 0
##$F1P= 0
##$F2P= 0
##$FCOR= 1
##$FTSIZE= 16384
##$FT_mod= 6
##$GAMMA= 0
##$GB= 0
##$INTBC= 1
##$INTSCL= 3.70164e-10
##$ISEN= 128
##$LB= 0.24
##$LEV0= 0
##$LPBIN= 0
##$MAXI= 10000
##$MC2= 0
##$MEAN= 0
##$ME_mod= 0
##$MI= 1.114404
##$NCOEF= 0
##$NC_proc= -6
##$NLEV= 6
##$NOISF1= 3.799351
##$NOISF2= 2.8
##$NSP= 0
##$NTH_PI= 0
##$NZP= 0
##$OFFSET= 15.70392
##$PC= 1
##$PHC0= -18746.43
##$PHC1= 0.4007139
##$PH_mod= 1
##$PKNL= yes
##$PPARMOD= 0
##$PSCAL= 0
##$PSIGN= 0
##$REVERSE= no
##$SF= 200.130013532968
##$SI= 16384
##$SIGF1= 3
##$SIGF2= 2
##$SINO= 5.538805
##$SIOLD= 16384
##$SREGLST= <1H.CDCl3>
##$SSB= 0
##$STSI= 16384
##$STSR= 0
##$SW_p= 3612.71676300578
##$SYMM= 0
##$S_DEV= 0
##$TDeff= 16384
##$TDoff= 0
##$TI= <>
##$TILT= no
##$TM1= 0
##$TM2= 0
##$TOPLEV= 0
##$USERP1= <user>
##$USERP2= <user>
##$USERP3= <user>
##$USERP4= <user>
##$USERP5= <user>
##$WDW= 1
##$XDIM= 16384
##$YMAX_p= 342552111
##$YMIN_p= -743335
$$ End of Bruker specific parameters
$$ ---------------------------------
##NTUPLES= NMR SPECTRUM
##VAR_NAME=  FREQUENCY,     SPECTRUM/REAL,   SPECTRUM/IMAG
##SYMBOL=    X,             R,               I
##VAR_TYPE=  INDEPENDENT,   DEPENDENT,       DEPENDENT
##VAR_FORM=  AFFN,          ASDF,            ASDF
##VAR_DIM=   16384,         16384,           16384
##UNITS=     HZ,            ARBITRARY UNITS, ARBITRARY UNITS
##FACTOR=    0.220516191357247, 1,           1
##FIRST=     3142.825795044, 0,              0
##LAST=      -469.890967961782, 0,           0
##MIN=       -469.890967961782, -743335,     0
##MAX=       3142.825795044, 342552111,      0
$$ Real data points
##PAGE= N=1
##DATA TABLE= (X++(R..R)), XYDATA
$$ [...]
8433 7595630 7432525 7255334 7190174 7066554 6969294 6955577 6892863 6837036 6765162 6623699 6559378
8422 6559378 6500285 6477578 6466951 6332963 6331129 6325252 6224760 6169106 6201382 6059818 6045222
8411 6045222 6046420 5994584 6048176 6109315 6226158 6237071 6129056 6117612 6155155 6147185 6242973
8400 6242973 6228443 6133951 6169653 6182069 6178479 6249497 6262814 6228836 6272810 6332047 6402438 6384485
8388 6384485 6441471 6494505 6462970 6497550 6474554 6499388 6559524 6624280 6660927 6772217 6865147
8377 6865147 6897391 6948322 6998468 7111467 7215301 7310008 7470989 7537833 7650692 7780979
8367 7780979 7983717 8086175 8278991 8366324 8635963 8872118 9086200 9376949 9616163 9846049
8357 9846049 10171681 10421339 10767092 11133210 11498209 11928847 12379176 12929317 13436980 14145412
8347 14145412 14785027 15559748 16498024 17530546 18747019 20084562 21594211 23481929 25539416
8338 25539416 27822043 30289776 32742463 35051228 36882487 38138305 38743019 38685487 38320784
8329 38320784 37895668 37599615 37630473 37991816 38492776 39094694 39683063 39892604 39485231 38650395
8319 38650395 37213868 35492781 33801929 32221686 30695706 29622838 28744174 28036883
8311 28036883 27668571 27372492 27407829 27674736 28086865 28684565 29513378 30443782 31740775
8302 31740775 33325227 35162424 37305341 39863992 42928065 46061541 49395882 52709780
8294 52709780 55677331 58109931 59771548 60805896 61147052 60813676 60224815 59515963 58953786
8285 58953786 58557408 58524317 58558407 58457893 57857530 56621937 54848675 52343192 49402085
8276 49402085 46216321 42860508 39607381 36784093 34304847 32195713 30406680 28926357
8268 28926357 27652548 26679777 25981548 25423818 25001297 24693786 24576794 24690336 25063823
8259 25063823 25494874 26220313 27245206 28283490 29525036 30943601 32168979 32980191 33499180
8250 33499180 33490016 32905772 32055777 31077437 30126175 29579607 29379268 29339523 29394810 29461701
8240 29461701 29130369 28339461 27101563 25473357 23494604 21472989 19672413 18049631
8232 18049631 16545217 15245817 14165601 13253644 12486658 11896263 11300556 10734375 10240948
8223 10240948 9884538 9515892 9146721 8808115 8435423 7968871 7687396 7465606 7107461
8214 7107461 6920083 6729568 6424040 6173810 5855751 5668785 5647504 5454967 5188602 5166019
8204 5166019 5153446 4914782 4804026 4629763 4577674 4510539 4395606 4124379 4110358 3886722
8194 3886722 3866215 3305225 4407237 5114912 4438881 4308856 4151619 4118740 3908239 3817845
8184 3817845 3661788 3574242 3401190 3497575 3328192 3393414 3373514 3282936 3206258 3124892 3004934
8173 3004934 2835927 2794337 2862353 2743438 2738155 2650668 2534074 2470350 2500225 2445177 2347723
8162 2347723 2397207 2385404 2304672 2311437 2268496 2150265 2281925 2316679 2151989 2195865 2187441
8151 2187441 2204605 2198645 2276766 2221217 2168659 2233927 2089872 1984474 1984166 1972339 1973885 1973704
8139 1973704 1889455 1903334 1925493 1909996 1817839 1764620 1741906 1746251 1653697 1614181 1568143 1653788
8127 1653788 1651858 1731553 1662768 1535848 1525067 1453646 1501166 1509108 1449785 1409603 1445895 1473741
8115 1473741 1501985 1443464 1355391 1326538 1324974 1383523 1429348 1408806 1329912 1193690 1175288
8104 1175288 1232658 1190543 1216031 1211873 1162005 1128734 1083578 1063411 1081988 1106723 1064241 1157615
8092 1157615 1047667 1021219 1076745 1054281 1007242 1019580 1015804 997018 1034183 975027 983346 1003720
8080 1003720 1007174 950960 1083131 1027784 1008093 1008170 1001736 977695 983225 960202 955941 846298
8068 846298 706128 717731 792253 771296 689244 692692 703091 675407 652677 597469 509013 493385
8056 493385 504906 510896 387219 468656 567421 454046 374536 454058 505484 460220 479022
8045 479022 520573 488926 474057 458971 468682 482653 510530 457843 353805 380783 495155
8034 495155 529319 471431 420819 413185 341096 386010 367101 369531 276825 296326 319650 269197
8022 269197 265105 277290 273981 216454 312988 309383 286941 335033 304266 354800 322379 225458
8010 225458 155495 119684 131376 117055 214744 231026 158859 149470 211164 208526 167580 123514
7998 123514 136005 113507 242510 278497 280580 232128 146462 142411 149128 167947 214502 249054
7986 249054 201420 63783 113429 213555 215071 189865 130154 95730 142271 163326 131622
7975 131622 62632 75889 163065 119104 118360 231265 184378 102368 173509 162277 153516 203147
7963 203147 147916 138873 166892 198588 273956 133691 110623 111216 136882 170538 179360 189547
7951 189547 86063 54367 139677 204672 235911 189094 106448 113295 106882 152643 148436 82135
7939 82135 173624 175602 165084 92294 166296 33859 63914 194098 229065 245590 235439 232594
7927 232594 271526 204718 150534 158233 151242 273561 181649 139196 206169 197714 230539 207469
7915 207469 111041 154839 101245 128489 101614 123284 181168 202227 175881 127351 117893 112134
7903 112134 22674 -135923 -118335 9143 83572 127658 68938 24660 -18402 -57033 4717
7892 4717 9806 55745 -16324 -19803 38217 -85599 -101049 -21355 14606 -23722 49137 38008
7880 38008 -104353 -104166 -56994 -64779 -75704 -141242 -167446 -165138 -103073 -56410 -136375 -179625
7868 -179625 -198340 -153243 -89586 -145181 -148018 -192104 -250639 -143283 -152900 -195488 -127106 -115242
7856 -115242 -165275 -173369 -172604 -178976 -157291 -291004 -209248 -166349 -198495 -253550 -289097 -308038
7844 -308038 -252245 -269467 -270637 -231321 -236530 -320727 -247135 -132131 -174320 -237998 -332257 -306913
7832 -306913 -275591 -272341 -311540 -294942 -251698 -220891 -285411 -332901 -307404 -280713 -236582 -146735
7820 -146735 -215159 -193631 -258820 -279987 -267664 -326429 -355149 -305458 -391653 -440531 -165891
7809 -165891 -8753 -121810 -215730 -332110 -319729 -284483 -315034 -316885 -289683 -389001 -319810
7798 -319810 -270886 -250169 -204713 -245030 -227861 -326258 -340660 -335810 -327906 -330593 -338569 -266459
7786 -266459 -257576 -209109 -274709 -355239 -421892 -448540 -384266 -343703 -465575 -483623 -449433 -448485
7774 -448485 -292784 -161182 -198253 -161001 -202382 -263384 -192867 -270985 -242560 -215052 -174640
7763 -174640 -101603 -112610 -121657 -44529 -85122 -54915 113944 232172 154944 204772 221691
7752 221691 243790 171391 209550 203743 227041 243875 100376 79357 128341 131930 55071 -21097
7740 -21097 -84591 -79530 -158736 -241800 -159912 -159994 -116517 -145982 -217538 -251790 -224000 -150778 -165594
7727 -165594 -234507 -213989 -172754 -238044 -248632 -252865 -285907 -345032 -232785 -170663 -151554 -197849
7715 -197849 -270212 -222997 -171606 -246597 -203125 -147210 -213670 -187534 -143114 -66844 -76751 -47286
7703 -47286 -11342 -66994 -84781 -100715 48743 152561 219230 320887 362103 321056 389777
7692 389777 356309 415826 518468 541680 500293 471898 389358 283362 260267 237753 200039
7681 200039 92879 71341 41519 -21121 -128633 -132815 -159503 -216872 -265351 -359752 -325584
7670 -325584 -257096 -290698 -302886 -379387 -400918 -312404 -291346 -293442 -291346 -313042 -318792 -294972
7658 -294972 -397736 -389912 -325328 -407841 -480537 -414645 -375355 -421700 -391891 -489375 -406071 -428729
7646 -428729 -516489 -454057 -427245 -343629 -416932 -514741 -453407 -460544 -393568 -372577 -386845 -405794
7634 -405794 -452920 -502997 -475273 -443283 -596888 -546039 -546308 -463443 -471425 -488660 -472130 -407572
7622 -407572 -371333 -439086 -396199 -390382 -367249 -460617 -507941 -570976 -472111 -436243 -520441 -516844
7610 -516844 -513286 -514849 -602684 -533455 -481799 -422946 -383442 -414795 -438476 -460176 -475915 -521660
7598 -521660 -456305 -433994 -389191 -372401 -402305 -457411 -441685 -407057 -384169 -442940 -491229 -433681
7586 -433681 -433914 -543134 -484944 -460170 -310737 -332249 -329688 -249865 -416460 -420853 -406940 -332384
7574 -332384 -368068 -345732 -326878 -336787 -301537 -233412 -322260 -371702 -315723 -245401 -266202 -129078
7562 -129078 -108488 -65910 -73783 -77025 -77858 -129590 -136510 -156986 -135186 -215698 -252149 -211488 -194043
7549 -194043 -186781 -210643 -181284 -70751 -47534 85119 104581 241315 310396 261543 292925
7538 292925 288240 163600 123329 148922 60187 -128526 -55939 -18805 -22072 -41975 -32224 -27180
7526 -27180 -48492 -90079 -140347 -214570 -189542 -67506 -88799 1738 -6821 -95566 -124032 -125243
7514 -125243 -137110 -111019 -82853 -99062 -125326 -125227 -80644 -101518 -194489 -204977 -161779 -202983
7502 -202983 -309526 -322552 -256096 -181663 -147316 -72311 -79721 -93424 -151999 -158016 -203789 -197895
7490 -197895 -166919 -12808 7493 -27150 -23415 108629 158122 89468 93198 -15548 123708
7479 123708 142283 77092 -40808 -63622 -47252 -141060 -115920 -129590 -52828 -134865 -159564
7468 -159564 -49921 -59005 -93712 -69913 -131548 -165525 -80913 -192837 -127749 13119 30788
7457 30788 -106836 -78597 76283 -19771 72391 182291 160430 16704 -103955 -151344 -202471
7446 -202471 -170008 -170471 -159400 -85395 -75277 -133093 -274579 -294516 -274561 -331171 -292027 -268047
7434 -268047 -346687 -376608 -341237 -352240 -371882 -379537 -359500 -304602 -225321 -358598 -322736 -294041
7422 -294041 -357065 -331900 -255728 -204857 -259784 -234653 -139524 -125095 -112170 -94443 -85658 -190846
7410 -190846 -187657 -206327 -223086 -271124 -210703 -114414 -158695 -193496 -78964 -112390 -58957 -24210
7398 -24210 -46781 70567 79792 42395 39949 56483 77638 63043 63264 112700 149121 217095
7386 217095 271955 290332 417122 444839 427990 462546 551677 760726 724931 803113 960256
7375 960256 1021473 1081457 1123301 1133069 1143083 1243450 1273450 1323972 1307659 1245966 1239802 1180790
7363 1180790 1072655 976878 872890 833703 794790 650526 557048 425543 407877 334597 211717
7352 211717 164108 105961 -88073 -68136 -111531 -87350 -147167 -106906 -80776 -97087 -63116
7341 -63116 -36575 -124315 -218532 -248723 -250739 -271622 -318178 -228787 -251602 -307840 -340683 -347429
7329 -347429 -321556 -300675 -416688 -475963 -459275 -434494 -358152 -397033 -411925 -543337 -556662
7318 -556662 -512236 -453347 -359288 -308630 -320147 -473040 -572757 -568613 -584090 -565333 -555069 -504721
7306 -504721 -527397 -446401 -440692 -451395 -562363 -471605 -377049 -501177 -493444 -555719 -563083 -571495
7294 -571495 -501133 -517396 -526645 -484442 -403613 -436809 -436710 -484330 -518233 -459056 -398144 -458872
7282 -458872 -520013 -541831 -557122 -575246 -548335 -591855 -596024 -566591 -504962 -524451 -369076 -517628
7270 -517628 -591778 -561152 -589911 -566802 -561513 -561984 -566131 -530801 -414365 -397428 -422255 -459971
7258 -459971 -438149 -530293 -575114 -485910 -486779 -582240 -711628 -643106 -530968 -543898 -492785 -504318
7246 -504318 -566754 -619464 -622218 -525001 -550782 -580521 -547577 -537537 -570744 -526360 -601669 -597474
7234 -597474 -579863 -628501 -548675 -526348 -571031 -587903 -556282 -557997 -618455 -507446 -493162 -589772
7222 -589772 -586241 -569938 -474427 -492663 -525884 -480862 -473687 -501473 -560250 -629909 -594116 -619208
7210 -619208 -743335 -622110 -585701 -563325 -446322 -465433 -555140 -472178 -542627 -662885 -606031
7199 -606031 -633439 -634475 -635389 -608309 -504773 -592129 -443521 -452320 -412469 -529434 -580985 -643834
7187 -643834 -637586 -628696 -598994 -574640 -607922 -515576 -476795 -483485 -389885 -425881 -494140 -476409
7175 -476409 -448028 -520174 -517788 -508201 -494581 -461067 -544872 -524993 -543929 -537499 -463126 -438035
7163 -438035 -456547 -455570 -429864 -403868 -507135 -517333 -474522 -489484 -548787 -497533 -523821 -504529
7151 -504529 -598696 -609699 -458827 -432746 -438368 -376401 -459087 -515314 -550622 -517873 -481679 -425194
7139 -425194 -506819 -530093 -484909 -485459 -536248 -459265 -452896 -452251 -387257 -365341 -391335 -478103 -430624
7126 -430624 -297982 -330587 -365588 -417750 -393153 -352409 -375835 -386804 -409093 -427099 -446403
7115 -446403 -354784 -348325 -400073 -502032 -402242 -405913 -412853 -527101 -453142 -359482 -375644 -334466
7103 -334466 -364479 -388583 -422218 -347193 -390603 -408818 -424219 -432210 -577565 -521278 -562753 -513116
7091 -513116 -462218 -513277 -502412 -451726 -506910 -479485 -421100 -428534 -463756 -538737 -452626 -381649
7079 -381649 -401469 -468844 -429717 -496945 -391584 -388026 -479360 -447756 -372573 -313936 -372037 -387411
7067 -387411 -380019 -408342 -360328 -425309 -386090 -285012 -311350 -264398 -392136 -500943 -431438
7056 -431438 -387864 -434488 -422494 -311319 -376696 -367553 -365496 -216197 -289963 -303207 -193416
7045 -193416 -231787 -204426 -251410 -172273 -152300 -278605 -286823 -206260 -155213 -229363 -242851 -260401
7033 -260401 -214556 -170742 -84146 -164952 -121725 -119021 -127499 -104735 -143802 -162016 -131807 -48332
7021 -48332 -102221 -57327 -92616 -85396 -32874 -78114 -98305 -90352 -104630 -98231 5771 108773
7009 108773 29420 -18991 113696 150272 113530 31503 23045 42918 90710 110274 41383 18098
6997 18098 -83214 -111348 47036 179913 103092 70731 26648 -858 -31055 76639 92213
6986 92213 96433 68279 109335 100956 122311 157520 79357 65111 19789 -6161 125112 97296
6974 97296 116620 87089 -4726 60139 85253 191827 212705 193819 165079 219936 263901 291956
6962 291956 246688 265979 259877 324457 372996 402175 452620 413833 572344 658074 772108
6951 772108 868701 1033394 1168390 1244250 1308770 1365109 1453904 1477607 1500413 1585203 1537921
6940 1537921 1595928 1376611 1348223 1308918 1117836 996472 1010870 998724 824317 702460
6930 702460 504358 533324 438545 317262 188601 111937 157195 95992 110859 116329 44248
6919 44248 30668 -34744 8326 -22031 -56672 -144268 -31821 21878 -101348 -185242 -301718
6908 -301718 -332840 -292507 -243230 -183053 -214457 -246862 -260144 -263830 -196759 -197534 -161238 -230253
6896 -230253 -243688 -256541 -284082 -237595 -257768 -247797 -212174 -154242 -189832 -241983 -282565 -202748
6884 -202748 -221716 -173705 -272311 -308536 -228235 -259103 -219677 -214398 -306325 -295766 -285328 -278613
6872 -278613 -257079 -200037 -213370 -297019 -240513 -133762 -163677 -172040 -202387 -286167 -333458 -329344
6860 -329344 -285206 -257546 -272938 -304566 -283709 -292034 -257689 -242719 -347164 -275222 -231861 -194994
6848 -194994 -179701 -213099 -207472 -175477 -120924 -156558 -167894 -237251 -241820 -168144 -102672 -189548
6836 -189548 -111746 -105723 -86543 -94639 -31041 52651 87540 16573 -98323 -62692 -49432 -22722
6824 -22722 29792 88797 111683 -5173 58338 169157 286695 298550 303800 388847 353202
6813 353202 293148 345958 294512 258396 249875 264867 399493 258313 140963 198099 318827
6802 318827 398525 466902 518075 582863 576485 761132 963686 1053070 1101093 1074690 1078915 1211315
6790 1211315 1267707 1244163 1266598 1221150 1151904 1088367 1126294 1034194 939808 928757 876822
6779 876822 802594 809489 951289 985220 1088267 1136878 1135494 1205291 1319944 1402365 1440096
6768 1440096 1621097 1804574 1891797 1923552 2024158 1943078 1851823 1831259 1837005 1841527 1649106
6757 1649106 1434280 1242913 1114218 1080876 1031457 1021165 1047384 967581 921963 858672 905779
6746 905779 944896 966723 1112810 1188647 1224502 1212152 1245250 1323111 1305083 1323096 1281765
6735 1281765 1258209 1187413 1158832 1125886 915769 755670 683027 688330 496340 473981 444485
6724 444485 424090 495031 451613 383699 371942 340337 394016 446497 429624 400967 421332 320887
6712 320887 415439 520753 440722 452076 476421 451188 378763 381791 415004 331669 203930
6701 203930 181973 162860 207724 269970 278857 171265 215280 324986 324034 321684 213230 129649
6689 129649 162306 219630 267123 234721 190000 163581 205643 185462 131350 63776 49689 4957
6677 4957 15004 -70537 -114115 3766 47289 99166 34927 135 -73208 -5205 55402 61757
6665 61757 83975 66167 3529 -59466 61341 8117 18751 -67387 -205748 -278431 -147677
6654 -147677 -40927 -14551 -41869 -167467 -177628 -42766 -33492 -92276 -104672 -130261 -17875
6643 -17875 -24621 -102404 -12073 -51954 -1093 61325 5984 59235 33335 -15007 -91587 -230075
6631 -230075 -164466 33559 107824 23256 40055 53921 41695 16931 130 81694 133704
6620 133704 134049 191405 163014 74162 -19612 -13508 71273 11543 59314 8449 -88766 -136407
6608 -136407 -112294 8870 -1203 -91708 -106065 -194077 -242586 -207042 -227183 -157555 -130171
6597 -130171 -116868 -221576 -307734 -293672 -252973 -225971 -217659 -215311 -259991 -325444 -315730 -267826
6585 -267826 -333262 -285629 -277114 -175371 -185543 -169975 -118061 -86961 -138126 -110377 -194013 -155414
6573 -155414 -136865 -87950 -61139 -99776 -185079 -277355 -302471 -217612 -220811 -307837 -224164 -224676
6561 -224676 -210612 -327454 -409794 -377120 -312556 -296223 -333434 -327175 -265724 -278566 -226361 -240088
6549 -240088 -218142 -266465 -289791 -228852 -279373 -299106 -294317 -317757 -295527 -256304 -312440 -331757
6537 -331757 -233863 -224978 -314979 -267473 -307302 -210538 -290086 -371667 -300583 -275104 -358507 -386053
6525 -386053 -333396 -373059 -382922 -358585 -290978 -264084 -266699 -364881 -461140 -410133 -420695 -272793
6513 -272793 -233586 -339981 -258456 -292289 -345129 -272555 -385728 -374038 -330401 -396766 -334538
6502 -334538 -490229 -484521 -355874 -322070 -301590 -308756 -285944 -317911 -344782 -217144 -179347
6491 -179347 -179772 -279172 -314242 -403316 -330325 -218868 -272045 -360579 -285379 -319162 -354197 -236134
6479 -236134 -213207 -365308 -379386 -395782 -392385 -401326 -428108 -455842 -319772 -333154 -413814 -435444
6467 -435444 -515566 -476381 -391680 -433545 -439494 -407837 -459079 -375469 -335816 -201713 -258779 -311612
6455 -311612 -285639 -164463 -150311 -243039 -240930 -300157 -281421 -300706 -345040 -292486 -232596 -240779
6443 -240779 -285745 -310572 -332358 -201381 -273832 -296685 -305876 -366813 -279239 -182927 -187109 -228434
6431 -228434 -193199 -159021 -231446 -208695 -171298 -195463 -178357 -219860 -217445 -251049 -321527 -312048
6419 -312048 -388008 -330605 -215268 -249309 -235220 -259979 -290329 -259753 -183570 -220941 -145671
6408 -145671 -122517 -133226 -133909 -185351 -185435 -125192 -138150 -106241 -135762 -157322 -167910 -159917 -204646
6395 -204646 -303186 -179434 -166123 -151250 -229710 -191444 -62744 2031 6262 -47401 -32173
6384 -32173 18065 79240 -22162 -39168 9388 21358 -75274 -136896 -14485 40526 86782
6373 86782 39564 32338 -47235 -142146 -40156 115491 67460 34887 72572 79138 -31219 22940
6361 22940 74447 3920 43093 75292 26948 112530 197104 90696 10744 147735 87667
6350 87667 86402 111248 70484 95232 15975 -50250 11316 137701 276363 229985 162159 234192
6338 234192 214149 303334 357986 282268 296925 384869 458969 511778 474487 520650 545637 482379
6326 482379 332939 413109 605855 697678 600198 701224 776909 785644 833919 848132 863286
6315 863286 926707 967962 1004957 1060403 1006655 914401 1033200 1040415 1080881 1154166 1076820 1092920
6303 1092920 1198190 1239406 1237664 1263228 1344599 1416815 1494548 1710157 1761087 1778037 1876847
6292 1876847 2056334 2120759 2232147 2358555 2555332 2637780 2701278 2719947 2868506 2940999
6282 2940999 2895841 2792344 2718957 2755377 2612489 2610806 2663753 2715963 2654851 2751269 2757062
6271 2757062 2730446 2779859 2826286 2962306 3038629 3191300 3298564 3337711 3476385 3713621
6261 3713621 3890358 3951021 3993043 4085761 4252514 4350234 4361014 4401632 4414049 4400752 4353462
6250 4353462 4421062 4298558 4133887 4010021 3961187 3930526 3819547 3762871 3670042 3643576 3651388
6239 3651388 3519243 3532010 3560938 3470217 3545421 3568733 3648195 3765657 3884689 3967201 4119831
6228 4119831 4295828 4289941 4332394 4321589 4351414 4449899 4451162 4425581 4352839 4296065 4277643 4223280
6216 4223280 4200705 4133187 4044650 3989425 3857802 3741457 3726541 3846342 3858428 3871212 3866676
6205 3866676 4001395 4044763 4159258 4304132 4425111 4421920 4395587 4543934 4616054 4593188 4619564
6194 4619564 4865641 4926578 4993622 5111117 5155843 5299783 5467624 5678325 5802791 5961398
6184 5961398 6158526 6465685 6683205 6878634 7103445 7290487 7443652 7604486 7846164 8035680
6174 8035680 8215975 8359240 8400047 8490647 8448611 8302193 8264160 8217155 8124065 8144980 8313962
6163 8313962 8461963 8628927 8907422 9230447 9724095 10265479 10740359 11410260 11929643 12475802
6153 12475802 12967130 13233553 13435030 13674242 13697862 13589702 13586775 13533376 13392124 13178677
6143 13178677 13033265 12728878 12411663 12220327 11927959 11771544 11628188 11668458 11790996 11889946
6133 11889946 12071957 12393264 12797294 13114509 13620516 14335990 15022543 15685813 16239249
6124 16239249 16615977 16777312 16815798 16484601 15868507 15154981 14460486 13674932 13023257 12394641
6114 12394641 11797566 11229460 10729464 10360469 10021570 9703696 9503475 9461229 9459633 9565741
6104 9565741 9580094 9743035 10034712 10346623 10839684 11369640 11913444 12313292 12747164 13026144
6094 13026144 13059975 13052504 12782043 12396173 12004752 11490616 10898845 10286325 9911840 9530407
6084 9530407 8985449 8481836 7982059 7556549 7114694 6805866 6453934 6070642 5938715 5800843
6074 5800843 5676611 5571449 5550248 5520396 5414594 5484632 5570618 5706753 5671778 5687556 5744935
6063 5744935 5670336 5621354 5616554 5526794 5332615 5190478 5061923 4907180 4892477 4812237 4747179
6052 4747179 4790718 4856060 4763649 4616580 4349394 4122682 3865197 3692220 3512811 3351878
6042 3351878 3115543 3045678 3040258 2913846 2834385 2666812 2564995 2536898 2540946 2445942 2536252
6031 2536252 2618840 2572985 2532329 2604766 2647946 2584567 2688858 2784181 2810894 2932834 3078293
6020 3078293 3176270 3083770 2970078 2886488 2824433 2828919 2850053 2836368 2896980 3026888 3034362
6009 3034362 3192045 3332391 3331875 3473877 3610559 3717243 3818061 3920154 4124346 4322426
5999 4322426 4477243 4556421 4477439 4508382 4562291 4628781 4698660 4856174 4932751 4870058 5018888
5988 5018888 5020750 4934738 4971615 4909264 4670691 4570741 4544076 4481781 4480694 4360660 4290097
5977 4290097 4338784 4292369 4320863 4383582 4415379 4557741 4628086 4700231 4872435 4938838 5038231
5966 5038231 5084979 5045974 5029302 5093211 5198938 5281662 5384583 5469637 5517341 5504421 5402242
5955 5402242 5317179 5264616 5170720 5093194 4956491 4739426 4654701 4413556 4301895 4158174
5945 4158174 3952390 3849643 3728127 3547131 3303889 3221386 3152936 3049223 2957622 3001345
5935 3001345 2918854 2865861 2857060 2883478 2907510 2903186 2940792 2894768 2839266 2833622 2745436 2690361
5923 2690361 2617474 2558296 2509585 2520858 2470874 2589416 2523618 2343592 2304406 2232716 2038664
5912 2038664 1842016 1768073 1764681 1713558 1706364 1635493 1479225 1405286 1368050 1287035 1291387 1302785
5900 1302785 1241542 1335144 1200214 1112555 1123897 1058689 1075744 1041186 1061247 1063955 1009272
5889 1009272 1130448 1148541 1241261 1129096 981654 1021117 967100 1046227 1099818 1024615 886965
5878 886965 950490 906326 883300 950735 919297 847654 831638 849266 879848 936628 823118
5867 823118 786952 965952 908798 833284 861456 712363 747146 804993 821940 772084 648073
5856 648073 773757 733071 777918 865321 817862 867148 774079 834749 867822 821327 868504
5845 868504 860507 841595 778180 878986 1052310 1029107 969885 1007193 1014847 1044258 1171143
5834 1171143 1142405 1112752 1088619 1142252 1262009 1173292 1111319 1103106 1088995 1128749 1103038
5823 1103038 1035147 1041483 1116479 1152067 1311161 1168948 1134557 1195653 961351 1031100 1187731
5812 1187731 1121537 1127744 1181188 1326602 1313215 1353368 1415855 1530249 1417459 1425636 1390569
5801 1390569 1418726 1521175 1378594 1418396 1444687 1378594 1440467 1478543 1354542 1327555 1351268
5790 1351268 1373344 1364630 1355068 1513790 1564526 1521970 1490292 1550621 1529924 1572988 1671247 1687688
5778 1687688 1666432 1631394 1729318 1738149 1913560 2087693 2074387 1994820 2118620 2193218 2147866
5767 2147866 2117535 2089864 2191070 2322398 2378947 2500307 2527290 2606989 2612530 2655834 2728457
5756 2728457 2878709 2988297 3105280 3139862 3273626 3363968 3385644 3593792 3656432 3655548 3661927
5745 3661927 3832561 3911281 3825219 3853040 3879744 3955235 3908830 3912746 4035705 4028250 3942328
5734 3942328 3984499 4062419 4176739 4149458 4162216 4330039 4384972 4597377 4709415 4811200
5724 4811200 4964383 5100401 5283647 5449641 5626910 5853976 6063937 6185023 6493858 6646675
5714 6646675 6661638 6888148 7097529 7259580 7365167 7362085 7368138 7361872 7334831 7352341 7413344
5703 7413344 7472005 7524045 7417952 7291595 7298991 7341221 7330903 7353403 7298718 7350509 7337581
5692 7337581 7440775 7641777 7732128 7746948 7757059 7966391 8079596 8324323 8553755 8575863
5682 8575863 8573996 8588091 8581656 8744002 8810961 8685017 8524894 8321002 8177992 8155184 8036831
5671 8036831 7863032 7525739 7364920 7286347 7159117 7138507 6990836 6832811 6797757 6816947
5661 6816947 6719865 6690217 6798948 6734004 6685223 6693060 6707482 6692075 6783781 6744427 6683972
5650 6683972 6636547 6609479 6700543 6679337 6582026 6531274 6438705 6394800 6310549 6220889 5997679
5639 5997679 5819301 5761562 5479782 5238218 5082998 5011174 4832073 4654997 4575349 4511638
5629 4511638 4431555 4418195 4402247 4262312 4154724 4120001 4015054 3980225 3901989 3791259 3821853
5618 3821853 3774687 3618738 3601158 3581043 3411114 3452969 3487518 3395343 3350299 3230256 3190759
5607 3190759 2986997 2911438 2933141 2792614 2768430 2806191 2677822 2578607 2510661 2443341 2374468
5596 2374468 2354000 2285891 2291186 2224033 2228885 2317775 2265413 2171036 2144204 2165536 2130195 2065502
5584 2065502 2007877 1962869 1952416 1921496 1860770 1841102 1768741 1751504 1721291 1813760 1781083
5573 1781083 1801265 1780565 1708619 1712424 1730428 1624404 1617458 1487672 1436038 1535003 1459742
5562 1459742 1543792 1554034 1421932 1309267 1267147 1340383 1443297 1418921 1422454 1406267 1401780
5551 1401780 1461913 1411557 1382709 1418282 1420220 1459670 1401217 1442272 1508678 1447173 1461149 1473470
5539 1473470 1516423 1531125 1544771 1642019 1697067 1645075 1563541 1580864 1625683 1570857 1594918
5528 1594918 1552231 1615018 1613132 1563468 1629216 1648772 1602945 1714317 1771676 1670807 1761816
5517 1761816 1799532 1863039 1938240 1946830 2035602 2105096 2043712 2004342 2127597 2267710 2184457
5506 2184457 2274771 2376303 2386783 2307971 2222296 2390410 2310930 2165068 2235465 2234290 2284756
5495 2284756 2400613 2389064 2477539 2486675 2454297 2605420 2672472 2661709 2678379 2687113 2764119
5484 2764119 2840024 2939520 3118889 3107958 3156359 3205835 3212623 3152228 3129244 3137904 3117422 3158066
5472 3158066 3258768 3370178 3465939 3532392 3542697 3604116 3637882 3747497 3865981 3899871 3973369
5461 3973369 4001100 4123538 4309265 4458058 4535480 4706761 4696221 4814073 5008842 5234076
5451 5234076 5383746 5578762 5925529 6242656 6542238 6976734 7559379 8203804 8942597 9828867
5441 9828867 10783631 11287225 11818339 12073463 11959435 11565045 11315217 11037796 10844770 10696481
5431 10696481 10515788 10327571 10095528 9742546 9405532 9152023 8912072 8792983 8793054 8824025
5421 8824025 8926122 9135254 9381790 9756148 10272078 10962205 11753340 12621794 13635099
5412 13635099 14979084 16429052 17717836 18935996 19761884 20077491 20039352 20014281 20179024
5403 20179024 20528006 20903849 21095868 20982068 20317291 19242351 17623164 16121809 14851124
5394 14851124 13829185 13075189 12487007 11975923 11635681 11587435 11616755 11821894 12078050 12320113
5384 12320113 12795552 13292055 13780859 14275379 14793352 15116912 15591487 15831758 16014928
5375 16014928 16261001 16630883 16983775 17173268 17299326 17228047 16782784 16041786 15057847 13909885
5365 13909885 12969736 12149810 11482714 11000941 10635554 10441282 10424700 10355809 10477755 10583513
5355 10583513 10707708 10814099 10927166 10904422 10835626 10818349 10882274 10924911 10842611 10732071
5345 10732071 10835589 10683783 10494721 10263771 9918456 9458871 9094007 8729635 8383414
5336 8383414 8072782 7882061 7741260 7666359 7529664 7471793 7508124 7443595 7522374 7547444 7675465
5325 7675465 7817170 8016191 8240712 8367343 8517052 8710158 8763468 8934006 9149160 9247207
5315 9247207 9404771 9557811 9476625 9331049 9099945 8885083 8678530 8421663 8247329 8250980
5305 8250980 8234476 8190876 8222755 8184647 8317950 8386862 8492867 8625492 8838392 9090557
5295 9090557 9332414 9581270 9870804 10250419 10607736 10979693 11359162 11803483 12321274 12851830
5285 12851830 13474930 14060789 14621293 15279662 15783698 16172454 16388654 16557250 16578686 16634411
5275 16634411 16589742 16552488 16598007 16632145 16741175 16818615 16888117 17008519 17295267 17669774
5265 17669774 18088344 18615230 19284225 20162194 20967019 22060857 23525888 25094183 26803138
5256 26803138 28680884 30688361 32554054 34072472 35033273 35344196 35024063 34465195 33931957
5247 33931957 33439201 32906967 32340651 31705929 30853283 29714053 28332129 27034498 25864490
5238 25864490 24886656 24009956 23457911 23102275 22886800 22934050 23257469 23734928 24374344 25453371
5228 25453371 26687688 28051810 29507797 30989635 32208877 32878399 33025201 32732052 32435437
5219 32435437 32046997 31732477 31392470 30978379 30177704 29059562 27648475 25938617 24070172
5210 24070172 22198723 20498177 18898487 17630661 16590628 15761341 15122843 14581121 14130015
5201 14130015 13814185 13502026 13388896 13465282 13484709 13588631 13805056 13918874 14197356 14402157
5191 14402157 14555361 14663868 14819586 15012732 15272292 15438178 15315819 14892002 14137273
5182 14137273 13262222 12371280 11727549 11151210 10612151 10142076 9849620 9590884 9427629
5173 9427629 9259467 9123482 9069498 8974549 9066567 8974356 9000964 9019513 9012286 9081446 9155052
5162 9155052 9152673 9230177 9281772 9363372 9433042 9491839 9621676 9773256 9812849 9972466 10072959
5151 10072959 10322617 10498263 10727016 10957606 11168294 11519527 11760415 12112087 12385748
5142 12385748 12688035 12894519 12916479 12926968 12958901 12935999 12900237 12940297 13049424 12978474 13031021
5131 13031021 13118738 13140691 13134923 13180716 13364658 13612150 13852581 14198078 14497494 14823939
5121 14823939 15215070 15693124 16036378 16351752 16569780 16835485 16983935 17130269 17202547 17198735
5111 17198735 17285985 17456105 17563160 17711735 17794557 17909929 18095279 18235038 18497250 18590680
5101 18590680 18671281 18777636 18929039 18963188 19008406 19138040 19220969 19420740 19576791 19709213
5091 19709213 19939845 20201053 20492525 20797122 21155493 21472833 21731256 22100540 22448545
5082 22448545 22693927 22991415 23346909 23667194 23869413 24208341 24322910 24499525 24656298
5073 24656298 24959511 25137456 25440002 25832542 26240401 26600389 27038336 27585150 28055843
5064 28055843 28503639 28835235 29414425 29986071 30607934 31352424 32004793 32664243 33452480
5055 33452480 34475247 35473878 36482412 37416642 38433958 39590974 40771104 41981850
5047 41981850 43198541 44607313 45798302 47024543 48123519 49298935 50380413 51346825
5039 51346825 52278039 53185297 53916350 54418714 54751821 54820335 54628426 54106204 53476463 52802342
5029 52802342 51940416 51272929 50711966 50142424 49680715 49335698 49152903 48929673 48784062
5020 48784062 48855633 48891474 48928709 49086853 49146855 49284538 49412291 49502447 49599851 49569592 49661548
5009 49661548 49723964 49716606 49565087 49212549 48787476 48415170 47916719 47280424 46321114 45230693
4999 45230693 44037891 42832166 41542139 40209675 38959710 37656962 36615019 35526774
4991 35526774 34405388 33464977 32594537 31565009 30584077 29772520 28795714 27766045 26894793
4982 26894793 25963318 24940747 24069043 23269959 22483728 21822554 21115557 20439470 19800074
4973 19800074 19142940 18601911 18071933 17667397 17355880 16979830 16639034 16131727 15762904
4964 15762904 15519082 15167834 14891727 14528070 14204771 13994891 13608271 13271587 13044166
4955 13044166 12803927 12497425 12227305 11977733 11684182 11476542 11299009 11043152 10878381
4946 10878381 10704613 10460353 10341655 10180531 9990571 9995351 9853465 9950161 9817532 9617353
4936 9617353 9586878 9466235 9373813 9361659 9309238 9197817 9141104 9110954 9137241 9098703 9019164
4925 9019164 8996012 8987747 8983236 8916697 8878834 8795655 8680978 8611992 8660889 8709669 8726492 8701661
4913 8701661 8616082 8680149 8709832 8687680 8621584 8601852 8587845 8551632 8596995 8622364 8608261
4902 8608261 8539040 8560023 8565891 8491600 8615091 8536552 8496373 8487586 8624784 8533894 8495864
4891 8495864 8513477 8554807 8590283 8516414 8514000 8616559 8681568 8759788 8707839 8689422 8774300
4880 8774300 8802043 8882594 8934915 8927158 9020119 8933290 8969251 9124339 9110364 9179236 9225950
4869 9225950 9222920 9321442 9395022 9430372 9530331 9624086 9732364 9777034 9837840 9937432 10046630
4858 10046630 10104712 10310657 10372225 10452737 10503546 10677173 10623770 10852355 11068829 11109132
4848 11109132 11175652 11265372 11489898 11571579 11659745 11772501 12004089 12133015 12287940 12513430
4838 12513430 12638699 12828899 13039535 13245961 13497152 13681519 13888054 14208741 14439837
4829 14439837 14646110 14964928 15252428 15528638 15822533 16067568 16263001 16552344 16756880
4820 16756880 16953627 17146521 17272234 17414623 17592429 17652667 17778981 17979461 18181733 18379360
4810 18379360 18437097 18561099 18640374 18764945 18915375 19223948 19493433 19750022 19951952 20213425
4800 20213425 20514524 20788823 21184694 21538908 21823172 22143073 22448537 22768833 23086241
4791 23086241 23565437 24040321 24519958 25053409 25523035 25961291 26419055 26863651 27435567
4782 27435567 28022309 28608636 29213063 29947168 30784578 31485975 32307067 33132401 34087236
4773 34087236 35161696 36243399 37245167 38392325 39624061 41004005 42077873 43280278
4765 43280278 44381739 45532290 46882145 48265623 49710742 51304049 52959608 54780070
4757 54780070 56785059 59055465 61570770 64131505 66900457 69931588 73428567 77520309
4749 77520309 81966728 86813943 92016697 97482647 102993626 108358776 113791361 119520323
4741 119520323 125852678 133029276 141250458 150965069 162493928 174949613 186818608 196267429
4733 196267429 200729438 200022244 196531609 192708709 191421921 194016371 198473160 203333080
4725 203333080 208361892 213058647 217607818 220805567 221647484 219423403 214502464 208004235
4717 208004235 200238782 191931454 183858056 177033991 172654093 171114674 172434467 176278247
4709 176278247 182708428 192088823 204261029 218912908 235164653 251811116 266637376
4702 266637376 278302737 288561578 296968037 298682840 292395879 281423859 264551415
4695 264551415 240551667 213124138 186957607 164329927 145433527 129799917 117114518
4688 117114518 106674752 97874255 90617727 84475204 79279925 74834047 71004766 67584947
4680 67584947 64470119 61788395 59155833 56638897 54648148 52750279 51056564 49494097
4672 49494097 48077027 46846072 45602080 44393435 43368229 42340206 41337441 40389494
4664 40389494 39476562 38600560 37667554 36876081 36059892 35330000 34633274 34126380 33565915
4655 33565915 33078680 32740211 32477164 32158895 31963635 31865036 31686261 31513287 31348842 31227504
4645 31227504 31200125 30933129 30813413 30655737 30411348 30191016 29941802 29794457 29557779 29311354
4635 29311354 29155747 28997021 28766027 28452434 28368403 28316005 28231075 28171563 28201483 28272589
4625 28272589 28284462 28427938 28545278 28640049 28739941 28954801 29123396 29361054 29523274 29828054
4615 29828054 30206204 30450497 30905482 31383427 31771615 32371325 32880818 33340050 33979475
4606 33979475 34708751 35248243 35834256 36474626 37273922 37914538 38714569 39538101 40360054
4597 40360054 41118623 41957646 42812935 43734234 44831617 45823002 46858709 48069520 49265128
4588 49265128 50585810 52047417 53526144 55171306 56991683 58872432 60889319 63065547
4580 63065547 65437767 67941770 70651986 73519981 76471967 79502199 82728575 85960931
4572 85960931 89288788 92685944 95812244 98912898 101865208 104816860 107739686 110464266
4564 110464266 112985840 115388022 117640589 119997979 122319203 124592955 127006883 129499156
4556 129499156 132206930 135094668 138203901 141475227 145058691 148823408 152544822 156333301
4548 156333301 160291214 164261554 168154901 171807989 175281143 178553313 181582721 184219930
4540 184219930 186480882 188323839 189635788 190443431 190856270 190889383 190306180 189350439 188093494
4531 188093494 186700530 185044722 183357599 181688314 180212919 178977408 178032637 177342143
4523 177342143 176938752 176922112 177546956 178492119 179800977 181585657 183667551 186023139 188619418
4514 188619418 191173431 193648860 195863219 197533783 198659827 199026819 198717745 197697750
4506 197697750 196035582 193739945 190520656 186483715 181805187 176732190 171453023 166169967
4498 166169967 160975916 155922210 151044125 146487053 142228870 138325252 135144811 132346334
4490 132346334 129800710 127529067 125490209 123606707 121648192 119431085 116897867 114067271
4482 114067271 110826531 107205383 103301965 99130442 94616029 90206338 85679443 81020893
4474 81020893 76550527 72337572 68370338 64672161 61255044 58153290 55325112 52596572
4466 52596572 50148945 48015360 46006305 44151770 42412163 40901913 39527785 38254300
4458 38254300 37042876 35848219 34692163 33701683 32894177 32006564 31174128 30340997 29591239
4449 29591239 28950440 28309780 27608744 26990438 26410155 25837190 25238644 24691158 24128933
4440 24128933 23519604 22905383 22405002 22019966 21537938 21134771 20613133 20182508 19888381
4431 19888381 19628037 19307742 19008150 18715310 18372893 18076775 17796050 17496122 17225294
4422 17225294 17092650 17024104 16849480 16556040 16295342 16114352 15963093 15711688 15489970 15313192
4412 15313192 15245415 15075363 14909143 14741061 14656150 14475250 14246866 14080028 13919854 13702887
4402 13702887 13579406 13339844 13107650 12884481 12702093 12504897 12278831 12118099 12010609
4393 12010609 11988269 11886976 11796333 11729848 11645690 11676644 11619727 11593830 11590834 11550695 11435810
4382 11435810 11327311 11250591 11071350 10791955 10497996 10255008 10082370 9943351 9838882 9613725
4372 9613725 9435154 9417255 9309821 9079374 9027538 8869337 8808279 8821935 8730215 8678136 8531816
4361 8531816 8489646 8387159 8327988 8255874 8232143 8209331 8136503 8076748 8027314 7912823 7848574
4350 7848574 7835244 7769213 7623316 7577687 7583408 7522979 7474192 7389168 7270945 7280693 7350288
4339 7350288 7374270 7248092 7232767 7266697 7230160 7079301 6980068 7030596 7018061 7005988 6942786
4328 6942786 6832725 6911884 6929756 6947515 7080257 7145180 7120600 7080307 6956997 6899401 7079450
4317 7079450 7132608 7299833 7396698 7305002 7266620 7239945 7368286 7376610 7382152 7393464 7411271
4306 7411271 7476186 7569685 7554093 7609883 7738310 7879988 8007423 8092528 8097714 8090080 8173767
4295 8173767 8361033 8372981 8379125 8324846 8360253 8548511 8622325 8691091 8769830 8828441 8814121
4284 8814121 8831245 8849623 8935124 8956397 8921776 9016064 9099335 9185340 9256573 9298939 9330338
4273 9330338 9432761 9519691 9572066 9721079 9904681 10002740 10166418 10406481 10557192 10819703
4263 10819703 11040117 11354589 11530260 11715028 11917152 12145405 12196430 12378729 12678526 12681639
4253 12681639 12800920 12616259 12458259 12343155 12202828 12035365 11872509 11957901 11913349 11859020
4243 11859020 11858524 11851647 11879389 11881411 11916133 11966027 12153489 12267602 12334983 12511698 12718580
4232 12718580 12936425 13165462 13352179 13745419 14125585 14423948 14859987 15192532 15482049
4223 15482049 15870107 16366732 16681316 17146914 17554523 17843631 18028602 18284891 18258381 18146736
4213 18146736 17975585 17780389 17675887 17503232 17406668 17253237 17010009 16899311 16753596 16668189
4203 16668189 16619097 16564601 16645739 16786824 16831906 16980723 17197103 17330243 17478807 17674139
4193 17674139 17875293 18154422 18557839 18929482 19300193 19595517 20133873 20730785 21165616
4184 21165616 21638979 22142023 22519675 22851597 23282178 23471787 23719486 23893346 23998176
4175 23998176 24130771 24288265 24504593 24713610 24829086 25080794 25583920 26244963 27008291
4166 27008291 27909125 29030710 30287700 31751419 33045916 34206937 34934494 35009450 33978956
4157 33978956 31831106 29273959 26972340 24898811 23178149 21806141 20757376 19655033
4149 19655033 18772681 18024849 17472630 17009343 16555022 16123091 15723249 15363262 15070249
4140 15070249 14702268 14564758 14372575 14165803 13919363 13672294 13600842 13484263 13495671 13362789
4130 13362789 13255490 13201424 13137279 13012418 13014513 12959778 12880233 12858194 12815426 12867804 12911471
4119 12911471 12945217 12907522 12868911 13013427 13073226 13101595 13129255 13210346 13157376 13236768 13389131
4108 13389131 13456623 13526242 13604072 13663516 13775484 13837971 13901740 14076858 14047185 14162680 14297811
4097 14297811 14361637 14477865 14589879 14832132 14810814 14959012 15169205 15276382 15396938 15593620
4087 15593620 15785160 15998241 16226597 16425410 16611957 16710799 16897103 17107348 17312383 17462965
4077 17462965 17736050 17863650 18125473 18421503 18634135 18872908 19081574 19355940 19578438
4068 19578438 19889988 20077167 20397100 20656611 21043266 21427356 21741763 22116764 22539700
4059 22539700 22898311 23367337 23812077 24251118 24810649 25384397 25974185 26508094 27268108
4050 27268108 27885611 28555074 29424409 30221282 31013826 32010979 32877228 33850348 34796715
4041 34796715 35872140 37096934 38326374 39657317 41016591 42518723 44088407 45662181
4033 45662181 47505477 49300128 51182145 53276956 55432888 57740596 60180489 62651482
4025 62651482 65304189 68299159 71294324 74587523 78182005 81867358 85625125 89428750
4017 89428750 93013285 96124026 98652548 100497849 101870462 103088747 104310184 105737355
4009 105737355 107409260 109273058 111167068 113206007 115257986 117453253 119611691 121695935
4001 121695935 123849824 125976625 127868728 129669702 131495804 133062391 134447025 135684446
3993 135684446 136851853 137903019 138889290 139747496 140573498 141194287 141506092 141802203 141986590
3984 141986590 142085831 141952791 141577359 140982825 140236258 139563209 138525883 137376128 136275918
3975 136275918 135067447 133676852 132350400 130988652 129425735 127793658 126083593 124273463
3967 124273463 122401539 120329483 118286671 116249250 114169395 111971069 109643218 107538699
3959 107538699 105417846 103154281 100976811 98797421 96640368 94485759 92339937 90141670
3951 90141670 87921564 85724510 83564432 81504566 79443433 77434538 75367166 73385846
3943 73385846 71464643 69548429 67683491 65929321 64164863 62466465 60802905 59189823
3935 59189823 57758286 56223366 54729491 53347842 52109704 50758490 49389677 48230283
3927 48230283 46987810 45922493 44889815 43827381 42885581 42122922 41222473 40312213 39628452
3918 39628452 38876494 38291992 37729739 37164329 36662779 36209519 35728481 35323159 35122188
3909 35122188 34756278 34452395 34165734 33937157 33697678 33623075 33553169 33453923 33377748 33391006
3899 33391006 33445835 33539915 33695619 33834426 33997701 34154018 34346669 34582130 34890246 35354417
3889 35354417 35748234 36176216 36726133 37407636 37991443 38666762 39375655 40081171 40782235
3880 40782235 41615775 42522859 43305380 44105245 44918795 45847127 46634869 47476849 48360414
3871 48360414 49395435 50386033 51423143 52539863 53761941 55013844 56302664 57548071
3863 57548071 58848136 60066962 61279374 62516116 63677716 64829454 66057905 67223655
3855 67223655 68397778 69607939 70939120 72364216 73979402 75684857 77506828 79477876
3847 79477876 81457876 83626824 86002840 88489088 91067790 93935705 96768864 99858017
3839 99858017 103247336 106876316 110686199 114572034 118594475 122591268 126588670 130487726
3831 130487726 134177118 137904024 141585714 145418760 149401553 153361664 157504056 161870450
3823 161870450 166535129 171417369 176554855 182065839 188067773 194391418 200931770 207477537
3815 207477537 213667406 219401893 224376987 228267767 231194922 233604952 235555128 237420421
3807 237420421 239674301 242037559 244430718 246656678 248833744 250502652 251714429 252495210
3799 252495210 252771448 252473564 251733876 250534204 248581545 246272461 243338080 240027215
3791 240027215 236411080 232383449 228428939 224447198 220199202 215495458 210411827 204712249
3783 204712249 198407439 191731630 184956889 178310311 172122850 166613425 161455721 156780729
3775 156780729 152405732 148305353 144469970 140786502 137148744 133408110 129795241 126341342
3767 126341342 122785257 119227234 115682020 111836506 107905151 103989875 100083935 96303837
3759 96303837 92757108 89642723 86732119 84050222 81408082 78916545 76619216 74518924
3751 74518924 72525010 70681952 68933874 67350503 66065094 64996445 63926540 63028447
3743 63028447 62194453 61499740 60872207 60232127 59548013 59013227 58359797 57596863 56926135
3734 56926135 56056756 55197812 54424456 53624908 52949961 52410592 51824512 51430696 50984998
3725 50984998 50597430 50326864 49981430 49832044 49660407 49573873 49316809 49038777 48902276 48822938
3715 48822938 48684887 48539124 48395696 48231063 48152304 48020691 47945412 47885045 47892431 47978830
3705 47978830 48084458 48205403 48313963 48380154 48469110 48661292 48814334 48865700 49061698 49405439
3695 49405439 49624399 49784982 50008583 50244599 50715961 51194028 51599957 52098092 52652246
3686 52652246 53190319 53886386 54587959 55502383 56280616 57168503 58097068 59110801 60183687
3677 60183687 61208420 62215908 63356110 64491755 65728659 66944661 68187213 69554303
3669 69554303 70704855 71925454 73294202 74557523 75700958 76903561 78208602 79459229
3661 79459229 80672924 81829534 82992165 83967384 84930025 85928633 86721648 87421468 88129394
3652 88129394 88855376 89556605 90250145 90964433 91647388 92310453 92952877 93593810 94196598
3643 94196598 94794579 95481257 96090729 96729892 97330999 97935208 98632895 99475829 100387764
3634 100387764 101305475 102259998 103425766 104579007 105963206 107480459 109132684 110885718
3626 110885718 112674196 114723180 116998323 119423620 122079815 124794195 127626560 130653029
3618 130653029 133885156 137247276 140694536 144241650 147905463 151580515 155352783 159103936
3610 159103936 162726923 166504306 170313236 174098150 177815694 181613650 185146663 188581168
3602 188581168 191815535 194802752 197629836 200267343 202701729 204988453 207212699 209174794
3594 209174794 211073671 212947388 214607769 216326605 217925696 219395012 220870936 222426760
3586 222426760 223940685 225328726 226927995 228503765 230350639 232195062 234206695 236227819
3578 236227819 238358800 240619805 243149034 245688426 248226256 250907498 253699401 256514903
3570 256514903 259373751 262279069 265223041 268178165 271043242 273773964 276452764 279023116
3562 279023116 281429285 283534342 285451973 287127979 288601000 289880945 291045862 292034007
3554 292034007 292917599 293736371 294330508 294865506 295260926 295731712 296024560 296356434 296700987
3545 296700987 297148818 297630468 298310284 299187779 300280492 301784076 303603122 305683385 308120734
3536 308120734 310791527 313782306 317033871 320279232 323513383 326773368 330077732 333174116
3528 333174116 335899229 338366001 340318222 341634785 342390642 342552111 341833766 340550526
3520 340550526 338700423 336502334 334097924 331390670 328464807 325528679 322251762 318914294
3512 318914294 315413331 311490423 307394763 303179122 298597169 293735406 288811706 283887375
3504 283887375 279109746 274618801 270377002 266277893 262181108 257829278 253163280 248246292
3496 248246292 242993833 237544606 232064691 226346427 220703041 215218524 209908016 204853178
3488 204853178 199695377 194476916 189136241 183488315 177551824 171060051 164225569 157035113
3480 157035113 149764966 142559669 135471905 128724776 122427558 116608507 111302213 106417930
3472 106417930 102130438 98197844 94496355 91173077 88085199 85149741 82380506 79869293
3464 79869293 77526498 75348567 73403406 71436402 69660303 67877279 66157204 64646821
3456 64646821 63220023 61777628 60458140 59133103 57988078 56911162 55826969 54756257
3448 54756257 53731817 52867604 51994813 51158981 50397921 49705901 49034182 48395045 47728871
3439 47728871 47050016 46460112 45971661 45363850 44826375 44390289 44008351 43614269 43301542
3430 43301542 42793610 42530397 42249751 41846682 41461223 41235851 40961085 40676033 40577471 40507831
3420 40507831 40318008 39986984 39861097 39681388 39714262 39882144 39873894 39838874 39868299 39887088
3410 39887088 39848904 39565748 39490527 39419123 39377282 39320830 39251691 39142278 39087486 39132898 39045725
3399 39045725 39058402 39003203 38970968 38946007 38964200 39030531 39006598 38937431 38851447 38791673 38725619
3388 38725619 38739023 38707638 38731608 38769409 38621753 38667854 38530740 38324363 38172792 37978886
3378 37978886 37763231 37597885 37451251 37318516 37275095 37287236 37194604 37154916 37172382 37087359
3368 37087359 37045109 36973361 37063817 37004115 36955011 36958169 36943718 36937865 36917951 36902045 36870589 36906761
3356 36906761 36804677 36739727 36673065 36663990 36627718 36596533 36683990 36706963 36659806 36489761 36444968
3345 36444968 36497835 36332011 36272736 36339128 36349889 36241119 36176985 36236273 36323488 36448225 36599400
3334 36599400 36805082 37001110 37240370 37529188 37756601 38074115 38467730 38787239 39043650
3325 39043650 39252742 39724598 40196298 40615922 41053358 41497455 41975482 42584457 43075138
3316 43075138 43574845 44155943 44788594 45415091 45863304 46452142 47147411 47687757 48287300
3307 48287300 48985008 49715441 50597478 51317762 52137438 53040998 53954674 55037803 56130538
3298 56130538 57233254 58413250 59643279 60971649 62429486 63895616 65437258 67167310
3290 67167310 68913408 70556640 72256652 73885961 75826718 77960203 80304277 82856433
3282 82856433 85478035 88226315 91231356 94552411 97888847 101297031 104883223 108575112
3274 108575112 112149959 115693140 119070680 122357424 124978982 126668433 127464431 127072524
3266 127072524 125468967 122855567 119128570 114849942 110276239 105592244 101259425 97059143
3258 97059143 93128927 89457004 85901045 82600076 79578600 76784940 74339857 71973801
3250 71973801 69844087 67816109 65895345 64171165 62569519 61156577 59762132 58350252
3242 58350252 57186287 56122477 54977923 54009161 53015785 52175090 51320136 50675401 49926898
3233 49926898 49273754 48634204 47987509 47294879 46803024 46285870 45894981 45572594 45160172
3224 45160172 44804931 44345858 43926618 43668390 43422736 43115205 42705586 42297846 42066517
3215 42066517 41619377 41080271 40570059 39992491 39300359 38581800 37887025 37097399 36237192
3206 36237192 35455679 34537023 33690933 32801891 31952313 31190520 30395678 29502387 28806300
3197 28806300 28177704 27519405 26769691 26098846 25538611 25040495 24570663 24100453 23524170
3188 23524170 23174450 22814736 22394064 22026999 21694730 21332490 21111642 20729003 20399567
3179 20399567 20153483 19989891 19726918 19566146 19284968 19049685 18818642 18618857 18453481
3170 18453481 18287605 18054403 17783585 17542703 17365969 17263990 17113420 16930969 16754248
3161 16754248 16610336 16483174 16369974 16174316 16105176 15920233 15812187 15699674 15578959 15388032
3151 15388032 15231138 15070998 14967839 14918805 14935978 14841866 14752421 14612498 14499189 14309094
3141 14309094 14248019 14154303 13983865 13861178 13762417 13592918 13577601 13520903 13437619 13436454 13394829
3130 13394829 13156860 13061794 12953698 12880663 12792943 12772432 12729512 12733713 12675138 12650892 12568728
3119 12568728 12461747 12393177 12327726 12325991 12258819 12106893 12095762 12200423 12123098 11975847 11944217
3108 11944217 11884619 11801275 11813519 11723419 11731988 11674778 11678475 11602666 11513025 11504597 11397542 11324194
3096 11324194 11219714 11158810 11217674 11187432 11154935 11065008 11063927 11035497 10977772 10920215 10944868
3085 10944868 10932435 10876689 10910798 10986197 10889762 10813815 10697453 10704101 10697775 10608599 10492273
3074 10492273 10497903 10526008 10600329 10589997 10532707 10407731 10306694 10362744 10408725 10431983 10419823
3063 10419823 10392673 10383065 10375527 10347016 10387374 10461325 10446533 10498293 10567306 10627726 10662892 10627511
3051 10627511 10776620 10860607 10800058 10759388 10824948 10951654 11004151 11004926 11062929 11106759 11111988
3040 11111988 11182267 11286604 11354962 11476502 11514824 11540014 11619963 11684461 11790425 11923714
3030 11923714 11950834 11917528 12123541 12333112 12500220 12555601 12604549 12799037 13008696 13309201
3020 13309201 13457870 13664343 13947245 14142333 14249089 14416442 14453366 14556171 14666168 14807860
3010 14807860 14764392 14885340 15113039 15237537 15234018 15343027 15488895 15607241 15742970 15925719
3000 15925719 15984737 16072914 16146740 16207674 16346822 16478997 16596676 16660758 16847080 16946562
2990 16946562 17229734 17328407 17509493 17724863 17937043 18160419 18440917 18743552 19008373 19326497
2980 19326497 19428749 19535043 19726932 19914146 20135601 20398281 20596586 20932538 21314287
2971 21314287 21595771 21952331 22278547 22679857 23127417 23593837 24034189 24544476 24966891
2962 24966891 25513678 25910174 26338036 26814291 27296977 27593045 27820976 28198430 28605199
2953 28605199 28854711 29068440 29345378 29551691 29733700 30032279 30368107 30623950 31037894
2944 31037894 31534581 32075600 32605027 33054914 33801709 34523278 35322521 36110621 37012765
2935 37012765 37928442 38824817 39747307 40471383 41269740 41806500 42178833 42363314 42323018 41927524
2925 41927524 41161022 40324594 39499101 38571293 37796017 37044037 36518598 36206598 36029872
2916 36029872 35863078 35843138 35826940 35804248 35861583 36045784 36090967 36148993 36249795 36398760
2906 36398760 36548996 36558830 36445772 36336728 36086789 35925366 35522697 35036577 34462706 33788862
2896 33788862 33070037 32357906 31571113 30739473 30072342 29312223 28721543 28065704 27467160
2887 27467160 26914282 26428730 25987205 25539237 25024678 24513492 24064890 23648442 23140999
2878 23140999 22550603 21902110 21316865 20696808 20063583 19444331 18904269 18374877 17905331
2869 17905331 17342290 16918337 16531632 16172952 15809792 15358288 15004256 14716145 14432500
2860 14432500 14117718 13895072 13667070 13505841 13171717 12949481 12690825 12416629 12187802
2851 12187802 11998296 11850656 11538204 11403648 11237578 10999570 10746852 10612766 10405740
2842 10405740 10179279 9944086 9834721 9772472 9611769 9396125 9320480 9212198 9013174 8758246
2832 8758246 8612378 8544795 8395103 8177691 8039405 7994612 7855969 7746190 7673505 7460376
2822 7460376 7308691 7141313 6967465 6945919 6832071 6749113 6582952 6565583 6530690 6477002
2812 6477002 6417534 6303384 6170537 6105382 6063973 5852637 5683623 5596691 5546156 5550614 5297461
2801 5297461 5231264 5246275 5089524 5023749 4887356 4902656 4803867 4650888 4676800 4664728 4595136
2790 4595136 4472062 4454410 4390387 4268736 4295493 4204167 4038580 3958652 3865415 3799186 3788414
2779 3788414 3786345 3700134 3649505 3545025 3570304 3504498 3458884 3395863 3264811 3188672 3241640
2768 3241640 3121976 3071642 3081324 3030162 2936451 2864378 2856568 2914195 2899465 2720302 2600944
2757 2600944 2576897 2595037 2643748 2645617 2587333 2514130 2338130 2353414 2310902 2252258 2285519
2746 2285519 2254515 2244009 2244014 2170408 2197505 2148252 2080705 2065701 2048018 2065495 2030982 1971836
2734 1971836 2012806 1928614 1868303 1913278 1859692 1859916 1864201 1815400 1789281 1807723 1808403 1743947
2722 1743947 1805952 1736530 1767479 1772977 1719554 1654934 1655020 1661037 1609077 1549759 1548952 1655151 1666301
2709 1666301 1645435 1572030 1562586 1613483 1573942 1555775 1597102 1580056 1601225 1624710 1630560 1627597
2697 1627597 1501157 1570496 1660413 1634171 1538003 1531450 1564772 1608985 1532935 1510464 1512653 1511386
2685 1511386 1570365 1531749 1514048 1550622 1496836 1462330 1562602 1530189 1503538 1504087 1398090
2674 1398090 1442453 1472069 1469746 1418042 1515947 1603784 1494627 1458126 1417075 1474994 1406008
2663 1406008 1515798 1563798 1568665 1532870 1468073 1517602 1595515 1533625 1418877 1604290 1675815
2652 1675815 1631527 1537084 1471575 1527517 1553713 1584707 1481479 1614568 1611712 1580480 1588156
2641 1588156 1496654 1569939 1531873 1562308 1578606 1510689 1572974 1551860 1488128 1452904 1420259
2630 1420259 1424732 1366853 1398582 1473235 1437306 1429269 1270544 1312179 1347266 1329903 1251417 1168661
2618 1168661 1246824 1365621 1249227 1181991 1351870 1402946 1343749 1329053 1430862 1377186 1348655
2607 1348655 1265207 1195973 1224823 1191743 1179499 1162522 1082814 1105937 1156809 1150656 1148717 1097837
2595 1097837 1071018 1049012 1030665 950730 1005865 950828 1000881 928747 884094 800154 671874
2584 671874 569642 648342 736743 648324 656865 644975 667086 636663 599986 555420 603990 582312
2572 582312 586929 607826 661470 585387 537248 561636 531245 426364 472763 473722 450969 390384
2560 390384 385338 366405 346795 293921 325179 376903 354232 323790 324858 329373 362561 298408
2548 298408 248911 214286 225640 276254 139077 72244 208900 309385 187816 160465 216066
2537 216066 141337 64119 -27305 -3012 97984 124938 161454 120022 80261 104580 156524
2526 156524 154444 96578 87398 206165 197970 156317 220483 221462 295779 250465 231716 194481
2514 194481 183094 82841 102999 212667 129302 156559 140377 118538 91635 184301 225221
2503 225221 68358 75897 119991 152833 128913 90449 75916 36716 97027 105071 78532 75500
2491 75500 19037 16175 61814 114035 87675 13285 -877 -10165 35583 45769 35281 5898
2479 5898 15552 18464 49446 -6452 13458 64002 -13542 11382 10962 36940 47900 -23273 -45291
2466 -45291 -96033 -99058 -74929 -91401 -26418 -980 -7061 2633 35551 21203 42378 -57312
2454 -57312 -154160 -150253 -152128 -105001 -113136 -91229 -79702 17568 -101567 -123660 -154785 -72669
2442 -72669 32232 75793 42857 -87832 -144398 -161009 -156028 -137296 -97509 -52799 -135008 -102107
2430 -102107 -62025 -75560 -41873 -58256 -115934 -157902 -175882 -168112 -92389 -80936 -117500 -55037
2418 -55037 -57006 -74717 -22111 -47449 -132192 -132453 -70531 -117758 -114480 -101593 -98835 -125330 -52845
2405 -52845 89821 7911 -24165 12026 -2608 -2174 -36000 -144416 -147102 -149031 -138915 -87062
2393 -87062 -88627 838 -8835 -53712 -149089 -80428 -127959 -187788 -149826 -118089 -151592 -106986
2381 -106986 -140821 -142016 -132107 -98496 -160534 -148032 -127461 -138845 -138714 -166533 -181615 -120981
2369 -120981 -114447 -111296 -153647 -181663 -63705 -16437 -127100 -210466 -191369 -116238 -5714
2358 -5714 -62770 -153733 -246784 -189767 -266588 -225609 -230744 -177927 -109560 -79470 -101762 -150662
2346 -150662 -144620 -179300 -149072 -167358 -155403 -141983 -164527 -35424 -60621 -96409 -104066 -173426
2334 -173426 -94904 -49574 -172754 -140680 -117547 -131421 -138408 -130970 -189720 -135259 -60925 -47694
2322 -47694 -76148 -70742 -50640 -127359 -116840 -205610 -192736 -86633 -68321 -48805 -46959 -111870
2310 -111870 -191670 -202053 -88189 -128732 -76726 -106187 -107843 -181202 -91839 -30187 -10773 -43462
2298 -43462 -87082 -202824 -138971 -107151 -114287 -83276 -57183 -13172 -133326 -178428 -111170 663
2286 663 -36743 -10143 -60284 -159101 -117402 -55700 -118888 -107638 -161669 -167410 -77712 -31209
2274 -31209 20990 72989 28745 -49293 -48719 -124169 -148558 -175400 -169219 -106134 -69551 -28128
2262 -28128 -34071 -73982 -51863 -62498 -107103 -16232 -49772 42427 80586 106076 130933 107564
2250 107564 35669 62854 50528 -57345 -61217 21262 10532 -50672 -21825 20622 -24785 62234
2238 62234 12145 19441 67644 118557 123966 135286 144412 46704 127397 117143 35860 67519
2226 67519 87711 80677 109553 62542 34603 50284 148499 170766 203104 109845 145248 203484
2214 203484 181643 154622 42682 118892 140909 145017 188672 198010 374596 429732 373361 315978
2202 315978 353299 353035 315651 295070 365776 389783 494255 433752 338482 422748 426833 529660
2190 529660 440517 385839 413397 432587 394469 481441 601916 576037 633055 683097 620908
2179 620908 599422 612361 645919 823588 845988 885944 893430 940763 905060 889830 964997 969076
2167 969076 1018683 1101485 1127546 1173456 1238860 1270372 1456195 1527473 1536624 1665746 1883791
2156 1883791 2014838 2192086 2282368 2338742 2538042 2764389 2971600 3248145 3574708 3873097
2146 3873097 4237125 4580468 5046903 5488183 6184259 6863601 7427999 8053750 8661253 9521682
2136 9521682 10702823 12395258 14383542 16339587 18105505 19007543 19032262 18758523 16530826
2127 16530826 13387973 10892702 8969112 7432686 6209471 5384465 4607564 4122917 3663403
2118 3663403 3396011 3159079 2812267 2622283 2499441 2322866 2115923 1946208 1779919 1690890
2108 1690890 1524712 1319898 1243808 1252177 1121599 1066608 992209 958989 909876 915397 875549
2097 875549 768258 717025 660971 654547 594468 673635 697711 557871 561773 550274 512420 510673
2085 510673 458558 492929 438168 408079 470100 520379 417653 362964 276708 277974 407512
2074 407512 404505 368353 245418 219874 251908 292388 311534 258621 110702 74101 253221
2063 253221 198573 166346 70363 49722 99283 129900 60149 81629 62380 76379 23302 -53998
2051 -53998 -99147 -32685 -36589 -34613 2595 1182 -36016 -74027 -69957 -70264 -129060 -185211 -17710
2038 -17710 3999 -56986 -8159 123159 113189 26578 92667 5372 -136777 -128675 -104248 -61843
2026 -61843 -8881 23509 -10916 -13747 -55335 -23156 49903 35041 32915 -53991 -67665 -37749
2014 -37749 -71661 -59061 1101 -118601 -124130 -76967 -208237 -169508 -164481 -105742 -198019 -194955
2002 -194955 -192580 -182758 -83067 5164 15787 -96620 -92394 -61761 -19420 1522 -141558 -111681
1990 -111681 -36639 -148438 -233120 -137940 -206538 -141428 -149003 -275397 -236482 -124984 -116137
1979 -116137 -167441 -117899 -136764 -164434 -106581 -165505 -121881 -139208 -193093 -166909 -190918 -121722
1967 -121722 -106077 -118004 -91386 -165656 -64641 -74451 -106752 -204505 -185688 -138418 -139555 -157270
1955 -157270 -148577 -44909 -135512 -157881 -164821 -124880 -104874 -101870 -106400 -130107 -108162 -140312
1943 -140312 -87639 -57585 -178895 -150466 -216133 -155599 -201761 -173438 -169564 -238195 -130531
1932 -130531 -164693 -175261 -158027 -119091 -56299 -128255 -157277 -152817 -37278 -66669 -160690 -190640
1920 -190640 -142116 -233311 -176583 -121720 -121719 -147050 -139737 -111262 -208606 -198346 -157540 -168977 -197745
1907 -197745 -205034 -153321 -168597 -198558 -228812 -217817 -224474 -209571 -188731 -196263 -214158 -178003
1895 -178003 -139735 -200360 -184745 -152705 -80576 -105524 -103059 -58622 -165310 -168737 -83697 -47167
1883 -47167 36287 42453 -93208 -71119 -63943 -220446 -106947 -132221 -125400 -180753 -204973 -120190
1871 -120190 -127543 -209622 -246115 -186617 -157262 -124440 -20935 -45944 -131435 -101266 -3903 -50138
1859 -50138 -42396 -32702 -52554 -93738 -187917 -187209 -167317 -190808 -168574 -166674 -199585 -177547 -230819
1846 -230819 -185986 -144819 -107706 -161268 -140787 -167808 -165863 -132362 -62192 -113604 -262727 -209845
1834 -209845 -105031 -79137 3460 -52077 -150980 -221639 -122596 -71862 -179959 -256136 -207925
1823 -207925 -93999 -96810 -145181 -183194 -186915 -182038 -260353 -232864 -162800 -71720 -94727 -216762
1811 -216762 -218732 -217342 -178454 -157408 -80697 -113379 -108616 -163410 -210400 -193959 -191284 -173637
1799 -173637 -141614 -168004 -159608 -148008 -164948 -149687 -152090 -175838 -153452 -185006 -193083 -218398
1787 -218398 -229459 -205148 -142870 -106878 -216294 -294948 -286603 -305302 -221151 -211778 -212044 -122990
1775 -122990 -68193 -137522 -90377 -105344 -138280 -139832 -101171 -3524 87863 -33228 -101475 -135036
1763 -135036 -83521 -92327 -236001 -158221 -148659 -55686 -68810 -152572 -167913 -194510 -196702 -180828
1751 -180828 -122614 -166536 -224508 -146054 -100162 -147149 -193145 -122755 -75050 -108825 -89888 -1641
1739 -1641 -61770 -94609 -78532 -77906 -156097 -111066 -102249 -85078 -196807 -239842 -170938 -191345
1727 -191345 -127563 -108542 -143522 -157506 -169345 -170138 -125753 -53838 1121 -29172 -119877 -210775
1715 -210775 -128787 -114697 -225579 -170661 -117971 -76753 -92729 -132392 -140892 -208665 -227801 -130467
1703 -130467 -93612 -184625 -199150 -205367 -173154 -135442 -105494 -9830 -113132 -150837 -142744 -82363
1691 -82363 -84263 -228104 -224938 -175526 -221491 -175504 -116893 -115865 -141369 -156225 -124119 -82267
1679 -82267 8880 -43493 -170556 -221058 -102311 110 8649 -53490 -87201 -83971 -29006 -43694
1667 -43694 -146774 -170382 -220757 -165004 -94062 -114717 -83011 -41761 -63784 -82166 -155627 -40105
1655 -40105 14522 14344 20240 -72048 -2731 -129950 -140785 -113657 -205855 -184072 -130000 -171035
1643 -171035 -95690 -120967 -169922 -133336 -191863 -138673 -114488 -101353 -51386 -68321 -122567 -178262
1631 -178262 -235135 -182186 -208202 -141213 -69423 -133711 -127170 -97917 -12952 -73055 -90101 -29595
1619 -29595 -32120 -160455 -161518 -137993 -152529 -166746 -159779 -52435 -133215 -190799 -167350 -76720
1607 -76720 -98996 -140696 -134506 -85290 -121305 -137402 -19647 -73067 -127238 -109747 -112688 -138717
1595 -138717 -174534 -162785 -103772 -115727 -121692 -164721 -26575 48739 -105690 -107929 -84412 -67546
1583 -67546 -7642 -14074 -56929 -104428 -93772 -106792 -21934 -20119 -109047 -66218 -111690 -98818
1571 -98818 -80842 -32277 -49678 -97027 -35590 -5573 -82637 -134070 -127266 -136149 -116009 -148835
1559 -148835 -125484 -88793 -84494 -63806 5794 42156 -29697 -129387 -84432 -10895 -60717 -103543
1547 -103543 -143669 -85584 24806 73767 -2002 14915 -15760 21101 89865 28256 50257
1536 50257 -58296 -123271 -148030 -66845 -9151 4661 7988 -5666 -48796 -95734 -51898 -56567
1524 -56567 -62450 -33510 -111703 -126991 -94483 -115887 -68405 -167288 -159627 -140987 -99575 -71080
1512 -71080 -85263 -208468 -173715 -150478 -114270 -35325 -4557 49206 -86058 -162597 -206507
1501 -206507 -111922 -49514 -61734 -59600 -65072 -99612 -46460 -10731 40639 2257 -56566 -26807
1489 -26807 12415 -33161 -81741 -110716 -164838 -115656 -144211 -176445 -184797 -76607 -78159 -171659
1477 -171659 -177770 -158816 -92362 -76020 -127221 -200357 -123912 -71066 -81196 -144965 -213446 -121393
1465 -121393 -165280 -202264 -167610 -67570 -16438 -40151 -25257 -85240 -30294 17064 -71881
1454 -71881 8835 21872 -42449 -66095 -2699 2762 44192 57583 69191 -52258 -135485 -149565
1442 -149565 -194160 -201342 -163569 -156166 -89221 -78037 -77833 -8529 -40819 -188 -58277 -43009
1430 -43009 -105126 8256 -36407 -45138 -74443 -77164 -46746 23881 16633 -88988 -57270 -117502
1418 -117502 -59981 39251 -46407 28642 50161 -70254 -132694 -104239 -47560 43069 33820 -61677
1406 -61677 -98170 -37116 -8284 25086 8300 1418 -11555 -64488 -43160 1822 -79103 5819
1394 5819 155895 -17028 -18855 -10349 -84977 -94857 -92553 -183424 -190388 -116326 -170995 -131903 54
1381 54 -61875 -26023 -7256 -6126 15355 -62318 -17037 -17125 -58336 -56104 -65338 16403 -56002 -106675
1367 -106675 -144633 -121203 -24875 -17126 -40022 104121 2084 -58022 -73922 34121 192574
1356 192574 38042 -45070 -25580 -56351 -47575 -97045 -90215 -71829 -156464 -131269 -32336 -4066
1344 -4066 -10797 21055 -1469 39299 -371 5810 -16460 -14062 -35302 -20670 5883 23665 50598
1331 50598 9839 13388 5717 45191 -49761 -65678 45285 39745 -31999 23826 -16683 -22170
1319 -22170 93190 67008 -50379 -91156 -29597 -50685 -29919 42276 10028 -40217 -58609
1308 -58609 -113766 -92536 -10738 47725 73352 115815 -46519 -146231 -10452 4474 26148
1297 26148 -32472 -57331 -57531 -6155 -39314 11928 26455 -79187 12301 33145 -27024 24874
1285 24874 -66330 -79767 -42531 -79656 -19757 20409 91850 43586 1719 -7873 -56371 -136944
1273 -136944 -82916 -37165 -63757 25860 -26087 -86639 -25531 -60366 -39568 -52902 -27426 -63241
1261 -63241 -16764 -49703 -35908 -78656 -11010 20486 51805 -3994 6558 -58865 -68943 -13522
1249 -13522 -22251 95345 53896 -105160 -120859 -37770 8896 28544 69441 92450 44258 -8371
1237 -8371 -74277 -3050 29113 2614 -78051 -137711 -48050 -62229 -99209 -53183 -87176 -141587
1225 -141587 -96683 -40868 -39588 -78487 -29596 -20576 -47765 26906 -36504 -64511 -100033 -10076
1213 -10076 55407 -52828 18734 2585 -134698 -72005 39293 31689 -78994 -1661 62941
1202 62941 76479 59215 -21578 -117863 -158855 -47298 44056 -42552 26177 37263 -25172 -13058
1190 -13058 5152 16154 126252 165566 145221 79954 -46858 -92951 26839 41915 7212
1179 7212 13362 -42359 21196 36291 -29602 -10666 54589 60627 -27782 -53006 8209 -24245
1167 -24245 -149896 -80595 -46082 -34724 -48360 -66463 -12817 -100369 -97523 -30325 -79162 -97359
1155 -97359 -69958 25948 7878 -58046 -73089 -52690 -25699 -26892 -49627 -12074 22358 -21888
1143 -21888 23293 -17700 -66602 -29470 -53402 50070 79698 72724 127578 145293 28675 18778
1131 18778 169274 162229 45980 -9316 42310 17125 -45891 -27233 10682 54394 49347 -89672
1119 -89672 -11497 42773 43255 -14751 -101641 -46887 38385 30118 6254 32433 13274 33495
1107 33495 151550 159838 137622 62483 -36676 -115815 -134755 -56601 63606 -24071 49635 -16117
1095 -16117 -9490 46046 8008 16805 23796 55670 53816 48184 -21906 72844 87509 116362 78539
1082 78539 -114899 -69366 19659 57842 24757 -24143 167194 29619 -60167 55048 63040
1071 63040 143322 175110 72807 51460 -90432 -115212 19344 126238 71153 -15935 22921
1060 22921 12652 133021 137123 33937 46525 10000 20860 69839 36642 6893 -62455 -2354
1048 -2354 9094 62505 -28110 42127 93541 68950 16722 107128 201673 160790 59659 21032
1036 21032 13298 32273 -28148 -31816 21577 17857 -84002 -66566 63918 -45946 -28448 48361
1024 48361 56255 -68988 -11501 -53637 -32043 131543 96736 25268 30741 -6151 -112832 -60885
1012 -60885 36954 39890 3594 27698 26598 -22388 -5242 6957 -9884 -5445 21170 -32657
1000 -32657 57353 89274 -11400 -61161 16778 83773 57946 79643 81863 65013 68347 53823
988 53823 56989 84334 87363 37734 57369 -45722 16301 18539 67734 54938 -50372 21290
976 21290 80556 18033 37174 2409 15280 -49839 -129172 -56578 -6475 16964 63521 2277
964 2277 -80818 -54251 -12383 -87364 -117223 77262 83286 11650 -34045 34544 37333 60516
952 60516 74015 119732 54684 -4054 -40837 -9155 106059 44244 35072 -95717 -28384 -23048
940 -23048 24189 88836 19788 155 -34358 -61561 -85958 22179 45707 -372 34477 94170
928 94170 48991 7204 14063 13256 57130 25602 64234 104840 74920 13655 83336 56371 -4152
915 -4152 -25837 -28069 -23749 -35757 39907 64463 10049 -14249 -50768 -46989 -43202 -56445 -13619
902 -13619 2664 -20396 -48591 9700 79209 68628 49004 43720 -88915 11354 95147 119100
890 119100 112862 109533 85622 129993 99050 73558 14735 -87412 -48327 46172 84553 25192
878 25192 -3045 41591 51147 153195 179701 168359 164484 88124 16205 65051 21987 210797
866 210797 215775 130277 129215 130906 148789 143796 -40257 -47761 7922 71094 23494 104267 166367
853 166367 33042 86144 17898 -8768 -1739 17501 34831 136858 138679 149091 128644 87821
841 87821 77795 94445 113978 58370 103751 75959 54244 93279 127400 101114 -26999 -51008
829 -51008 -34107 76633 22339 103551 159613 62664 -28313 10209 80979 87768 108277 71399
817 71399 57805 -44894 75142 -18068 -32072 2927 11526 -90010 -145472 -35758 -45043 39658
805 39658 -44917 8619 -12933 -76754 -134294 -32633 -23744 23616 -15797 -14434 -26299 74749
793 74749 107998 166461 76577 1656 18311 3310 32414 129984 124913 82821 86978 164550
781 164550 70339 76045 69964 144524 100819 73349 94400 106227 143293 62621 74377 56795
769 56795 71274 126806 113499 149760 91892 81346 69036 42218 106025 100631 99874 108133 92890
756 92890 4573 113331 67357 138953 92526 84543 46874 79191 13763 46998 89101 97797
744 97797 83172 -28133 -65516 662 17880 106476 49098 39038 95156 108254 71306 54218
732 54218 -46436 17568 139039 172951 113193 141874 47370 -29639 89887 48814 59400
721 59400 128723 60453 75884 35781 9946 -16124 -110062 55590 92038 97990 131004 203933
709 203933 205727 139636 148679 152571 69238 49565 64490 86610 58169 93842 21377 36189
697 36189 108187 35565 63947 110342 105518 28199 71565 111011 96654 54968 47836 86596
685 86596 84595 48233 47020 174488 22207 -40622 -20560 43902 154774 45033 20543 104920
673 104920 69057 45110 151366 68306 76127 102671 97001 130433 70758 47180 40531 30234
661 30234 2941 59800 10264 -26291 -8598 97518 79813 103929 63792 77789 130665 73245
649 73245 80689 48426 31627 3098 32376 126428 69673 114886 173147 75558 42822 -43184
637 -43184 -11533 97545 148216 150504 60835 24346 31206 27828 81322 168365 223755 154697
625 154697 72860 19624 66179 68779 128076 70914 90552 36605 -140223 -68196 -38378 -27029
613 -27029 70174 144230 137581 70890 -67910 -29910 29383 97242 104571 93865 15048 -22492
601 -22492 -8578 52053 53400 22937 15340 57362 101419 42062 49219 53350 19286 11063 81758
588 81758 27343 7305 82325 25153 -48913 -29419 -87353 -102416 -102408 -19540 39988 43642 12595
575 12595 -43281 -8461 107855 40147 121952 154925 20542 73668 156736 141628 54661 -28942
563 -28942 3645 -34589 66421 23645 28492 40361 145974 137570 123690 214360 48870 54525
551 54525 -1150 62994 97883 56132 6987 51223 24987 59975 54009 31518 41315 192564
539 192564 184190 119523 131359 86445 104430 109170 94942 93580 38709 5528 -36051 -53525
527 -53525 27716 106632 188743 134022 96287 16349 110243 144798 54666 51900 92794 137718
515 137718 124092 64450 25050 -1672 36932 94335 22762 60392 117726 102467 100864 98700
503 98700 65358 -7649 45971 92470 47282 26389 3214 112375 205979 165110 101276 142269
491 142269 128907 126736 128232 63484 9700 83301 129871 158086 87224 61983 41681 -46335
479 -46335 45840 28165 -69502 11038 56752 53614 181131 147594 147145 206002 76682 123243
467 123243 181372 193139 101634 51039 14974 18373 106714 71515 124299 130230 84536 115663
455 115663 160626 126430 170298 98817 73388 183853 143105 137853 201194 71933 -12807 -1090
443 -1090 35384 108766 57306 62473 99890 48139 34461 42920 2676 110963 112248 80785 156050
430 156050 115516 156229 144282 45459 64494 35280 27914 43006 -3311 28043 44248 68838
418 68838 83062 181446 159264 115346 127995 67133 50686 201235 122896 -14209 13367 50414
406 50414 70110 110587 110784 113074 173985 143056 220874 231030 158680 161664 138280 65177 -7122
393 -7122 99179 85708 100336 153058 82309 3037 77187 21712 52969 116116 140349 101684
381 101684 145962 122210 15880 9285 43841 122554 68768 86674 -35335 -38718 94780 151362
369 151362 196463 118855 93236 43851 27035 17262 47977 132295 101142 85999 108671 159555
357 159555 63755 78007 72060 91611 106956 157812 129407 169785 28908 11494 130827 113384
345 113384 134266 152663 99339 65273 137512 228531 266370 242975 97466 90436 96052 101426
333 101426 199262 291336 133622 78920 164044 239437 253492 236593 245126 143149 75257 56014
321 56014 163927 137576 74532 111749 54466 -5683 74480 115110 60044 -27789 22104 46738
309 46738 -18421 16452 149637 156602 151162 131521 98414 83855 56162 104813 -168 -12541
297 -12541 108102 92123 74176 105019 271320 153783 44895 7295 20645 45155 -54937
286 -54937 30376 141432 149092 124471 160782 126388 89814 92855 62005 59529 74219 25541
274 25541 28691 106386 82828 99570 111952 110264 108456 121483 140081 122453 20590 52046
262 52046 56895 58153 88501 123930 106620 46309 91316 85294 -10851 14851 110143 108068 170511
249 170511 241716 171611 177656 111257 -47813 -93613 69059 248968 211946 100082 117954
238 117954 145414 101297 157352 141439 132215 134807 93326 56935 64357 145206 244612 244133 200990
225 200990 222169 244740 187199 229637 183727 130245 29959 -44459 42795 122288 59890 69581
213 69581 118443 152757 185020 221724 266110 298736 147959 -4602 85706 135661 104800 200322
201 200322 244648 219021 236584 169943 73891 24476 68295 113628 57548 56504 136984 194464
189 194464 109603 61152 56010 43811 108066 143809 46066 39311 122201 131468 135173 91132 174383
176 174383 263110 240277 173715 157240 160058 232758 149811 118111 126243 80265 103448 71408
164 71408 96461 127911 71738 73266 60945 71979 38472 105242 219622 186869 184563 132769
152 132769 122092 121097 110579 156397 94874 75896 96565 101492 126663 56475 27056 24247 22769
139 22769 109022 166111 192248 113639 48833 57210 112954 104383 123787 85493 123943 135905
127 135905 104107 97679 72524 24794 88484 172464 94996 139658 170416 95817 26174 148955
115 148955 179319 206426 196891 172856 215299 72184 57269 96959 143484 122514 105269 77543
103 77543 36374 63987 75670 110385 88450 134571 157254 55697 53795 96155 142334 98659
91 98659 54674 138874 119570 147412 154794 223720 227712 229840 247364 132011 91412 138238 157429
78 157429 109156 129276 124909 94678 121044 127262 108486 57159 132299 179650 147959 174853
66 174853 203069 108581 64274 65522 122073 83692 32783 19885 126411 140466 122050 81829
54 81829 97267 141347 141964 192639 220507 263934 228702 172213 150248 145219 105858 140726 193010
41 193010 164717 139256 150116 117552 120586 162972 171272 59380 -32565 77674 162415 219564
29 219564 222832 206031 202769 151422 184892 205984 163930 153443 236079 248659 148010 32931
17 32931 149779 194768 122350 60643 -11406 28279 79800 150319 160632 176174 142790 139280
5 139280 126905 80261 146523 108122 10827
0 10827
$$ Imaginary data points
##PAGE= N=2
##DATA TABLE= (X++(I..I)), XYDATA
16383 -3114857 -3048958 -3019926 -3011706 -2961141 -2920587 -2862650 -2800007 -2730862 -2712616 -2595783 -2536639
16372 -2536639 -2560993 -2475680 -2341432 -2278512 -2260899 -2201018 -2198306 -2128949 -2053178 -2093329 -2053919
16361 -2053919 -1931936 -1853876 -1757732 -1737626 -1686563 -1596624 -1542601 -1536039 -1501106 -1511456 -1409768
16350 -1409768 -1299731 -1248410 -1204722 -1159661 -1088977 -1093915 -1037824 -1011324 -876405 -865133 -728864
16339 -728864 -693498 -732376 -666910 -580634 -592575 -572865 -444106 -397951 -339945 -313503 -267026
16328 -267026 -300781 -217247 -159559 -106543 -81673 -30505 59045 232977 281087 300244 343255
16317 343255 455470 466278 411123 428193 492109 606797 643068 748732 752277 780178 855239
16306 855239 833099 874399 909739 996620 1153802 1154407 1143427 1208950 1158352 1256071 1326560 1350583
16294 1350583 1357969 1413343 1521971 1547910 1565423 1580526 1636264 1771932 1860505 1873435 1909472
16283 1909472 1898424 1829515 1873564 1996133 1981041 2043156 2057415 2177461 2252007 2253504 2291266
16272 2291266 2278978 2321453 2340168 2380856 2441983 2514825 2588880 2622362 2554180 2552880 2639217
16261 2639217 2724975 2758190 2798333 2819504 2814280 2861495 2914520 2966556 3000595 3024188 2999189
16250 2999189 3089435 3160318 3095625 3118609 3155432 3203308 3196298 3293107 3284599 3349900 3385222 3397095
16238 3397095 3475807 3535340 3530749 3609265 3546997 3541179 3550376 3634664 3738379 3755337 3742284 3672940
16226 3672940 3717544 3807743 3808415 3895549 3915852 3833488 3961876 3939174 4001021 3998274 4086860 4101085
16214 4101085 4110353 4075141 4173831 4226813 4294833 4232937 4145544 4133125 4148918 4224559 4199945
16203 4199945 4203147 4288387 4259064 4236081 4237555 4278025 4359171 4417218 4427417 4375476 4405355 4416614
16191 4416614 4402594 4504842 4553907 4613348 4612565 4686122 4685525 4655320 4751799 4654298 4617984 4649480
16179 4649480 4712822 4692749 4776645 4831454 4850034 4765355 4695488 4709984 4686113 4747522 4789441
16168 4789441 4893774 4963987 4903086 4842253 4909944 4956044 4982191 4970256 5035227 4862656 4867929
16157 4867929 4864303 4915850 4925726 5052466 5124711 5145049 5083439 5025754 5114963 5098415 5145434
16146 5145434 5129587 5158005 5207425 5261305 5240485 5201726 5211660 5207043 5196407 5245453 5200965 5370826
16134 5370826 5347405 5277360 5265311 5362528 5202950 5199587 5161363 5209361 5260175 5248621 5284792
16123 5284792 5341457 5426723 5374219 5258975 5289933 5226201 5391256 5371328 5245431 5281244 5308314
16112 5308314 5223641 5177790 5279618 5262362 5247436 5246688 5377800 5353353 5333455 5343438 5365025
16101 5365025 5394496 5458853 5459856 5539296 5505063 5544387 5487356 5411910 5428715 5425043 5453842 5500231
16089 5500231 5475268 5467427 5517860 5468924 5467575 5507096 5517419 5501617 5459109 5511692 5577729 5430497
16077 5430497 5405481 5447936 5501640 5479527 5426603 5494279 5522661 5509316 5544884 5556326 5586452
16066 5586452 5590211 5519273 5522418 5524304 5444194 5411107 5529410 5595145 5538225 5606778 5579199 5547220
16054 5547220 5526450 5487007 5558453 5498518 5480980 5533521 5575891 5537124 5528136 5555618 5530967
16043 5530967 5540371 5576418 5565658 5574880 5588711 5562907 5495421 5447751 5384961 5417276 5511752 5582591
16031 5582591 5546705 5619380 5602582 5565869 5496284 5461922 5455291 5516241 5511597 5496687 5535676 5552176
16019 5552176 5568227 5553895 5555914 5503902 5485751 5547523 5614114 5584464 5619540 5573954 5567664 5558095
16007 5558095 5558867 5574095 5494702 5563300 5545242 5571766 5586842 5571941 5573662 5570848 5540633 5506480
15995 5506480 5556113 5549424 5469818 5391462 5380916 5536116 5698325 5666110 5670325 5547472 5577645
15984 5577645 5572102 5540022 5522629 5539086 5592865 5548164 5478135 5527102 5467560 5517760 5557838
15973 5557838 5434488 5483305 5574650 5559496 5537583 5513374 5558880 5537556 5472153 5489961 5578093
15962 5578093 5650192 5579577 5560286 5516528 5526625 5564440 5550403 5539148 5586692 5541129 5481726
15951 5481726 5449164 5412263 5493676 5538747 5524382 5492422 5591400 5608877 5551816 5512077 5558643
15940 5558643 5589199 5544985 5521080 5568124 5652140 5608302 5656436 5603373 5640288 5546903 5509890
15929 5509890 5524983 5532288 5564209 5476387 5457667 5496836 5551960 5566391 5481599 5550300 5588303
15918 5588303 5465112 5485802 5495725 5568251 5546064 5524505 5534883 5558967 5516234 5580971 5550411
15907 5550411 5476775 5554483 5493403 5507452 5585732 5574745 5526437 5545523 5506949 5564776 5618165
15896 5618165 5614217 5604349 5593726 5508236 5479748 5456592 5513123 5528242 5566508 5581661 5505009 5518727
15884 5518727 5512840 5480994 5561304 5528161 5604577 5697367 5624940 5563185 5551522 5673026 5661015
15873 5661015 5678854 5657766 5638331 5585993 5510302 5562895 5648922 5669922 5652048 5588276 5567830
15862 5567830 5491415 5440765 5554416 5633279 5696892 5616804 5445504 5477529 5509287 5573414 5678715
15851 5678715 5753135 5687730 5596083 5666931 5687750 5576909 5539648 5487696 5478239 5530266 5593650
15840 5593650 5562417 5540386 5610161 5606744 5676623 5651058 5559112 5478163 5455732 5480187 5490017 5508020
15828 5508020 5508390 5550658 5532442 5576334 5472464 5379569 5427968 5529802 5498583 5507542 5502032 5524347
15816 5524347 5481865 5492743 5448738 5464950 5568256 5413929 5488657 5649895 5730193 5671661 5559797
15805 5559797 5514133 5461612 5471649 5478638 5539602 5631168 5623859 5576614 5593166 5665012 5537298
15794 5537298 5530709 5592813 5584183 5597217 5577697 5632769 5660613 5573039 5615116 5587764 5525160 5483888
15782 5483888 5568457 5533120 5525879 5529922 5573859 5605368 5543780 5558779 5598713 5570477 5605858 5611368
15770 5611368 5578058 5637897 5604607 5672993 5579148 5631450 5564774 5527099 5575102 5605075 5674541
15759 5674541 5672368 5602270 5477414 5525311 5513930 5557440 5559453 5610001 5554691 5532941 5643269
15748 5643269 5614001 5575689 5538911 5593287 5623910 5536028 5538675 5547308 5615557 5590818 5613360 5622348
15736 5622348 5649891 5676227 5670250 5642911 5618808 5623112 5525181 5491064 5424944 5475573 5533983 5487868
15724 5487868 5504747 5507824 5531408 5525559 5602872 5634655 5526507 5460617 5517210 5562648 5557007 5626109
15712 5626109 5680311 5681682 5560826 5611959 5691000 5639844 5603707 5670823 5628215 5558507 5579705
15701 5579705 5572528 5668271 5569151 5440538 5506752 5541573 5597173 5569809 5450161 5455322 5499596
15690 5499596 5563235 5492485 5521060 5544049 5574906 5630586 5671098 5612576 5496914 5623983 5526258
15679 5526258 5503892 5519981 5497200 5599242 5695511 5692298 5552224 5458253 5507554 5512154 5698355
15668 5698355 5604837 5402252 5513997 5561321 5533989 5540534 5502921 5549711 5516380 5527356 5558501
15657 5558501 5627690 5583030 5506805 5528356 5523810 5609416 5542328 5539475 5471451 5479089 5577151 5612324
15645 5612324 5502578 5507287 5515991 5542073 5576287 5429520 5546409 5575395 5599582 5507425 5471871
15634 5471871 5507388 5641969 5617828 5587247 5610171 5613312 5684920 5646139 5750042 5663498 5657562
15623 5657562 5676744 5640125 5615091 5631555 5674717 5663676 5550881 5592460 5546888 5513744 5513992
15612 5513992 5534828 5563262 5515685 5546678 5599835 5555014 5602911 5593620 5618859 5600090 5656611
15601 5656611 5772595 5644786 5543856 5537550 5589080 5574796 5539803 5451993 5483295 5553895 5679984
15590 5679984 5617261 5483431 5551039 5705734 5579387 5575440 5634495 5625341 5674398 5643288 5747527
15579 5747527 5668452 5649504 5692408 5575733 5663882 5625386 5652125 5667754 5673676 5655556 5565473
15568 5565473 5540966 5618821 5616704 5548572 5561744 5465493 5521981 5578215 5556346 5488445 5609953
15557 5609953 5590713 5613224 5628748 5594919 5610787 5605126 5512918 5554036 5568609 5584932 5631386
15546 5631386 5539231 5629807 5641086 5603636 5626891 5687562 5669587 5594978 5617597 5616029 5704210
15535 5704210 5761506 5720749 5584125 5643553 5741922 5658006 5531584 5574063 5495237 5473335 5511570
15524 5511570 5624594 5594325 5504733 5559902 5473864 5552404 5559412 5558897 5587004 5607723 5607951 5559787
15512 5559787 5679062 5670516 5625619 5653157 5643084 5645954 5535922 5494681 5577044 5531427 5566180
15501 5566180 5602473 5515344 5597176 5520748 5516982 5561624 5591414 5593500 5739349 5624688 5494959
15490 5494959 5520429 5556205 5564741 5697424 5687425 5763159 5725794 5658086 5648606 5708719 5657534 5558258
15478 5558258 5673288 5653551 5581745 5586103 5562178 5556141 5597941 5654979 5659352 5528442 5541625
15467 5541625 5725032 5628586 5623193 5780623 5768810 5717712 5741734 5621384 5633130 5706136 5561229
15456 5561229 5658727 5632085 5651528 5669062 5657325 5597428 5695857 5697920 5597002 5684011 5712993
15445 5712993 5651586 5602858 5677522 5724702 5772243 5766101 5749640 5745556 5652149 5773379 5704110
15434 5704110 5711158 5721853 5695850 5657597 5712721 5659441 5643244 5658228 5672606 5661298 5696189
15423 5696189 5674714 5684928 5622792 5681067 5619350 5570689 5616726 5670353 5688665 5614545 5711438
15412 5711438 5738288 5760381 5691890 5616460 5603610 5644040 5647013 5556143 5575013 5660776 5585958
15401 5585958 5515167 5533274 5599894 5567312 5650838 5585208 5601381 5645375 5752169 5801667 5673382
15390 5673382 5696762 5642307 5654965 5606352 5640434 5679031 5673077 5642764 5599101 5558984 5591791
15379 5591791 5742536 5690363 5736205 5638343 5617232 5603057 5608453 5618344 5639623 5548953 5447120
15368 5447120 5482259 5606823 5624660 5611375 5595895 5603524 5631114 5701708 5630352 5557907 5596720
15357 5596720 5600053 5624336 5640581 5707535 5687312 5573872 5584109 5663318 5684454 5713433 5752057
15346 5752057 5734077 5707171 5628614 5698112 5647523 5583595 5685195 5627516 5580663 5593263 5607717
15335 5607717 5610608 5684061 5714009 5708312 5613109 5611568 5648275 5600823 5587253 5496962 5561197 5663668
15323 5663668 5659003 5744066 5706428 5698035 5744438 5723490 5688342 5673649 5621566 5612128 5586666 5639768
15311 5639768 5635026 5629047 5624176 5666188 5718393 5615994 5603010 5579079 5533142 5549550 5639254 5596641
15299 5596641 5636071 5730076 5707068 5713059 5641584 5652607 5715874 5668140 5625496 5636327 5630300 5673748
15287 5673748 5586720 5563864 5645767 5689177 5582598 5537322 5572635 5618443 5741866 5684468 5592616
15276 5592616 5603181 5640213 5553429 5526126 5551147 5584586 5668846 5696209 5716161 5686206 5678774
15265 5678774 5676742 5658858 5614670 5567097 5523699 5637391 5795883 5709119 5679986 5754504 5693787
15254 5693787 5739811 5672096 5656051 5629263 5643783 5694325 5758064 5722074 5742020 5745941 5705175
15243 5705175 5717445 5658310 5674727 5698296 5600234 5580946 5590379 5595973 5733388 5726270 5774292 5683501
15231 5683501 5744720 5768893 5809052 5654667 5558859 5634907 5663843 5633946 5523130 5612576 5645287
15220 5645287 5659187 5695971 5647988 5688862 5695286 5617774 5641821 5694244 5656664 5679833 5735100
15209 5735100 5730234 5730683 5681604 5619243 5651326 5696346 5648457 5651046 5646218 5712549 5754070 5793246
15197 5793246 5688351 5735110 5737534 5726565 5567859 5622903 5697081 5760446 5778369 5760394 5744978
15186 5744978 5650991 5730283 5625989 5613557 5625349 5704100 5730338 5729786 5689717 5753490 5808704
15175 5808704 5790670 5682644 5675262 5675638 5733418 5757210 5748378 5651197 5669037 5580581 5658096 5665572
15163 5665572 5594372 5549641 5630512 5717043 5736706 5732809 5759658 5794372 5711038 5674886 5634293
15152 5634293 5645672 5718049 5749026 5795349 5856049 5783034 5706871 5645354 5601447 5691874 5785897
15141 5785897 5803910 5718088 5645404 5672896 5767098 5753593 5634794 5680732 5631191 5690256 5676305
15130 5676305 5625059 5570072 5560629 5582182 5539239 5631788 5651269 5644539 5713465 5645650 5617801 5658248
15118 5658248 5732732 5841598 5844630 5720652 5658567 5646528 5649996 5612680 5702253 5678415 5637523
15107 5637523 5650405 5747493 5771545 5715653 5697874 5734769 5570283 5660531 5736573 5819988 5908009
15096 5908009 5772923 5700737 5710770 5818538 5760491 5672046 5681141 5731032 5695858 5712371 5768195
15085 5768195 5682728 5647055 5787319 5768027 5740007 5814181 5726561 5554468 5686791 5796536
15075 5796536 5824587 5799776 5711973 5747920 5777163 5740787 5739133 5682446 5650757 5672122 5628651
15064 5628651 5658771 5719537 5674226 5636755 5637614 5637548 5587062 5601422 5654554 5738375 5749280 5667707
15052 5667707 5663425 5720970 5718344 5630896 5668228 5656096 5696633 5704354 5692993 5661616 5617779 5727934
15040 5727934 5766374 5688127 5642870 5637603 5691530 5727391 5698237 5611217 5666215 5661024 5674186 5650578
15028 5650578 5643011 5672898 5659988 5701173 5779452 5781062 5832521 5778946 5843236 5820089 5753414 5755926
15016 5755926 5654329 5633933 5579029 5666709 5632452 5648672 5709128 5741019 5738232 5781902 5772455
15005 5772455 5729950 5741176 5750437 5686484 5802139 5814178 5786888 5771854 5805994 5750990 5687435
14994 5687435 5712001 5753937 5749652 5707328 5751913 5737029 5661941 5709547 5761169 5778434 5846042
14983 5846042 5754736 5794803 5845491 5744409 5695255 5745883 5665922 5709928 5707888 5751450 5813262
14972 5813262 5752193 5760524 5667920 5781095 5807838 5727476 5811658 5858934 5728198 5750041 5670841
14961 5670841 5712672 5754401 5778158 5745790 5670749 5567673 5595738 5643371 5650153 5709416 5720865
14950 5720865 5717628 5703749 5750916 5730535 5691350 5760912 5726977 5676408 5662522 5678819 5654537
14939 5654537 5683580 5702567 5664283 5672307 5658627 5673682 5724392 5825490 5838033 5814823 5742518
14928 5742518 5735048 5770574 5782938 5774131 5736665 5777830 5713670 5585983 5622799 5755674 5769998
14917 5769998 5689488 5639691 5606449 5720073 5767357 5820756 5710008 5677384 5738924 5807893 5703403
14906 5703403 5701433 5705930 5759555 5829325 5844573 5783170 5792252 5816916 5800790 5792820 5849106 5828280
14894 5828280 5806117 5780398 5793194 5721974 5741584 5794790 5748959 5704142 5749661 5789510 5728337
14883 5728337 5680684 5689908 5691941 5819808 5951394 5928186 5825239 5773337 5767842 5812996 5744461
14872 5744461 5764612 5792120 5753033 5825100 5803304 5776468 5751865 5704711 5726790 5730421 5631906
14861 5631906 5683055 5782438 5883194 5863114 5858161 5874809 5863539 5870033 5869208 5802030 5821081 5771201
14849 5771201 5833230 5819083 5805823 5854278 5799213 5822885 5746706 5763651 5864237 5849305 5799019
14838 5799019 5808629 5825629 5817786 5742731 5718459 5769737 5768991 5823459 5795273 5729717 5755544 5679374
14826 5679374 5678856 5849695 5811712 5821307 5802240 5794489 5688200 5754107 5766970 5729703 5717884 5653056
14814 5653056 5766507 5837249 5766650 5762178 5734853 5743125 5727667 5765627 5695949 5759328 5767122 5713356
14802 5713356 5682863 5694843 5706149 5739157 5772836 5782418 5773552 5708635 5766792 5842288 5851147 5750263
14790 5750263 5646494 5759479 5823364 5683064 5786639 5821700 5678227 5708907 5767256 5727094
14780 5727094 5735697 5774088 5761106 5848653 5878132 5788497 5733993 5658328 5757355 5807773 5729601
14769 5729601 5741128 5745409 5765184 5821601 5875477 5869825 5732623 5772707 5800686 5837842 5858231
14758 5858231 5810745 5826904 5790139 5772981 5816678 5786891 5835563 5753025 5726530 5778354 5796175
14747 5796175 5862189 5885621 5860364 5936101 5922211 5842323 5830087 5862200 5825416 5737204 5757307
14736 5757307 5815928 5830588 5851629 5846494 5914959 5904537 5884428 5935797 5954571 5879581 5835033
14725 5835033 5864461 5888657 5823647 5782491 5788494 5809535 5774692 5786219 5847792 5893265 5753851
14714 5753851 5779384 5889195 5882028 5827067 5739393 5710915 5791620 5856628 5850627 5870177 5820402
14703 5820402 5837796 5846148 5845813 5899300 5943089 5869187 5953392 6020528 5943446 5873156 5929614 5812473
14691 5812473 5748460 5919908 5904911 5861016 5870420 5981659 5914263 5996684 6030672 5780011 5881464
14680 5881464 5910547 5809410 5861416 5848843 5833052 5870641 5838693 5755912 5767579 5724274 5663381
14669 5663381 5690842 5824250 5821388 5865988 5821339 5772307 5839667 5808640 5809569 5865262 5934238 5905654
14657 5905654 5859432 5823311 5866743 5901899 5880602 5804117 5808131 5821112 5879866 5828866 5853703
14646 5853703 5802821 5934244 5981621 5884467 5894031 5932328 5863197 5893090 5881319 5881099 5825206 5815083
14634 5815083 5879978 5925687 5871825 5761047 5742606 5724052 5782701 5773941 5804693 5807532 5841391
14623 5841391 5891112 5807958 5834807 5811781 5785436 5798632 5869487 5752246 5781805 5861059 5806231
14612 5806231 5721161 5695237 5779647 5827622 5806114 5767954 5867575 5802521 5747384 5792634 5850812
14601 5850812 5899241 5874344 5884181 5818906 5793392 5814137 5864821 5944948 5802396 5811768 5922946
14590 5922946 5922365 5909272 5970645 5947070 5959750 5865204 5873764 5887673 5836345 5904504 5936283 5790127
14578 5790127 5860740 5852033 5867977 5871390 5841667 5851979 5894935 5838422 5850011 5912432 5919210 5836139
14566 5836139 5800815 5817399 5770710 5804276 5864270 5847920 5816534 5831550 5693336 5694157 5792343
14555 5792343 5868605 5937987 5954769 5958409 5906250 5928061 5886421 5818652 5813551 5790764 5836827 5923004
14543 5923004 5956717 5908787 5857224 5794200 5939192 5919688 5889918 5815530 5793425 5874749 5909276
$$ [...]
##END NTUPLES=NMR SPECTRUM
##END=
