##TITLE=1H_TG-2365-H
 CDCl3
 8 sc, 
 21.2.2023
##JCAMPDX= 6.0         $$ Bruker NMR JCAMP-DX V2.0
##DATA TYPE= NMR SPECTRUM
##DATA CLASS= NTUPLES
##ORIGIN= UXNMR, Bruker Analytische Messtechnik GmbH
##OWNER= root
$$ XWIN-NMR		Version 3.5
$$ Wed Feb 22 14:21:04 2023 Russian Standard Time (UT+4h)  she@DPX200
##.OBSERVE FREQUENCY= 200.13135
##.OBSERVE NUCLEUS= ^1H
##.ACQUISITION MODE= SIMULTANEOUS
##.ACQUISITION SCHEME= undefined
##.AVERAGES= 8
##.DIGITISER RES= 18
##SPECTROMETER/DATA SYSTEM= spect
##.PULSE SEQUENCE= zg30
##.SOLVENT NAME= DMSO
##.SHIFT REFERENCE= (INTERNAL, DMSO, 0, 15.7932)
##AUDIT TRAIL= $$ (NUMBER, WHEN, WHO, WHERE, WHAT)
$$ ##TITLE= Audit trail, XWIN-NMR		Version 3.5
$$ ##JCAMPDX= 5.01
$$ ##ORIGIN= Bruker BioSpin GmbH
$$ ##OWNER= she
$$ F:/spectra/data/she/nmr/H-F/1/pdata/1/auditp.txt
$$ ##AUDIT TRAIL=  $$ (NUMBER, WHEN, WHO, WHERE, WHAT)
(   1,<2023-02-22 14:19:33.50 +0400>,<she>,<DPX200>,
      <created by zg, POWCHK disabled, PULCHK disabled
       configuration hash MD5:
       00 E9 B6 7A A2 85 ED C7 34 08 36 98 17 FE 4E 26
       data hash MD5: 16K
       0E B4 4C 97 1F 68 39 8B E5 51 11 CE BB 2E 4A 94>)
(   2,<2023-02-22 14:19:36.70 +0400>,<she>,<DPX200>,
      <Start of raw data processing
       efp BC_mod = 2 LB = 0.24 FT_mod = 6 PKNL = 1 PHC0 = -19106.23 PHC1 = 6.20074 SI = 16K 
       data hash MD5: 16K
       7D 62 C1 E0 9A 88 C0 34 8F 06 3D 6C F0 38 3C 65>)
(   3,<2023-02-22 14:19:56.46 +0400>,<she>,<DPX200>,
      <pk PHC0 = 4.213566 PHC1 = 0 
       data hash MD5: 16K
       A1 B3 79 30 19 15 CB F1 64 34 54 44 E6 AB CA 36>)
(   4,<2023-02-22 14:19:59.31 +0400>,<she>,<DPX200>,
      <abs ABSG = 5 
       data hash MD5: 16K
       40 2A E9 EF 41 F4 CA 16 70 7B 0D A8 4A 97 CE DC>)
$$ ##END=
$$ 
$$ hash MD5
$$ 90 2C 81 C5 55 C1 91 62 30 CB ED 7A B4 D7 B6 74
##$RELAX= 
##$RELAX= 
##$RELAX= 
##$RELAX= 
##$RELAX= 
##$RELAX= 
$$ Bruker specific parameters
$$ --------------------------
##$DU= <F:/spectra>
##$EXPNO= 1
##$NAME= <H-F>
##$PROCNO= 1
##$TYPE= <nmr>
##$USER= <she>
##$AMP= (0..31)
100 100 100 100 100 100 100 100 100 100 100 100 100 100 100 100 100 100 
100 100 100 100 100 100 100 100 100 100 100 100 100 100 
##$AQSEQ= 0
##$AQ_mod= 1
##$AUNM= <au_zg>
##$AUTOPOS= <>
##$BF1= 200.13
##$BF2= 200.13
##$BF3= 200.13
##$BF4= 200.13
##$BF5= 200.13
##$BF6= 200.13
##$BF7= 200.13
##$BF8= 200.13
##$BYTORDA= 1
##$CFDGTYP= 0
##$CFRGTYP= 5
##$CHEMSTR= <none>
##$CNST= (0..31)
1 1 145 1 1 1 1 1 1 1 1 1 1 1 1 1 1 1 1 1 1 1 1 1 1 1 1 1 1 1 1 1 
##$CPDPRG= <>
##$CPDPRG1= <>
##$CPDPRG2= <>
##$CPDPRG3= <>
##$CPDPRG4= <mlev>
##$CPDPRG5= <mlev>
##$CPDPRG6= <mlev>
##$CPDPRG7= <mlev>
##$CPDPRG8= <mlev>
##$CPDPRGB= <>
##$CPDPRGT= <>
##$D= (0..31)
0 1.2 0 0 0 0 0 0 0 0.06 0 0.03 0 0 0 0 0.0002 0 0 0 0 0 0 0 0 0 0 0 0 
0 0 0 
##$DATE= 1677061172
##$DBL= (0..7)
120 120 120 120 120 120 120 120 
##$DBP= (0..7)
150 150 150 150 150 150 150 150 
##$DBP07= 0
##$DBPNAM0= <>
##$DBPNAM1= <>
##$DBPNAM2= <>
##$DBPNAM3= <>
##$DBPNAM4= <>
##$DBPNAM5= <>
$$ [...]
##$SUBNAM3= <"">
##$SUBNAM4= <"">
##$SUBNAM5= <"">
##$SUBNAM6= <"">
##$SUBNAM7= <"">
##$SUBNAM8= <"">
##$SUBNAM9= <"">
##$SW= 18.05172834244
##$SWIBOX= (0..15)
0 0 2 0 0 0 0 0 0 0 0 0 0 0 0 0 
##$SW_h= 3612.71676300578
##$TD= 16384
##$TD0= 1
##$TE= 0
##$TE2= 300
##$TE3= 300
##$TEG= 300
##$TL= (0..7)
0 120 120 120 120 120 120 120 
##$TP= (0..7)
150 150 150 150 150 150 150 150 
##$TP07= 0
##$TPNAME0= <>
##$TPNAME1= <>
##$TPNAME2= <>
##$TPNAME3= <>
##$TPNAME4= <>
##$TPNAME5= <>
##$TPNAME6= <>
##$TPNAME7= <>
##$TPOAL= (0..7)
0.5 0.5 0.5 0.5 0.5 0.5 0.5 0.5 
##$TPOFFS= (0..7)
0 0 0 0 0 0 0 0 
##$TUNHIN= 0
##$TUNHOUT= 0
##$TUNXOUT= 0
##$USERA1= <user>
##$USERA2= <user>
##$USERA3= <user>
##$USERA4= <user>
##$USERA5= <user>
##$V9= 5
##$VALIST= <valist>
##$VCLIST= <CCCCCCCCCCCCCCC>
##$VD= 0
##$VDLIST= <DDDDDDDDDDDDDDD>
##$VPLIST= <PPPPPPPPPPPPPPP>
##$VTLIST= <TTTTTTTTTTTTTTT>
##$WBST= 1024
##$WBSW= 4
##$XGAIN= (0..3)
0 0 0 0 
##$XL= 0
##$YL= 0
##$YMAX_a= 506798
##$YMIN_a= -894335
##$ZGOPTNS= <>
##$ZL1= 120
##$ZL2= 120
##$ZL3= 120
##$ZL4= 120
##$ABSF1= 15.75791
##$ABSF2= -2.29394
##$ABSG= 5
##$ABSL= 3
##$ALPHA= 0
##$AQORDER= 0
##$ASSFAC= 0
##$ASSFACI= 0
##$ASSFACX= 0
##$ASSWID= 0
##$AUNMP= <proc_1d>
##$AZFE= 0.1
##$AZFW= 0.1
##$BCFW= 0
##$BC_mod= 2
##$BYTORDP= 0
##$COROFFS= 0
##$CY= -3
##$DATMOD= 1
##$DC= 0
##$DFILT= <>
##$DTYPP= 0
##$F1P= 0
##$F2P= 0
##$FCOR= 1
##$FTSIZE= 16384
##$FT_mod= 6
##$GAMMA= 0
##$GB= 0
##$INTBC= 1
##$INTSCL= 3.70164e-10
##$ISEN= 128
##$LB= 0.24
##$LEV0= 0
##$LPBIN= 0
##$MAXI= 10000
##$MC2= 0
##$MEAN= 0
##$ME_mod= 0
##$MI= 1.114404
##$NCOEF= 0
##$NC_proc= -6
##$NLEV= 6
##$NOISF1= 3.799351
##$NOISF2= 2.8
##$NSP= 0
##$NTH_PI= 0
##$NZP= 0
##$OFFSET= 15.79317
##$PC= 1
##$PHC0= -19102.02
##$PHC1= 6.20074
##$PH_mod= 1
##$PKNL= yes
##$PPARMOD= 0
##$PSCAL= 0
##$PSIGN= 0
##$REVERSE= no
##$SF= 200.129995671732
##$SI= 16384
##$SIGF1= 3
##$SIGF2= 2
##$SINO= 5.538805
##$SIOLD= 16384
##$SREGLST= <1H.CDCl3>
##$SSB= 0
##$STSI= 16384
##$STSR= 0
##$SW_p= 3612.71676300578
##$SYMM= 0
##$S_DEV= 0
##$TDeff= 16384
##$TDoff= 0
##$TI= <>
##$TILT= no
##$TM1= 0
##$TM2= 0
##$TOPLEV= 0
##$USERP1= <user>
##$USERP2= <user>
##$USERP3= <user>
##$USERP4= <user>
##$USERP5= <user>
##$WDW= 1
##$XDIM= 16384
##$YMAX_p= 343209921
##$YMIN_p= -682452
$$ End of Bruker specific parameters
$$ ---------------------------------
##NTUPLES= NMR SPECTRUM
##VAR_NAME=  FREQUENCY,     SPECTRUM/REAL,   SPECTRUM/IMAG
##SYMBOL=    X,             R,               I
##VAR_TYPE=  INDEPENDENT,   DEPENDENT,       DEPENDENT
##VAR_FORM=  AFFN,          ASDF,            ASDF
##VAR_DIM=   16384,         16384,           16384
##UNITS=     HZ,            ARBITRARY UNITS, ARBITRARY UNITS
##FACTOR=    0.220516191357247, 1,           1
##FIRST=     3160.68703879587, 0,            0
##LAST=      -452.029724209914, 0,           0
##MIN=       -452.029724209914, -682452,     0
##MAX=       3160.68703879587, 343209921,    0
$$ Real data points
##PAGE= N=1
##DATA TABLE= (X++(R..R)), XYDATA
$$ [...]
6215D396335m6435O6318R5566J40705j7725K1130J75688J90005N143L9879J33300
6204E199909J42524J72285l4116M4540Q5866Q1857O6051J49760J12912K32286
6194F253874K38907K62175K48969L08576L46277L75384M78948L08127K94218J98498
6184I313953K42620Q0912m0787O5699K2560J24691N9992J25320K89596L28775
6174A0613331K58767N12217N65525N15174N17720N33525O56921O58310P52648
6165A5584138Q41062R04378J044326J176303J189043J141973J012739N62260J25390
6156B3581612m33853o84965r02427r31078p85394p57863n14822l80734j07371
6147A8083105j47003o8901L2173J56454K91592K56378N10004O51557P41091R40233
$$ plain form
6215 4396335 4349900 4416218 4511784 4652489 4634764 4655894 4831582 5021587 5026730 5066609 5199909
6204 5199909 5342433 5514718 5480602 5525142 5611008 5692865 5758916 5908676 6021588 6253874
6194 6253874 6492781 6754956 7003925 7312501 7658778 8034162 8513110 8821237 9115455 9313953
6184 9313953 9556573 9637485 9596698 9662397 9684957 9809648 9869640 9994960 10284556 10613331
6174 10613331 10872098 11384315 11949840 12465014 12982734 13516259 14173180 14831490 15584138
6165 15584138 16425200 17329578 18373904 19550207 20739250 21881223 22893962 23456222 23581612
6156 23581612 23147759 22462794 21560367 20629289 19843895 19086032 18571210 18190476 18083105
6147 18083105 17936102 17867201 17899374 18055828 18347420 18603798 19113802 19765359 20506450 21446683
6137B1446683J167160J377760J514251J660562J807782J726069J223461O35906
6129C2559634l38743j012753j523562j714991j781857j581751j267862j085165
6121B2252950r76281p56148p11740n74264m02053k60176k47052p6182o998K72196
6111A8514252K71590M77314O00053P39931Q99587J012806J038834Q01746M85300
6102B4841413o247n30792r40539j187090j255502j212853j092797p82471p53833
6093A7079289o27154m88682o06697l73932k83805k49411l59554k65357K6488j57134
6083A3694051j04477j00955q6150k0818P8942N7766J22497p842j39785j95287
6073A3297942l06062l06202m06725m16847l11991k36278k03457k54817k18560
$$ plain form
6137 21446683 22613843 23991603 25505854 27166416 28974198 30700267 31923728 32559634
6129 32559634 32220891 31208138 29684576 27969585 26187728 24605977 23338115 22252950
6121 22252950 21276669 20520521 19808781 19234517 18832464 18572288 18325236 18249054 18242056 18514252
6111 18514252 18785842 19263156 19863209 20603140 21502727 22515533 23554367 24356113 24841413
6102 24841413 24835166 24304374 23363835 22176745 20921243 19708390 18615593 17833122 17079289
6093 17079289 16452135 15963453 15356756 14982824 14699019 14449608 14090054 13824697 13851185 13694051
6083 13694051 13589574 13488619 13402469 13381651 13460593 13518359 13640856 13633014 13493229 13297942
6073 13297942 12991880 12685678 12278953 11862106 11550115 11313837 11110380 10855563 10637003
6064A0637003k51864j06174k69318k50514k53000j12315k50272r4597o4476M1220
6054I025693j6958j36723r5670l3393m5787r2185j20981Q1410m4541j20968j58943
6043H240954j76296k2248n0530r2226q5931L9555j63194j86196k169M0014j9739
6032G521994L7875J4991M3659k0846m9722J9434N3439N1939J47095P4327R592
6021G903777P4004K76476L43788L05604K92482L81243K48493J25527q0390o17301
6011I253703p64502o30446l31705m77862l49887j48890j19338j09675p2618p5649
6001F173131j67944M7712J95106R9263j1190J38285J97399K57792K19353K32013
5991G380920K06973L64614N43710O27080P39790R05570J226328J406023J210635
$$ plain form
6064 10637003 10385139 10278965 10009647 9759133 9506133 9393818 9143546 9048949 8984473 9025693
6054 9025693 9008735 8872012 8776342 8742949 8697162 8604977 8483996 8565406 8520865 8399897 8240954
6043 8240954 8064658 8042410 7991880 7899654 7813723 7853278 7690084 7503888 7501719 7541733 7521994
6032 7521994 7559869 7574860 7618519 7597673 7547951 7567385 7620824 7672763 7819858 7894185 7903777
6021 7903777 7977781 8254257 8598045 8903649 9196131 9577374 9825867 9951394 9871004 9253703
6011 9253703 8489201 7858755 7527050 7049188 6699301 6550411 6431073 6321398 6248780 6173131
6001 6173131 6005187 6052899 6248005 6347268 6336078 6474363 6671762 6929554 7148907 7380920
5991 7380920 7587893 7952507 8496217 9123297 9863087 10768657 11994985 13401008 14611643
5982A4611643J009884P9058j297439j786538j739662j402788r64225q40533m94232
5973G175168l32329l60351j68865k53529r1509j14659q258J0720l3117L2195J79593
5962F035059L04242J87254K85442L78633M06877M82054N66967O66592J007470
5953A0320590J162315J365783J191213R15324L43839r80966j879395j841061j669351
5944H928291j091391p71473o98646n02247l66922m07055j23125j16741j98002
5935D652689j18596K0265j76977p9050L9353O2311J9750j8506J29703J32730J26508
5924D790180J59713N8904K83318N03266L18400K90637K63307Q1704l42139n92109
5914E815181o58468m91199m41791l46339l88970j71875j38764m1661k27455k12620
$$ plain form
5982 14611643 15621527 15700585 14403146 12616608 10876946 9474158 8509933 7669400 7175168
5973 7175168 6842839 6482488 6313623 6060094 5968585 5853926 5845668 5856388 5823271 5855466 6035059
5962 6035059 6339301 6526555 6811997 7190630 7597507 8079561 8646528 9313120 10320590
5953 10320590 11482905 12848688 14039901 14955225 15299064 14318098 12438703 10597642 8928291
5944 8928291 7836900 7065427 6366781 5864534 5497612 5090557 4967432 4850691 4652689
5935 4652689 4534093 4554358 4377381 4298331 4337684 4399995 4419745 4401239 4530942 4663672 4790180
5924 4790180 4949893 5008797 5292115 5795381 6113781 6404418 6667725 6749429 6407290 5815181
5914 5815181 5156713 4665514 4223723 3877384 3488414 3316539 3177775 3136114 2908659 2696039
5904B696039n5803k0760o3923m1589l0419p147n346j4611K7058q0901J9613m4305
5892B377906j14491m5953o7628J4307j4443q3063p5075P6159l5577P6302n1758
5881B056686K712M2524J4275p3926n287M327q2354R0336l5012L1915o601m6353
5869A993242J22234k9778k2188R3077j2775K8236M7427j0081O9956N1520r763
5858B321107k8721R1807N0211R306J05185o3369J51796K1404J20344L5388J14148
5847B928606R8308J70361J80939O5852J50141q6211N7484J42525J46458K08031
5837D062494J86481K02438L9810J4931Q0128K26355O0428N2968R5601j6673J79212
5826E184173J30827L6642K5907J36482J42357J06164N8824j7254j5014K1219n5464
$$ plain form
5904 2696039 2640236 2619476 2555553 2513964 2483545 2476398 2471052 2456441 2483499 2402598 2422211 2377906
5892 2377906 2263415 2217462 2149834 2164141 2149698 2066635 1991560 2067719 2032142 2108444 2056686
5881 2056686 2059398 2101922 2116197 2042271 2036984 2041311 1958957 2049293 2014281 2046196 2039595 1993242
5869 1993242 2115476 2085698 2063510 2156587 2143812 2172048 2219475 2209394 2279350 2330870 2321107
5858 2321107 2292386 2384193 2434404 2443710 2548895 2485526 2637322 2658726 2779070 2814458 2928606
5847 2928606 3026914 3197275 3378214 3444066 3594207 3507996 3565480 3708005 3854463 4062494
5837 4062494 4248975 4451413 4491223 4506154 4586282 4812637 4873065 4926033 5021634 5004961 5184173
5826 5184173 5315000 5351642 5377549 5514031 5656388 5762552 5821376 5804122 5789108 5810327 5754863
5815E754863m5557o247j4900j41051j74876q9836j57997K9891j30608k17527j48262
5804D657893q6622q3936j64142n7428l5581o7862K4126r284M567r1801K7064J19589
5792D236583P022O8870j694N2031J18617J19766J68259j9054J10716R9004k4759
5781D935361R7754o825r4453o7865N4355j5465j25365n2985k2792M817p3862o2868
5769D569807P2746k7088K7730l1948Q530n8743L9462l3917o3467L440j32527j07907
5757D266118m3554j08361j26646j11258r8081j13254j01761j27762j36728j29933
5747C168780m433o0247l7849m6949j21512Q528r9499q5548k0145o7732J3658L2990
5735B680042Q090q7531o1977j49921O5237m0017j65276J15804n3804p3141R0997
$$ plain form
5815 5754863 5709306 5703059 5688159 5547108 5372232 5282396 5124399 5154290 5023682 4806155 4657893
5804 4657893 4571271 4487335 4323193 4265765 4230184 4162322 4186448 4177164 4181731 4089930 4116994 4236583
5792 4236583 4243605 4312475 4310781 4362812 4481429 4601195 4769454 4750400 4861116 4960120 4935361
5781 4935361 5033115 5026290 4931837 4863972 4918327 4902862 4777497 4724512 4701720 4706537 4632675 4569807
5769 4569807 4642553 4615465 4643195 4611247 4619777 4561034 4600496 4566579 4503112 4506552 4374025 4266118
5757 4266118 4222564 4114203 3987557 3876299 3778218 3664964 3563203 3435441 3298713 3168780
5747 3168780 3164347 3104100 3066251 3019302 2897790 2906318 2806819 2721271 2701126 2633394 2647052 2680042
5735 2680042 2688132 2600601 2538624 2388703 2453940 2413923 2248647 2364451 2310647 2237506 2328503
5724B328503K3909p5160q1205J08986n6444J0935M6291K7837J0202j64589N0759
5713B230024R3129N9374p4439j00184j4400n8740L3202J0520m0285o2611q4293
5702A991297Q9263K106P6493j13818m8017j42903L1153r616k0377J00768l6097
5691A920252M1694k2347K5998k6021n1948N8238K3285q4529n4242J04799L0042
5680A965221l8662p317j37611l6386J23121p3951n5858k3247j5792Q2857J75495
5669A957870K3636p6989m5937j25101j0130j601Q5006L3334k0447o7876L9283
5658A791048O7975K7492m5718R620k6483J19650J87456k1011P1049k11439p2532
5647A897107l3574P29J610j16734l1740J3597n8188L4093r989m1158k3393J0479
$$ plain form
5724 2328503 2352412 2277252 2196047 2305033 2248589 2259524 2305815 2333652 2343854 2179265 2230024
5713 2230024 2323153 2382527 2308088 2207904 2193504 2134764 2167966 2178486 2138201 2075590 1991297
5702 1991297 2080560 2082666 2159159 2045341 1997324 1854421 1885574 1875958 1855581 1956349 1920252
5691 1920252 1961946 1939599 1965597 1939576 1887628 1945866 1969151 1884622 1830380 1935179 1965221
5680 1965221 1926559 1919242 1781631 1745245 1868366 1794415 1738557 1715310 1699518 1782375 1957870
5669 1957870 1981506 1904517 1858580 1733479 1723349 1721748 1806754 1840088 1819641 1751765 1791048
5658 1791048 1859023 1886515 1840797 1850417 1823934 1943584 2131040 2110029 2181078 1969639 1897107
5647 1897107 1863533 1864262 1865872 1749138 1717398 1730995 1672807 1706900 1696911 1655753 1632360 1642839
5635A642839O0592L328j7934j4767L2441k4461n60n5341o3p3317J9565R1970l791
5622A660501J4336P7984k7771n6645M7449J33958N0856m954o460q7366J23499
5611A925387J5200l7565P9255J33429j0150Q806l0137K0747O0905k570k7369L8237
5599B174175j6070n277P5346J11701j3946j27679J35609J5511m3355J0242n3625
5588B262632P9870Q0526J864P7461O9393J11790Q0070K2722J20643K1307j0721
5577B917557P6526R1722P8169J299J23521L4764J7119R7044O0817J47278K50986
5566C896802J59057J62250J94144J47156J68586K37580J72744J89675J90461L29037
5556E847492J44963K03787J61713K00895K00999K2368P3910J13335j00287l8265
$$ plain form
5635 1642839 1703431 1706759 1688825 1674058 1706499 1682038 1681478 1626137 1626074 1552757 1572322 1664292 1660501
5622 1660501 1674837 1752821 1725050 1668405 1715854 1849812 1900668 1895714 1889254 1801888 1925387
5611 1925387 1940587 1903022 1982277 2115706 2105556 2114362 2084225 2104972 2165877 2163307 2135938 2174175
5599 2174175 2158105 2152828 2228174 2339875 2325929 2198250 2333859 2349370 2306015 2316257 2262632
5588 2262632 2342502 2423028 2424892 2502353 2571746 2683536 2763606 2786328 2906971 2928278 2917557
5577 2917557 2994083 3085805 3163974 3165273 3288794 3323558 3340677 3437721 3498538 3645816 3896802
5566 3896802 4055859 4218109 4412253 4559409 4727995 4965575 5138319 5327994 5518455 5847492
5556 5847492 5992455 6196242 6357955 6558850 6759849 6782217 6856127 6969462 6869175 6830910
5546F830910o7940J2702q659N278n5069J3007l2091R3397J49884P9705J53835
5535G174959J88337L2124J09168J41840K60241K06579J88868J55569K90092L02718
5525I050495L10357L21248J86153J39871J69569K43999M6696J86693j4874J25490
5515A0765697o7640J4575K0727L891j11055j88494k59560k58561k73698l09806
5505I336076k04679j08657k18055k43464j91483K7532m9537n2255l7494P3390
5495H331374K09908J17147O8000J83661j09192N2759L9849P5146J21167Q9908
5485I179727j5075n5935k5144j13439j35824k46462j51465k28452k99392l49977
5475G558562j71608k24377k84404k71291j47273q6842j82081j73267j53555j91150
$$ plain form
5546 6830910 6762970 6775672 6767013 6772291 6717222 6730229 6698138 6791535 6941419 7021124 7174959
5535 7174959 7363296 7395420 7504588 7646428 7906669 8113248 8302116 8457685 8747777 9050495
5525 9050495 9360852 9682100 9868253 10008124 10177693 10421692 10468388 10655081 10640207 10765697
5515 10765697 10698057 10712632 10733359 10737250 10626195 10437701 10178141 9919580 9645882 9336076
5505 9336076 9131397 9022740 8804685 8561221 8369738 8397270 8347733 8295478 8257984 8331374
5495 8331374 8541282 8658429 8726429 8910090 8800898 8853657 8893506 8968652 9089819 9179727
5485 9179727 9164652 9108717 9083573 8970134 8834310 8587848 8436383 8207931 7908539 7558562
5475 7558562 7386954 7162577 6878173 6606882 6459609 6372767 6190686 6017419 5863864 5672714
5465E672714q0409j32272j09434l7833j18192r2019l9999O5883l3057l6210j06375
5454D952797Q215q236q0751k9064n4334N818o869n9725O2998r1567l498N2928
5442D748712q767n9250P6142R5974o5419Q4978M783M637O7979N6910O5614K5465
5430E097758R1041J15469o3889J26743J38141J22810J22006L2110K33289K50609
5420F266087O7835J70269J13309J49537M8464P9472L379k2230P924N3996q2987
5409F855055j4818L7549p3424O0230Q892L1939P1536J8286J18702R7676M4211
5398G255834J12827R4041O6605K28562J30933J32708J81992J13373J62801L88111
5388H867787K82173K01721L75861K97081L85011L40208L65620L46851M06646L73406
$$ plain form
5465 5672714 5592305 5460033 5350599 5312766 5194574 5102555 5062556 5128439 5095382 5059172 4952797
5454 4952797 4961012 4952776 4872025 4842961 4788627 4794445 4787576 4727851 4790849 4699282 4695784 4748712
5442 4748712 4739945 4680695 4756837 4852811 4787392 4872370 4877153 4881790 4949769 5006679 5072293 5097758
5430 5097758 5188799 5304268 5240379 5367122 5505263 5628073 5750079 5782189 6015478 6266087
5420 6266087 6333922 6504191 6617500 6767037 6815501 6894973 6898352 6876122 6884046 6938042 6855055
5409 6855055 6840237 6877786 6804362 6864592 6873484 6905423 6976959 6995245 7113947 7211623 7255834
5398 7255834 7368661 7462702 7529307 7757869 7888802 8021510 8203502 8316875 8479676 8867787
5388 8867787 9149960 9351681 9727542 10024623 10409634 10749842 11115462 11462313 11868959 12242365
5378A2242365J34021J82923L2603L5319J2504o1948r272j09909r7592j63856j96211
5367A2000947j46346m0974k41506N672J34846K1032J07998K42813P0112K34536
5357A2389130L19766K07760L35971M19196M77271M82522O35157N91041Q69165
5348A6726979O56357N85498N21443L66487L33122N62035N05773N58737O00638
5339B1417069M44328K48229K55466O1396j17052l2175J0464j13647k81189o9841
5329B1823048r6920j06573N8752N1297K48958L69147L59215M54089O69388N85317
5319B4415718O85249R03354R09797J127062J104903J318536J316715J388859J440159
5310C4610352J576515J452095J483904J575608J528868J590765J754753J735431
$$ plain form
5378 12242365 12376386 12559309 12591912 12627231 12639735 12577787 12568515 12458606 12361014 12197158 12000947
5367 12000947 11854601 11813627 11572121 11577793 11712639 11733671 11841669 12084482 12154594 12389130
5357 12389130 12708896 12916656 13252627 13671823 14149094 14631616 15266773 15857814 16726979
5348 16726979 17383336 17968834 18490277 18856764 19189886 19751921 20257694 20816431 21417069
5339 21417069 21861397 22109626 22365092 22426488 22309436 22277261 22287725 22174078 21892889 21823048
5329 21823048 21726128 21619555 21678307 21729604 21978562 22347709 22706924 23161013 23830401 24415718
5319 24415718 25100967 26004321 26914118 28041180 29146083 30464619 31781334 33170193 34610352
5310 34610352 36186867 37638962 39122866 40698474 42227342 43818107 45572860 47308291
5302D7308291J647165J258601R47410N46349J30720k30088l47388j17085O6674
5293E1210649M45879O01130Q11448J220951J494219J632535J735125J505263J111482
5284F1768681Q06323L87781J77849K02838N12412J018945J343093J705488J972936
5275F9896346K032934K041369K167805K164637J920781J588441J176216P47024
5267H3735553N84314L01140M57603J155578J932370K573159K936338K629379J582434
5258I7887868L47033q82011j576991k288589k573941k442119j787771j177327
5250H5506152m40564J30120J95749j86374q15277j711919k305484k407292k135939
5241G5829172j624159j268327r75341p12448m41052R1687M09752P37496O99332
$$ plain form
5302 47308291 48955456 50214057 51161467 51707816 51838536 51608448 51261060 51143975 51210649
5293 51210649 51656528 52257658 53069106 54290057 55784276 57416811 59151936 60657199 61768681
5284 61768681 62575004 62962785 63140634 63343472 63855884 64874829 66217922 67923410 69896346
5275 69896346 71929280 73970649 76138454 78303091 80223872 81812313 82988529 83735553
5267 83735553 84319867 84621007 85078610 86234188 88166558 90739717 93676055 96305434 97887868
5258 97887868 98234901 97352890 95775899 93487310 90913369 88471250 86683479 85506152
5250 85506152 85065588 85195708 85391457 85205083 84389806 82677887 80372403 77965111 75829172
5241 75829172 74205013 72936686 71961345 71248897 70807845 70899532 71309284 72046780 72746112
5232G2746112J62685n21214j288795j715431k061902j937960j714444j504061
5224F2164990j287217q57756m54012j93931j19513j94273o91149j442126k024125
5215E4900888k427808k505318k212616j866865j367272o18836j65843K38985Q35843
5206D4811158J039252J378530J165951O46853j45728j091251j934347k056366
5198D3814052j835343j527842r88245r04803r69206j118910j328281j182463q74210
5189C3084749o01069k39621m9989J57400K97353P43859R92424J330218J648457
5180C7363781J932954K179679J572523R97461J70267n67307j176772j219295j169290
5171D0084001r83173q47851r37089r07496j166411j187803r85661q09848r03089
$$ plain form
5232 72746112 72908797 72387583 71098788 69383357 67321455 65383495 63669051 62164990
5224 62164990 60877773 60020017 59566005 59372074 59252561 59058288 58367139 56925013 54900888
5215 54900888 52473080 49967762 47755146 45888281 44521009 43902173 43736330 43975315 44811158
5206 44811158 45850410 47228940 48394891 49041744 48896016 47804765 45870418 43814052
5198 43814052 41978709 40450867 39462622 38557819 37588613 36469703 35141422 33958959 33084749
5189 33084749 32483680 32244059 32194070 32351470 32648823 33392682 34385106 35715324 37363781
5180 37363781 39296735 41476414 43048937 44046398 44216665 43649358 42472586 41253291 40084001
5171 40084001 39100828 38252977 37315888 36408392 35241981 34054178 33068517 32258669 31355580
5162C1355580j031485j470304j612905j566848j380831j202580r56420q10296
5154B1323911o01887k86026j93139n1235Q1789J16752O0910J57967N6282l7839
5144B0627485p7197L0520J50613K63667K79618R6409j18252l50647r75766j333774
5134A8592676j418716j210413j029663q76556o32314n49504m70565l56014k86666
5125A1762265l51587k18510l39032j78731q9938j0300k01128k79717j60330j30316
5115I802676m2261n9310P5474R5898N5091j09077j1160p586j4577j36520m4527
5104I604121j40181k09871l6230l6626M350J1507K26199Q2603n8354J30381K11946
5093I789845K52561L17790L69721M48467N72663N48774N44559N70155L28863J34819
$$ plain form
5162 31355580 30324095 28853791 27240886 25674038 24293207 23090627 22134207 21323911
5154 21323911 20722024 20435998 20242859 20191624 20273413 20390165 20451075 20609042 20665324 20627485
5144 20627485 20550288 20580808 20731421 20995088 21274706 21371115 21252863 20902216 19926450 18592676
5134 18592676 17173960 15963547 14933884 14057328 13425014 12875510 12404945 12048931 11762265
5125 11762265 11410678 11192168 10853136 10674405 10584467 10574167 10373039 10093322 9932992 9802676
5115 9802676 9760415 9701105 9776579 9872477 9927568 9818491 9807331 9799745 9785168 9648648 9604121
5104 9604121 9463940 9254069 9217839 9181213 9185563 9197070 9423269 9505872 9447518 9577899 9789845
5093 9789845 10042406 10360196 10729917 11178384 11751047 12299821 12844380 13414535 13743398 13878217
5083A3878217o0737l91045m96309n97909n04192l75750l32913k21138j42361j17409
5073A0638454q4598j17806k3440l9525p1070L0466K7492K6727N0491J68089K15899
5062A0821179J83701P0294K16869J11072K20002J71923L77857K92078J78322K14247
5052A2857544M01792M95189M00007O28219N61228O05275O72956N12560N93069
5043A7727839O18574P42538Q91096J147604J209721J433235J581122J839053K165327
5034B9356109K443137K537594K480336K182554J567082Q32494m290n76033r38780
5025C9880203r24840p38260o04683l51113l78641n79940n34134o91238n96791
5016C4480563l91741j73953R4292L68175N59142R63882J245857J584450K038391
$$ plain form
5083 13878217 13817480 13426435 12930126 12332217 11828025 11452275 11119362 10898224 10755863 10638454
5073 10638454 10553856 10436050 10412610 10373085 10302015 10332481 10359973 10386700 10437191 10605280 10821179
5062 10821179 11004880 11075174 11292043 11403115 11623117 11795040 12172897 12464975 12643297 12857544
5052 12857544 13259336 13754525 14154532 14782751 15343979 15949254 16622210 17134770 17727839
5043 17727839 18346413 19088951 19980047 21127651 22337372 23770607 25351729 27190782 29356109
5034 29356109 31799246 34336840 36817176 38999730 40566812 41399306 41395016 40818983 39880203
5025 39880203 38955363 38217103 37612420 37261307 36882666 36302726 35768592 35077354 34480563
5016 34480563 34088822 33914869 34009161 34377336 34936478 35900360 37146217 38730667 40769058
5007D0769058K372680K616321K736972K649402K214695J526573O48316j58020
4999E5375997o12031p17333o76933n41777l84886l55654o15769r00537j355519
4990D9215558j998557k556139k768839k693080k501580k120876j796717j281681
4982C1498089j030652p63848n47148k25752J3531L78453M19286N24440N68487
4973C0834886N35119M35603L78863L48346M02760M32341M10587M15909J22194
4964C4316608l96266j050453j680965k017402k179810k184946k048577j772158
4956B0986031j344979j072136q95129p39185p41726n20955o10679m43672l91361
4947A4226209l89494m08657l17037j48972p5605k36026j24338j4586l5479K46542
$$ plain form
5007 40769058 43141738 45758059 48495031 51144433 53359128 54885701 55534017 55375997
4999 55375997 54763966 54046633 53369700 52827923 52443037 52087383 51471614 50571077 49215558
4990 49215558 47217001 44660862 41892023 39198943 36697363 34576487 32779770 31498089
4982 31498089 30467437 29703589 29156441 28930689 28944220 29322673 29741959 30266399 30834886
4973 30834886 31370005 31805608 32184471 32532817 32935577 33367918 33778505 34194414 34316608
4964 34316608 33920342 32869889 31188924 29171522 26991712 24806766 22758189 20986031
4956 20986031 19641052 18568916 17673787 16934602 16192876 15671921 15061242 14617570 14226209
4947 14226209 13836715 13428058 13111021 12962049 12886444 12650418 12526080 12511494 12476015 12722557
4937A2722557J82709L22914M08246O96553O03400N77212L89383k61035r74970
4928A4666969r97206q52617o77496n47311l42350k44866j647M7798k0754J74590
4918A1205110K34181J15212L07839J28212m625j94889l69144m21340l17027n12074
4908A0171455k80346k33035k00673j32668o3646p6333m116n2478j60017n3226
4898H914917k28348j13761l00073k12420j12698k01156n3643K1605j57692m9035
4888G507696k470Q0767J1695J23332R6726P9226l7405K7645n5513o0193K5415
4877G796921O6639j4854j16392l2637j9153M0440K2393L2072J37900P1794J35229
4866H120352P8116K093p2734q2766K2015Q8037N3027J63217L1699P1300R4552
$$ plain form
4937 12722557 12905266 13228180 13636426 14332979 14936379 15513591 15902974 15641939 14666969
4928 14666969 13669763 12817146 12139650 11592339 11249989 11005123 11003476 11051274 11030520 11205110
4918 11205110 11439291 11554503 11862342 11990554 11985929 11791040 11421896 11000556 10683529 10171455
4908 10171455 9891109 9658074 9457401 9324733 9261087 9184754 9180638 9128160 8968143 8914917
4898 8914917 8686569 8572808 8272735 8060315 7947617 7746461 7692818 7714423 7556731 7507696
4888 7507696 7505226 7585993 7597688 7721020 7817746 7896972 7859567 7887212 7831699 7771506 7796921
4877 7796921 7863560 7848706 7732314 7699677 7680524 7720964 7743357 7775429 7913329 7985123 8120352
4866 8120352 8198468 8200561 8127827 8045061 8067076 8155113 8208140 8371357 8403056 8474356 8568908
4855H568908K4259J32975K55021J86070J97642N8763J41838J68130Q8052K01412
4845A0023070K36395J39429K033Q891M4206J02801P8462J94194J98580J98959
4835A1227020K62379J91888L13602M22808L74906O28178N41847M33921M48985
4826A4845534N69764O38610O41050P43320O99025P99437R09290J090416J233737
4817B2170183J145221J397778J589677J786653J781411K111613K402751K751760
4809C7137047L115277L576270M212655N023326N826666P333544R060548J1325269
4801H6610602J4448224J8429526K1216844K0812596J9189121J2878379n739315
4794A87845977j7748075k0146456k4164014k2597383j7922434j3838293j0312474
$$ plain form
4855 8568908 8593167 8726142 8981163 9167233 9364875 9423638 9565476 9733606 9821658 10023070
4845 10023070 10259465 10398894 10400927 10409818 10454024 10556825 10635287 10829481 11028061 11227020
4835 11227020 11489399 11681287 11994889 12417697 12792603 13420781 13962628 14396549 14845534
4826 14845534 15415298 16053908 16694958 17438278 18137303 18936740 19846030 20936446 22170183
4817 22170183 23315404 24713182 26302859 28089512 29870923 31982536 34385287 37137047
4809 37137047 40252324 43828594 48041249 53064575 58891241 66224785 75285333 86610602
4801 86610602 101058826 119488352 140705196 161517792 180706913 193585292 187845977
4794 187845977 170097902 149951446 125787432 103190049 85267615 71429322 61116848
4787F1116848p634016n973565m825535l868058l223458k755371k390175k149797
4779B8296873j834311j669697j358037j296213j139919j003288o89363p52467
4771A8553578p02521p34418n64293m04305o00494o71737n40749o64686n55077
4762A3115298l93964l97495m82690m31340l95576l42006l12794m07177l14484
4753I637772k71523l39894j93072k48976k11087k25634j50103p5295k58380j17315
4743G546493o9332k3315j86470r5421L9373k3613p5344l8258O0917o796p2605
4732G055629j17779n8109j01275n3036K3533j66177j76817p9058j21193m6098
4722F159620J1967j6949m2569O165n4149l9771m8824K4478L4536m4213n0092Q3614
$$ plain form
4787 61116848 53482832 47509267 42683732 38815674 35592216 32836845 30446670 28296873
4779 28296873 26462562 24792865 23434828 22138615 20998696 19995408 19306045 18553578
4771 18553578 17851057 17116639 16552346 16148041 15547547 14875810 14335061 13670375 13115298
4762 13115298 12721334 12323839 11841149 11409809 11014233 10672227 10359433 9952256 9637772
4753 9637772 9366249 9026355 8833283 8584307 8373220 8147586 7997483 7922188 7663808 7546493
4743 7546493 7477161 7453846 7267376 7171955 7211328 7187715 7112371 7074113 7135030 7128234 7055629
4732 7055629 6937850 6879741 6778466 6725430 6748963 6582786 6405969 6326911 6205718 6159620
4722 6159620 6171587 6154638 6112069 6118234 6064085 6024314 5975490 5999968 6034504 5990291 5940199 6023813
4710F023813q1923o4906m3804N657m0192j5543l6214q7666l8128j35372k8725
4699E456997m1546j3818J4950j00019j0106q8806Q3842J21102o937K3343R4109
4688E533111R8719N1082J50056P0451P2898J53106J7405j09105j28463j02294
4678E806966J0787k74486k1347J02533q2612J2682n1693m1227J18716q1374o2308
4667E436637K727K6184j45113N3840m0935o269Q5450J43416o1270J30461K11238
4656E836366J15277J65758J02405K12577J93817K31529J59920P6962l4397K6923
4646G087137Q370J17968j3832p3319o1085o2096Q0578L2332m6309Q6894J67442
4635G324080J20705J80396L64074K96875L04854L75840L37154M60456M98910N66214
$$ plain form
4710 6023813 5941890 5876984 5833180 5838837 5798645 5783102 5746888 5659222 5621094 5485722 5456997
4699 5456997 5415451 5401633 5416583 5316564 5306458 5217652 5301494 5422596 5415659 5439002 5533111
4688 5533111 5631830 5682912 5832968 5903419 5976317 6129423 6146828 6037723 5909260 5806966
4678 5806966 5817753 5543267 5521920 5624453 5541841 5554523 5502830 5461603 5580319 5498945 5436637
4667 5436637 5439364 5465548 5320435 5374275 5333340 5327071 5412521 5555937 5494667 5625128 5836366
4656 5836366 5951643 6117401 6219806 6432383 6626200 6857729 7017649 7094611 7060214 7087137
4646 7087137 7095507 7213475 7199643 7126324 7065239 7003143 7083721 7116053 7069744 7156638 7324080
4635 7324080 7444785 7625181 7989255 8286130 8590984 8966824 9303978 9764434 10263344 10829558
4625A0829558N66313M21270K82716K81651l8920j89349l91437l83435l28402k67008
4615A0782957j25400o6145j13199Q2414J21353j0963m3190O2012k0345k2740R7852
4604A0744606R0902K05816P649L0691J57925J82605Q1738L80856L36247K79783
4594A2498818M30722M79461M59944M67801M43836L90318N89953N66353P38595
4585A7065801Q18238Q27816Q43474R88495J278792J297310J485590J788075J960201
4576B8353792K329474K825108L155342L819462M392877N281500O345444P903756
4568F4406755J0072745J2630769J4667787J4509899J2300753P835196l237189
4561A33186715j4864446j8317505j7331680j4296142j0878605q124000o163351
$$ plain form
4625 10829558 11395871 11817141 12099857 12381508 12342588 12153239 11761802 11378367 11049965 10782957
4615 10782957 10657557 10591412 10478213 10560627 10681980 10671017 10627827 10689839 10669494 10646754 10744606
4604 10744606 10835508 11041324 11048973 11079664 11237589 11420194 11501932 11882788 12219035 12498818
4594 12498818 12929540 13409001 13868945 14336746 14780582 15170900 15760853 16327206 17065801
4585 17065801 17884039 18711855 19555329 20543824 21822616 23119926 24605516 26393591 28353792
4576 28353792 30683266 33508374 36663716 40483178 44876055 50157555 56502999 64406755
4568 64406755 74479500 87110269 101778056 116287955 128588708 136423904 133186715
4561 133186715 118322269 100004764 82673084 68376942 57498337 49374337 43210986
4554D3210986m693521l756920l174713k717004k299388j821869j635854j429300
4546B1682417j330268j150180r88951p91491o78596o31969n79192n33646m29056
4537A4569068m39160m26868m21447m24277m62377m07403k81702k92456k64686
4528A1148692l56041k21123k68672k47686l01808j66489k67247k53437l56703
4519H709486k89733j18103j78439k19672j90809j63900m5079j34925m0999N6671
4509G384498N6571n117o7790J18624k4249r1513R8666K3469P6509R3493N5091
4498G718252J29799K1063l6896J06965O7511j7542r4588j49896J6395l5005K5368
4487G751426P3035O1381P5531J05390k3644J15909K21626J10357J10968R4661
$$ plain form
4554 43210986 38517465 34760545 31585832 28868828 26569440 24747571 23111717 21682417
4546 21682417 20352149 19201969 18213018 17421527 16742931 16110962 15531770 14998124 14569068
4537 14569068 14129908 13703040 13281593 12857316 12394939 11987536 11705834 11413378 11148692
4528 11148692 10792651 10571528 10302856 10055170 9753362 9586873 9319626 9066189 8709486
4519 8709486 8419753 8301650 8123211 7903539 7712730 7548830 7503751 7368826 7327827 7384498
4509 7384498 7441069 7435952 7368162 7486786 7462537 7371024 7469690 7493159 7569668 7663161 7718252
4498 7718252 7848051 7869114 7832218 7939183 8006694 7989152 7894564 7744668 7761063 7726058 7751426
4487 7751426 7824461 7885842 7961373 8066763 8043119 8159028 8380654 8491011 8601979 8696640
4477H696640m8403m8686l1143K9032n3654O7561P6340L992J33899Q6487O9796
4466H981861J54713M2225J17983R8255J73165K17298J01231K54978K65006K6001
4456A0432716R4962o738J6933P5360J95313K54485L25494K48245J98827K92829
4446A2128426J87997K02090K06410J45143K83920K91593L06337K79493L20966
4437A4352375L52540M16485M63626N14003M77816N09374N98558P38591Q85307
4428A9308675J042738J220581J308358J522685J874598K266590K816014L565132
4420C4925371M068324M175580L837617K786291M16137k298876l907104m049602
4412C9953738l393068k555589j792561j229832o03378l30323j14389J9645K34086
$$ plain form
4477 8696640 8648237 8599551 8568408 8597440 8543786 8611347 8687687 8691679 8825578 8912065 8981861
4466 8981861 9136574 9178799 9296782 9395037 9568202 9785500 9886731 10141709 10406715 10432716
4456 10432716 10527678 10520940 10537873 10613233 10808546 11063031 11388525 11636770 11835597 12128426
4446 12128426 12316423 12518513 12724923 12870066 13153986 13445579 13751916 14031409 14352375
4437 14352375 14704915 15121400 15585026 16099029 16576845 17086219 17684777 18423368 19308675
4428 19308675 20351413 21571994 22880352 24403037 26277635 28544225 31360239 34925371
4420 34925371 38993695 43169275 47006892 49793183 50209320 47910444 44003340 39953738
4412 39953738 36560670 34005081 32212520 30982688 30379310 30048987 29934598 29954243 30188329
4403C0188329M89523N38165P12087J067150J381690J594169J920855K501498K916387
4394D3309853L385821L923932M639317N666981P026760Q901932J0975650J2357823
4386A00188069J2169216R878291N302789k968882j2180048j5281783j4080985
4379H3026667j1468540q520988o134429m438485l225617k425687j982523j650589
4371D3179809j103780p38693l42308m2345L04168Q66239J360261J608413K100383
4362D7192147K682331L301689L990328M885633O056722P703803R588757J1727212
4354I7128622J2552187J1284680Q030478J690489q307814j5488197j6254816j4079875
4346G6555754j1080837q219463o060019m727235l623358l022739k593599k231331
$$ plain form
4403 30188329 30677852 31216017 31928104 32995254 34376944 35971113 37891968 40393466 43309853
4394 43309853 46695674 50619606 55258923 60925904 67952664 76854596 87830246 100188069
4386 100188069 112357285 122235576 127538365 124569483 112389435 97107652 83026667
4379 83026667 71558127 63037139 56902710 52464225 49238608 46812921 44830398 43179809
4371 43179809 42076029 41337336 40995028 40952683 41256851 42123090 43483351 45091764 47192147
4362 47192147 49874478 53176167 57166495 62052128 68108850 75812653 85401410 97128622
4354 97128622 109680809 120965489 128995967 130686456 122378642 106890445 90635629 76555754
4346 76555754 65474917 57255454 51195435 46468200 42844842 39822103 37228504 34997173
4338C4997173j766912j478448j204616r96432o31365l85748j35051J51370L59408
4329B8909379N31459Q50945J209736J611639K159088K668559L301946L784004
4321D5026755L683927L107783J221582j749434m470815n628536n445626m604960
4313C1140676l582961k776204k136410j623321j409407j293457j049065j064170
4305A6205681q45728q09379p66986m45323m88195k77999l22946j99321k78507
4296A1771297k11979j19646k56387k63621j32283k68606l31376p3806k31923j84350
4286I697320k08017k47953j40908p0028n8166j45588k21931j72303l6931j41843
4276H253652j72047j37910j3406o4776p2756r602q0993O9738k7837O2593l0088
$$ plain form
4338 34997173 33230261 31751813 30547197 29550765 28919400 28533652 28398601 28549971 28909379
4329 28909379 29440838 30291783 31501519 33113158 35272246 37940805 41242751 45026755
4321 45026755 48710682 51818465 53040047 51290613 46819798 41191262 35745636 31140676
4313 31140676 27557715 24781511 22645101 21021780 19612373 18318916 17269851 16205681
4305 16205681 15359953 14550574 13783588 13338265 12850070 12572071 12249125 12049804 11771297
4296 11771297 11559318 11439672 11183285 10919664 10787381 10518775 10187399 10113593 9881670 9697320
4286 9697320 9489303 9241350 9100442 9030414 8972248 8826660 8604729 8432426 8395495 8253652
4276 8253652 8081605 7943695 7930289 7865513 7792757 7783155 7702162 7771900 7744063 7806656 7776568
4265G776568l9722N6445K38953k210j08934N8569Q2276J60414K15209k7111k9511
4254H380946j23013k08198n2356j54166j3974l8504l2791k1480P068J1144k0842
4243G733834K5383L0423J12647l4651J15239J21685O8829j1509O3422J9340J76381
4232H421023J53487j5883J12650L618J65577O9004J34355J95485P6338K75927
4222I591581J27706R3970Q2670J75166L27219J85259J64313Q3410K80518K11029
4212A1322841K53684K69004L08930L24553L30971K92423L26109K51269L21690
4203A4001474L77477L51956L63438L87342M02265M02925L63194M67922M48907
4194A7566900M13233M58747N03058L14969K80506L94053M09791K30525L08449
$$ plain form
4265 7776568 7736846 7793291 8032244 8030034 7921100 7979669 8061945 8222359 8437568 8410457 8380946
4254 8380946 8257933 8049735 7997379 7843213 7829239 7790735 7757944 7736464 7743532 7754676 7733834
4243 7733834 7759217 7789640 7902287 7867636 7982875 8104560 8173389 8161880 8225302 8244642 8421023
4232 8421023 8574510 8558627 8671277 8674895 8840472 8909476 9043831 9239316 9315654 9591581
4222 9591581 9719287 9813257 9895927 10071093 10398312 10583571 10747884 10831294 11111812 11322841
4212 11322841 11576525 11845529 12154459 12479012 12809983 13102406 13428515 13679784 14001474
4203 14001474 14378951 14730907 15094345 15481687 15883952 16286877 16650071 17117993 17566900
4194 17566900 17980133 18438880 18941938 19256907 19537413 19931466 20341257 20571782 20880231
4185B0880231K62100J78340K15227J17951J32100N4385J93824J42895Q5164P3900
4175B2336117r4728n1166N505k248l46214k52440k45548k73971k32498l01077
4165B0541732l29215k81667l42113n21180l35095m13213l60677m75003m00329
4156A7083240m75367m89563n00994l96686m93699n58702m00528m11061m36731
4147A2919909m30783n40677l67002k98154l86852l01795l86507l63889k69780
4138I574470l32925l15962l42244k60113j86653k64254k02664k38632k00381j36791
4128G093851n2884j43466k66122k3510o0301j19060o1250P4444l6748j5815n3954
4117F335185o5510N6858l5879O9411j9435P1027Q5543J1229J22991K01217J22039
$$ plain form
4185 20880231 21142331 21320671 21535898 21653849 21785949 21840334 22034158 22177053 22262217 22336117
4175 22336117 22241389 22190223 22195728 22193480 21847266 21594826 21349278 21075307 20842809 20541732
4165 20541732 20212517 19930850 19588737 19067557 18732462 18319249 17958572 17483569 17083240
4156 17083240 16607873 16118310 15617316 15220630 14726931 14168229 13767701 13356640 12919909
4147 12919909 12489126 11948449 11581447 11283293 10896441 10594646 10208139 9844250 9574470
4138 9574470 9241545 8925583 8583339 8323226 8136573 7872319 7669655 7431023 7230642 7093851
4128 7093851 7040967 6897501 6631379 6607869 6547568 6428508 6367258 6441702 6404954 6389139 6335185
4117 6335185 6269675 6326533 6290654 6360065 6340630 6411657 6497200 6508429 6631420 6832637 6954676
4106F954676K4153j18886j85606k13677j42071q9857j76967N2714j15201j11383
4096E877895M8476O0711K4884p7384K6902L2299K0806J41188R182l6193J83267
4085F312033J33532J21995R0236Q8122j2592k5086m785n8819p1242L3924M6630
4074F653948L9476Q8699P3865j4691M9617J08106O6279N4610N7713J44367Q5738
4063G407727J61146Q6605M2317J59973K58476R8395J72951J77879K13549J60845
4053H939863K28339J63209L12255P2964K49700K59650J70176J71758l6284R8750
4043A0630380L44990J71622J16321K32612L03139K80234K22663M30875L23412
4034A3056248L64856L65647L24400M65638N47857M12240O01134M45365L77484
$$ plain form
4106 6954676 6978829 6859943 6674337 6460660 6318589 6228732 6051765 6104479 5989278 5877895
4096 5877895 5926371 5987082 6011966 5934582 5961484 5993783 6014589 6155777 6164959 6128766 6312033
4085 6312033 6445565 6567560 6657796 6745918 6733326 6708240 6703455 6644636 6573394 6607318 6653948
4074 6653948 6693424 6782123 6855988 6841297 6890914 6999020 7065299 7119909 7177622 7321989 7407727
4063 7407727 7568873 7655478 7697795 7857768 8116244 8214639 8387590 8565469 8779018 8939863
4053 8939863 9168202 9331411 9643666 9716630 9966330 10225980 10396156 10567914 10531630 10630380
4043 10630380 10975370 11146992 11263313 11495925 11799064 12079298 12301961 12732836 13056248
4034 13056248 13421104 13786751 14111151 14576789 15124646 15536886 16138020 16583385 16960869
4025A6960869L70583K72421L22158L55711M84116N80735M69972O58424N75157
4016B1050146O96884P41428P14412P41855Q14275P86799Q97783R01916J093541
4007B8439039J047844J007501J267784J347931J386276J403750J616797J647371
3999C9164293J652620J899731J937586K086804K103360K236313K462811K612659
3991E6156177K782012K781606K918137L101980L219180L416962L406908L553281
3983H1336243L546329L700100L815107L856345L945488L981231M036007M095398
3975A12312248M124445M218405M210343M173551M046606L949076L833337L726215
3967A44594226L330357L303605K979463K792087K674890K307577K128014K164025
$$ plain form
4025 16960869 17331452 17603873 17926031 18281742 18765858 19346593 19816565 20474989 21050146
4016 21050146 21747030 22488458 23202870 23944725 24759000 25545799 26443582 27345498 28439039
4007 28439039 29486883 30494384 31762168 33110099 34496375 35900125 37516922 39164293
3999 39164293 40816913 42716644 44654230 46741034 48844394 51080707 53543518 56156177
3991 56156177 58938189 61719795 64637932 67739912 70959092 74376054 77782962 81336243
3983 81336243 84882572 88582672 92397779 96254124 100199612 104180843 108216850 112312248
3975 112312248 116436693 120655098 124865441 129038992 133085598 137034674 140868011 144594226
3967 144594226 147924583 151228188 154207651 156999738 159674628 161982205 164110219 166274244
3959A66274244J926856J634886J432849J067834P60700K71962j09937n44642q27166
3950A71887586j121213j408394j643937j891807k004386k178313k272366k531260
3942A56835910k881807l011809l396457l470162l651817l900769m049677m012601
3934A28460811m193912m202816m132875m045964m075829l879572l904529l774797
3926I6250517l831938l660973l640599l537258l467526l395548l293099l133401
3918F8290175l038427k951237k763766k586502k506311k299026k139403k025440
3910D7980063k019957j869979j720526j734747j617014j390508j349403j254739
3902C5023190j197281j057361r97956r03443q47530q18662o65869p57307o23754
$$ plain form
3959 166274244 168201100 169835986 171268835 172336669 173097369 173369331 173259394 172714752 171887586
3950 171887586 170766373 169357979 167714042 165822235 163817849 161639536 159367170 156835910
3942 156835910 153954103 150942294 147545837 144075675 140423858 136523089 132473412 128460811
3934 128460811 124266899 120064083 115931208 111885244 107809415 103929843 100025314 96250517
3926 96250517 92418579 88757606 85117007 81579749 78112223 74716675 71423576 68290175
3918 68290175 65251748 62300511 59536745 56950243 54443932 52144906 50005503 47980063
3910 47980063 45960106 44090127 42369601 40634854 39017840 37627332 36277929 35023190
3902 35023190 33825909 32768548 31770592 30867149 30019619 29200957 28535088 27777781 27154027
3893B7154027o06810n96220n06841m97267m87380m34410l69748m54839k96879
3884B2903633l98517l17413k96226l08147k62881k08473k35918k46275k07318
3875B0422465j35763K3095j31603k53234j60094l8322J1586q8752q8106J24202
3865A9685474O0656J3303K40967K13162K31294K75360L62441N25530L72286M83894
3855B2464367N38792O44613N66548P42810Q37741R95768R68016J049956R65314
3846B9773925J032126J095977P59458Q03073P10412N62249M42990K83058K76408
3837C5739676J67167J70358J58901J28438n2938p0514r4082o3002j15357k46340
3827C5722307j95551k79226m69783l94065n19549m72325m82169m80941l33612
$$ plain form
3893 27154027 26547217 25950997 25444156 24946889 24459509 24025099 23655351 23200512 22903633
3884 22903633 22505116 22187703 21891477 21583330 21320449 21111976 20876058 20629783 20422465
3875 20422465 20286702 20309797 20178194 19924960 19764866 19726544 19738130 19649378 19561272 19685474
3865 19685474 19746130 19759433 20000400 20213562 20444856 20720216 21082657 21608187 21980473 22464367
3855 22464367 23003159 23647772 24214320 24957130 25794871 26790639 27758655 28808611 29773925
3846 29773925 30806051 31902028 32661486 33464559 34174971 34737220 35180210 35463268 35739676
3837 35739676 35906843 36077201 36236102 36364540 36311602 36241088 36147006 36084004 35968647 35722307
3827 35722307 35526756 35247530 34777747 34383682 33864133 33391808 32909639 32428698 32095086
3818C2095086j56249m4079K6098J09426L08627M12868M12273M14302O31462P83161
3808C4992975N75645O19184N46475J56900L10460K17369R0582Q9829q0861j45568
3798C7372990k99899k81514l46526l66054l06094o39772o52186p99432o70193
3789C3011320q19929r93809j109385j155157j074000j122166j166957j121006
3781B4448911j250137r39360q45462q28938p32264p97977o99341n66595m67621
3772A7321216n21643m15973m12040l12054l74416l59011l70019j61007l63727
3763A4031326k60449k85001k48275j67811k49300j90768n4338j29002k05758k14095
3753A2026529n9547k23978m8949j01436k18196j25438m4538j15063j00235j54664
$$ plain form
3818 32095086 31938837 31894758 31920856 32030282 32338909 32751777 33164050 33578352 34209814 34992975
3808 34992975 35568620 36187804 36734279 36891179 37201639 37419008 37509590 37599419 37518558 37372990
3798 37372990 37073091 36791577 36445051 36078997 35772903 35133131 34480945 33681513 33011320
3789 33011320 32191391 31197582 30088197 28933040 27859040 26736874 25569917 24448911
3781 24448911 23198774 22259414 21413952 20585014 19852750 19054773 18355432 17788837 17321216
3772 17321216 16799573 16383600 15971560 15659506 15285090 14926079 14556060 14395053 14031326
3763 14031326 13770877 13485876 13237601 13069790 12820490 12629722 12575384 12446382 12240624 12026529
3753 12026529 11966982 11743004 11694055 11592619 11374423 11248985 11204447 11089384 10989149 10834485
3743A0834485j913r8500r3017R0102j12052n7121J08862m1823J9233p9437o0773
3732A0508046N2669J5470J41765m0295P4356Q6886P6070J72463k9470K6511R6260
3721A1180731N0838J89482J8329m6695J75594O0685Q8966R9117J2051M7701O8066
3710A1944865J37208M7701J39961J57222N9093J32021J53147K04439R8903Q9928
3700A3164488K48363R9694K02152J32031J75789J86802J08561K80190K06184J96175
3690A5000429L39365K11090L09744K69484J76515K41539L68939K99701J90251
3681A7407057L44907L29882M30635L70060L45902L92235L18843K99557M75024
3672B0714102L82880L74438L47620L86574L73229L26998L99329L45968N38422
$$ plain form
3743 10834485 10832572 10734072 10641055 10731157 10619105 10561984 10670846 10629023 10648256 10568819 10508046
3732 10508046 10560715 10576185 10717950 10677655 10752011 10838897 10914967 11087430 11057960 11084471 11180731
3721 11180731 11231569 11421051 11439380 11392685 11568279 11628964 11717930 11817047 11829098 11876799 11944865
3710 11944865 12082073 12129774 12269735 12426957 12486050 12618071 12771218 12975657 13074560 13164488
3700 13164488 13412851 13512545 13714697 13846728 14022517 14209319 14317880 14598070 14804254 15000429
3690 15000429 15339794 15550884 15860628 16130112 16306627 16548166 16917105 17216806 17407057
3681 17407057 17751964 18081846 18512481 18882541 19228443 19620678 19939521 20239078 20714102
3672 20714102 21096982 21471420 21819040 22205614 22578843 22905841 23305170 23651138 24189560
3663B4189560M50169L41391L70349M00491L93761M17182L62680M11508M97887
3654B7834978M90118M49065O02757O32281O71650O17597O44726O58353P14869
3645C3316394P78034Q12207Q91242R63787J025751J058283J093362J194642J316143
3636D2449845J415233J561267J678799J695371J698548J885131K043676K019244
3628E6447114K222196K615614K463106K587724K787170K878820K897381L014903
3620G7914028K966021L077443L002329K860070K844966K813566K794079K693116
3612A00965618K590842K619171K430674K238008K204716K072219J931703J937446
3604A18990397J685040J273008J096471Q79872P27330O17823M55898L41577K57327
$$ plain form
3663 24189560 24639729 24981120 25351469 25751960 26145721 26562903 26925583 27337091 27834978
3654 27834978 28325096 28774161 29376918 30009199 30680849 31298446 31943172 32601525 33316394
3645 33316394 34094428 34906635 35797877 36761664 37787415 38845698 39939060 41133702 42449845
3636 42449845 43865078 45426345 47105144 48800515 50499063 52384194 54427870 56447114
3628 56447114 58669310 61284924 63748030 66335754 69122924 72001744 74899125 77914028
3620 77914028 80880049 83957492 86959821 89819891 92664857 95478423 98272502 100965618
3612 100965618 103556460 106175631 108606305 110844313 113049029 115121248 117052951 118990397
3604 118990397 120675437 121948445 123044916 123924788 124652118 125269941 125725839 126067416 126324743
3595A26324743K21830L91422K56226K51537K48289K59280M09277K58323J58506
3586A28779433K45103K40738L53629M60606O52833Q34400J132176J438139J578766
3577A35715823J639293J992571K303290K727347K936349L156299L499844L893069
3569A57863885M266347M483863M597582M781689M977362N009247N113247N128337
3561A96221559M997815M915041M715753M674083M503998M307657M257446M248696
3553B32842048M009373L612924L291434K899973K498862J961143J396738Q73103
3545B53385598L26863q8515k81457n43747p09609n42194o26736n66859m65715
3536B49887629m53609m62775l91894l57994k13679j64835O8037L02102L30848
$$ plain form
3595 126324743 126546573 126937995 127194221 127445758 127694047 127953327 128362604 128620927 128779433
3586 128779433 129024536 129265274 129618903 130079509 130732342 131566742 132698918 134137057 135715823
3577 135715823 137355116 139347687 141650977 144378324 147314673 150470972 153970816 157863885
3569 157863885 162130232 166614095 171211677 175993366 180970728 185979975 191093222 196221559
3561 196221559 201219374 206134415 210850168 215524251 220028249 224335906 228593352 232842048
3553 232842048 236851421 240464345 243755779 246655752 249154614 251115757 252512495 253385598
3545 253385598 253712461 253623946 253342489 252798742 252089133 251546939 250920203 250353344 249887629
3536 249887629 249434020 248971245 248579351 248221357 248007678 247842843 247910880 248212982 248543830
3527B48543830O41247P95230J039737J246295J334568J392029J440626J595734
3519B58029296J822408J892835J891737J818862J689536J598231J620202J250295
3511B71613402J003274Q90551O33497M54647K49693p5079j79549l00028l66803
3502B73923605k20581m7361K78575O36873R71214J610098K304034K961331L849363
3493B86267151M616053N417455O378998P047086P478919P223299O634359N471982
3485C36535302L850477K259275N64867q42221j838432k227112k257428j923593
3477C34121135j437647r77593l40691m45157r61230j795163l087606m823147o515161
3468C13737740q308040r708575j0562152j0722222j0489423r788570q770497p751502
$$ plain form
3527 248543830 249185077 249980307 251020044 252266339 253600907 254992936 256433562 258029296
3519 258029296 259851704 261744539 263636276 265455138 267144674 268742905 270363107 271613402
3511 271613402 272616676 273507227 274140724 274595371 274845064 274769985 274590436 274290408 273923605
3502 273923605 273703024 273655663 273934238 274571111 275542325 277152423 279456457 282417788 286267151
3493 286267151 290883204 296300659 302679657 309726743 317205662 324428961 331063320 336535302
3485 336535302 340385779 342645054 343209921 342367700 340529268 338302156 336044728 334121135
3477 334121135 332683488 331705895 331365204 330920047 329958817 328163654 325076048 320252901 313737740
3468 313737740 305429700 295721125 285158973 274436751 263947328 254158758 245388261 237636759
3460B37636759o471032n577237m734445l950100l368767k685896k167204j785603
3452B06896475j394563q93342n58210m5239M65484J237552J847044K550530L458284
3443B13564015M163092M772363N283028N603145N455214M909314L996633K832945
3435B50579749J397800j82154j498250k673736l331133l615643l560428l398417
3427B33717788l193409k850812l036502l247662l923128m897211o136818p508021
3419A98924225q682093r728361j0400859j0551127j0575613j0091110r401255
3412A29493807q477450p611852o850672o329987n636137n132478m752642m405313
3404H0297276m028214l608263l337724l005413k822362k540429k242317j969040
$$ plain form
3460 237636759 231165727 225588490 220854045 216903945 213535178 210849282 208682078 206896475
3452 206896475 205501912 204608570 204050360 204005121 204470605 205708157 207555201 210105731 213564015
3443 213564015 217727107 222499470 227782498 233385643 238840857 243750171 247746804 250579749
3435 250579749 251977549 251795395 250297145 247623409 244292276 240676633 237116205 233717788
3427 233717788 230524379 227673567 224637065 221389403 217466275 212569064 206432246 198924225
3419 198924225 190242132 180513771 170112912 159561785 148986172 138895062 129493807
3412 129493807 121016357 113404505 106553833 100223846 94587709 89455231 84702589 80297276
3404 80297276 76269062 72660799 69323075 66317662 63495300 60954871 58712554 56743514
3396E6743514j905404j776360j551820j365740j368266j224364j066522r40390
3388D5544648p48606p05870o44961l39618m0896K13603N62142P24561R27201P78622
3378D6270826K96481r30260k108500k254060j788416j379382r55736o37259m46308
3369C6067386k34437k2631J01800K51955K82832L90341J87343J17736K20591O4123
3359C7427039k24106j89600k77291k25127M6239K20176L90020Q21675J293479
3350C9282504J884535K586193K791234K312547K048398m14105l298384l651821
3342D3541101l326871k656211j767499j032032o03735l60005N3856K73192M60363
3333C4582159O53663P28455O39959N91370L91382J8909l17704q33060j076708
$$ plain form
3396 56743514 54838110 53061750 51509930 50144190 48775924 47551560 46485038 45544648
3388 45544648 44796042 44090172 43445211 43105593 43064697 43278300 43840442 44565003 45492204 46270826
3378 46270826 46567307 45637047 43528547 41274487 39486071 38106689 37150953 36513694 36067386
3369 36067386 35832949 35810318 35912118 36164073 36446905 36837246 37024589 37142325 37362916 37427039
3359 37427039 37202933 37013333 36736042 36510915 36557154 36777330 37167350 37989025 39282504
3350 39282504 41167039 43753232 46544466 48857013 50905411 50491306 47192922 43541101
3342 43541101 40214230 37558019 35790520 34758488 34154753 33794748 33848604 34121796 34582159
3333 34582159 35235822 35964277 36604236 37195606 37586988 37605897 37288193 36455133 35378425
3324C5378425j164099j117409j133622q92419n68226j01848K73798M81737O61023
3315C1817360O31833M66978j13235j673903k137899j969969j579399j110098r03352
3306B3428316o34563m17964m26117j57679n4750M3522K7015P2618P3214L4731
3296B1988343n9062j99877m16816m52994n45579o64384p23566p61800p92105n88154
3286A6784006m59709m25093l97541l16666k51272k10851k32014k69999k53262
3277A3967599l07984l13626k72097m29371m84586k59453l01128k59690j25397
3268A1214267r0824j5495k06543j90472r2358n1513Q0450k2818L5178k9480j15892
3257A0514500j71684j13512L2704n1255p7443m2954N244n5492O3907O6347j34766
$$ plain form
3324 35378425 34214326 33096917 31963295 31070876 30502650 30400802 30674600 31156337 31817360
3315 31817360 32449193 32916171 32802936 31129033 28991134 27021165 25441766 24331668 23428316
3306 23428316 22793753 22375789 21949672 21791993 21737243 21780765 21807780 21880398 21953612 21988343
3296 21988343 21929281 21729404 21312588 20859594 20314015 19649631 18926065 18164265 17372160 16784006
3286 16784006 16324297 15899204 15501663 15184997 14933725 14722874 14490860 14220861 13967599
3277 13967599 13659615 13345989 13073892 12644521 12159935 11900482 11599354 11339664 11214267
3268 11214267 11123443 11107948 10901405 10710933 10618575 10567062 10647512 10624694 10659872 10630392 10514500
3257 10514500 10342816 10229304 10262008 10210753 10133310 10090356 10095600 10040108 10104015 10170362 10035596
3246A0035596J5882o924j07413k27868j51081M0901o6870j85140k288l9813l4586
3235I270396k6005L5187q0000k5383L9333J3817j16609N6837J6865J34797M0301
3224I359536J18935J00525k0411P7544Q1178J01349Q027m1427J35817J86448K8080
3213A0135601P7026J70552L22071K52043L92807L12577K94420L25238L55149K77516
3203A2915000J99685R7757J77449Q9136j78047j64233l3255j10483j75164j18360
3193A2699485k07506j43243q4949p1159p3521m4294l06792k10248j57463m31827
3183A0968483l11666k93904l54438l52139m22209l22128k60384k06512k13095
3174H232008k60173j14253j35918j31930j31273l7031o1491j8412L4186P5577
$$ plain form
3246 10035596 10051478 10044554 9937141 9709273 9558192 9599093 9532223 9347083 9344795 9304982 9270396
3235 9270396 9244391 9279578 9199578 9174195 9213528 9227345 9110736 9167573 9184438 9319235 9359536
3224 9359536 9478471 9578996 9558585 9636129 9717307 9818656 9826683 9785256 9921073 10107521 10135601
3213 10135601 10212627 10383179 10705250 10957293 11350100 11662677 11957097 12282335 12637484 12915000
3203 12915000 13114685 13212442 13389891 13479027 13300980 13136747 13103492 12993009 12817845 12699485
3193 12699485 12491979 12348736 12263787 12192628 12119107 12074813 11768021 11557773 11400310 10968483
3183 10968483 10656817 10362913 10008475 9656336 9234127 8911999 8651615 8445103 8232008
3174 8232008 7971835 7857582 7721664 7589734 7458461 7421430 7359939 7341527 7375713 7451290
3164G451290O4166K274P6175M5176J20500J00137J74142J90729J00717J51575
3154H476881J34057O961J4043P4479j44701k78512k84179k56797j27280k14635
3144G400317l04435r6624k6696o4562m2177j450L1504J1367o7978l2436J60559
3133F967389j18278l5303J2664r851r9475N9354J01426O335N7806Q6725M6988
3122G075780O9627J55372p0221J16936l2360j08503k28632q6968o8209m6105p3271
3111F703446j31095P2740J70253N9668O4185l3422j1687J41973M0603m3974M4155
3100G076845J46222M3959M9339J61555J73745M4871J45869R4786J17801P4579
3090H129571J03491K39798K55958J94746K18307J91638K58307P9686J78489K25528
$$ plain form
3164 7451290 7515456 7517730 7593905 7639081 7759581 7859718 8033860 8224589 8325306 8476881
3154 8476881 8610938 8617899 8631942 8706421 8561720 8283208 7999029 7742232 7614952 7400317
3144 7400317 7095882 6999258 6972562 6908000 6865823 6864373 6895877 6907244 6839266 6806830 6967389
3133 6967389 6849111 6813808 6826472 6816621 6717146 6776500 6877926 6884261 6942067 7028792 7075780
3122 7075780 7145407 7300779 7230558 7347494 7315134 7206631 6977999 6891031 6822822 6776717 6703446
3111 6703446 6572351 6645091 6815344 6875012 6939197 6905775 6894088 7036061 7076664 7032690 7076845
3100 7076845 7223067 7267026 7316365 7477920 7651665 7696536 7842405 7937191 8054992 8129571
3090 8129571 8233062 8472860 8728818 8923564 9141871 9333509 9591816 9671502 9849991 10075519
3080A0075519J68419K46954J41658K00027L22158K89906J08018Q5418K26233K47299
3070A2111609J79105J63607K88925K48459L78255M05964M05746M34826M00019
3061A5016515M64455N45366N22817P25370N07710N94962O97890Q11736Q65349
3052B0752170P32457R89278R69766J008090J079426J221185J230765J456677J701081
3043C1140895J753928J941136K315568K594627L055184L424448M033419M671584
3035E4930789N700880P089334Q895108J1114991J3589107J4492601J3297391J0093441
3027A39203642K624124q330487j5259466j5992740j3649136j0447839p519339
3020G0628759n149743l522381k411930j584395q53582m18839k24M85262J031929
$$ plain form
3080 10075519 10243938 10490892 10632550 10832577 11154735 11444641 11552659 11638077 11864310 12111609
3070 12111609 12290714 12454321 12743246 12991705 13369960 13775924 14181670 14616496 15016515
3061 15016515 15480970 16026336 16549153 17274523 17782233 18377195 19075085 19886821 20752170
3052 20752170 21484627 22473905 23443671 24451761 25531187 26752372 27983137 29439814 31140895
3043 31140895 32894823 34835959 37151527 39746154 42801338 46225786 50259205 54930789
3035 54930789 60631669 67721003 76616111 87731102 101320209 115812810 129110201 139203642
3027 139203642 141827766 133497279 118237813 102245073 88595937 78148098 70628759
3020 70628759 65479016 61956635 59544705 57960310 57106728 56687889 56687665 57172927 58204856
3011E8204856J627794K032502K759722L421410M283258N150400O049303P239007
3003I0768252Q741107J0891253J3827347J7783176K2719586K6529931K6452813
2996B17713465K2567084J3921002o693920k7703705l3846892l1259309k5411116
2989A29286609j8827741j3804108j0315712p741080o096292m754330m082125l151557
2981F0513664k609043j994157j285891q81022l13935K08064N64158R75559J483130
2972E6660527K319102K859932L827722N197785O580958Q595422J0574487J1574282
2964A08190217J0747502P801948J769373q001376j5016082j6042756j4273565
2957G5175261j1387587q562335o433096n171397m019393l271107k725713k486847
$$ plain form
3011 58204856 59832650 61865152 64624874 68046284 72329542 77479942 83529245 90768252
3003 90768252 99509359 110400612 124227959 142011135 164730721 191260652 217713465
2996 217713465 240280549 254201551 247507631 219803926 185957034 154697725 129286609
2989 129286609 110458868 96654760 86339048 78597968 72501676 67747346 63665221 60513664
2981 60513664 57904621 55910464 54624573 53743551 53429616 53637680 54201838 55177397 56660527
2972 56660527 58979629 61839561 65667283 70865068 77446026 86041448 96615935 108190217
2964 108190217 118937719 126739667 128509040 120507664 105491582 89448826 75175261
2957 75175261 63787674 55225339 48792243 43620846 39601453 36330346 33604633 31117786
2949C1117786k079542j755322j585962j324568j152699r97434r75332p10138o22175
2940A9914614p15131o89597n39421l77355l24766l12577l86752m16349l17080
2931A5835586k00856l26885l46327k26753m52872n32135n70568m59703n45544
2922A2173943l94730m66147k85981k57813m17840k68872j72605k51456k52605
2913I405894j78466j30892l7146j24772j1428m8940n4533j5121m0193L1133J56850
2902H952386J43438J62307K25274Q7313O3531j26274k49906k27898l55230l64261
2892H310680k06034o9935r2855k35336m7956J1622M158k0365o5979N29j21269
2881G467260r797n1679m9587j65910j211o1172p9426L058O5686j08078r3855P2355
$$ plain form
2949 31117786 29038244 27282922 25696960 24372392 23219693 22222259 21246927 20536789 19914614
2940 19914614 19199483 18509886 17970465 17593110 17268344 16955767 16569015 16152666 15835586
2931 15835586 15634730 15307845 14961518 14734765 14281893 13749758 13179190 12719487 12173943
2922 12173943 11779213 11313066 11027085 10769272 10351432 10082560 9909955 9658499 9405894
2913 9405894 9227428 9096536 9059390 8934618 8923190 8874250 8819717 8804596 8764403 8795536 8952386
2902 8952386 9095824 9258131 9483405 9570718 9634249 9507975 9258069 9030171 8674941 8310680
2892 8310680 8104646 8034711 7941856 7706520 7658564 7670186 7674344 7653979 7588000 7588529 7467260
2881 7467260 7457463 7405784 7356197 7190287 7189076 7127904 7048478 7051536 7117222 7009144 6915289 6987644
2869F987644L8922Q560N0652r0541r7585m4616m0785Q6009m3175m2070O3556J59577
2857G036148K28233J81891L38188L39629J26148j9531l12267m58405m66733m14328
2847F578973l23083l08098k29517l54894k25425k07233k26272j23479j03679o528
2837D470765q3830j53567r5237N1744N5958j60263p405M1296n0077O2682O9559
2826D201625M5543K4510m8246q7356O1985J1710j79206k03974n7006j84086j56009
2815C429490j38608j87991k35508j02880o8210j27048j58961k5730m7547q6065
2805B250942j07932m2294m688p1472n8122n96k6495q7267J2494j39269K2686n8407
2793A689580n2436J07699j25551n743R9269r3011m2503k4289p5006m3682j71645
$$ plain form
2869 6987644 7026566 7035126 7085778 6995237 6897652 6853036 6812251 6898260 6855085 6813015 6876571 7036148
2857 7036148 7264381 7446272 7784460 8124089 8250237 8230706 7918439 7460034 6993301 6578973
2847 6578973 6255890 5947792 5718275 5363381 5137956 4930723 4704451 4580972 4477293 4470765
2837 4470765 4386935 4233368 4138131 4189875 4245833 4085570 4078165 4119461 4069384 4132066 4201625
2826 4201625 4247168 4271678 4223432 4136076 4198061 4209771 4030565 3826591 3769585 3585499 3429490
2815 3429490 3290882 3102891 2867383 2764503 2696293 2569245 2410284 2384554 2337007 2250942
2805 2250942 2143010 2100716 2096028 2024556 1966434 1965838 1939343 1852076 1864570 1725301 1747987 1689580
2793 1689580 1637144 1744843 1619292 1613549 1712818 1619807 1577304 1553015 1478009 1434327 1262682
2782A262682j7912J02184r0368j31981j6878Q2232K4944o1422k2529P7170l97
2771A207725p13j0811p9212L2893j104o8873r6631N632K1429N2805p0658M6655
2759A039137R9526q1567k4772r6324m0986M8967O2605j25301m7948j23J94042
2748A027256n984r0181L604K04689J25734K5804N348m7278J3139j02359q2114
2737A077658n1493K4482L127k7144l3625j36271m800M08P10k400l3950q2793m1428
2724F92481J02150j8418M5981n2754J5212J01921L5449p7376q242J94929O4888
2713A096221J74005J67706J06651J56497L8464p8159j80487j30322j45243j79206
2703A026127j29661j60660p3699j7145k509k9380j7919J6105j01287m501O5175
$$ plain form
2782 1262682 1244770 1346954 1256586 1124605 1107727 1189959 1214903 1153481 1130952 1208122 1207725
2771 1207725 1207012 1196201 1116989 1149882 1148778 1079905 983274 988906 1010335 1063140 992482 1039137
2759 1039137 1138663 1057096 1032324 936000 895014 943981 1006586 881285 833337 833214 1027256
2748 1027256 1021272 931091 934695 1139384 1265118 1290922 1296270 1248992 1262131 1159772 1077658
2737 1077658 1026165 1050647 1053774 1026630 993005 856734 851934 852342 853052 850652 816702 733909 692481
2724 692481 794631 776213 822194 769440 784652 886573 922022 844646 836404 1031333 1096221
2713 1096221 1270226 1437932 1544583 1701080 1739544 1661385 1480898 1350576 1205333 1026127
2703 1026127 896466 735806 662107 644962 642453 613073 595154 611259 509972 505471 570646
2692E70646M1759r2223Q8483Q2956l3878r6320J42156m6524p123R24j6404O9843
2680G04295K5294J7509J05748R7507n1540j53487P9509j29259j78147L1072n8930
2669D89571j19539M4966k5781j12297J5657l4576P2386q587o5323J1467j5294
2658B52650q573k0442J0437j42l2900l137L6376L6296K6898J1698j1634j15346
2646A82181n8010P4150n5353k0730l726p987N234M7947N3100r2080j6531L7630
2634A45825q1955l5066k3454L2011L03N7914K6264J4647r4063q6755J5929L9168
2622A0768N5370R7628j58147O664Q1819J03564p9128j32289J23385N0769o1919
2611I8484l7791K456J01308j30088k3537K7326L2687p569j6560N5154l5136j9975
$$ plain form
2692 570646 612405 520182 608665 691621 657743 561423 703579 657055 649932 650856 634452 704295
2680 704295 729589 747098 852846 950353 898813 745326 824835 695576 517429 548501 489571
2669 489571 370032 414998 389217 276920 292577 258001 330387 321800 256477 267944 252650
2658 252650 244077 223635 234072 233930 201030 197893 234269 270565 297463 309161 297527 182181
2646 182181 124171 198321 142968 122238 118512 110525 115759 163706 216806 124726 108195 145825
2634 145825 63870 28804 5350 37361 37664 95578 121842 136489 42426 -44329 -28400 10768
2622 10768 66138 163766 5619 12283 94102 197666 118538 -13751 109634 160403 98484
2611 98484 60693 63149 164457 34369 10832 38158 70845 63276 46716 101870 66734 46759
2599D6759K1856L4091p3591o1679M3120k7340r352L1269P46r9736K6925O7529
2587E97L0632n211L8534Q0916n2629m7447j01395R1206K9569p5745L4119m8990
2575b5844N9679r628J4674J6477j68043M7751L9079q204o0047o6399N9696M3787
2563e7022K6961P7213o5966J0744J4843j69723R2506J09519p8642K4620m4425
2552e9372J772P6738M2290j25726j6132J4406P094l7615l5896Q4424N5003n2042
2540d5056n3961N1293o4955q06L0287j4676M3938n3720M0849k4193K4590L6687
2528b9723m0026q3688L5917n1048L9876r6214J4629J54720Q6468o9292o2069o173
2516a06623k6494R4632m4511j9772l6419l4185J1687M0419l9708Q2093o1919Q8332
$$ plain form
2599 46759 68615 102706 29115 -32564 10556 -16784 -26136 5133 5879 -93857 -66932 597
2587 597 31229 26018 64552 145468 92839 45392 -56003 35203 64772 -10973 23146 -25844
2575 -25844 33835 24207 38881 55358 -112685 -64934 -25855 -34059 -94106 -160505 -100809 -57022
2563 -57022 -30061 47152 -18814 -8070 6773 -162950 -70444 39075 -39567 -14947 -59372
2552 -59372 -57600 19138 61428 -64298 -80430 -66024 -58930 -96545 -132441 -48017 6986 -45056
2540 -45056 -99017 -47724 -112679 -113485 -83198 -97874 -53936 -107656 -66807 -91000 -66410 -29723
2528 -29723 -69749 -153437 -117520 -168568 -128692 -224906 -210277 -55557 30911 -38381 -100450 -106623
2516 -106623 -133117 -38485 -82996 -102768 -139187 -173372 -161685 -121266 -160974 -78881 -140800 -52468
2504e2468j5376q0687K1730J03992l3905l3716j0875m7190k6646O7886J69181
2493F1926q3489n0207M0390o0282j51036j9556J01301O2699n9386n3481J01805
2482a09316j2643j8487J0100k3787J4819O3779L462k3517J5528L1833j8788n4992
2470a22009J3846K8607l9811m1733N5655p5229o1810J17180J16361n8547o6088
2459a33578J8647Q8385K2056j1819o6261J6206l3477j23503o8990L2247R9080
2448a61007N5964P978L8954j8206k9711P739M593j8152P1465l0839r7446M07N4557
2435a13704o5752L6284R5058n8788q161n4658p2159R5300J4792j01023m4275J73139
2423a03947m5616K4460N9889p7616j9143m1590L4940m490K853J3612n7450l8162
$$ plain form
2504 -52468 -67844 -148531 -126801 -22809 -56714 -90430 -101305 -148495 -175141 -107255 61926
2493 61926 -21563 -71770 -31380 -91662 -242698 -262254 -160953 -98254 -157640 -211121 -109316
2482 -109316 -121959 -140446 -130346 -154133 -139314 -75535 -72073 -95590 -80062 -48229 -67017 -122009
2470 -122009 -108163 -79556 -119367 -161100 -105445 -180674 -242484 -125304 -8943 -67490 -133578
2459 -133578 -114931 -26546 -4490 -16309 -82570 -66364 -99841 -223344 -292334 -260087 -161007
2448 -161007 -105043 -97065 -58111 -76317 -106028 -98289 -93696 -111848 -40383 -71222 -168668 -168261 -113704
2435 -113704 -179456 -143172 -48114 -106902 -115063 -169721 -241880 -146580 -131788 -232811 -277086 -103947
2423 -103947 -149563 -125103 -65214 -142830 -161973 -203563 -168623 -173113 -170260 -156648 -214098 -252260
2411b52260k2785J01410J54782m4359k5335q5516M3900R757q758P514P532J4800
2399i9318Q0923p1019j58354J12689l159K5501K5768k0375K4798n8590M4107J4296
2387h2733J04670j0729r0148r493J20087r4654j10710N8169l8294j0596O5826
2376i8605m2923k9704n5098Q2180K4124o511l2991O319L1890j4237N4580Q6755
2364E779r0725o5745J06572l3186k7003k2350O0516L9934R320P1753k7935r2775
2352f5845o9963L60K1276K3453j1928o7533Q0030J27694n6715j15497N7331M6178
2340c1159q2193k6057m9530L8952J10604j4588Q1114q3572q5139P1629P4406M3560
2328D8027n8343p8584q0422n6816J5517J46934N8327j1159L6885L2287M6541M0057
$$ plain form
2411 -252260 -275045 -173635 -18853 -63212 -88547 -174063 -130163 -120406 -129164 -121650 -114118 -99318
2399 -99318 -18395 -89414 -247768 -135079 -138238 -112737 -86969 -107344 -82546 -141136 -97029 -82733
2387 -82733 21937 11208 -78940 -88433 31654 -63000 -173710 -115541 -153835 -164431 -98605
2376 -98605 -141528 -171232 -226330 -144150 -120026 -126537 -159528 -153209 -121319 -135556 -80976 5779
2364 5779 -84946 -150691 -44119 -77305 -104308 -126658 -66142 -26208 -16888 54865 26930 -65845
2352 -65845 -135808 -135448 -114172 -90719 -102647 -170180 -90150 37544 -19171 -134668 -77337 -31159
2340 -31159 -113352 -139409 -188939 -149987 -39383 -53971 27143 -56429 -141568 -69939 4467 48027
2328 48027 -10316 -88900 -169322 -226138 -210621 -63687 -5360 -16519 20366 52653 99194 139251
2316A39251k4418q2895j4451n2856o9024L9841j1107q577m0614J7771P7905n9910
2304h9084K2870J09890j19206k134J4359K3406j1479o4091K9247J1906K8581q0183
2292a25918r3206K2784J50899l0996R3381m9214j48556M5833N5802m9461N7446
2281g1206l8602m0276K5922R8006j2284j85258K3562J6124K1383O8376p1191o948
2269a72392L3880J1683M7851L4334L2987j862J8864k2625L5653l2282k4549L8516
2257E8o7297P4566j5888j28991P7195k6204m7752L4567k2684Q4961J2768j12546
2245a37247j4639M8909l9212K8630k6582j4165j9409M0344L1905J2681m7959M5084
2233i1660k529K9644l8903n628M4458L4301K8478K6207m5356j10590R2296o779
$$ plain form
2316 139251 114833 31938 17487 -35369 -104393 -64552 -75659 -84236 -124850 -107079 -29174 -89084
2304 -89084 -66214 43676 -75530 -77664 -63305 -39899 -51378 -115469 -86222 -74316 -45735 -125918
2292 -125918 -219124 -196340 -45441 -76437 16944 -32270 -180826 -134993 -79191 -128652 -71206
2281 -71206 -109808 -150084 -124162 -26156 -38440 -223698 -200136 -184012 -162629 -94253 -165444 -172392
2269 -172392 -138512 -126829 -78978 -44644 -11657 -13519 5345 -17280 18373 -13909 -38458 58
2257 58 -67239 7327 -8561 -137552 -60357 -86561 -134313 -99746 -122430 -37469 -24701 -137247
2245 -137247 -151886 -102977 -142189 -113559 -140141 -154306 -173715 -133371 -101466 -88785 -136744 -91660
2233 -91660 -94189 -64545 -103448 -109076 -64618 -30317 -1839 24368 -20988 -131578 -39282 -46061
2221d6061j6273Q390m635K1527R4699n7790J082K9956m0078j46899K283J27068
2209b6731Q2579j42638L7415O8577k8685K5213J7466n8722K8344m71l7111Q3078
2197D8314j7347j09480l8633K8684N2532N1661l4209J36730l2205l7300L8585
2186H7332o5994K7987J08757R977J2667m7823k2078j3436l5761M6307R7473r4258
2174A11150J7461o1524j3429r8473m500P0478o5374K7197M938J24758K3621o5279
2162G1024M6560N807Q8096K7182o5185o0024l8580R1652l4593J35888k915J1723
2150B76635j5643J3473J2784K2345m5752r74Q105N9452O5383p6998n3337L4391
2138B99864n4560J28511q90Q4568J10859p0492P035P1769l0856K3741L7659p37
$$ plain form
2221 -46061 -62334 -53944 -58579 -37052 57647 -143 939 30895 -9183 -156082 -153799 -26731
2209 -26731 55848 -86790 -49375 19202 -9483 15730 33196 -25526 2818 2347 -34764 48314
2197 48314 30967 -78513 -117146 -88462 -35930 15731 -18478 118252 86047 48747 87332
2186 87332 21338 49325 158082 168059 180726 132903 110825 97389 61628 107935 205408 111150
2174 111150 128611 67087 53658 -44815 -49315 21163 -44211 -17014 -12076 112682 136303 71024
2162 71024 117584 123391 211487 238669 173484 113460 74880 166532 131939 267827 264912 276635
2150 276635 260992 274465 287249 309594 263842 262868 270973 330425 395808 318810 265473 299864
2138 299864 245304 373815 372925 457493 568352 497860 504895 576664 545808 569549 607208 606471
2126F06471M4753l3362l1974J39678O924M84M2255Q1199N1782l2438J7523J9726
2114I13021m694J7207J13352O6396M1756m2547J33588R5962k3527J21253L6741
2103A468508L3039N412k4812J7019j5123N7353J26398n4008j05499N5803r3018
2092A471072R6758M8427L5112J74271J70965J51132P7279J5296K05782R9367N9130
2081B604591J29455K02017J89011J22087K26051K12000J18910J61434L57872L34761
2071D658189K49865M46224N06911N53152M86510O30737N98109N18648O04647P91395
2061A0044387J041776J189375J512771J821382K483280L041171M227577N199800
2053C0561519N206428M406908M003639n74783o784435p108057o104482m624196
$$ plain form
2126 606471 651224 617862 585888 725566 732490 732974 775229 856428 908210 875772 893295 913021
2114 913021 908327 925534 1038886 1105282 1147038 1104491 1238079 1334041 1310514 1431767 1468508
2103 1468508 1501547 1506959 1482147 1499166 1484043 1541396 1667794 1613786 1508287 1564090 1471072
2092 1471072 1567830 1616257 1651369 1825640 1996605 2147737 2225016 2240312 2446094 2545461 2604591
2081 2604591 2734046 2936063 3125074 3247161 3473212 3685212 3804122 3965556 4323428 4658189
2071 4658189 4908054 5354278 5861189 6414341 6900851 7531588 8129697 8648345 9252992 10044387
2061 10044387 11086163 12275538 13788309 15609691 18092971 21134142 25361719 30561519
2053 30561519 35767947 40174855 44178494 43603711 36819276 29711219 23606737 18982541
2045A8982541l161269k362344j845190j289062j002518r10647p71942m49276l13764
2036F876529k54040n20138o22936n63908m16446l27044k47648j41545j69930j80861
2026C432033j15569j30897k55870j76303j35351k17785j00555j17072o7737k4879
2016B090015q8097j31737j87858j31163j31397Q3299n5346q5770j11010r9021
2006A151915m5867j60269R4741m9148p0503l0872n6205N9046R38p0390o458j5878
1994H01050m9778k6246j45286M6535J14155P4008n5803r8689o0775N0046r3395
1983E55822J5712r999J4271l7499p7391q485J05537l9782n178j6068O0477N0741
1971F08158n5452k017n8900r4536K0372j2708Q0152j20176o422M7418j21702O7113
$$ plain form
2045 18982541 15821272 13458928 11613738 10324676 9322158 8411511 7639569 7190293 6876529
2036 6876529 6622489 6102351 5479415 4915507 4499061 4172017 3924369 3782824 3612894 3432033
2026 3432033 3316464 3185567 2929697 2753394 2618043 2400258 2299703 2182631 2114894 2090015
2016 2090015 2001918 1870181 1682323 1551160 1419763 1503062 1447716 1361946 1250936 1151915
2006 1151915 1106048 945779 1040520 991372 920869 889997 833792 892838 893776 823386 816928 801050
1994 801050 751272 725026 579740 626275 740430 814438 758635 659946 599171 649217 555822
1983 555822 571534 561535 575806 538307 460916 452431 557968 518186 513008 496940 557417 608158
1971 608158 552706 550689 491789 397253 417625 404917 485069 364893 358471 405889 284187 351300
1959C51300O253r9229P6778j1797r2384m9690m8057m3481J22591M9485K7072N5647
1947C44488j11272m8184N1617k9686n8271k7372O3928o436k2917r452k5381j1425
1935A09637j25046J13410L4589J8080l4532L0028n9217o3997P0321R293J05955
1924B08521o0002o8457k1045K912n7130K2830o613K0874m1929N8467L9166m0918
1912E6676N9454l122n3156k4044O9729l9368n2336J2331M8725j46132N4367L6679
1900A9803N3401J5333n1511o5760Q9223p9215k0705j7198Q2374L9254j518j1786
1888E1695j24072N8607l9261j7677q0045J0131Q9376O8346M0970j46229K1947
1877f6212L4301k5511N6Q4250j5247m5571J02668j19688j6342O6851k427Q0134
$$ plain form
1959 351300 357553 258324 335102 323305 230921 181231 133174 89693 212284 261769 288841 344488
1947 344488 233216 185032 236649 206963 148692 121320 185248 178812 155895 146443 121062 109637
1935 109637 -15409 98001 132590 150670 116138 146166 86949 22952 93273 102566 208521
1924 208521 148519 80062 59017 61929 4799 27629 21016 41890 -39 58428 97594 56676
1912 56676 116130 113008 59852 35808 105537 66169 13833 26164 74889 -71243 -16876 19803
1900 19803 73204 88537 37026 -28734 60489 -18726 -39431 -56629 25745 64999 63481 51695
1888 51695 -72377 -13770 -53031 -70708 -150753 -140622 -51246 17100 58070 -88159 -66212
1877 -66212 -31911 -57422 -57366 26884 11637 -33934 68734 -50954 -67296 -445 -2872 77262
1865G7262q2394j0156M221j9464Q103L2453p1463O2251L4731o587o8471k803O2806
1852B0489J4207n0914o382L868J6790L9730j02192N4708j23568m3450K09537j6367
1840A6456k4061L4815k5330l8194p6054O6800k3484L7410j13215O6251L8414J0107
1828c0085j0041r5383K6604Q2861l6829l4865o8385L7228N7728p3605N6727n0441
1816a38486j00383k4976Q1835K8870Q898O6273Q1658J7967J5954j6341p8725M3700
1804a3756l360j71063L7169P1355O4006p1794R331O5378j2331n2975P7190m5856
1792d6706j05192L503j0025J69685R4204p8934j8189r494P0635O1713l6069l8040
1780E7091p4940M4843k647Q9202m4403r3709k0301P3383p1669M8255m4364j00887
$$ plain form
1865 77262 -5132 -15288 -11067 -30531 -22428 10025 -61438 813 35544 28957 -39514 -42317 20489
1852 20489 34696 -16218 -22600 -18732 -1942 37788 -64404 -9696 -133264 -176714 32823 16456
1840 16456 -7605 27210 1880 -36314 -112368 -45568 -69052 -31642 -144857 -78606 -40192 -30085
1828 -30085 -40126 -135509 -108905 -26044 -62873 -97738 -166123 -128895 -71167 -144772 -88045 -138486
1816 -138486 -238869 -263845 -182010 -153140 -144242 -77969 3689 21656 37610 21269 -57456 -13756
1804 -13756 -17116 -188179 -151010 -79655 -15649 -87443 -78112 -12734 -25065 -78040 -850 -46706
1792 -46706 -151898 -148395 -158420 11265 105469 26535 8346 -1148 69487 131200 95131 57091
1780 57091 -17849 26994 24347 113549 69146 -24563 -44864 28519 -43150 5105 -39259 -140146
1768a40146M6592L1902p4056J3741J9367J0072M8152m155p9665l0861N4959n9241
1756a63339q3615J05163J26500k2822p4384K4597R5541j17097j43871L4239J40820
1745g8268m2788j8136O1215q658l2380m3535M607P1853n0785M1578O5397j35461
1733a65361k038M5358M4120m3945k0693R5228j2096p4341L5793O4996j24577N7714
1721i9842N9347K4674j8609k5176O7090p6786o4111M5806L9261p2082p4785m979
1709b00192J90642K8162j26777l5432o9445K1961J11000m4427L9232q1426Q651
1698a58051M7117o9428P8801l5348L2912p3052l7316J143O3176P9311J2982p4902
1686a32655M185j5123L9521N8428j4622Q8125l4282j681M1444r2578n5068O2386
$$ plain form
1768 -140146 -93554 -61652 -135708 -121967 -102600 -92528 -44376 -48531 -128196 -159057 -104098 -163339
1756 -163339 -246954 -141791 -15291 -38113 -112497 -87900 7641 -109456 -253327 -219088 -78268
1745 -78268 -121056 -139192 -77977 -86635 -119015 -162550 -157943 -86090 -136875 -95297 -29900 -165361
1733 -165361 -167399 -122041 -77921 -121866 -142559 -47331 -59427 -133768 -97975 -32979 -157556 -99842
1721 -99842 -40495 -15821 -34430 -59606 7484 -69302 -133413 -87607 -48346 -120428 -195213 -200192
1709 -200192 -9550 18612 -108165 -143597 -213042 -191081 -80081 -124508 -85276 -166702 -158051
1698 -158051 -110934 -180362 -101561 -136909 -103997 -177049 -214365 -213222 -150046 -70735 -57753 -132655
1686 -132655 -128470 -143593 -104072 -45644 -60266 27859 -6423 -8104 33340 -59238 -114306 -51920
1674e1920K0416j43607l9419l1620m842l9512J49184Q7871n6415J7846J01515
1663I497j00399J9227O1323m2902k4511l1983M4273P2718k3161l3723O9728j29322
1651a09235J8277l0472O6976K9027q7090k2179m754L3788K551K3011J6693k7257
1639i0664O5315r3493N7000K5047m4596R774k173j3868L9942q393j05266n4639
1627b16014r298J00456K8377M5626j5655j09967J33368M7082k3148n9727Q1437
1616B537m9332k9037P402l2023J35604M237j15023n9044J52272j06112L3002l5541
1604i1058L9019O5397j54030L3279O091o1120O8119O0426p937K4880j0922q3366
1592a11222Q3759O9482j41166j9358L7186L4682L2306J9170r1621N971R0954j02336
$$ plain form
1674 -51920 -31504 -175111 -214530 -246150 -250992 -290504 -141320 -53449 -109864 -92018 9497
1663 9497 -90902 -71675 -10352 -53254 -77765 -109748 -65475 7243 -15918 -49641 20087 -109235
1651 -109235 -90958 -121430 -54454 -25427 -112517 -134696 -139450 -105662 -103111 -80100 -63407 -90664
1639 -90664 -25349 -118842 -61842 -36795 -81391 -71617 -73790 -87658 -47716 -56109 -161375 -216014
1627 -216014 -225312 -124856 -96479 -50853 -66508 -176475 -43107 3975 -19173 -78900 2537
1616 2537 -46795 -75832 -68430 -100453 35151 39388 -75635 -134679 17593 -88519 -55517 -91058
1604 -91058 -52039 13358 -140672 -107393 -101302 -162422 -94303 -33877 -41814 -16934 -27856 -111222
1592 -111222 -27463 42019 -99147 -118505 -81319 -46637 -14331 4839 -86782 -80811 10143 -92193
1580i2193J4895R2455j15148q415R329j67j2585n8807P3418m9541L6195J16606
1568F042j8941p1041K4755l469j9204Q7199q1202j10236K09391K3118r8640k5477
1556g7705J01868p3348n9152J10496m2971o6746l7014M6672r6193L5618N508Q6497
1544f6470o6147p2199P4268l3184R1009o869l3105J0021N8988R5195K0590K81
1532G2378o5414r3369j5948O7650n0976j4397l2358N4552O8161p0286m931k6751
1520a11689J2384L0096L5010p0560K7981M1621M4917k5123j09265N4522l456j8012
1508i1574O3844o7503k793K7554R3832m9141N5186j0711j3851n9886M7094J30519
1496A22570p4176j55648j4649Q0853J419N2455j6582J1557m5572r9545q0962Q3112
$$ plain form
1580 -92193 -77298 15157 -99991 -108406 -99077 -99244 -111829 -170636 -97218 -146759 -110564 6042
1568 6042 -12899 -83940 -59185 -62654 -81858 5341 -75861 -186097 23294 46412 -52228 -77705
1556 -77705 24163 -49185 -108337 2159 -40812 -107558 -144572 -97900 -194093 -158475 -152967 -66470
1544 -66470 -132617 -204816 -130548 -163732 -72723 -79592 -112697 -102676 -43688 51507 72097 72378
1532 72378 6964 -86405 -102353 -34703 -85679 -100076 -132434 -77882 -9721 -80007 -84938 -111689
1520 -111689 -99305 -69209 -34199 -104759 -76778 -35157 9760 -15363 -124628 -70106 -73562 -91574
1508 -91574 -27730 -95233 -98026 -70472 23360 -25781 29405 18694 4843 -55043 -7949 122570
1496 122570 48394 -107254 -121903 -41050 -39631 12824 -3758 7799 -37773 -137318 -218280 -135168
1484a35168Q941J02732q7252K0558j708L6124J2650j229n2914k3242M0016r5307
1472a75799J0762J01212O5693r60q3077Q557k4647m4103N014P53J02765p67R0168
1459E5571m8613l939k677j293k784m5098J6825o1204k3670k1139K4945J08271
1447d805p957n4174J2303r235r5350L8619q051L6695Q3371Q8242o138j32730o7815
1434a27025L0198J24935m9556J2867k7954M3023q244o363N1366j05474p2356P5401
1422e9182N9333k270j3536j18480N9921o6771J9405N2289l3839J274r003K286
1410a08573n7743J03351Q4563n0611m9843P7810k5004O815k5253M8471L8893r5134
1398e2258j26078P3284J43058r432L6781k0698J2847n4302P7494j241j29999o5319
$$ plain form
1484 -135168 -126227 -23495 -110747 -90189 -91897 -55773 -43123 -44352 -97266 -120508 -80492 -175799
1472 -175799 -165037 -63825 1868 908 -82169 -73612 -98259 -142362 -137348 -136595 -33830 -34597 55571
1459 55571 6958 3019 342 -951 -3735 -48833 -32008 -93212 -116882 -138021 -113076 -4805
1447 -4805 -12762 -66936 -54633 -63868 -159218 -120599 -128650 -91955 -8584 79658 73520 -59210 -127025
1434 -127025 -96827 28108 -21448 -8581 -36535 6488 -1756 -8119 43247 -62227 -134583 -59182
1422 -59182 151 -2119 -15655 -134135 -74214 -140985 -121580 -69291 -103130 -101856 -110859 -108573
1410 -108573 -166316 -62965 21598 -29013 -78856 -1046 -26050 -19235 -44488 3983 42876 -52258
1398 -52258 -178336 -105052 38006 28574 65355 44657 57504 3202 80696 79455 -50544 -115863
1386a15863m504q3158N7892J56132o8843L4701j9078J6977N8511K690O795j43637
1374a01385P405K2396O3310P848l5011P5632r2544j10613Q865J00395R269o2783
1362a07216R1878q1989j17121J00855L2437Q714l5536J9439n4722P426R6267L2176
1350g392m4379o2998N087J20172k042p2631J7784O9601n4880K7712K1037J7043
1338C4114K0503q3851K1836K7161J6170n6179j6809k6342k1552m227J04948n7861
1326d2089p5141J3125K8035Q9812j0152m9905j731J6927R3286p2276k3878Q8397
1314E4410P532p9968M8091j5298j8525j17969l1220L0794L5281j7213k9550K6526
1302a07109O643q8522R5769L3955m923j5254m8688J24128K2668M7726m8294n8017
$$ plain form
1386 -115863 -120367 -203525 -145633 10499 -58344 -23643 -42721 -25744 32767 35457 42252 -101385
1374 -101385 -93980 -71584 -8274 -426 -35437 40195 -52349 -162962 -154097 -53702 -44433 -107216
1362 -107216 -15338 -97327 -214448 -113593 -81156 -72442 -107978 -88539 -143261 -135835 -39568 -7392
1350 -7392 -51771 -114769 -109682 10490 8448 -64183 -46399 23202 -31678 -3966 17071 34114
1338 34114 54617 -29234 -7398 19763 35933 -20246 -37055 -63397 -84949 -89176 15772 -42089
1326 -42089 -117230 -104105 -76070 13742 3590 -46315 -48046 -31119 62167 -10109 -33987 54410
1314 54410 61942 -18026 30065 14767 -3758 -121727 -152947 -122153 -86872 -104085 -133635 -107109
1302 -107109 -100466 -188988 -93219 -59264 -64187 -79441 -128129 -4001 18667 66393 18099 -39918
1290c9918k5047O0849j725n9038j915K3647K039Q0624P1995j7514r5652j01373
1278a03028M3809J01611p9952J3984P1015j5227L3797m3625p4739P34n5898J01977
1266e542n3023o742m0380Q9624Q4962N580m3803l2769n6005N010p2659J6537J30220
1253B1010j6473M8715q8968J3683K5510O487n657l828j1710L8021L4232l1987
1241B9035J7008j28295k6212P5421K3630k2219k8995l6741R626L4918n2635m7460
1229a52919K21559N2302j31347j6046m5301q2722Q2638J83907j5917p0153N3665
1218G9666l8808j33162P1596j2168m5295K3215O8134j1681l5006L0402p2610j5324
1206i1041j4941P1107L7391J5708L7548L830m9895j5581K9137p0671K166L1472
$$ plain form
1290 -39918 -64965 -4116 -5841 -64879 -66794 -43147 -41108 39516 111511 93997 -1655 -103028
1278 -103028 -59219 42392 -37560 -23576 47439 32212 66009 22384 -52355 -51621 -107519 -5542
1266 -5542 -58565 -65307 -105687 -16063 68899 74479 30676 -2093 -58098 -53088 -125747 -109210 21010
1253 21010 4537 53252 -35716 -22033 3477 9964 4307 479 -11231 26790 61022 29035
1241 29035 46043 -82252 -108464 -33043 -9413 -31632 -60627 -97368 -87742 -52824 -105459 -152919
1229 -152919 68640 120942 -10405 -26451 -71752 -154474 -71836 112071 96154 26001 79666
1218 79666 40858 -92304 -20708 -32876 -78171 -54956 13178 1497 -33509 -3107 -75717 -91041
1206 -91041 -105982 -34875 2516 18224 55772 59602 9707 -5874 23263 -47408 -45242 -13770
1194a3770j07956o8773K40965K2718j8914r330p7658r4394N3003Q2398l0664M1400
1182A9025L5174j3461J2882o3132p8206N4214J6929l0290j5619o846L5098k03484
1170b37716M7249J02389L071N5848Q394m961k9128J41746N3739j07955m471l1397
1158c192l0212m2498o799L7736Q0848K9372M728m7420n2515J3265k9626k4471
1146g0784Q2900o7110J2895Q7823m832l5924m7699J6822M1949l6077m5667O4919
1134g85L1032j05782J2535J02889p8602K4530O6269M4223q9032j20879j30089
1123b43691Q2474Q5914r353j4606J10449R2446k692m2964j7482o7301J6468J6725
1111F387K7265q3894j28364J42756K1167k5435k419J9215K4219J5745N4754L6394
$$ plain form
1194 -13770 -121726 -190499 50466 73184 54270 44940 -32718 -127112 -74109 8289 -22375 19025
1182 19025 54199 40738 53620 -9512 -87718 -33504 -16575 -46865 -62484 -69330 -34232 -237716
1170 -237716 -190467 -88078 -85007 -29159 -20765 -25726 -54854 86892 140631 32676 28205 -3192
1158 -3192 -33404 -75902 -82701 -44965 35883 65255 69983 22563 -29952 -16687 -46313 -70784
1146 -70784 12116 -54994 -42099 45724 40892 4968 -42731 -25909 16040 -20037 -65704 -785
1134 -785 30247 -75535 -63000 39889 -38713 -14183 52086 96309 7277 -113602 -243691
1123 -243691 -161217 -75303 -84656 -99262 11187 103633 100941 57977 40495 -26806 -10338 6387
1111 6387 33652 -50242 -178606 -35850 -14683 -40118 -42537 -23322 897 16642 71396 107790
1099A07790o6118l0552q4038q0102P039J3601q210J0006N371r402O5219O0936
1087h460L6564l3453J24281N8971r5260j2673Q1827j01037j54269N7452m0891
1076h6948M1735J01001K1286O2066n2199k156N1195m5509M7983r3211M6891j4085
1064G8049J1856l7299l9040k409m4256O3309K1124L6426K1083O9305q3601q138
1052H6409n1054M1201p6695L9583J7739L8204k8103m6812O6231j41991n2537O1858
1040d5967K7901j2773p8696R1497O681J3678N3182p26K8409j2999j756j9377O1809
1027A10863m9684j15180R511L6309L4542p3483K701Q5025n2063l3836m539P2695
1015B2861p0462L1042L9218M1538J7328q4048J8961j06217N6456J41082r9744
$$ plain form
1099 107790 41672 11120 -72918 -153020 -145981 -132380 -140590 -130584 -125213 -134615 -69396 -8460
1087 -8460 28104 -5349 118932 177903 82643 69970 151797 50760 -103509 -46057 -86948
1076 -86948 -45213 55788 77074 139140 86941 84785 135980 90471 138454 45243 92134 78049
1064 78049 89905 52606 13566 11157 -33099 30210 51334 87760 108843 178148 94547 86409
1052 86409 35355 76556 -139 39444 57183 95387 67284 20472 86703 -55288 -107825 -45967
1040 -45967 -18066 -30839 -109535 -18038 -11357 2321 55503 54777 83186 70187 68431 49054 110863
1027 110863 61179 -54001 -44490 -8181 26361 -47122 -44421 40604 -11459 -45295 -49834 22861
1015 22861 -47601 -16559 22659 64197 81525 -2523 16438 -89779 -33323 107759 8015
1004H015O2275j768p7940K4240o8963j9158j83J10691q346p3727L2581R961O8823
991F6501R8340o5090j08186O414L013N5565j22842l491P2959L0159M1415l0841
979D3916m9664O6412j73461O0045O9046j4689k3267o6383R9117l4781M9213J020
967B6524J6312l5227L4662j9343l5742o6960j4369K9811K9802J09245l1524J787
955D4978O225N0666j24602J2607l256j030m2112M4920P7591j00535o038N1708
943A1122q931j70304J14571K1434r676P4815j9709o0123O7928J4613j06825M8413
931b2672J1547k041J29121K852j7231O0562q8379L7072p4924j31223k5955K1584
919i9687P5441k0246q9755J51434M4889J8542j4513K8438L9344O5729k4744q3400
$$ plain form
1004 8015 70290 68522 -9418 14822 -54141 -73299 -73482 37209 28863 -44864 -12283 -2322 66501
991 66501 164841 99751 -8435 -2021 992 56557 -66285 -69776 3183 33342 74757 43916
979 43916 -5748 60664 -112797 -52752 16294 1605 -21662 -88045 11072 -23709 25504 26524
967 26524 42836 7609 42271 22928 -12814 -79774 -94143 -64332 -34530 74715 43191 44978
955 44978 51203 101869 -22733 -10126 -13382 -14412 -56524 -11604 65987 -34548 -40586 11122
943 11122 2191 -168113 -53542 -32108 -41784 33031 13322 -46801 21127 35740 -71085 -22672
931 -22672 -11125 -13166 115955 118807 101576 162138 73759 110831 35907 -95316 -121271 -99687
919 -99687 -24246 -44492 -134247 17187 62076 80618 66105 94543 133887 199616 174872 91472
907I1472n3332n0305O0102O7804j1073m4510n3534J976P1607n1810M0316p165
895F1548R5042o7400j1667j2186r0875n2227Q3129m4764j1673p7325L5739R3037
883C78O6047k8221j6245J3628m9442K692L5784L198o1663j5378P5839J1442o0876
870b2817o021R261M6492k4396o1436J4755n504L5705k7231o8482R1243l0604L9964
857i071J6387N431j3186J3190q0275P8147J6220L3611k5195j09142l071L6602
845d0352J7054r3946J06206L5698k7612L0375J0100m722j00419p294J22862K5059
833G3009l1540r8670M9247K5046Q758J1661P799M7348J10486k0025r3933m8558
821D0628o2956J9442O4292k4511m2338j8365M1847l9037M323O279j363J11373
$$ plain form
907 91472 38140 -12165 47937 115741 104668 60158 6624 8600 80207 28397 68713 61548
895 61548 156590 89190 77523 65337 -25538 -77765 5364 -39400 -51073 -128398 -92659 378
883 378 66425 38204 21959 35587 -13855 -11163 24621 27819 -33844 -49222 26617 38059 -22817
870 -22817 -28838 -19577 26915 2519 -58917 -44162 -49666 -13961 -41192 -109674 -18431 -49035 -9071
857 -9071 7316 12747 -439 12751 -67524 10623 26843 60454 35259 -73883 -76954 -40352
845 -40352 -23298 -117244 -11038 24660 -2952 27423 37523 32801 -67618 -74912 47950 73009
833 73009 41469 -57201 -7954 17092 25850 37511 45310 92658 203144 183119 89186 40628
821 40628 -22328 -2886 61406 36895 -5443 -23808 18039 -20998 -16675 -10396 -11759 99614
809I9614n1571j6067m9976N0701K155j1695j5516p428j38275K3603P2165K258
797d0032J21696n6105q1160O2241N6107n1627R6311J4976j12398m6812l0054N490
785f1367j6128m3236k520L7879O9714J02197K9278q2901k8059j4890N9768N3873
773A03608n0007K8930k6252k9623n1077K4801J10602q1177L0374m3459r2769J22954
761D6905J10334o0513j48625k6299Q9715M0077J5643o2858m4781L6669P15O3569
749F0551r1081l85P6955K4676j2357k8953k106p673j0872M2053M5155n7608J8657
736E7012n0390o9223J5873P3644l1062j24159J00717M4044L345O679K2096J45
724D8721o7457j5880j0776Q2004k4131j2805o5586J950P5806p940P3325M4803
$$ plain form
809 99614 48043 31976 -18000 32701 34856 23161 7645 217 -138058 -114455 -42290 -40032
797 -40032 81664 25559 -55601 6640 62747 11120 107431 122407 10009 -36803 -66857 -61367
785 -61367 -77495 -120731 -123251 -85372 -15658 86539 115817 32916 4857 -10033 49735 103608
773 103608 53601 82531 56279 26656 -24421 380 110982 29805 60179 16720 -76049 46905
761 46905 157239 96726 -51899 -78198 11517 51594 67237 4379 -40402 -3733 -3018 60551
749 60551 -30530 -30915 46040 70716 58359 29406 27300 19627 8755 50808 95963 38355 57012
736 57012 6622 -62601 -46728 26916 -4146 -128305 -27588 16456 19801 26480 48576 48721
724 48721 -18736 -34616 -45392 36612 12481 -324 -65910 -63960 11846 3906 77231 122034
712A22034M0394p6772o5112J5943M5939k4519o1272O4261J2169m4044M1489J19740
700A90250q7255j27560M7560Q8619p831J479k7675O4964L5290n7673k2564j38711
688d1107J9700p1298J73357N5746j0045L3271n7933p869l8111j5738k0628K3805
676D3150M7313r858j123m8224j8811M7610l229n4614K9560O9420l8669P7117n1166
663H8476j07064P2261p4450l6691J04614P8853n3496r9739K8386r0440R3712J37973
651A42395M630j01579l0565K5151N8562o1935o364j249j7595J10423l8169j0098
639G3607j1257p979J1145l6142l6978L5247J669m364M7343j3014K325p5821P95
626a3424O0596Q915m1160N5486j07088O6966P037K8486P1275q3590k4294N5025
$$ plain form
712 122034 162428 85656 20544 36487 82426 57907 -3365 60896 73065 29021 70510 190250
700 190250 102995 -24565 22995 111614 103783 105262 77587 142551 177841 120168 97604 -41107
688 -41107 -21407 -92705 80652 136398 126353 159624 101691 93822 55711 39973 19345 43150
676 43150 90463 80605 79482 31258 12447 60057 56828 2214 31774 101194 62525 139642 88476
663 88476 -18588 53673 -20777 -57468 47146 125999 72503 -27236 1150 -89290 4422 142395
651 142395 147025 45446 14881 40032 98594 36659 30295 29046 11451 121874 83705 73607
639 73607 62350 54371 65516 29374 -7604 27643 29312 24948 72291 59277 61602 -14219 -13424
626 -13424 47172 56087 14927 70413 -36675 30291 37328 65814 137089 53499 29205 84230
614H4230k4769p1984J05399N6811k383l4704m5277N2882j38072n5743J26991K6059
602G9440K0737J5749q5616l4869J14630N7004Q430n0500n1163k8992l1546M7407
590F0711J8085p116j0321p590J16144o576o5917k0194p80j3757j0133M2744R5222
577A90522n9417J183j20481j43131J17289J44841r704m9296P6661n4606K6133
566A19994N0031p9077N0412m7451l4464p1037k7486j1429K4988J08536M4368k1241
554A06144J9001j6949j6504k9401p6863k7711N5560M1861O5199p3394k5475m0696
542a9228J13589M2031K2252m770p6731m4717l1380N9270J8742R5372M4794o065
530B13159p5651j11357P9061l6434L7424P2726o4238k3291K4281M7278m6981N5818
$$ plain form
614 84230 59461 -12523 92876 149687 147304 112600 67323 120205 -17867 -73610 53381 79440
602 79440 100177 115926 30310 -4559 110071 167075 175505 125005 73842 44850 13304 60711
590 60711 78796 71680 61359 53769 169913 163337 97420 77226 76446 62689 52556 95300 190522
577 190522 131105 132288 11807 -131324 -14035 130806 121102 71806 148467 93861 119994
566 119994 170025 90948 141360 93909 59445 -11592 -39078 -50507 -25519 83017 127385 106144
554 106144 125145 108196 91692 62291 -14572 -42283 13277 55138 120337 46943 21468 -19228
542 -19228 94361 136392 158644 153874 77143 32426 1046 60316 79058 174430 219224 213159
530 213159 137508 26151 105212 68778 106202 178928 114690 91399 115680 162958 115977 171795
518A71795J55n3755m3382p8047J0966o4002j2179K08707m6438j6L1517L4541j22953
505C6909p1300P7753M479O4171j5215j47754R6372k2405J17320n2619r1504P6626
493G2833j0701j6643n0261M4891L083P3083N269k0407K9345o0841N51M0835r5607
480A5430Q6585m9815L9981R0363Q559n9033j18435O3102o648j05375l7416R4553
468B1851j0802K5772J5723k7800M5832k3100k5376K7059m23K6293L5483j28261
456a7749O4782j6370k3189P162r6840N1299j0212K6054L6894k4105J02053P9115
444A78894j37754j7681K4502M8313R1737o5049J9140l3907j2006L3651m0699r5429
432f288J3640R7154N0670J24740j21143q9826n376N7943q3443p270K339K6474
$$ plain form
518 171795 171950 118195 74813 -3234 7732 -56270 -68449 140258 93820 93804 125321 159862 36909
505 36909 -34391 43362 47841 112012 96797 -50957 45415 23010 140330 87711 -3793 72833
493 72833 62132 45489 -4772 40119 43202 116285 121554 101147 130492 69651 70202 111037 15430
480 15430 102015 52200 92181 182544 191103 132070 13635 76737 70089 -35286 -72702 21851
468 21851 11049 36821 52544 24744 70576 47476 22100 49159 48736 75029 110512 -17749
456 -17749 47033 30663 7474 14636 -82204 -30905 -41117 -15063 21831 -2274 99779 178894
444 178894 41140 23459 47961 96274 188011 122962 142102 108195 96189 129840 89141 -6288
432 -6288 7352 104506 155176 279916 158773 68947 63571 121514 38071 30801 33140 59614
420E9614J1128M339K6279P228p1248M6746O3218l1887L4767l8414m1396O3824
408A34198K242p3076K3508J8339l9141J6851R9588k2297m8118k0949k3019J4095
396H2221n1489N1036m8738J03096O3041j21658Q0362j17308Q5381O451R491o8209
384G3677M2850N186M5727Q30n2337l8953P2635M0133j492q2442l7464m6787O7737
371H9300J45339q1017k6172j18854m4148K3572l5025P4243J04896M5268L87m2260
359A35529k9510n2164j2692m4540N2338P4150J2781k3701R369j15078N4459k5583
347C5358K6089K28094o5288r9073J46158J2447j88449J15788l8708n5939O6610
336A83087j7772n0833J4666N2829n7933N0949k5649l335L682j6380n5073M5255
$$ plain form
420 59614 70742 75081 101360 108588 37340 84086 147304 115417 150184 111770 70374 134198
408 134198 136440 63364 86872 105211 66070 82921 182509 160212 112094 91145 68126 82221
396 82221 30732 81768 33030 136126 199167 77509 157871 40563 125944 132395 141886 73677
384 73677 116527 121713 167440 168270 115933 76980 149615 189748 188256 105814 68350 21563 89300
371 89300 234639 153622 127450 8596 -35552 -11980 -47005 27238 132134 177402 177789 135529
359 135529 106019 53855 41163 -3377 48961 123111 135892 112191 121560 6482 60941 35358
347 35358 61447 289541 224253 125180 271338 283785 95336 211124 172416 116477 183087
336 183087 165315 114482 129148 181977 124044 174993 149344 146009 149691 133311 78238 123493
324A23493k8725L4579o7007l5672N4006N896k7788K0512k6416o9410N4640j3654
312B4454J7347j25639O9573J12539J2122L4980J10181l438l7332j06722J6572
301A24637r330K3125M5196j6466L1091o5000j2930M0068L4944j8067p6650l3962
289F6656k9657N045M1061l9189M0096L2737j3166m4928P0052p3323L0621J4480
$$ plain form
324 123493 94768 129347 62340 26668 80674 86570 58782 79294 52878 -16532 38108 24454
312 24454 41801 -83838 -14265 98274 110396 145376 255557 252119 214787 108065 124637
301 124637 115307 138432 183628 167162 198253 133253 120323 160391 195335 177268 100618 66656
289 66656 36999 42044 83105 43916 84012 116749 103583 58655 128707 55384 86005 100485
$$ [...]
##END NTUPLES=NMR SPECTRUM
##END=
