##TITLE=1H_TG-2365-F
 CDCl3
 8 sc, 
 21.2.2023
##JCAMPDX= 6.0         $$ Bruker NMR JCAMP-DX V2.0
##DATA TYPE= NMR FID
##DATA CLASS= NTUPLES
##ORIGIN= UXNMR, Bruker Analytische Messtechnik GmbH
##OWNER= root
$$ XWIN-NMR		Version 3.5
$$ Tue Feb 21 16:50:10 2023 Russian Standard Time (UT+4h)  she@DPX200
##.OBSERVE FREQUENCY= 200.13135
##.OBSERVE NUCLEUS= ^1H
##.DELAY= (6, 6)
##.ACQUISITION MODE= SIMULTANEOUS
##.ACQUISITION SCHEME= undefined
##.AVERAGES= 8
##.DIGITISER RES= 18
##SPECTROMETER/DATA SYSTEM= spect
##.PULSE SEQUENCE= zg30
##.SOLVENT NAME= D2O
##.SHIFT REFERENCE= (INTERNAL, D2O, 0, 15.7039)
##AUDIT TRAIL= $$ (NUMBER, WHEN, WHO, WHERE, WHAT)
$$ ##TITLE= Audit trail, XWIN-NMR		Version 3.5
$$ ##JCAMPDX= 5.01
$$ ##ORIGIN= Bruker BioSpin GmbH
$$ ##OWNER= she
$$ F:/spectra/data/she/nmr/H-F/1/audita.txt
$$ ##AUDIT TRAIL=  $$ (NUMBER, WHEN, WHO, WHERE, WHAT)
(   1,<2023-02-21 16:47:46.14 +0400>,<she>,<DPX200>,
      <created by zg, POWCHK disabled, PULCHK disabled
       configuration hash MD5:
       00 E9 B6 7A A2 85 ED C7 34 08 36 98 17 FE 4E 26
       data hash MD5: 16K
       EF 58 01 91 D8 33 40 7C 13 F9 CC 9E 0B 2B 62 4F>)
$$ ##END=
$$ 
$$ hash MD5
$$ A8 9E D1 E3 79 3C 57 1A AC 0B EE A8 77 EF 45 C0
##$RELAX= 
##$RELAX= 
##$RELAX= 
##$RELAX= 
##$RELAX= 
##$RELAX= 
$$ Bruker specific parameters
$$ --------------------------
##$DU= <F:/spectra>
##$EXPNO= 1
##$NAME= <H-F>
##$PROCNO= 1
##$TYPE= <nmr>
##$USER= <she>
##$AMP= (0..31)
100 100 100 100 100 100 100 100 100 100 100 100 100 100 100 100 100 100 
100 100 100 100 100 100 100 100 100 100 100 100 100 100 
##$AQSEQ= 0
##$AQ_mod= 1
##$AUNM= <au_zg>
##$AUTOPOS= <>
##$BF1= 200.13
##$BF2= 200.13
##$BF3= 200.13
##$BF4= 200.13
##$BF5= 200.13
##$BF6= 200.13
##$BF7= 200.13
##$BF8= 200.13
##$BYTORDA= 1
##$CFDGTYP= 0
##$CFRGTYP= 5
##$CHEMSTR= <none>
##$CNST= (0..31)
1 1 145 1 1 1 1 1 1 1 1 1 1 1 1 1 1 1 1 1 1 1 1 1 1 1 1 1 1 1 1 1 
##$CPDPRG= <>
##$CPDPRG1= <>
##$CPDPRG2= <>
##$CPDPRG3= <>
##$CPDPRG4= <mlev>
##$CPDPRG5= <mlev>
##$CPDPRG6= <mlev>
##$CPDPRG7= <mlev>
##$CPDPRG8= <mlev>
##$CPDPRGB= <>
##$CPDPRGT= <>
##$D= (0..31)
0 1.2 0 0 0 0 0 0 0 0.06 0 0.03 0 0 0 0 0.0002 0 0 0 0 0 0 0 0 0 0 0 0 
0 0 0 
##$DATE= 1676983665
##$DBL= (0..7)
120 120 120 120 120 120 120 120 
##$DBP= (0..7)
150 150 150 150 150 150 150 150 
##$DBP07= 0
##$DBPNAM0= <>
##$DBPNAM1= <>
##$DBPNAM2= <>
##$DBPNAM3= <>
##$DBPNAM4= <>
##$DBPNAM5= <>
##$DBPNAM6= <>
##$DBPNAM7= <>
##$DBPOAL= (0..7)
0.5 0.5 0.5 0.5 0.5 0.5 0.5 0.5 
##$DBPOFFS= (0..7)
0 0 0 0 0 0 0 0 
##$DE= 6
##$DECBNUC= <off>
##$DECIM= 32
##$DECNUC= <off>
##$DECSTAT= 4
##$DIGMOD= 1
##$DIGTYP= 9
##$DL= (0..7)
0 120 120 120 120 120 120 120 
##$DP= (0..7)
150 150 150 150 150 150 150 150 
##$DP07= 0
##$DPNAME0= <>
##$DPNAME1= <>
##$DPNAME2= <>
##$DPNAME3= <>
##$DPNAME4= <>
##$DPNAME5= <>
##$DPNAME6= <>
##$DPNAME7= <>
##$DPOAL= (0..7)
0.5 0.5 0.5 0.5 0.5 0.5 0.5 0.5 
##$DPOFFS= (0..7)
0 0 0 0 0 0 0 0 
##$DQDMODE= 0
##$DR= 18
##$DS= 0
##$DSLIST= <SSSSSSSSSSSSSSS>
$$ [...]
##$SUBNAM2= <"">
##$SUBNAM3= <"">
##$SUBNAM4= <"">
##$SUBNAM5= <"">
##$SUBNAM6= <"">
##$SUBNAM7= <"">
##$SUBNAM8= <"">
##$SUBNAM9= <"">
##$SW= 18.05172834244
##$SWIBOX= (0..15)
0 0 2 0 0 0 0 0 0 0 0 0 0 0 0 0 
##$SW_h= 3612.71676300578
##$TD= 16384
##$TD0= 1
##$TE= 0
##$TE2= 300
##$TE3= 300
##$TEG= 300
##$TL= (0..7)
0 120 120 120 120 120 120 120 
##$TP= (0..7)
150 150 150 150 150 150 150 150 
##$TP07= 0
##$TPNAME0= <>
##$TPNAME1= <>
##$TPNAME2= <>
##$TPNAME3= <>
##$TPNAME4= <>
##$TPNAME5= <>
##$TPNAME6= <>
##$TPNAME7= <>
##$TPOAL= (0..7)
0.5 0.5 0.5 0.5 0.5 0.5 0.5 0.5 
##$TPOFFS= (0..7)
0 0 0 0 0 0 0 0 
##$TUNHIN= 0
##$TUNHOUT= 0
##$TUNXOUT= 0
##$USERA1= <user>
##$USERA2= <user>
##$USERA3= <user>
##$USERA4= <user>
##$USERA5= <user>
##$V9= 5
##$VALIST= <valist>
##$VCLIST= <CCCCCCCCCCCCCCC>
##$VD= 0
##$VDLIST= <DDDDDDDDDDDDDDD>
##$VPLIST= <PPPPPPPPPPPPPPP>
##$VTLIST= <TTTTTTTTTTTTTTT>
##$WBST= 1024
##$WBSW= 4
##$XGAIN= (0..3)
0 0 0 0 
##$XL= 0
##$YL= 0
##$YMAX_a= 785940
##$YMIN_a= -1145400
##$ZGOPTNS= <>
##$ZL1= 120
##$ZL2= 120
##$ZL3= 120
##$ZL4= 120
##$ABSF1= 10
##$ABSF2= 0
##$ABSG= 5
##$ABSL= 3
##$ALPHA= 0
##$AQORDER= 0
##$ASSFAC= 0
##$ASSFACI= 0
##$ASSFACX= 0
##$ASSWID= 0
##$AUNMP= <proc_1d>
##$AZFE= 0.1
##$AZFW= 0.1
##$BCFW= 1
##$BC_mod= 2
##$BYTORDP= 1
##$COROFFS= 0
##$CY= 11.3945322036743
##$DATMOD= 1
##$DC= 2
##$DFILT= <>
##$DTYPP= 0
##$F1P= 2.36226072786647
##$F2P= -0.459571619588291
##$FCOR= 0.5
##$FTSIZE= 0
##$FT_mod= 4
##$GAMMA= 1
##$GB= 0.15
##$INTBC= 1
##$INTSCL= 1
##$ISEN= 128
##$LB= 0.24
##$LEV0= 0
##$LPBIN= 0
##$MAXI= 10000
##$MC2= 0
##$MEAN= 0
##$ME_mod= 0
##$MI= 1.114404
##$NCOEF= 0
##$NC_proc= 0
##$NLEV= 6
##$NOISF1= 3.799351
##$NOISF2= 2.8
##$NSP= 1
##$NTH_PI= 0
##$NZP= 0
##$OFFSET= 15.70392
##$PC= 1
##$PHC0= -19104.21
##$PHC1= 11.60078
##$PH_mod= 1
##$PKNL= yes
##$PPARMOD= 0
##$PSCAL= 0
##$PSIGN= 0
##$REVERSE= no
##$SF= 200.130013532006
##$SI= 16384
##$SIGF1= 3
##$SIGF2= 2
##$SINO= 400
##$SIOLD= 16384
##$SREGLST= <1H.CDCl3>
##$SSB= 0
##$STSI= 0
##$STSR= 0
##$SW_p= 3612.71676300578
##$SYMM= 0
##$S_DEV= 0
##$TDeff= 0
##$TDoff= 0
##$TI= <>
##$TILT= no
##$TM1= 0
##$TM2= 0
##$TOPLEV= 0
##$USERP1= <user>
##$USERP2= <user>
##$USERP3= <user>
##$USERP4= <user>
##$USERP5= <user>
##$WDW= 1
##$XDIM= 8192
##$YMAX_p= 0
##$YMIN_p= 0
$$ End of Bruker specific parameters
$$ ---------------------------------
##NTUPLES= NMR FID
##VAR_NAME=  TIME,          FID/REAL,        FID/IMAG
##SYMBOL=    X,             R,               I
##VAR_TYPE=  INDEPENDENT,   DEPENDENT,       DEPENDENT
##VAR_FORM=  AFFN,          ASDF,            ASDF
##VAR_DIM=   8192,          8192,            8192
##UNITS=     SECONDS,       ARBITRARY UNITS, ARBITRARY UNITS
##FACTOR=    0.0002768,     1,               1
##FIRST=     0,             0,               0
##LAST=      2.2672688,     0,               0
##MIN=       0,             -1145400,        0
##MAX=       2.2672688,     785940,          0
$$ Real data points
##PAGE= N=1
##DATA TABLE= (X++(R..R)), XYDATA
$$ plain form
0 0 0 0 0 0 0 0 -8 8 -8 8 -16 24 -32 32 -40 56 -72 88 -104 120 -150 176 -208 248 -288 338 -395 456 -527
29 -527 602 -691 791 -895 1012 -1144 1290 -1449 1623 -1813 2023 -2254 2504 -2775 3074 -3401
45 -3401 3759 -4147 4572 -5037 5551 -6116 6733 -7423 8190 -9050 10019 -11118 12381
58 12381 -13847 15576 -17646 20179 -23364 27502 -33124 41226 -53965 76953 -131150 510341
70 510341 -111823 -1120568 454938 472748 -615139 -130494 701742 -305206 -567311 565673
80 565673 472878 -618647 -176673 474277 -116859 -318571 365877 94118 -483014 60856
90 60856 415142 -259810 -184851 430955 -31832 -476414 249759 363559 -447817 -209580
100 -209580 559580 -1646 -542529 241351 443279 -447801 -298210 539474 147444 -484461
$$ packed form
0@%%%%%%qJ6j6J6k4M0n6O4p2R6j28J60j92K24k70L26l84M56n36O26p33Q51r83
29e27J129j293J482j686J907k156K434k739L072l436L836m277M758n279N849o475
45c401P160p906Q719r609J0588j1667J2849j4156J5613j7240J9069k1137K3499
58A2381k6228K9423l3222L7825m3543N0866o0626P4350r5191J30918k08103O41491
70E10341o22164j008745J575506J7810j087887M84645Q32236j006948k62105J132984
80E65673r2795j091525M41974O50950n91136k01712O84448k71759n77132N43870
90F0856L54286o74952P4959O15806m62787m44582P26173J13800q11376K38237
100b09580P69160n61226n40883P83880K01928q91080J49591Q37684l92030o31905
$$ plain form
110 -484461 60549 356276 -291565 -242842 416872 105680 -417328 40642 349220 -127517
120 -127517 -231407 130117 54226 -102900 129966 84091 -215556 -49785 159083 -47717
130 -47717 -56932 161412 -6032 -190062 101643 194404 -188335 -182757 198092 104676 -157701
141 -157701 24232 137072 -121560 -127295 177217 122593 -181121 -106040 137233 67757 -102567
152 -102567 -69192 48315 63166 -1244 -20157 4187 -9573 -40653 -7477 57304 9424 -76853
164 -76853 7506 96686 -19937 -96468 33270 92552 -39041 -67824 61996 41053 -81051
175 -81051 -30505 58596 15216 -24600 8975 23458 -12486 -36197 -9312 40353 39175 -49300
187 -49300 -66737 60883 65326 -76946 -42215 82643 8872 -66571 59316 71065 -122434
$$ packed form
110d84461N45010K95727o47841M8723O59714l11192n23008M57970L08578m76737
120a27517j03890L61524p5891j57126K32866m5875k99647J65771K08868k06800
130d7717r215K18344j67444j84030K91705R2761l82739N578L80849r3416k62377
141a57701J81933J12840k58632n735L04512n4624l03714P5081K43273o9476j70324
152a02567L3375J17507J4851o4410j8913K4344j3760l1080L3176O4781m7880q6277
164g6853Q4359Q9180j16623p6531J29738N9282j31593k8783J29820k0943j22104
175h1051N0546Q9101m3380l9816L3575J4483l5944k3711K6885M9665j178q8475
187d9300j7437J27620M443j42272L4731J24858p3771p5443J25887J1749j93499
$$ plain form
198 -122434 -76091 150596 48953 -153697 -11171 139094 -8856 -94020 36091 48705
208 48705 -56179 -7711 50321 -31227 -37516 31237 1588 -23672 23555 13724 -26724 13029
220 13029 21396 -51437 -12215 67191 -29345 -78979 68062 80298 -83579 -57813 100638 34557
232 34557 -96603 8187 80265 -54268 -58356 76714 29727 -79038 2507 78235 -19779
243 -19779 -51349 39723 10556 -54903 16492 40936 -36804 -23188 36953 544 -23850 29332
255 29332 6232 -47994 28135 54240 -62653 -48247 75125 24617 -77796 3914 79023
266 79023 -20690 -51713 47632 17928 -62782 10358 54823 -40378 -51889 50766 42856 -49750
278 -49750 -24520 40619 6253 -20519 2327 -6252 -10618 13992 3086 -24598 4139 35263
$$ packed form
198a22434M6343K26687j01643k02650J42526J50265j47950q5164J30111J2614
208D8705j04884M8468N8032q1548o289O8753k9649k5260M7227r831m0448L9753
220A3029Q367p2833L9222P9406r6536m9634J47041J2236j63877K5766J58451o6081
232C4557j31160J04790P2078j34533m088J35070m6987j08765Q1545P5728r8014
243a9779l1570R1072k9167o5459P1395K4444p7740J3616O0141l6409k4394N3182
255B9332k3100n4226P6129K6105j16893J4406J23372n0508j02413Q1710P5109
266G9023r9713l1023R9345k9704q0710P3140M4465r5201j1511J02655p910r2606
278d9750K5230O5139l4366k6772K2846q579m366K4610j0906k7684K8737L1124
$$ plain form
290 35263 -8701 -27514 27105 21555 -30866 -8132 25756 -8243 -24811 20811 22261 -29386
302 -29386 -4204 44854 -3941 -42625 8880 32148 -15578 -29799 10770 13887 -13275 999
314 999 12347 -5868 -3259 6250 -659 -4135 -2170 -3680 -4960 4827 7050 -7059 -945 13148
328 13148 3829 -324 -548 -9073 -3058 9208 3328 -15919 -11800 18319 18113 -9409 -14389 636
342 636 13713 5441 -17140 -14980 5244 13380 916 -15483 -5190 15098 13463 -199 -12620
355 -12620 -7267 12393 11451 -8776 -18919 -1055 23669 9275 -14810 -1890 13500 3925 -6640
368 -6640 -2881 -2097 -9415 3242 12229 -10777 -12120 12887 8915 -7230 -1340 3828 -8736 -7703
382 -7703 12330 371 -19935 2216 17241 -1486 -5456 5252 3244 -830 6645 -129 -20625
$$ packed form
290C5263m3964j8813N4619n550n2421K2734L3888l3999j6568M5622J450n1647
302b9386K5182M9058m8795l8684N1505K3268m7726j4221M0569L117k7162J4274
314I99J1348j8215K609R509o909l476J965j510j280R787K223j4109O114J4093
328A3148r319m153k24q525O015J2266n880j9247M119L0119k06k7522m980J5025
342F36J3077q272k2581K160K0224Q136j2464j6399J0293K0288j635j3662j2421
355a2620N353J9660r42k0227j0143J7864K4724j4394k4085J2920J5390r575j0565
368f640L759P84p318J2657Q987k3006j343K5007l972j6145N890N168j2564J033
382g703K0033j1959k0306K2151J5025j8727l970J0708k008m074P475o774k0496
$$ plain form
395 -20625 -2215 25088 -1352 -23473 3967 20711 1838 -8810 1406 -3371 -9334 11180
407 11180 5468 -24693 -5418 26078 2707 -22383 4533 21662 -9827 -13260 16741 882
419 882 -19669 6424 10851 -13155 233 23280 -1953 -20792 13588 20242 -18422 -12915 12669
432 12669 -2961 -10303 9902 4607 -13765 3738 17745 -12302 -15512 18951 3994 -25918 -1337
445 -1337 17503 -6285 -10498 12355 3686 -14212 11193 18970 -16823 -14815 15052 4818 -12691
458 -12691 2388 9623 -9220 -2585 21878 2841 -20067 1530 11033 -6928 -4849 4123 -8470
471 -8470 -8012 18743 10579 -24775 -6265 26194 2561 -18751 -2071 4422 -2969 5357 5702 -15976
485 -15976 -6248 27573 11211 -21457 -5774 12086 2757 -2370 -1908 -10506 -5373 17058 9145 -17593
$$ packed form
395b0625J8410K7303k6440k2121K7440J6744j8873j0648J0216m777n963K0514
407A1180n712l0161J9275L1496k3371k5090K6916J7129l1489l433L0001j5859
419H82k0551K6093M427k4006J3388K3047k5233j8839L4380O654l8664N507K5584
432A2669j5630p342K0205n295j8372J7503J4007l0047l210L4463j4957k9912K4581
445a337J8840k3788m213K2853q669j7898K5405P777l5793K008K9867j0234j7509
458a2691J5079P235j8843O635K4463j9037k2908K1597R503j7961K079Q972j2593
471h470M58K6755q164l5354J8510L2459k3633k1312J6680O493p391Q326L45k1678
485a5976R728L3821j6362l2668J5683J7860r329n127M62q598N133K2431p913k6738
$$ plain form
499 -17593 -3571 16456 -2389 -11184 4735 1989 -12299 -3108 10284 -2877 -7842 9601 4593
512 4593 -9473 2842 9557 -4306 -7683 3397 889 -7484 5267 11860 -5083 -5623 7854 4418
526 4418 -1044 818 -5225 -11126 3014 15334 -3621 -15830 3969 10517 -2422 -1434 2991 -4470
540 -4470 -6479 3789 3116 -7117 -218 5439 -5348 730 13868 836 -12213 -918 9269
553 9269 1197 -3680 -809 -6565 -1350 14194 3487 -12437 -751 11207 1831 -8116 -4094 -374
567 -374 -1919 1494 1202 -4984 783 6075 -709 -4267 1132 4982 -867 -5469 -1310 -768 -310 5152
583 5152 2170 -2032 3173 6377 319 -5147 -1966 -568 -3261 3864 5724 -5640 -6348 4603 7221
598 7221 -67 -5299 -2837 22 1418 858 -7221 -6900 6194 8835 -561 -4394 -262 2855 566
$$ packed form
499a7593J4022K0027j8845q795J5919k746j4288R191J3392j3161m965J7443n008
512D593j4066J2315O715j3863l377J1080k508q373J2751O593j6943n40J3477l436
526D418n462J862o043n901J4140J2320j8955j2209J9799O548j2939R88M425p461
540d470k009J0268o73j0233O899N657j0787O078J3138j3032j3049J1295J0187
553I269q072m877K871n756N215J5544j0707j5924J1686J1958r376r947M022L720
567c74j545L413k92o186N767N292o784l558N399L850n849m602M159N42M58N462
583E152k982m202N205L204o058n466L181J398k693P125J860j1364p08J0951K618
598G221p288n232K462K859J396n60q079L21J3094K641r396l833M132L117k289
$$ plain form
613 566 -188 -1329 -2574 3477 3772 -4618 -2425 4848 2930 -1514 933 4398 -962 -5473 -2427 -1293
629 -1293 1181 3323 -2069 -4068 1563 4138 528 -3868 -2201 1956 2391 163 -4427 -5258 1233 5070
645 5070 3672 1085 83 2330 182 -3352 -889 539 -586 -58 1153 1128 -39 881 1857 -1569
661 -1569 -1711 1254 1 -2277 -4893 -4629 1461 5712 3986 -1906 -4207 745 3056 672 -2396 -5036
677 -5036 -606 6393 4484 -3203 -5874 1549 8240 3217 -2978 -3196 -265 2219 -1310 -4063 -677
692 -677 2504 2366 67 -2605 -1396 468 779 -683 -2498 23 1109 -1594 -2019 -534 1822 3711
708 3711 1429 -71 803 31 -1485 -2304 344 2279 -341 -38 1666 501 364 762 539 -287 -1660
725 -1660 -1514 -1873 -1684 -324 -566 616 2299 748 -198 -419 -1522 -1409 -964 -259 711 539 920 277
$$ packed form
613E66p54j141j245O051K95q390K193P273j918m444K447L465n360m511L046J134
629a293K474K142n392j999N631K575l610m396J667M157M35k228m590q31O491L837
645E070j398k587j002K247k148l534K463J428j125N28J211k5j167R20R76l426
661a569j42K965j253k278k616K64O090M251j726n892k301M952K311k384l068k640
677e036M430O999j909p687k671P423O691n023o195k18K931K484l529k753L386
692f77L181j38k299k672J209J864L11j462j815K521J086k703m25J485K356J889
708C711k282j500Q74p72j516q19K648J935k620L03J704j165j37L98k23q26j373
725a660J46l59J89J360k42J182J683j551r46k21j103J13M45P05R70j72L81o43
$$ plain form
743 277 -285 1986 2710 1161 -1381 -2044 1384 1761 -2241 -2837 716 3819 2412 -1867 -2482 -155 1617
760 1617 362 -3381 -3068 979 1689 -296 -2203 -1662 2311 3383 836 -1848 -1561 1789 1334 -2076
776 -2076 -1145 760 1973 2040 398 -144 128 1124 1002 -1365 -1951 -906 -249 470 -975 -1879 686 2286
794 2286 824 -1294 -2241 -545 372 -505 -1450 -1579 809 2872 1121 -247 -419 1359 2396 -283 -1962
811 -1962 -767 670 966 -742 -429 1503 1426 748 -685 -1376 -165 113 -1493 -1988 -770 688 637 -561
829 -561 -395 285 1157 931 -1436 -1440 526 488 -208 -676 424 1544 1321 958 525 -52 379 194 -540 -921
849 -921 -1214 123 542 -154 -36 179 490 146 -951 -1016 -886 -533 -501 -1044 -426 832 783 664 469 -48
869 -48 705 1015 116 -1343 -808 1562 1117 -740 211 1363 1310 543 -710 -808 -41 118 -1042 -2064 -577
$$ packed form
743B77n62K271P24j549k542o63L428L77m002n96L553L103j407m279o15K327J772
760A617j255l743L13M047P10j985j907N41L973J072k547k684K87L350m55l410
776b076R31J905J213O7j642n42K72R96j22k367n86J045O57P19j445r04K565J600
794B286j462k118r47J696R17q77r45j29K388K063j751j368j72J778J037k679j679
811a962J195J437K96j708L13J932p7o78j433o91J211K78j606m95J218J458n1j198
829e61J66O80Q72k26k367mJ966l8o96m68J100J120k23l63m33n77M31j85p34l81
849i21k93J337M19o96J18K15L11l44j097o5J30L53L2n43O18J258m9j19j95n17
869d8P53L10q99j459N35K370m45j857R51J152n3p67j253r8P67J59j160j022J487
$$ plain form
888 -577 1112 373 -363 -650 -37 851 368 -1173 -1585 -423 1217 -174 -969 579 1704 1165 420 101
906 101 460 340 294 -173 -1262 -488 766 608 167 -345 -477 342 521 -666 -1772 -1337 294 -24 -990
925 -990 -516 129 888 863 13 -892 -81 1125 449 -1580 -865 1143 1443 551 -222 233 1344 1341 -177 -1519
945 -1519 -663 823 -53 -1336 -520 359 479 257 -325 -776 -252 298 -349 -1459 -443 569 -165 -105 537
964 537 955 611 546 392 21 226 276 0 -75 552 311 159 551 799 -52 -719 181 -190 -1034 -887 -406
985 -406 -516 -197 125 -503 -292 676 715 -881 -871 382 269 -282 -148 408 768 885 638 83 420 1132
1005 1132 108 -989 -238 674 -84 -579 -366 143 586 341 -589 -1054 -113 251 -912 -1465 -204 425
1023 425 68 -315 -69 442 534 244 -296 -37 683 195 -450 -69 818 1023 363 168 314 439 135 -531
$$ packed form
888e77J689p39p36k87O13Q88m83j541m12J162J640j391p95J548J125n39p45l19
906A01L59j20m6m67j089P74J254j58m41n12j32Q19J79j187j106M35J631l18r66
925i90M74O45P59k5q50r05Q11J206o76k029P15K008L00q92p73M55J111lj518j342
945a519Q56J486q76j283Q16Q79J20k22n82m51N24N50o47j110J016J012p34O0O42
964E37M18l44o5j54l71K05N0k76p5O27k41j52L92K48q51o67R00l71q44J47M81
985d06j10L19L22o28K11R68L9j596J0J253j13n51J34N56L60J17k47n55L37P12
1005A132j024j097P51R12p58m95K13N09M43k45r30m65R41L64j163n53J261O29
1023D25l57l83K46N11R2k90n40K59P20m88o45L81Q87K05o60j95J46J25l04o66
$$ plain form
1043 -531 -720 -282 153 -263 -667 51 320 -265 -477 -5 71 -426 -574 -442 68 329 -88 -151 506 1172 373
1064 373 -375 303 874 175 -226 -366 151 483 280 -573 -638 537 720 -397 -1158 -292 317 -402 -1137 -630
1084 -630 329 470 -72 -847 -76 853 283 -738 -247 628 606 -356 53 426 745 965 260 -552 151 858
1104 858 -226 -701 -132 658 -21 -716 -162 114 221 -385 -610 -254 115 -163 -979 -400 834 339 -704
1123 -704 41 920 508 42 -113 70 274 782 75 -715 337 1229 73 -455 234 644 147 -622 -784
1142 -784 -462 240 -133 -968 -410 698 270 -1082 -490 575 223 -524 -579 416 246 311 95 -167 549 973
1162 973 182 -509 174 880 151 -559 100 474 526 -74 -998 -316 673 275 -1168 -1099 532 852 -1078 -1230
1182 -1230 185 533 221 -548 -659 237 705 490 -624 -464 1062 742 -335 -61 218 460 333 122
$$ packed form
1043e31j89M38M35m16m04P18K69n85k12M72P6m97j48J32N10K61m17o3O57O66p99
1064C73p48O78N71o99m01j40N17L32k03q53o5J175J83j117p61Q66O09p19p35N07
1084f30R59J41n42p75P71R29n70j021M91Q75k2r62M09L73L19K20p05q12P03P07
1104H58j084m75N69P90o79o95N54K76J07o06k25L56L69k78q16N79J234m95j043
1123g04P45Q79m12m66j55J83K04N08p07p90J052Q92j156n28O89M10m97p69j62
1142g84L22P02l73q35N58J108m28j352N92J065l52p47n5R95j70O5k16k62P16M24
1162I73p91o91O83P06p29p10O59L74N2o00r24O82R89l98j443O9J631L20j930j52
1182a230J415L48l12p69j11Q96M68k15j114J60J526l20j077K74K79K42j27k11
$$ plain form
1200 122 135 2 216 -329 -792 544 514 -888 -688 271 427 -678 -798 -46 235 -154 -134 -490 209 702
1220 702 -85 -356 115 711 205 -606 -155 876 757 214 -723 -295 1324 739 -653 -1428 133 1149
1238 1149 -240 -1264 -370 428 454 -506 -842 -213 268 -96 -650 -497 873 839 -437 -313 397 651 558
1257 558 -443 -305 646 899 92 -733 73 1222 36 -771 -50 250 -245 -782 -316 502 -143 -326 -579
1276 -579 -561 428 -101 -846 -184 398 539 -114 -515 29 447 335 98 -214 505 851 -396 -529 318 1285
1296 1285 156 -1314 -309 783 340 -787 -669 599 795 -404 -972 -530 -8 263 -973 -768 573
1313 573 770 84 -701 -482 917 869 -140 -1103 -428 1428 971 -915 -472 1120 1441 39 -1205 -70
1331 -70 454 122 -423 -687 204 419 -317 -496 -324 -468 207 -211 -524 -339 -282 498 64 -174 313 104 467
$$ packed form
1200A22J3j33K14n45m63J336l0j402K00R59J56j105j20P52K81l89K0l56O99M93
1220G02p87k71M71N96n06q11M51J031j19n43r37M28J619n85j392p75J561J016
1238A149j389j024Q94P98K6r60l36O29M81l64n54J53J370l4j276J24P10K54r3
1257E58j001J38R51K53q07q25Q06J149j186q07P21L00m95n37M66Q18o45j83k53
1276e79J8R89n29p45O62N82J41o53m01N44M18j12k37l12P19L46j247j33Q47R67
1296A285j129j470J005J092m43j127J18J268J96j199n68M42N22K71j236K05J341
1313E73J97o86p85K19J399m8j009r63O75J856m57j886M43J592L21j402j244J135
1331g0N24l32n45k64Q91K15p36j79J72j44O75m18l13J85N7P80m34k38M87k09L63
$$ plain form
1352 467 744 242 -74 -603 59 1243 850 -719 -1405 253 1469 -47 -1466 -438 930 835 -902
1369 -902 -1646 -227 552 165 -807 -671 494 1118 -214 -743 -448 815 969 -626 -987 176 1386 915
1387 915 -829 -364 1431 1002 -387 -1071 -182 532 -149 -450 -1 196 393 -4 -195 -35 -97 -558 -565 -520
1407 -520 380 -118 -537 154 323 544 394 -373 55 685 426 -335 -342 839 693 -640 -200 665 566 -173
1427 -173 -520 299 628 -270 -771 -763 52 707 -379 -794 39 586 412 -654 -872 187 766 37 -791 -657
1447 -657 1189 1018 -507 -420 657 1488 130 -1427 -402 953 535 -391 -981 302 1098 360 -616 -1133
1465 -1133 -21 827 -420 -1180 -703 213 912 -182 -876 253 923 410 -661 -570 630 72 -212 407
1483 407 310 178 132 346 837 -14 -501 -7 243 69 -525 -809 201 438 121 -400 -619 389 462 -161
$$ packed form
1352D67K77n02l16n29O62J184l93j569o86J658J216j516j419J028J368r5j737
1369i02p44J419P79l87r72J36J165O24j332n29K95J263J54j595l61J163J210m71
1387I15j744M65J795m29j389o84Q89P14o81l01M49J97J97l97j91J60o2m61pM5
1407e20R00m98m19O91J69K21j50p67M28O30k59p61pJ181j46j333M40Q65r9p39
1427a73l47Q19L29q98n01QQ15O55j086m15Q33N47j74j066k18J059N79p29q28J34
1447f57J846j71j525Q7J077Q31j358j557J025J355m18r26n90J283P96p38r76n17
1465a133J112Q48j247p60M77R16O99j094o94J129O70n13j071R1J200n58k84O19
1483D07r7j32m6K14M91q51m87M94K50j74n94k84J010K37l17n21k19J008P3o23
$$ plain form
1503 -161 -784 -1017 431 1146 -728 -1333 432 1722 633 -1099 -558 1183 921 -344 -1363 -109 1448
1520 1448 513 -715 -494 344 1099 13 -993 -638 3 538 -5 -1197 -608 795 629 -385 -920 512
1538 512 749 -603 -651 90 271 88 -40 469 989 274 73 197 599 196 -753 -131 225 -248 -102 -106 58
1559 58 146 -282 52 -82 -230 127 -427 -1130 -278 432 693 -558 -595 1048 1206 -309 -891 -204 1188 579
1579 579 -1021 -623 841 1160 137 -746 306 969 51 -560 -1014 -213 730 -177 -914 -655 402 1113
1597 1113 -78 -1113 -189 729 608 -768 -1032 462 720 225 -93 -10 908 569 -367 132 50 85 -38
1616 -38 -172 -109 -117 370 700 -279 -231 133 -232 9 -305 -734 -471 -470 213 849 -138 -646 16 774 573 -739
1638 -739 -526 378 313 6 -701 37 1209 538 -283 20 460 636 -290 -1251 -674 736 966 -338 -1524
$$ packed form
1503a61o23k33J448P15j874o05J765J290j089j732N41J741k62j265j019J254J557
1520A448r35j228K21Q38P55j086j006L55O41N35n43j192N89J403j66j014n35J432
1538E12K37j352m8P41J81j83j28N09N20p15k01J24M02m03r49O22L56m73J46mJ64
1559E8Q8m28L34j34j48L57n54p03Q52P10K61j251l7J643J58j515n82O87J392o09
1579E79j600L98J464L19j023q83J052O63r18o11m54Q01R43r07p37K59J057P11
1597A113j191j035R24R18j21j376k64J494K58m95l18Q3R18l39r36M99q2L5j23
1616c8j34O3qM87L30r79M8L64l65K41l14m29K63JO83O36r87n08O62P58k01j312
1638g39K13R04o5l07p07P38J172o71q21L03M40J76r26r61N77J410K30j304j186
$$ plain form
1657 -1524 20 1232 579 -829 -1410 267 940 -556 -1335 -707 742 1290 -159 -374 229 631 325
1674 325 -469 -491 134 231 624 -112 -646 303 631 290 -35 -359 -198 -250 -611 -230 -107 -341 -256 321 856
1695 856 -239 -977 -6 443 -81 -521 -271 290 148 -406 284 859 991 -44 -745 146 625 212 -472
1714 -472 -1109 -116 1425 1059 -562 -1480 -22 1616 503 -1309 -1271 -69 558 -433 -674 555 478 -67
1732 -67 -91 560 785 -409 -1113 -199 626 801 173 -1045 -486 768 1289 799 -1041 -921 275 650 -209
1751 -209 -1104 -650 565 551 181 29 -207 -222 -253 114 279 -669 -738 52 441 328 -146 359 1006 174 -285
1772 -285 -212 -115 160 -131 -360 251 383 804 246 -651 -93 443 544 -536 -1335 -21 988 -326 -1175
1791 -1175 -395 1323 1128 -628 -1013 11 819 318 -833 -828 386 893 657 -442 -580 708 784 221
$$ packed form
1657a524J544J212o53j408n81J677O73j496p79O28J449N48j449k15O03M02l06
1674C25p94k2O25R7L93p36n34R49L28l41l25l24J61n2l61L81J23k34Q5N77N35
1695H56j095p38R71M49n24m40K50N61j42n54O90N75J32j035p01Q91M79m13o84
1714d72o37R93J541l66j621r18J458J638j113j812L8J202O27r91k41J229p7n45
1732f7k4O51K25j194p04R14Q25J75o28j218N59J254N21m90j840J20J196L75q59
1751b09q95M54J215j4l70j52k36j5l1L67J65r48o9P90L89j13m74N05O47q32m59
1772b85P3R7K75k91k29O11J32M21n58q97N58N36J01j080p99J314J009j314q49
1791a175P80J718j95j756l85J024Q08n01j151NJ214N07k36j099j38J288P6n63
$$ plain form
1809 221 -662 -798 154 180 -530 -291 170 575 154 -326 150 82 -441 -449 -481 119 10 -184 187 210 119 717
1831 717 516 -20 -261 -397 277 183 -125 5 -165 626 959 130 -353 -493 99 730 -345 -1268 -620 584
1851 584 1022 -423 -872 384 965 325 -850 -895 331 277 -131 -407 -113 817 815 -137 -391 31 704 470
1871 470 -857 -803 265 620 157 -614 -256 829 541 -104 -379 -314 123 -357 -479 -243 -53 192 379 176
1891 176 9 -86 533 216 -497 -418 -139 -30 326 60 43 378 280 690 304 -592 -502 -210 92 -178 -863 77
1913 77 665 304 -270 -35 580 337 -823 -702 115 42 82 -366 -124 758 515 400 -457 -555 572 548 -315
1934 -315 -831 -432 936 676 -508 -363 386 864 119 -912 -490 278 -160 -447 -589 316 505 221 130
1953 130 -373 -83 337 206 -465 -601 -20 677 185 -577 377 629 675 175 -556 -78 -135 -106 35 -427 -383
$$ packed form
1809B21q83j36R52K6p10K39M61M05m21m80M76o8n23ql2O00j09j94L71K3r1N98
1831G17k01n36k41j36O74r4l08J30j70P91L33q29m83j40N92O31j075r23O48J204
1851E84M38j445m49J256N81o40j175m5J226n4m08k76K94R30kr52k54M22O73k34
1871D70j327N4J068L55m63p71L58J085k88o45k75O5M37m80j22K36J90K45J87k03
1891A76j67r5O19l17p13P9K79J09L56k66j7L35r8M10l86q96R0K92L02k70o85R40
1913G7N88l61n74K35O15k43j160J21Q17p3M0m48K42Q82k43j15q57r8J127k4q63
1934c15n16L99J368k60j184J45P49M78p45j031M22P68m38k87j42R05J89k84r1
1953A30n03K90M20j31o71j36N81O97m92p62R54K52M6n00p31M78n7K9J41m62M4
$$ plain form
1974 -383 127 574 795 -601 -532 420 311 -485 -981 -581 312 57 -147 -3 59 738 409 -373 -281 -179 261
1995 261 331 -678 -536 658 931 413 -709 -111 804 503 -567 -1103 -145 544 6 -522 -139 33 589
2014 589 281 -397 -395 29 216 10 -830 -359 149 502 386 -109 210 550 8 32 -171 -295 -178 -368 32
2035 32 299 -64 296 168 -178 -254 -272 97 -135 -800 -122 247 11 118 -258 108 370 458 9 -452 -373 193
2057 193 -32 88 -273 -53 680 670 -1 -172 169 326 -366 -837 -112 225 252 -63 -251 336 573 133 -153
2078 -153 -662 -167 351 -118 -667 -350 215 910 231 -571 227 540 313 -542 -721 281 371 9 44 -247
2098 -247 474 673 361 -102 -520 -235 350 -94 -557 -700 144 695 146 -248 -71 119 471 -47 -607 -192
2118 -192 -135 86 322 -294 -350 458 795 153 -557 -120 414 102 -724 -469 195 712 90 -161 6 274 399
$$ packed form
1974c83N10M47K21j396O9R52j09p96m96M00Q93k55k04J44O2O79l29p82R2J02M40
1995B61P0j009J42J194K73n18j122N98R15l01j070n36R58O89n38n28L83J72N56
2014E89l08o78KM24J87k06q40M71N08L53j16m95L19L40n42K4k03j24J17j90M00
2035C2K67l63L60j28l46p6j8L69k32o65O78L69k36J07l76L66K62Q8m49m61P9N66
2057A93k25J20l61K20P33j0o71j71L41J57o92m71P25L37K7l15j88N87K37m40k86
2078a53n09M95N18m69n49L17N65O95o79q02P98L13k27q55j79J002R0l62L5k91
2098b47P21J99l12m63m18K85N85m44m63j43Q44N51n49l94J77J90L52n18n60M15
2118a92N7K21K36o16n6Q08L37o42p10M37N34l12q26K55O64N17o22k51J67K68J25
$$ plain form
2139 399 -121 -553 -645 -173 248 220 -630 -159 437 527 219 -539 -21 243 -265 -471 -143 102 318 -184 251
2160 251 431 302 325 -257 -507 -135 -138 368 -352 -611 67 587 359 -224 -406 43 470 -195 -233 -241 -187 105
2182 105 103 437 299 -27 512 269 -383 -197 23 62 -277 -637 212 410 240 -130 -275 460 303 -199 -280
2203 -280 -469 -254 106 68 -43 -66 128 567 -14 -442 -41 117 139 -446 -442 206 409 370 104 -40 385 307
2225 307 -4 -396 -450 53 254 86 -187 -161 247 505 -83 -377 15 99 33 -348 -455 140 98 38 44 -15 397
2248 397 201 -60 -309 -303 35 357 -241 -159 76 510 568 -322 -418 -31 387 261 -439 -608 -27 145 327 135
2270 135 -341 87 343 231 -291 -442 41 136 -88 -259 -284 350 546 -184 -10 231 246 152 -356 -650 -122
2291 -122 161 434 33 -252 132 508 179 -397 -434 -105 256 -301 -387 -44 169 387 58 63 103 4 241 -71
$$ packed form
2139C99n20m32r2M72M21k8q50M71N96R0l08p58N18K64n08k06L28K45K16n02M35
2160B51J80j29K3n82k50L72lN06p20k59O78N20k28n83j82M49M27o65l8qN4K92
2182A05kL34j38l26N39k43o52J86K20L9l39l60Q49J98j70l70j45P35j57n02q1
2203b80j89K15L60l8j11k3J94M39n81m28M01J58K2n85MO48K03l9k66j44M25p8
2225C07l11l92n4N03K01j68k73K6M08K58n88k94L92Q4o6l81j07N95m2o0On9M12
2248C97j96k61k49OL38L22n98Q2K35M34N8q90r6L87M18j26p00j69N81J72J82j92
2270A35m76M28K56j12n22j51M83R5k24j71k5O34J96p30J74K41J5r4n08k94N28
2291a22K83K73m01k85L84L76l29n76l7L29L61n57q6L43K13K18l29NM0r9K37l12
$$ plain form
2313 -71 -428 -206 227 392 -69 -260 374 533 198 -28 -319 103 -79 -237 -149 -71 -164 142 -62 160 94 32
2335 32 -49 -461 -283 -71 -160 -45 -172 -193 395 384 -95 -7 -188 229 -11 -389 -272 -33 102 305 58 66 64
2358 64 355 370 -288 -534 -251 -61 -132 -242 -172 291 188 -18 -210 -95 286 -5 -421 -251 -325 288 351 -16
2380 -16 -129 81 525 571 -316 -483 68 379 -69 -380 -187 399 247 137 -14 -228 -22 50 -299 -202 -345
2401 -345 -28 272 49 -180 167 275 315 -8 -87 242 66 -89 -254 7 -13 225 419 180 -11 252 151
2422 151 -175 -248 -409 71 105 19 -206 25 269 225 -63 -176 -147 147 70 -258 -191 25 249 254 17 -114 312
2445 312 385 -111 -233 -138 197 262 -351 -99 220 260 137 -216 -113 -24 -68 -263 -541 -142 39 118 84 -186 -70
2468 -70 254 146 -340 -330 -172 39 -112 -230 25 276 297 198 171 55 72 -55 -135 -240 -73 104 26 36 -120
$$ packed form
2313g1l57K22M33J65m61j91O34J59l35k26k91M22j82j58Q8P8r3L06k04K22o6o2
2335C2q1m12J78K12q9J15j27k1N88j1m79Q8j81M17k40l78J17K39J35K03k47Qk
2358F4K91J5o58k46K83J90p1j10P0M63j03k06j92J15L81k91m16J70p4O13O3l67
2380a6j13K10M44M6q87j67N51L11m48l11J93N86j52j10j51k14K06P2l49R7j43
2401c45L17L00k23k29L47J08M0l23p9L29j76j55j65K61k0K38J94k39j91K63j01
2422A51l26p3j61M80L4q6k25K31K44m4k88j13K9K94p7l28O7K16K24Nk37j31M26
2445C12P3m96j22R5L35O5o13K52L19M0j23l53J03Q9m4j95k78L99J81P9l4k70J16
2468g0L24j08m86J0J58K11j51j18K55K51K1r9k7j16J7j27q0j05J67J77p8J0j56
$$ plain form
2491 -120 -93 121 77 -144 -204 -124 91 -73 -105 -277 -70 159 323 39 -105 -86 308 108 -392 -306 89 276
2513 276 78 -176 -72 571 335 -191 -229 -224 121 -199 -385 -395 -11 310 27 -211 -15 170 185 -79 -600 -143
2535 -143 202 194 -177 -255 103 359 112 6 -123 24 144 -88 -105 -188 -87 134 124 112 54 -20 -39 86 -194
2558 -194 -198 -13 -165 70 -52 -254 42 187 156 -75 -190 -98 54 -87 -244 -151 312 468 18 -71 260 293
2580 293 257 -294 -328 -103 133 -42 -294 32 419 191 133 -165 -116 41 -180 -243 -381 -78 178 26 -194 -24
2602 -24 106 225 44 -179 -90 37 31 -54 -202 59 272 62 88 30 86 60 -121 -129 -162 -342 -99 133 -50 92
2626 92 136 71 18 -66 -125 -225 -205 -32 64 -204 143 354 214 -290 -95 240 223 -26 -435 -153 136 155 -257
2649 -257 3 129 321 285 -223 -254 92 127 -282 -331 -64 210 205 -131 115 147 363 97 -338 -222 134 -5
$$ packed form
2491a20K7K14m4k21o0Q0K15j64l2j72K07K29J64k84j44J9L94k00n00Q6L95J87
2513B76j98k54J04O43k36n26l8NL45l20j86j0L84L21k83k38J96J85J5k64n21M57
2535a43L45ql71p8L58K56k47j06j29J47J20k32j7q3J01K21j0j2n8p4j9J25k80
2558a94mJ85j52K35j22k02K96J45l1k31j15R2J52j41j57R3M63J56m50q9L31L3
2580B93l6n51l4K25K36j75k52L26L87k28n8k98M9J57k21o3j38L03K56j52k20J70
2602b4J30J19j81k23Q9J27oq5j48K61K13k10K6n8N6k6j81ql3j80K43K32j83J42
2626I2M4o5n3q4n9j00K0J73R6k68L47K11j40n04J95L35j7k49m09K82K89J9m12
2649b57K60J26J92l6n08l1L46L5m09m9K67K74nl36K46L2K16k66m35J16L56j39
$$ plain form
2671 -5 5 -259 24 155 258 51 12 3 92 6 -160 8 -20 -157 21 152 286 185 -34 -69 25 -196 -131 -142
2695 -142 27 147 -101 -84 194 237 156 -158 -56 185 122 -229 -350 31 221 196 -126 62 180 198 59 -204
2717 -204 -292 242 -5 -172 -137 -74 128 171 -87 -46 142 8 -243 -345 -26 239 43 -82 -30 206 267 97
2739 97 -267 -106 15 -81 -123 -83 113 18 0 -31 35 32 -56 -57 -30 -158 64 -233 -113 26 161 193 188 191 244 -183 -332
2766 -332 15 74 42 -186 -100 31 254 50 27 69 -79 121 -183 -332 68 128 -12 -171 6 268 157 -42
2788 -42 -15 -38 39 21 -311 -361 145 36 55 -45 215 275 121 -83 -181 0 7 -73 -1 221 109 241 -82 -156 -12
2813 -12 5 -13 -94 -156 -94 58 -29 13 62 74 -99 -97 20 80 -48 -167 -87 163 -3 -172 6 272 188 161 -128
2838 -128 64 35 -291 -195 -31 169 43 -202 -169 158 154 109 -118 -145 71 -4 89 -400 -228 311 113 -74 -75 146
$$ packed form
2671eJ0k64K83J31J03k07l9rQ9q6j66J68k8j37J78J31J34j01k19l5R4k21O5j1
2695a42J69J20k48J7K78M3q1l14J02K41o3l51j21L81J90k5l22J88J18J8j39k63
2717b04q8N34k47j67L5O3K02M3k58M1J88j34k51j02L19K65j96j25N2K36O1j70
2739I7l64J61J21r6m2M0J96r5j8l1O6lq8jK7j28K22k97J20J39J35L2nLN3m27j49
2766c32L47N9l2k28Q6J31K23k04k3M2j48K00l04j49M00O0j40j59J77K62j11j99
2788d2K7k3P7j8l32n0N06j09J9j00K60O0j54k04r8J81Pq0P2K22j12J32l23p4J44
2813a2J7j8q1o2O2J52q7M2M9J2j73KJ17O0j28j19Q0K50j66j69J78K66q4k7k89
2838a28J92k9l26R6J64K00j26k45L3L27mm5k27k7K16p5R3m89J72N39j98j87jK21
$$ plain form
2862 146 226 29 -228 -112 8 147 -128 -7 148 120 226 76 -95 188 -42 -134 -193 -27 33 -15 -49 53
2884 53 1 236 -44 -127 2 154 98 -289 36 15 151 21 158 398 159 -64 100 84 5 -232 -176 -35 160
2907 160 67 17 -102 128 124 147 -249 -222 177 146 -219 -171 140 5 171 -183 -193 88 152 -77 -30 -10 39 144
2931 144 -165 56 133 153 272 -43 -115 -29 166 -138 -273 -131 39 64 60 68 201 174 -73 -257 15 25 -48 -121
2955 -121 135 80 -12 85 106 143 100 -283 -172 69 -94 -7 -96 -74 147 93 120 -51 -98 99 -69 -168 -122 101 169
2980 169 -169 -57 170 120 89 -335 -67 28 89 -362 -84 -24 55 3 -27 56 56 -24 112 -5 -75 1 -123 36 -152
3005 -152 37 331 35 -243 96 186 49 -207 -141 215 -6 -101 59 -13 226 -11 80 229 173 -175 -51 -98
3027 -98 -6 -9 -124 -90 0 196 193 -90 85 -136 73 -96 -156 -12 122 109 2 -86 68 212 -137 -131 162 103 14
$$ packed form
2862A46Q0j97k57J16J20J39k75J21J55k8J06j50j71K83k30r2n9J66O0m8l4J02
2884E3n2K35k80q3J29J52n6l87L25k1J36j30J37K40k39k23J64j6p9k37N6J41J95
2907A60r3n0j19K30mK3l96K7L99l1l65M8L11j35J66l54j0K81O4k29M7K0M9J05
2931A44l09K21P7K0J19l15p2Q6J95l04j35J42J70K5mQJ33k7k47j84K72J0p3p3
2955a21K56n5r2R7K1L7m3l83J11K41j63Q7q9K2K21n4K7j71m7J97j68r9M6K23O8
2980A69l38J12K27n0l1m24K68R5O1m51K78O0P9n2l0Q3%q0J36j17p0P6j24J59j88
3005a52J89K94k96k78L39R0j37k56O6L56k21r5J60p2K39k37R1J49n6l48J24m7
3027i8R2lj15L4R0J96lk83J75k21K09j69o0J44J34j3j07q8J54J44l49OK93n9q9
$$ plain form
3052 14 -205 134 373 92 -170 -39 19 249 123 -172 -154 -55 115 119 -167 124 72 277 -83 -277 -98 158
3074 158 -92 -126 -120 99 112 -66 70 -65 67 154 -41 142 -49 -65 82 -91 -203 -71 -51 32 297 -113 30
3097 30 -57 32 45 -4 -205 -32 13 303 -8 -316 91 211 157 -142 -336 135 208 -98 -124 -110 72 238 36
3120 36 -237 -255 14 170 -183 -117 -13 97 -26 -83 -112 97 79 -143 -145 -56 69 -68 -170 102 -62 -37 -95 104
3144 104 -19 -102 -70 105 -81 -176 110 -17 168 103 57 138 -38 -193 -62 57 -156 35 95 -5 -44 -151 21
3167 21 156 160 -153 -35 211 -36 -200 -78 120 155 -159 -81 89 -7 108 41 -132 136 137 -115 -11 -11 249 212
3191 212 -62 -63 -9 362 -3 -362 -151 236 -55 -117 -179 9 91 -43 -90 59 18 -65 131 -134 -250 -30 3
3214 3 125 -197 0 163 141 24 -190 157 137 149 -23 17 -105 -25 14 259 -16 -216 -67 267 -56 -143 -153
$$ packed form
3052A4k19L39K39k81k62J31N8K30j26k95J8R9J70Mk86K91n2K05l60j94J79K56
3074A58k50l4OK19J3j78J36j35J32Q7j95J83j91j6J47j73j12J32K0Q3K65m10J43
3097C0q7Q9J3m9k01J73M5K90l11l08M07J20n4k99j94M71P3l06k6J4J82J66k02
3120C6k73j8K69J56l53O6J04J10j23n7k9K09j8k22kQ9J25j37j02K72j64K5n8J99
3144A04j23q3L2J75j86r5K86j27J85o5m6Q1j76j55J31J19k13J91O0j00l9j07J72
3167B1J35Ml13J18K46k47j64J22J98L5l14P8J70r6J15o7j73K68Jk52J04%K60l7
3191B12k74jN4L71l65l59K11L87k91o2o2J88Q2j34m7J49m1q3J96k65j16K20L3
3214CJ22l22J97J63k2j17k14L47k0J2j72M0j22Q0L9K45k75k00J49L34l23q7j0
$$ plain form
3237 -153 108 68 -80 -114 -54 28 139 -16 -61 39 -84 100 -276 -148 -89 118 112 -115 -128 268 216 19 -123
3260 -123 -98 139 39 -93 105 59 231 -10 -212 -126 -35 64 -81 -37 -216 -35 -85 126 -37 -38 86 142 28
3283 28 46 56 2 41 -40 175 -8 6 96 113 -48 -116 -63 119 -294 -211 -142 -31 110 -189 -70 86 212 34
3307 34 -144 -186 -52 -140 115 -16 -150 166 213 77 -11 68 165 185 -290 26 89 -10 -36 -260 92 215 32 -111
3331 -111 -72 -22 19 -26 -214 -147 101 139 112 -335 -37 113 73 37 -73 69 47 -114 18 -41 209 -46 96 -36
3355 -36 -13 -8 3 78 -50 -120 -195 168 121 10 -207 -4 144 63 -45 -94 82 -77 97 -211 -143 -12 74 26 -247
3380 -247 20 311 209 -124 -91 115 302 -39 -196 49 196 332 58 -204 -77 -107 -4 64 -304 -339 113
3401 113 252 68 -100 -51 328 88 -142 -254 -127 109 -127 62 4 118 159 -37 -66 54 -161 -110 12 -33
$$ packed form
3237a53K61m0j48l4O0Q2J11j55m5J00j23J84l76J28N9K07ok27j3L96n2j97j42
3260a23K5K37j00j32J98m6J72k41k02Q6R1R9j45M4j79J81n0K11j63jJ24N6j14
3283B8J8J0n4L9q1K15j83J4R0J7j61o8N3J82m13Q3O9J11J41k99J19J56J26j78
3307C4j78m2J34q8K55j31j34L16M7j36q8P9R7K0m75L16O3r9k6k24L52J23j83j43
3331a11L9N0M1m5j88O7K48L8k7m47K98J50m0l6j10J42k2j61J32n9K50k55J42j32
3355c6K3NJ1P5j28p0p5L63m7j11k17K03J48q1j08m9J76j59J74l08O8J31Q6m8k73
3380b47K67K91j02l33L3K06J87l41j57K45J47J36k74k62J27l0J03O8l68l5M52
3401A13J39j84j68M9L79k40k30j12J27K36k36J89n8J14M1j96k9J20k15N1J22m5
$$ plain form
3423 -33 -145 59 296 179 -238 -169 224 94 -105 -134 -165 35 -37 213 56 -246 166 224 93 -205 -41 68
3445 68 -6 -144 -195 -110 16 16 -45 194 175 -21 -61 -84 -7 -84 -289 39 -145 -133 60 101 -148 -124 117 126 28 -242
3471 -242 -47 168 58 9 -66 28 302 -48 9 103 24 29 109 -52 -48 39 193 22 -74 -69 33 3 -84 -283 204 -68
3497 -68 -132 -140 -125 -141 42 40 6 1 -34 163 -108 -243 -98 -86 339 -28 -139 260 100 251 -124 -270 -12 84 -10
3522 -10 -55 -215 70 202 193 -98 -238 -1 364 -69 -186 -246 61 362 126 -271 53 -9 278 41 -45 -100 23
3545 23 236 0 -159 5 142 21 234 -131 -21 57 -72 -51 -70 24 155 64 32 41 -48 139 59 -52 -166 -11
3569 -11 126 79 5 45 166 87 -85 33 -82 117 38 -97 -151 -203 41 68 82 -106 -68 190 112 -294 -110 23
3593 23 190 -241 -305 35 140 -14 -139 -46 76 262 -132 -43 70 118 -3 -3 -50 -98 -50 210 -21 -129 105
$$ packed form
3423c3j12K04K37j17m17O9L93j30j99k9l1K00p2K50j57l02M12N8j31k98J64J09
3445F8p4j38n1Q5J26%o1K39j9j96m0k3P7p7k05L28j84J2J93M1k49K4K41Rr8k70
3471b42J95K15j10m9p5R4K74l50N7R4p9NQ0j61MQ7J54j71r6NJ02l0q7j99M87k72
3497f8o4qJ5j6J83kl4nl5J97k71j35J45J2M25l67j11L99j60J51l75j46K58R6r4
3522a0m5j60K85J32rk91j40K37L65m33j17o0L07L01k36l97L24o2K87k37q6n5J23
3545B3K13k36j59J64J37j21K13l65J10P8j29K1j9R4J31r1l2Rq9J87q0j11j14J55
3569a1J37m7p4M0J21p9j72J18j15J99p9j35n4n2K44K7J4j88L8K58p8m06J84J33
3593B3J67m31o4L40J05j54j25R3J22J86l94Q9J13M8j21%m7m8M8K60k31j08K34
$$ plain form
3616 105 -121 2 -183 -276 107 46 37 78 56 55 73 -52 8 -156 -90 208 45 21 -22 105 60 94 -119 -19 150
3641 150 199 -75 -76 -99 31 42 118 -10 138 67 174 -10 -188 -131 86 3 -156 -125 -20 135 3 -31 -12 96
3665 96 53 -53 -217 63 118 106 113 30 152 103 115 -12 -213 -22 33 -130 -193 -15 56 143 -78 14 128 64 64 -8
3691 -8 -113 -85 -99 -152 6 -185 78 141 161 86 -20 -48 141 -88 -138 -221 64 126 53 82 113 -50 55 -61 -141
3716 -141 -133 172 92 -59 -256 -19 109 42 8 -7 46 87 -188 -168 -183 -31 154 79 119 111 164 105 -51 102 -186
3741 -186 -75 -104 -41 -105 200 182 -17 147 -56 219 14 -35 0 -117 25 37 -79 89 53 119 275 -123 -167
3764 -167 113 79 -78 -68 -185 324 -28 20 -72 18 -12 -59 131 0 7 1 -53 -162 -89 168 192 76 -81 -81 -71 35
3790 35 -15 -52 -217 142 29 -71 54 -5 45 167 -52 41 -161 139 122 -131 -70 83 173 177 -60 -99 -65 34 -114
$$ packed form
3616A05k26J23j85r3L83o1rM1k2jJ8j25O0j64O6K98j63k4m3J27m5L4k13J00J69
3641A50M9k74jk3J30J1P6j28J48p1J07j84j78N7K17q3j59L1J05J55j32l4J9J08
3665I6m3j06j64K80N5j2Pq3J22m9J2j27k01J91N5j63o3J78P1Q7k21R2J14o4%p2
3691hj05K8j4n3J58j91K63O3K0p5j06k8J89k29n0q3K85O2p3K9L1j63J05j16q0
3716a41QL05q0j51j97K37J28o7l4j5N3M1k75K0j5J52J85p5M0qN3n9j56J53k88
3741a86J11k9O3o4L05j8j99J64k03K75k05m9L5j17J42J2j16J68l6O6J56l98m4
3764a67K80l4j57J0j17N09l52M8r2R0l0m7J90j31Pon4j09P3K57K4j16j57%J0J06
3790C5n0l7j65L59j13j00J25n9N0J22k19R3k02L00j7k53O1J53R0Mk37l9L4R9j48
$$ plain form
3815 -114 -143 -28 87 19 -14 55 -113 126 96 6 -157 -138 -57 42 -118 -275 18 212 -5 -155 33 91 -80
3838 -80 -129 76 14 10 123 64 -124 109 94 73 65 -5 -266 -12 38 -72 -78 -261 -88 132 162 53 -76 -39 44 -54
3864 -54 -133 -139 -107 105 -65 -232 248 -5 22 -59 147 15 -99 -236 9 -3 26 117 32 -30 39 34 60 -224 -128 -70
3890 -70 -27 113 -55 145 103 190 83 -26 64 -99 -17 -166 -13 -9 48 65 -120 183 104 114 15 -139 -115 -128 69
3915 69 -55 -148 107 250 231 58 -86 -85 241 13 -72 -123 -73 82 -36 -43 170 -28 154 -26 -96 -113 46 42 4
3940 4 -115 71 34 101 58 20 -18 158 217 -171 -200 -158 136 69 -91 -53 21 13 102 -99 133 -6 -33 41 -296 -13
3966 -13 200 173 114 -56 17 99 110 57 44 -109 148 145 -63 -42 5 157 72 22 3 -37 -102 166 48 -70 102 154
3992 154 -33 129 -42 144 154 -163 -116 -249 61 58 0 -48 143 111 109 2 4 38 3 -150 -189 -54 -23 90 86 -61
$$ packed form
3815a14k9J15J15o8l3O9j68K39l0r0j63J9Q1R9j60j57K93J94k17j50J88N8j71
3838h0m9K05o2mJ13n9j88K33j5k1qp0k61K54N0j10oj83J73K20L0j09j29L7Q3r8
3864e4p9oL2K12j70j67M80k53K7q1K06j32j14j37K45j2K9R1q5o2O9nK6k84R6N8
3890g0M3J40j68K00m2Q7j07j09R0j63Q2j49J53MN7J7j85L03p9J0r9j54K4j3J97
3915F9j24r3K55J43j9j73j44JL26k28q5n1N0J55j18pK13j98J82j80p0j7J59ml8
3940Dj19J86l7O7m3l8l8J76N9l88k9M2K94o7j60L8P4qQ9k01K32j39k7P4l37K83
3966a3K13k7n9j70P3Q2J1n3j3j53K57lk08K1M7J52q5n0j9m0o5K68j18j18J72N2
3992A54j87J62j71J86J0l17M7j33L10ln8m8J91l2kj07KL4l5j53l9J35L1J13mj47
$$ plain form
4018 -61 -32 147 -11 -37 78 43 -3 -73 -25 140 194 162 37 5 125 67 -15 -50 -128 -26 101 125 177 -41 35 86
4044 86 165 -67 -177 -38 38 -133 -53 35 44 65 32 -38 85 8 192 -73 -51 21 85 -6 97 -47 85 77 -91 54
4070 54 71 -151 -77 -261 95 16 -16 184 76 -95 127 -75 178 -16 -126 23 112 96 -57 -78 82 133 13
4093 13 44 37 -69 -57 66 -169 -51 36 -15 162 -18 -83 162 -23 -28 -53 -164 47 37 -119 -10 -87 -120 83 4
4118 4 -87 -132 44 21 -127 -87 110 189 -24 -15 9 63 17 9 -127 137 15 65 46 30 -101 53 140 24 -13 -100 -108
4145 -108 1 -53 -67 -10 69 67 58 163 52 112 -151 -57 -83 -238 -86 200 -143 27 -27 145 131 34 -76 196 -31
4170 -31 -16 -230 16 177 -49 6 43 -105 147 -68 -157 134 7 38 26 -129 -20 161 27 195 218 -63 -55
4193 -55 -19 -53 -139 -6 150 37 -108 125 37 161 154 -29 0 -61 37 -76 -145 67 121 56 25 72 141 39 38 137
$$ packed form
4018f1K9J79j58k6J15l5m6p0M8J65N4l2j25l2J20n8q2l5p8J02J27K4N2k18P6N1
4044H6P9k32j10J39P6j71Q0Q8RK1l3p0J23p7J84k65K2P2O4r1J03j44J32qj68J45
4070E4J7k22P4j84L56p9l2K00j08j71K22k02K53j94j10J49Q9j6j53k1J60N1j20
4093A3L1pj06J2J23k35J18Q7n1J77j80o5K45j85nk5j11K11j0j56J09p7l3K03p9
4118Dr1m5J76k3j48M0J97P9k13RK4N4m6qj36K64j22N0j9j6j31J54Q7j16l7q7q
4145a08J09n4j4N7P9krJ05j11O0k63R4k6j55J52K86l43J70n4J72j4r7j10K72k27
4170c1J5k14K46J61k26N5L7j48K52k15q9K91j27L1j2j55J09J81j34J68K3k81Q
4193e5L6l4q6J33J56j13j45K33q8J24pj83K9o1R8j13o9K12N4o5l1M7O9j02jR9
$$ plain form
4219 137 -127 -8 25 -6 -1 -178 109 48 41 -116 76 -75 10 -130 -169 13 -104 -25 10 112 155 -17 -25 -97 -136
4244 -136 -30 -127 -138 -39 -51 9 210 65 -41 -103 18 15 21 -257 1 41 -14 -14 -21 10 25 -3 28 -128 -88 -135 95
4271 95 -33 95 -18 159 -143 -82 -72 -114 -5 -71 -73 6 -44 102 16 -18 174 179 -15 45 -234 -15 112 -106 186
4296 186 47 -32 16 68 57 10 -2 249 46 -126 -47 -91 94 74 50 112 67 149 -83 -184 238 -26 -81 -80 -183
4321 -183 -21 53 -69 118 157 -41 -21 -150 -203 -151 -60 51 -187 -23 151 90 -7 87 -81 112 57 10 25 -63
4345 -63 46 22 -54 8 61 35 185 -15 -147 98 -155 -97 -34 39 107 11 14 -109 61 -174 -109 -132 25 -67 -238
4370 -238 -23 6 -234 -45 185 76 -34 66 -94 42 4 -140 49 113 -56 -70 75 89 15 -45 130 -82
4392 -82 -231 37 41 32 -32 25 170 -100 -167 -16 -23 61 -72 -69 29 15 -26 -9 27 99 -148 -5 -49 -177 130 -67 -4
$$ packed form
4219A37k64J19L3l1Nj77K87o1pj57J92j51Q5j40l9J82j17P9L5J02M3j72qp2l9
4244a36J06r7j1R9j2O0K01j45j06o2J21lOk78K58M0n5%pL1J5k8L1j56M0m7K30
4271I5j28J28j13J77l02O1J0m2J09o6kP9n0J46q6l4J92Nj94O0k79K19J27k18K92
4296A86j39p9M8N2j1m7j2K51k03j72P9m4J85k0k4O2m5Q2k32j01M22k64n5Jj03
4321a83J62P4j22J87L9j98K0j29n3N2R1J11k38J64J74o1r7R4j68J93n5m7J5q8
4345f3J09k4p6O2N3k6J50k00j32K45k53N8O3P3O8r6Lj23J70k35O5k3J57r2j71
4370b38K15K9k40J89K30j09j10J00j60J36l8j44J89O4j69j4J45J4p4o0J75k12
4392h2j49K68Mro4N7J45k70o7J51pQ4j33LR8j4m1J7L6P2k47J43m4j28L07j97O3
$$ plain form
4419 -4 -69 1 60 36 255 57 -130 72 -104 -35 -157 -44 83 105 50 -40 47 -31 -122 3 -102 -148 -76 -271 -19
4444 -19 -134 -25 -50 122 85 36 -70 -66 -160 -124 22 171 -83 -34 32 88 185 -11 -1 -183 -67 -191 -202 -29 110
4469 110 -103 210 -35 -5 -73 168 19 -11 -27 -174 -142 15 -1 100 154 14 127 59 -123 100 -17 -49 -11
4492 -11 92 -4 18 122 15 -93 -60 63 34 -99 -271 -106 196 3 -109 271 32 52 35 -192 -206 26 97
4515 97 -21 52 -16 148 27 12 66 -105 183 -53 0 -202 193 7 42 24 10 188 119 63 20 62 -119 54
4539 54 -42 -169 68 14 74 77 163 0 116 -5 -34 -104 -242 -28 -77 -90 -207 -68 -15 -52 -31 70 -107 -20 -85
4564 -85 -40 33 37 119 45 45 85 -32 -69 -55 -40 -125 52 45 -263 -95 70 114 -14 -49 -41 -76 -4 -46 82 81 -46 -58 109
4593 109 36 111 53 -29 51 -19 -2 8 -109 7 -24 52 36 47 163 -61 -72 10 42 4 9 -17 10 51 -13 165 -28
$$ packed form
4419do5P0N9k4K19j98j87K02j76O9j22J13J27K2n5r0Q7p8r1J25j05m6P2j95K52
4444a9j15J09k5J72l7m9j06Mr4L6J46J49k54M9O6N6R7j96J0j82J16j24j1J73J39
4469A10k13L13k45L0o8K41j49l0j6j47L2J57j6J01N4j40J13o8j82K23j17l2L8
4492a1J03r6K2J04j07j08L3J23k9j33j72J65L02j93j12L80k39K0j7k27j4K32P1
4515I7j18P3o8J64j21j5N4j71K88k36N3k02L95j86L5j8j4J78o9n6m3M2j81J73
4539E4r6j27K37n4O0LQ6j63J16j21k9p0j38K14m9j3j17J39N3l7K1J01j77Q7o5
4564h5M5P3MQ2p4%M0j17l7J4J5q5J77pl08J68J65M4j28l5Ql5P2m2J28jj27j2J67
4593A09p3P5n8q2Q0p0J7J0j17J16l1P6j6J1J16k24j1Q2L2l8Nk6K7M1o4J78j93
$$ plain form
4620 -28 112 60 -113 192 56 -184 -66 6 -30 -45 11 -45 23 23 -71 -165 -99 -92 -133 -109 57 -51 23 85 32 -18 -33
4647 -33 -110 -70 -180 -10 10 -23 27 -3 -3 176 -228 -16 72 95 -144 58 25 -193 27 -43 -30 -154 69 148 -168
4672 -168 46 -20 39 58 3 -84 25 96 27 97 3 34 78 39 -41 -151 -112 84 89 -191 58 92 21 -5 -74 128 10
4699 10 -51 -141 154 -2 137 -13 33 109 -93 59 12 -65 -60 -175 148 -25 205 29 61 38 -37 32 57 84 31
4724 31 -21 -57 -7 -11 -21 13 203 -23 80 -86 -32 -70 49 33 40 38 -48 71 -37 53 -58 -139 -18 55 -34 -99 -196
4751 -196 -9 35 122 -62 -21 -3 -27 107 23 29 -42 -136 -113 8 128 94 -92 82 -15 7 -43 -92 10 135 26
4776 26 -108 93 -11 22 -3 15 101 46 43 -69 -117 -12 86 -78 32 -72 -79 -4 -40 -139 -16 -12 48 54 68 44 152
4803 152 104 87 263 -182 -114 90 -50 -57 -86 -33 58 -99 -5 -13 -246 -5 -19 76 -159 -99 95 53 41 72 -154 42
$$ packed form
4620b8J40n2j73L05j36k40J18P2l6j5N6n6O8%r4r4O6Pm1K4J66j08P4O2n3n0j5
4647c3p7M0j10J70K0l3N0l0%J79m04K12Q8K3k39K02l3k18K20p0J3j24K23P9l16
4672a68K14o6N9J9n5q7J09P1o9P0r4L1M4l9q0j10L9J96Nk80K49L4p1k6o9K02j18
4699A0o1r0K95j56J39j50M6P6k02J52m7p7Nj15L23j73K30j76L2k3p5O9K5K7n3
4724C1n2l6N0mj0L4J90k26J03j66N4l8J19j6Pkq6J19j08R0j11q1J21P3q9o5r7
4751a96J87M4Q7j84M1J8k4J34q4Op1r4K3J21J20l4j86J74r7K2n0m9J02J25j09
4776B6j34K01j04L3k5J8Q6n5lj12m8J05R8j64J10j04pP5l6r9J23MO0OJ4k4J08
4803A52m8j7J76m45O8K04j40pk9N3R1j57R4qk33K41j4R5k35O0J94m2j2L1k26J96
$$ plain form
4829 42 159 -121 12 -18 85 -14 -50 125 -61 -61 -157 -180 32 84 -121 77 76 -14 237 58 12 80 -109 -40 -58
4854 -58 -93 96 8 20 -35 -71 23 87 28 84 -117 0 -112 -146 12 -80 -23 45 -245 -92 -54 65 -67 6 -44 -38
4880 -38 -74 33 -33 -27 -63 -61 -3 -52 55 87 -36 -37 -43 -58 164 -14 -42 -54 -50 63 -80 73 10 -41 -163 -114 -27 -160
4908 -160 -233 -111 87 24 47 -47 -112 -38 38 122 -106 -45 76 1 -42 56 -75 168 119 -53 165 56 33 -174 -140
4933 -140 127 26 -54 -97 51 1 -10 50 41 -98 11 -19 -59 163 -26 27 -9 -90 118 150 -64 2 -71 187 -50
4958 -50 11 -16 -39 -55 70 -118 -9 -99 -72 -42 98 -51 -88 33 -61 -93 -215 4 94 -80 -97 120 -14 72 -62
4983 -62 -39 182 51 12 121 122 -12 127 -8 -20 -81 -67 -139 54 -158 43 96 -64 62 119 49 40 -160 34 -93
5008 -93 -115 135 -90 209 38 -52 125 194 -29 -55 -53 117 -71 -44 15 21 161 -100 77 -190 -21 -106 77 -52
$$ packed form
4829D2J17k80J33l0J03r9l6J75j86%r6k3K12N2k05J98jr0K51j79m6O8j89O9j8
4854e8l5J89q8J2n5l6R4O4n9N6k01J17j12l4J58r2N7O8k90J53L8J19j32P3n0O
4880c8l6J07o6Ol6KN8m9J07L2j23joj5K22j78k8j2MJ13j43J53o3n1j22M9Q7j33
4908a60p3J22J98o3K3r4o5P4P6Q4k28O1J21p5m3R8j31K43m9j72K18j09k3k07L4
4933a40K67j01q0m3J48n0j1O0rj39J09l0m0K22j89N3l6q1K08L2k14O6p3K58k37
4958e0O1k7k3j6J25j88J09r0K7L0J40j49l7J21r4l2j22K19R0j74j7K17j34Q6j34
4983f2K3K21j31l9J09Jj34J39j35j2o1J4p2J93k12K01N3j60J26N7p0rk00J94j27
5008i3k2K50k25K99j71r0J77O9k23k6KJ70j88K7N9OJ40k61J77k67J69q5J83j29
$$ plain form
5032 -52 -57 -86 29 -133 -59 50 17 193 -117 -139 79 -76 40 2 -44 -81 -122 -92 -142 -39 131 106 281 27 103
5057 103 161 58 16 146 2 -52 -84 -18 54 -29 -3 -34 -158 153 195 36 45 -74 -69 31 33 -8 100 111 56 26 91
5084 91 -54 -3 17 -81 -81 49 -92 8 57 -53 -87 -199 -28 -125 -31 -27 -147 -126 -54 52 30 -55 18 132 -30 50
5110 50 -3 31 43 42 187 30 110 -97 26 -35 112 36 45 -26 -109 -98 -64 19 68 72 18 -31 52 124 -94 63 32 -5
5138 -5 -8 -89 -104 -4 80 -3 -80 120 66 107 -68 168 81 -109 102 16 89 -32 -96 -72 -130 -153 -51 -19 -197 -42
5164 -42 -15 -145 -115 59 -75 -9 -196 -76 78 -22 89 51 264 87 -6 36 104 -73 75 94 -36 -154 -61
5187 -61 133 -187 6 52 -1 70 115 43 76 -101 -133 62 -15 -45 120 -18 62 128 103 55 81 79 38 -66 -68 -86 16
5214 16 104 -73 88 -76 -207 28 -34 10 -6 -120 -69 -9 138 39 -225 -121 -150 101 -138 -57 121 55 -155 -83
$$ packed form
5032e2nk9J15j62P4J09l3J76l10k2K18j55J16l8m6l7m1L0n0J03J70k5J75k54P6
5057A03N8j03m2J30j44n4l2O6P2q3K6l1j24L11M2j59Rj19NJ00Km1J08J1n5l0O5
5084I1j45N1K0r8%J30j41J00M9j10l4j12J71r7R4Mj20K1P2J06k2q5P3J14j62Q0
5110E0n3L4J2jJ45j57Q0k07J23o1J47p6Rp1q3J1L4Q3M9Mn4m9Q3P2k18J57l1l7
5138elq1j5J00Q4q3p7K00n4M1j75K36q7j90K11q6P3j21o4K4n8k3J02L2j78J55
5164d2K7j30L0J74j34O6j87J20J54j00J11l8K13j77r3M2O8j77J48J9j30j18R3
5187f1J94l20J93M6n3P1M5p2L3j77l2J95p7l0J65j38Q0O6k5m8K6km1j04kj8J02
5214A6Q8j77J61j64j31K35o2M4j6j14N1O0J47r9k64J04k9K51k39Q1J78o6k10P2
$$ plain form
5238 -83 10 13 62 -76 110 105 12 71 26 18 -11 118 -52 5 -32 66 -98 -62 52 80 179 -34 -2 24 -72 -25 59 14
5266 14 90 -107 1 -16 -43 -87 155 50 7 4 -17 107 51 -37 85 15 -118 244 -77 -32 42 -41 95 110 -122
5291 -122 -23 90 186 139 -65 68 -148 39 -77 -81 44 -36 -171 -16 46 -67 -49 128 -11 30 -135 45 -17
5314 -17 -26 -2 12 -10 17 67 25 45 -15 26 -19 14 94 -84 52 55 -26 42 -39 -98 20 -129 156 12 -45 91 -8 7
5342 7 -15 13 35 -91 -86 127 68 -36 -161 -71 116 4 -57 61 -25 -106 3 50 148 55 -87 -79 -134 21 -82 20
5368 20 -8 -28 49 -94 53 4 2 -16 -173 62 25 -69 -89 75 -70 -107 85 13 -164 32 -47 -86 -70 -12 -124 7
5394 7 -49 -120 -74 -9 40 -83 -89 18 148 -33 -129 -68 -23 131 92 -88 50 -45 -234 118 9 39 59 56 2 -22 -115
5421 -115 -108 74 -51 35 39 -74 9 75 54 32 -126 203 -22 -101 -63 9 11 -124 125 -1 -119 -86 -52 -26 -27 130
$$ packed form
5238h3R3LM9j38J86nr3N9m5qk9J29j70N7l7R8j64L6J14K8R9k13L2K6r6M7Q4m5
5266A4P6j97J08j7k7m4K42j05m3lk1J24n6q8J22p0j33L62l21M5P4q3J36J5k32
5291a22R9J13R6m7k04J33k16J87j16mJ25q0j35J55O2j13J8J77j39M1j65J80o2
5314a7rK4J4k2K7N0m2K0o0M1m5L3Q0j78J36Lq1O8q1n9J18j49K85j44n7J36r9J5
5342Gk2K8K2j26NK13n9j04j25R0J87j12o1J18q6q1J09M7R8r3j42Qn5J55j03J02
5368B0k8k0P7j43J47m9kj8j57K35l7r4k0J64j45l7J92p2j77J96p9l9J6N8j12J31
5394Gn6p1M6O5M9j23oJ07J30j81r6O1M5J54l9j80J38r5j89L52j09L0K0ln4k4r3
5421a15PJ82j25Q6Mj13Q3O6k1k2j58L29k25p9L8P2Kj35K49j26j18L3L4K6jJ57
$$ plain form
5447 130 51 -12 95 -44 33 -21 -45 -156 -96 110 99 36 46 53 75 27 34 93 -30 173 -87 47 -102 85 -98
5472 -98 -70 -26 -175 30 -90 18 89 32 49 -74 -157 -197 -21 125 -122 -27 -28 96 -9 -31 -69 -60 -95 65 -10 47
5498 47 -18 107 6 -32 17 -123 43 -113 -48 169 -97 -43 -54 67 63 23 19 11 -51 -123 -107 -7 -82 -85 -50 -93 39
5525 39 18 -126 228 75 -135 -88 -25 96 50 45 -112 -73 48 1 -93 -119 45 16 95 -164 -77 -54 52 -48 63
5550 63 -48 8 37 -38 90 69 110 -89 -94 139 13 -44 4 22 -61 -10 62 -126 126 106 92 48 35 -139 -19 25
5576 25 5 119 -3 112 66 93 -18 127 86 80 -10 -124 54 71 142 -98 61 -114 -99 -3 5 -59 -7 6 77 45
5602 45 40 -67 -103 85 94 -9 62 141 0 -203 116 -35 126 -87 -46 47 34 103 -59 44 23 44 -99 68 -185
5627 -185 127 -12 230 31 59 -81 139 -80 81 -46 13 153 36 21 -48 198 25 147 -61 71 6 91
$$ packed form
5447A30p9o3J07j39P7n4k4j11O0K06j1o3J0PK2m8PN9j23K03k60J34j49J87j83
5472i8K8M4j49K05j20J08P1n7J7j23q3m0J76J46k47R5jJ24j05k2l8Rl5J60p5N7
5498D7o5J25j01l8M9j40J66j56O5K17k66N4j1J21mm0mqo2p2J6J00p5lL5m3J32
5525C9k1j44L54j53k10M7O3J21m6nj57L9J21m7r4k6J64k9P9k59Q7K3J06j00J11
5550F3j11N6K9p5J28k1M1j99nK33j26n7M8J8q3N1P2j88K52k0j4m4j3j74J20M4
5576B5k0J14j22J15m6K7j11J45m1or0j14J78J7P1k40J59j75J5R6Qo4N2J3P1l2
5602D5nj07l6J88Rj03P1P9j41k03L19j51J61k13M1R3j3O9j62J03k1K1j43J67k53
5627a85L12j39K42j99K8j40K20k19J61j27N9J40j17j5o9K46j73J22k08J32o5Q5
$$ plain form
5649 91 -40 -190 -11 20 232 62 25 -15 55 39 -7 -67 73 -179 -8 59 1 -47 -36 -87 32 -94 17 -149
5673 -149 -92 -36 105 14 46 15 -171 36 61 -34 0 -5 -13 -74 110 -43 -36 117 62 54 190 89 53 -62 70 -27 32
5700 32 127 43 -160 -63 156 -84 29 -133 204 65 -150 56 -33 60 -55 71 -52 -13 -38 -42 48 -109 -108 -25 64
5725 64 43 -22 60 53 63 -7 -152 -35 -35 -19 -64 -48 -126 -23 77 -105 -66 -6 -32 -38 -88 -27 -7 -28 -3 86 70 47 -30
5754 -30 109 24 -19 -99 128 -53 66 -32 -20 46 -177 34 -100 44 113 93 21 -157 -207 -91 66 48 -26 15 93
5779 93 -20 81 92 -38 100 -75 74 125 -33 -15 23 199 54 -126 94 -14 21 -152 -146 35 19 21 75 43
5803 43 -35 -57 -113 -67 -50 47 128 -12 -18 40 -24 117 -64 -68 -147 169 74 102 -188 -28 -8 191 95 -119 -13 -68 41
5830 41 -48 66 158 65 72 118 -96 -199 88 173 -32 -34 4 -106 -24 -266 -73 37 81 -20 -142 127 67 171 0
$$ packed form
5649I1j31j50J79L1K12j70l7m0P0j6m6o0J40k52J71O7n8m8J1n1J19j26J11j66
5673a49N7N6J41r1L2l1j86K07K5r5L4nqo1J84j53PJ53n5qJ36j01l6j15J32r7N9
5700C2R5q4k03R7K19k40J13j62L37j39k15K06q9R3j15J26j23L9k5mR0j57JQ3Q9
5725F4k1o5Q2pJ0p0j45J17%J6m5J6p8J03J00j82L9O0k6on0O1K0k1K5Q9j6k3p7
5754c0J39q5m3q0K27j81J19r8J2O6k23K11j34J44O9k0p2j78n0J16J57j8p4M1P8
5779I3j13J01J1j30J38j75J49N1j58J8L8J76j45j80K20j08L5j73OJ81j6KN4l2
5803D3p8k2n6M6J7R7Q1j40oN8o4J41j81mp9L16r5K8k90J60K0J99r6k14J06n5J09
5830D1q9J14R2r3PM6k14j03K87Q5k05kL8j10Q2k42J93J10M4j01j22K69o0J04j71
$$ plain form
5855 0 -111 26 -21 51 23 108 33 -153 105 -65 -7 151 84 -50 -136 84 68 -64 -21 -121 35 111 -57 54
5879 54 -167 104 -31 -22 -10 -117 -133 83 234 49 -109 -203 -105 -124 -17 -46 -78 -109 -106 14 28 -41 23 82 -57 -12
5905 -12 -88 72 18 -89 -116 -96 80 -66 -130 4 -47 55 -44 3 -4 -13 -28 83 -1 38 43 68 7 -166 113 -151 -53
5932 -53 -137 34 -3 39 -3 -110 89 51 31 98 -32 72 -40 -92 31 -89 -97 -41 4 39 -109 -31 92 42 -208
5957 -208 -88 79 -29 -94 -51 12 -183 113 -80 -140 -24 21 -22 -112 15 -48 68 35 -113 -16 34 -11 -99 63
5981 63 29 50 -88 -100 -8 -107 64 70 47 -71 -50 -15 -49 14 -102 25 -33 38 -53 -83 56 41 -116 -45 -105 62 78
6008 78 -137 84 -61 141 65 72 0 -63 133 -210 23 50 143 0 33 -81 113 10 -86 103 -88 56 -78
6031 -78 -87 69 91 100 34 -44 136 -47 -87 -47 -131 -105 -17 75 -64 58 -203 -46 -77 -53 96 -135 -136 161 -16 22
$$ packed form
5855@j11J37m7P2k8Q5p5j86K58j70N8J58o7j34q6K20j6j32M3j00J56P6j68J11
5879E4k21K71j35RJ2j07j6K16J51j85j58r4R8j9J07k9l2l1LJ20J4o9O4N9j39M5
5905a2p6J60n4j07k7K0J76j46o4J34n1J02r9M7prj5J11q4L9NK5o1j73K79k64R8
5932e3q4J71l7M2m2j07J99l8k0O7j30J04j12n2J23j20qN6M5L5j48P8J23n0k50
5957b08J20J67j08o5M3O3j95K96j93o0J16M5m3r0J27o3J16l3j48R7N0m5q8J62
5981F3l4K1j38j2R2r9J71Ok3j18K1L5l4O3j16J27n8P1r1l0J39j5j57P1o0J67J6
6008G8k15K21j45K02p6Pp2o3J96l43K33K7R3j43L3j14J94j03r6J89j91J44j34
6031g8rJ56K2Ro6p8J80j83m0M0q4K6Q8R2j39J22k61J57l1K4J49k31jK97j77L8
$$ plain form
6057 22 83 118 28 21 102 -13 -104 -56 79 -131 -124 -79 48 -4 31 187 -24 -69 -18 38 -61 -73 -11 47 40 189 -131 -32
6085 -32 -70 82 -25 -85 16 -59 21 -155 151 -16 45 50 122 58 -156 3 -60 132 -21 39 75 118 14 -44 -6
6110 -6 53 -101 152 -89 -11 -90 -46 65 -98 -159 -148 -19 -41 54 -53 -163 70 -85 -142 -43 -51 50 -2 68 -204
6135 -204 -140 38 -52 -18 -1 -101 -68 38 -195 31 111 -63 29 27 49 -72 -45 -254 -221 118 46 -34 -230 -155 -11
6160 -11 21 29 -101 -1 144 -143 -47 -64 -29 -69 34 -119 -18 -43 178 33 -160 81 -17 -117 139 -5 49 33
6184 33 -23 82 -13 21 -101 -122 105 -18 -181 -18 74 51 38 -16 -89 -138 50 20 64 120 -36 45 -53 -98 61 -163
6210 -163 -76 17 -48 -52 -25 -115 42 6 58 101 93 50 56 132 -32 10 -11 -80 -50 87 -8 22 16 -57 -188 140 -82 -49 -56
6239 -56 -132 -30 -139 -75 -35 -20 -141 35 -22 -101 -91 -102 -197 -79 157 -41 40 -118 38 231 -180 -6 -68 -203
$$ packed form
6057B2O1L5r0pQ1j15r1M8J35k10PM5J27n2L5J56k11m5N1N6r9j2O2N8pJ49l20R9
6085c2l8J52j07o0J01p5Q0j76L06j67O1NP2o4k14J59o3J92j53O0L6M3j04n8L8
6110fN9j54K53k41P8p9M4J11j63o1J1J29k2R5j07j10K33j55n7R9qJ01n2P0k72
6135b04O4J78r0L4J7j00L3J06k33K26Q0j74R2kK2j21K7k09L3L39p2q0j96P5J44
6160a1L2Qj30J00J45k87R6j7L5m0J03j53J01k5K21j45j93K41r8j00K56j44N4j6
6184C3n6J05r5L4j22k1K27j23j63J63R2k3j3n4p3m9J88l0M4N6j56Q1r8m5J59k24
6210a63Q7R3o5mK7r0J57l6N2M3qm3OP6j64M2k1o9L0J37r5L0op3j31L28k22L3p
6239e6p6J02j09O4M0J5j21J76n7p9J0j1r5J18K36j98Q1j58J56J93m11J74o2j35
$$ plain form
6263 -203 -90 -53 128 154 -49 5 51 73 215 56 -124 -148 -18 104 -129 -70 33 -37 114 158 55 139 -23
6286 -23 -39 62 -121 78 -34 -51 97 80 -65 138 -110 42 -89 24 -9 71 92 -22 118 64 -167 -67 -101
6309 -101 84 41 -59 -94 -43 34 97 -125 -42 96 -72 25 23 14 119 -5 -85 -75 221 34 137 77 -115 40 -44
6334 -44 -61 -154 23 -199 -70 63 171 124 -60 190 -28 6 34 24 -43 -39 50 58 -28 -16 48 93 -98 1 -70 -47 53
6361 53 -123 189 52 -160 32 108 86 -83 149 -56 85 -36 -16 -72 3 -73 29 -77 26 129 111 58 -105
6384 -105 3 -48 171 -31 -20 8 20 -70 -210 154 28 -96 -24 -119 -39 -42 -74 -216 118 -52 -66 96 86 -7 -70
6409 -70 -79 -100 -6 92 -171 -56 -51 -161 -25 -34 87 -37 -80 62 23 59 45 3 -82 -62 53 6 62 -161 52 51 11
6436 11 68 141 -27 -18 -31 -5 211 8 20 63 10 110 33 -98 -37 74 -39 -65 36 -1 56 271 -80 -126 22
$$ packed form
6263b03J13L7J81K6k03N4M6K2J42j59j80k4J30J22k33N9J03p0J51M4j03Q4j62
6286b3j6J01j83J99j12j7J48j7j45K03k48J52j31J13l3Q0K1j14J40n4k31J00l4
6309a01J85m3j00l5N1P7O3k22Q3J38j68R7krJ05j24q0J0K96j87J03o0j92J55q4
6334d4j7r3J77k22J29J33J08m7j84K50k18L4K8j0o7MQ9Qq6J2O4M5j91R9p1K3J00
6361E3j76L12j37k12J92P6k2j69K32k05J41j21K0n6P5p6J02j06J03J03j8n3j63
6384a05J08n1K19k02J1K8J2r0j40L64j26j24P2r5Q0ll2j42L34j70j4J62j0r3o3
6409g0rk1R4R8k63J15Nj10J36rJ21j24m3J42l9L6j4m2q5K0J15m7N6k23K13jm0
6436A1N7P3j68Rj3K6K16k03J2M3n3J00p7j31O1J11j13k6J01l7N7K15l51m6J48
$$ plain form
6461 22 -175 23 14 54 -45 -24 95 -4 94 -189 -95 -117 -134 -73 47 -11 198 49 -24 56 56 -69 54 -100 -13 -12 7
6488 7 55 -15 -35 41 -109 13 56 -63 8 28 7 -46 -10 32 39 80 -48 8 63 -51 -95 -141 109 42 47 165 134 -46
6516 -46 28 74 123 140 -8 72 -83 -121 -103 -15 -46 -107 52 -16 -64 -35 3 -21 85 25 22 -32 -32 96 112 -151 4 -22
6544 -22 -138 130 83 -69 -26 102 -10 -185 -38 127 -172 31 35 81 50 -94 -25 -8 36 -46 -66 12 -140 78
6568 78 -113 -33 26 118 -48 -60 -87 102 51 73 -113 9 -224 -100 161 42 -15 -26 -139 -32 57 190 -135 53
6592 53 -13 125 -78 76 133 15 76 -66 116 56 96 12 -152 -76 117 16 -62 4 -19 -66 -35 10 42 -121 -96
6617 -96 76 22 -7 38 -1 -18 101 -27 30 -9 -157 -29 56 38 6 -27 -63 96 96 -79 62 136 -35 138 8
6642 8 158 46 45 83 -188 56 -40 64 -93 49 -117 106 -9 80 -172 -194 13 -6 54 33 101 21 -113 66
$$ packed form
6461B2j97J98rM0r9K1J19r9R8k83R4k2j7O1J20n8K09j49p3Q0%j25J23j54Q7JJ9
6488GM8p0k0P6j50J22M3j19P1K0k1n3L6M2PM1j28N6N5j14m4m6K50o7NJ18l1j80
6516d6P4M6M9J7j48Q0j55l8J8Q8l1o1J59o8m8K9L8k4J06o0ln4%J28J6k63J55k6
6544b2j16K68m7j52M3J28j12j75J47J65k99K03MM6l1j44O9J7M4q2k0P8j52K18
6568G8j91Q0N9R2j66j2k7J89n1K2j86J22k33J24K61j19n7j1j13J07Q9J33l25J88
6592E3o6J38k03J54N7j18O1j42J82o0M0q4j64P6J93j01p8O6k3m7L1M5L2j63K5
6617i6J72n4k9M5l9j7J19j28N7l9j48J28Q5j8l2l3l6J59%j75J41P4j71J73j30
6642HJ50j12jL8k71K44r6J04j57J42j66K23j15Q9k52k2K07j9O0k1O8q0j34J79
$$ plain form
6666 66 -35 -103 5 -51 -117 41 -201 34 -85 -113 -155 -78 10 -180 83 85 186 -63 -120 -1 81 -2 -1 47 71 -122
6692 -122 95 45 -19 4 43 -3 -105 -48 -100 155 18 -28 10 102 5 -1 -78 -186 -192 45 -213 201 104 -96 22 1
6718 1 -34 -19 70 -84 139 -100 84 157 18 24 75 -68 105 -101 -57 17 -94 -42 -157 -42 131 87 137 14 -153
6743 -153 -54 -46 -66 131 128 -42 103 -11 -2 -127 43 88 83 -165 49 -3 -75 -165 -73 15 0 40 177 -13 -130 -115
6769 -115 19 -81 -58 35 25 -19 -203 -67 -9 -33 -10 -27 -10 -63 -152 46 -10 -22 34 -128 77 1 -152 -162 -6
6794 -6 -85 -90 99 73 13 1 -18 -6 -84 -130 3 -49 95 120 -153 187 17 73 168 -70 -13 -18 -136 -24 21 22 165
6821 165 -31 -3 -81 -8 -141 -40 23 -16 -26 -210 21 14 3 21 57 -35 47 9 142 -3 84 63 -38 -84 -145 9
6847 9 109 -113 -32 60 107 72 23 -11 31 60 -2 61 -2 23 94 126 -54 -33 12 -2 -25 35 67 -59 14 104 33 -13 -104
$$ packed form
6666F6j01o8J08n6o6J58k42K35j19k8m2P7Q8j90K63KJ01k49n7J19Q2q3JM8K4j93
6692a22K17n0o4K3L9m6j02N7n2K55j37m6L8R2r7op7j08oK37k58M14r7k00J18k1
6718Al5J5Q9j54K23k39J84P3j39ON1j43J73k06M4P4j11N2j15J15J73m4N0j23j67
6743a53R9Qk0J97lj70J45j14Rj25J70M5nk48K14n2p2r0R2Q8j5M0J37j90j17J5
6769a15J34j00K3R3j0m4j84J36N8k4K3j7J7n3q9J98n6j2N6j62K05p6j53j0J56
6794fp9nJ89k6o0j2j9J2p8m6J33n2J44K5k73L40j70N6R5k38N7nj18J12M5JJ43
6821A65j96K8p8P3j33J01O3l9j0j84K31pj1J8L6r2Q2l8J33j45Q7k1j01m6o1J54
6847IJ00k22Q1R2M7l5m9l4M2K9o2O3o3K5P1L2j80K1M5j4k3O0L2j26P3R0p1m6r1
$$ plain form
6876 -104 137 10 -67 106 4 -215 124 -6 17 156 -125 -28 -68 -174 162 -21 -152 -15 1 -92 -87 27 35
6899 35 128 59 174 64 -108 56 -42 163 63 27 27 -44 97 38 -72 -5 -48 -104 24 19 13 87 136 37 -39 13 -81
6926 -81 -21 112 38 22 103 -41 -1 -60 52 92 -157 234 -209 54 -15 -7 19 -51 -179 -52 108 42 68 4 8 36
6952 36 68 83 28 77 36 -116 -28 46 81 1 -120 -85 85 -46 -3 28 52 22 26 -84 -69 10 -129 -44 130 29 -66
6979 -66 -106 -8 -12 51 -66 186 -52 6 -107 -143 3 93 44 86 -57 64 -33 9 -100 114 -124 6 -135 98
7003 98 0 -78 -12 131 51 46 136 39 65 -85 7 -24 143 -18 76 -88 42 -25 138 -147 -197 -148 176 56 133 64
7029 64 -121 58 -67 -90 101 62 102 -22 16 -151 34 30 5 -16 75 58 74 -2 -55 79 135 -22 -110 83 -145
7054 -145 206 -129 -8 42 -1 48 1 -107 58 34 -50 -162 56 56 -44 -83 -57 -149 148 33 -25 -46 60 67 -11
$$ packed form
6876a04K41j27p7J73j02k19L39j30K3J39k81R7m0j06L36j83j31J37J6r3NJ14Q
6899C5R3o9J15j10j72J64r8K05j00l6%p1J41n9j10O7m3n6J28noP4M9r9p6N2r4
6926h1O0J33p4j6Q1j44M0n9J12M0k49L91m43K63o9QK6p0j28J27J60o6K6o4MK8
6952C6L2J5n5M9m1j52Q8P4L5q0j21L5J70j31M3L1K4l0Mj10J5P9j39Q5J74j01r5
6979f6m0R8mO3j17K52k38N8j13l6J46R0m9M2j43J21r7M2j09K14k38J30j41K33
7003I8r8p8O6J43q0nR0r7K6j50R2l1J67j61R4j64J30o7J63k85n0M9L24j20P7o9
7029F4j85J79j25k3J91l9M0j24L8j67J85mk5k1R1j7J6p6n3J34N6j57q8J93k28
7054a45L51l35J21N0m3M9m7j08J65k4q4j12K18%j00l9K6r2K97j15n8k1J06Pp8
$$ plain form
7079 -11 -192 165 -77 -116 -6 70 -107 -28 136 76 -38 7 164 41 -135 55 70 -54 99 17 -8 65 212
7102 212 -71 67 -9 -7 40 102 109 -123 57 31 67 297 -39 -51 57 -29 50 -25 14 78 107 51 124 -35 13 7 141
7129 141 -49 101 82 -56 -83 76 -110 82 -30 52 -19 110 76 145 90 -22 6 -96 -10 107 -54 58 -56
7152 -56 76 -7 14 -85 173 13 -123 110 -54 -150 56 91 -11 -48 16 -7 -36 -69 -8 -3 -34 148 41 -25 26 -62
7178 -62 -30 143 112 22 -61 -181 91 72 155 3 2 24 -168 121 -38 30 21 -33 -22 37 188 78 -7 119 -29 -92
7204 -92 -30 -52 -201 -27 -7 -200 66 35 -50 219 84 -31 -1 -18 13 86 -76 -16 -97 -51 145 6 32 27 -42 150
7230 150 -90 -107 -65 154 -219 81 33 -71 101 4 52 -13 76 -21 20 27 122 218 -10 -14 -82 48 -18 154 34 -44
7256 -44 -138 87 106 41 -49 -18 -41 -27 44 -123 -34 60 17 -183 143 36 -100 62 -89 37 45 98 66 -26 18 2
$$ packed form
7079a1j81L57k42l9J10P6j77P9J64o0j14M5J57j23j76J90J5j24J53q2k5P3J47
7102B12k83J38p6KM7O2Pk32J80k6L6K30l36j2J08q6P9p5L9O4K9n6P3j59M8oJ34
7129A41j90J50j9j38k7J59j86J92j12Q2p1J29l4O9n5j12K8j02Q6J17j61J12j14
7152e6J32q3K1r9K58j60j36K33j64r6K06L5j02l7O4k3k9l3O1Nl1J82j07o6N1q8
7178f2L2J73l1r0q3j20K72j9Q3j52jK2j92K89j59O8rn4J1N9J51j10q5J26j48o3
7204i2O2k2j49J74K0j93K66l1q5K69j35j15L0j7L1P3j62O0q1M6J96j39K6no9J92
7230A50k40j7M2K19l73L00m8j04J72r7M8o5Q9r7M1PR5R6k28mo8J30o6J72j20p8
7256d4r4K25J9o5r0L1k3J4P1j67Q9R4m3k00L26j07j36J62j51J26QN3l2r2M4j6
$$ plain form
7282 2 -140 -161 -25 84 201 41 -94 -12 -41 76 -35 43 -7 197 -15 -141 62 -203 -3 -129 -91 70 88
7305 88 -88 61 -89 -48 52 22 -41 -40 -100 8 129 25 -23 0 57 81 161 41 -21 36 118 -85 168 73 -150
7330 -150 -58 -223 40 103 58 30 -126 59 -39 29 27 38 47 41 44 35 -6 37 -184 -105 16 1 9 -16 -138 -14 63 -12 87
7359 87 -6 110 30 58 21 136 68 -132 -124 208 -5 -29 53 -71 -29 10 -114 -154 -2 35 113 -11 85 -149 -108 -24
7385 -24 -9 -121 -79 -87 -126 -70 58 -57 103 16 -181 30 -84 -27 -112 -50 77 -163 98 25 -89 60 -4 -89 49
7410 49 -11 -135 43 22 -106 185 -8 -22 20 -198 -83 -55 44 189 138 -16 -123 -65 -121 22 -49 -133 22 161
7434 161 46 -98 35 -22 13 53 -33 16 60 99 -32 15 68 147 134 62 112 18 -26 -94 80 45 -133 4 175 8
7460 8 36 81 143 -112 -25 48 -77 -236 -28 99 -19 31 -221 -49 -119 -113 -21 -28 53 -39 -78 22 -102 4 -94 18
$$ packed form
7282Bj42k1J36J09J17j60j35Q2k9J17j11P8n0K04k12j26K03k65K00j26L8J61J8
7305H8j76J49j50M1J00l0o3Jo0J08J21j04m8K3N7K4Q0j20o2N7Q2k03K53r5k23
7330a50R2j65K63O3m5k8j56J85r8O8kJ1RoLrm1M3k21P9J21j5Qk5j22J24P7p5R9
7359H7r3J16q0K8l7J15o8k00QL32k13k4Q2j24M2L9j24m0J52L7P8j24R6k34M1Q4
7385b4J5j12M2ql9N6J28j15J60q7j97K11j14N7q5O2J27k40K61p3j14J49o4q5J38
7410D9o0j24J78k1j28K91j93j4M2k18J15K8R9J45n1j54j07N8n6J43p1q4J55J39
7434A61j15j44J33n7L5M0q6M9M4L9j31M7N3P9j3p2N0r4m4o8J74l5j78J37J71j67
7460HK8M5O2k55Q7P3j25j59K08J27j18N0k52J72p0OR2pQ1r2l9J00j24J06r8J12
$$ plain form
7486 18 -17 -163 -18 35 45 32 -11 -131 -136 -75 78 189 59 127 159 97 94 36 -33 87 -3 32 185 -39 196 59
7512 59 -35 -1 -4 60 81 -44 50 50 -36 -104 -11 -56 18 -133 52 168 -14 -31 -52 -95 -12 2 85 0 -74 9 -110 -51
7540 -51 -118 27 53 -160 24 105 195 128 -28 -7 -76 -73 16 168 120 44 96 26 -11 -66 -17 -172 14 134 -32 12
7566 12 51 40 -16 -102 51 -129 106 74 -185 154 -156 20 160 -230 87 50 34 44 105 -66 -40 -93 -178 15
7590 15 40 -50 -111 122 94 92 50 91 35 16 -144 2 -60 -63 47 14 167 -8 33 -79 -101 -35 -59 61 11 7 -82 117
7618 117 -63 -41 226 57 67 99 -167 -40 10 -89 27 -83 -126 58 -204 89 -84 -80 38 104 91 -49 -36 -74
7642 -74 4 18 -65 72 12 -151 154 52 32 -88 87 -257 41 9 -173 -92 -43 -14 -66 33 -8 284 119 -39
7666 -39 77 -95 -148 -77 -95 170 22 194 244 -15 68 93 -98 197 -42 -162 33 84 -44 53 -5 -137 -101 145
$$ packed form
7486A8l5j46J45N3J0j3m3j20nO1J53J11j30O8L2o2ln8o9J20r0L5J53k24K35j37
7512E9r4L4lO4K1j25R4%q6o8R3m5P4j51J85J16j82j7k1m3Q3J4Q3q5p4Q3j19N9
7540e1o7J45K6k13J84Q1R0o7j56K1o9LQ9J52m8p6N2p0l7n5M9j55J86J20j66M4
7566A2L9j1n6q6J53j80K35l2k59L39l10J76J40l90L17l7j6J0O1j71K6n3q5J93
7590A5K5r0o1K33k8km2M1n6j9j60J46o2lJ10l3J53j75M1j12k2O6k4J20n0mq9J99
7618A17j80K2K67j69J0L2k66J27N0r9J16j10m3J84k62K93j73MJ18O6j3j40J3l8
7642g4P8J4q3J37o0j63L05j02k0j20J75l44K98l2j82Q1M9K9n2R9m1K92j65j58
7666c9J16j72n3P1j8K65j48J72N0k59Q3K5j91K95k39j20J95N1j28R7n8j32L6K46
$$ plain form
7690 145 -85 -105 154 232 49 -28 -31 130 238 -3 -65 99 -35 -134 24 93 23 30 55 -28 120 -170 90 52 120
7715 120 9 55 -174 94 -49 64 -63 -133 19 -114 -73 96 -44 -38 -49 20 66 4 -57 113 255 60 4 49
7739 49 159 15 25 -9 98 45 -47 102 -104 -72 11 60 -3 12 -11 64 -44 -49 -141 71 2 -38 13 -50 -7 -74 -86
7766 -86 52 84 45 -39 -104 -52 -43 -90 -31 -157 -10 76 -84 -18 218 -23 73 46 -68 -44 -25 -14 -52 -21 114 -22
7792 -22 -132 8 32 -41 -92 -10 12 -108 -280 34 -7 10 155 76 -38 104 28 41 -34 -147 121 33 -31 78 -28
7817 -28 -14 77 -14 -81 42 107 34 -74 -39 -17 -46 -73 -50 10 -92 -2 68 -5 5 54 -213 -26 11 -23 -129 -57 -131
7844 -131 -35 59 41 45 -20 -31 -40 -15 -27 -53 -34 -27 47 32 -160 0 -71 -18 64 -93 -88 44 126 62 -41 25 -32 -43 15
7873 15 28 -46 -48 9 -21 -100 51 -74 53 28 -8 -101 -47 103 40 110 -124 74 -24 -122 55 145 -44 32 -72 53
$$ packed form
7690A45k30k0K59P8j83p7lJ61J08k41o2J64j34r9J58O9p0PK5q3J48k90K60l8O8
7715A20j11M6k29K68j43J13j27p0J52j33M1J69j40Oj1O9M6o2o1J70J42j95n6M5
7739D9J10j44J0l4J07n3r2J49k06L2Q3M9o3J5k3P5j08nr2K12o9m0N1o3M3o7j2
7766h6J38L2l9q4o5N2Rm7N9j26J47Q6j60O6K36k41R6k7j14K4J9J1l8L1J35j36
7792b2j10J40K4p3n1Q2K2j20j72L14m1J7J45p9j14J42p6J3p5j13K68q8o4J09j06
7817b8J4R1r1o7J23O5p3j08L5K2k9k7K3O0j02R0P0p3J0M9k67J87L7l4j06P2p4
7844a31R6R4j8Mo5j1rK5j2k6J9PP4j5j92J60p1N3Q2j57NJ32Q2o4j03O6n7j1N8
7873A5J3p4kN7l0p9J51j25J27k5l6r3N4J50o3P0k34J98r8r8J77R0j89P6j04J25
$$ plain form
7899 53 73 248 75 45 28 -160 -47 139 31 -42 -105 28 121 104 108 -63 -161 10 -41 17 84 20 -26 -56 -33 -42 50
7926 50 7 126 3 62 32 34 -95 -102 -110 -111 19 -166 -65 -5 -54 -17 70 -58 73 110 -86 -102 79 -205 -38 137
7952 137 -112 -38 -2 -29 65 -118 84 -125 -136 -20 -31 88 77 -59 -116 -6 141 -44 -196 98 -36 -3 -148
7975 -148 63 2 -54 62 -31 14 28 -96 96 -69 -42 -71 96 -87 115 -40 -64 155 -78 -34 94 98 75 -73
7999 -73 107 90 30 10 20 -54 83 2 -92 -21 -122 -50 -10 -9 5 53 47 -10 118 -113 -115 -71 -8 52 -34 51 101 38 -80
8028 -80 98 -17 73 59 30 49 -23 54 -30 -77 12 -31 101 66 -26 20 -47 184 -78 -123 106 2 -14 -105 96 -13
8054 -13 54 57 59 -65 117 -86 13 -12 204 21 -31 76 -95 158 -53 -82 22 -84 95 -61 -56 80 -69 4
8078 4 18 6 -28 20 116 150 -62 45 179 4 -5 -18 -124 28 -152 -55 -2 -114 -91 -29 -104 61 66 55 -123 110
$$ packed form
7899E3K0J75j73l0j7j88J13J86j08p3o3J33R3j7Mj71r8J71n1N8O7o4m6l0K3rR2
7926E0m3J19j23N9l0Kj29pqjJ30j85J01O0m9L7Q7j28J31L7j96j6J81k84J67J75
7952A37k49P4L6k7R4j83K02k09j1J16j1J19j1j36n7J10J47j85j52K94j34L3j45
7975a48K11o1n6J16r3M5J4j24J92j65K7k9J67j83K02j55k4K19k33M4J28Mk3j48
7999g3J80j7o0k0J0p4J37q1r4P1j01P2M0JJ4M8on7J28k31kM4O3O0q6Q5N0o3j18
8028h0J78j15R0j4k9J9p2P7q4m7Q9m3J32l5r2M6o7K31k62m5K29j04j6r1K01j09
8054a3O7LKj24J82k03R9k5K16j83n2J07j71K53k11k9J04j06J79j56NJ36j49P3
8078DJ4j2l4M8R6L4k12J07J34j75rj3j06J52j80R7N3j12K3O2p5J65Nj1j78K33
$$ plain form
8104 110 -42 37 -103 97 50 -54 -5 -5 8 -18 1 -66 117 125 -160 82 -154 -52 -22 112 -85 9 84 -38 26
8129 26 25 -75 -57 -43 -116 13 -112 -176 0 -1 -75 49 -19 -34 108 105 -41 0 62 62 -85 14 27 82 49 23 8 69
8157 69 -45 3 28 20 24 26 -70 145 -120 -59 -84 -11 -55 119 -114 -17 -52 -46 -26 15 -6 37 29 171 75 26 58 -73 -88
8186 -88 -167 6 -155 54 -81
$$ packed form
8104A10j52P9j40K00m7j04M9%J3k6J9o7J83Qk85K42k36J02L0J34j97R4P5j22O4
8129B6jj00J8J4p3J29j25o4J76jp4J24o8j5J42lj46M1O2%j47R9J3N5l3k6j5O1
8157F9j14M8K5qMKr6K15k65O1k5P3m4J74k33R7l5OK0M1k1M3qJ42r6m9L2j31j5
8186h8p9J73j61K09j35
8191h1
$$ Imaginary data points
##PAGE= N=2
##DATA TABLE= (X++(I..I)), XYDATA
$$ plain form
0 0 0 0 0 0 0 0 8 0 0 0 8 -8 8 -8 8 -16 16 -16 20 -24 32 -36 40 -48 56 -64 73 -83 92 -108 124 -138 152
33 152 -173 194 -215 239 -264 295 -328 362 -395 437 -484 534 -585 642 -708 779 -858 942
51 942 -1040 1151 -1275 1417 -1578 1771 -2000 2276 -2617 3045 -3603 4358 -5422 7016 -9601
66 -9601 14301 -24515 55330 -337466 -1145400 282882 785940 -539642 -290531 697438 -83384
77 -83384 -627856 466768 540032 -620345 -336433 556287 27650 -402452 254479 205016
87 205016 -441936 -13353 477700 -155536 -307430 353694 71912 -478905 138091 428859
97 428859 -356253 -292837 518519 109867 -565089 120630 501338 -353984 -371758 512313
107 512313 226739 -527998 -51378 422120 -180280 -297656 373419 179525 -428651 -29374
$$ packed form
0@%%%%%%Qq%%Qj6J6j6J6k4L2l2L6m4N6o8P6q8J04j20J37j56J75k00K32k62K90
33A52l25L67m09M54n03N59o23O90p57Q32r21J018j119J227j350J487j637J800
51I42j982K191k426K692k995L349l771M276m893N662o648P961r780J2438j6617
66i601K3902l8816P9845l92796q07934J428282N03058j325582K49111R87969p80822
77h3384n44472J094624P3264j160377K83912Q92720n28637m30102O56931m9463
87B05016o46952M28583M91053o33236j51894O61124k81782n50817O16996K90768
97D28859p85112O3416Q11356m08652o74956O85719L80708q55322j7774Q84071
107E12313k85574p54737M76620M73498o02400j17376O71075j93894o08176L99277
$$ plain form
117 -29374 388671 -96212 -299031 134899 146794 -119040 40886 89663 -193724 -75006
127 -75006 199728 7601 -105681 110077 23302 -185677 48111 192070 -151368 -192579
137 -192579 206095 156222 -175397 -37739 147624 -75895 -128552 157280 127093 -184775
147 -184775 -116427 162686 86686 -118264 -63316 78448 71005 -21368 -46146 -6695 -3274 -25227
159 -25227 1082 48438 10344 -67466 -3014 87234 -15378 -99082 26626 95278 -35874
170 -35874 -82480 48803 53560 -74167 -33252 76337 26384 -37965 -1476 20558 -14157 -30658
182 -30658 3145 37929 22762 -45066 -56143 53573 69115 -69719 -55704 82258 27719
193 27719 -75588 21166 64908 -94816 -76242 141344 67655 -152618 -26695 151848 2112
$$ packed form
117b9374M18045m84883k02819M33930J1895k65834J59926M8777k83387J18718
127g5006K74734j92127j13282K15758q6775k08979K33788J43959l43438m1211
137a92579L98674m9873l31619J37658J85363k23519n2657K85832l0187l11868
147a84775O8348K79113p6000k04950N4948J41764p443r2373k4778L9451L421k1953
159b5227K6309M7356l8094p7810O4452R0248j02612q3704J25708O8652j31152
170c5874m6606J31283M757j27727M0915J09589m9953o4349L6489K2034l4715j6501
182c0658L3803L4784j5167o7828j1077J09716J5542j38834J4015J37962n4539
193B7719j03307R6754M3742j59724J8574K17586p3689k20273J25923J78543j49736
$$ plain form
204 2112 -116789 23472 72190 -47708 -27001 56879 -13256 -44344 36382 21928 -26360 13864
216 13864 19361 -28534 -4955 21558 -35614 -21826 59381 -7418 -74819 50092 80962 -78431
228 -78431 -71851 91639 45904 -102330 -16108 89216 -32316 -68959 70449 46798 -76854
239 -76854 -10789 81624 -10833 -67385 29854 30961 -49640 4839 50637 -27957 -31935 39355
251 39355 12838 -31859 13528 15235 -41990 7849 51215 -48244 -53822 71296 38730 -75755
263 -75755 -8667 81571 -11340 -67281 34321 35162 -57115 -2330 61303 -25000 -51057 49377
275 49377 50191 -50343 -34270 46192 13385 -33492 -3079 4444 -9089 9915 6631 -19558 137
288 137 30228 -6598 -34360 16266 23264 -32369 -16459 28459 406 -23836 16718 26577 -22896
$$ packed form
204B112j18901J40261M8718j19898K0707Q3880p0135l1088Q0726j4454m8288M0224
216A3864N497m7895K3579K6513n7172J3788Q1207o6799o7401J24911L0870j59393
228g8431O580J63490m5735j48234Q6222J05324j21532l6643J39408k3651j23652
239g6854O6065R2413r2457n6552R7239J107q0601N4479M5798p8594l978P1290
251C9355k6517m4697M5387J707n7225M9839M3366r9459n578J25118l2566j14485
263g5755O7088R0238r2911n5941J01602Q41r2277N4785O3633q6303k6057J00434
275D9377Q14j00534J6073Q0462l2807m6877L0413P523j3533J9004l284k6189J9695
288A37L0091l6826k7762N0626O998n5633J5910M4918k8053k4242M0554R859m9473
$$ plain form
301 -22896 -12209 39132 10 -45142 7121 37843 -11923 -30174 14390 24322 -10528 -4895
313 -4895 14083 -5094 -8938 5334 -1330 -7425 -2439 -784 -1408 4235 7137 -5243 -3908 11335
327 11335 1918 -8194 -2996 -5900 -1646 9864 4000 -10454 -5396 20118 17312 -14011 -16556 4369
341 4369 12905 1699 -17110 -11611 11411 14143 -1967 -14719 -3606 15712 8311 -9596 -15112
354 -15112 -6208 11242 8309 -11653 -14684 4902 23496 7822 -18544 -4948 14745 2726 -9715
367 -9715 -3584 2771 -2012 4061 13614 -5290 -11410 13798 11096 -10784 -6299 3665 -5218 -7231
381 -7231 9320 3555 -17306 771 19548 -2334 -11612 2763 3127 -4312 -130 -805 -14158 -795
395 -795 24997 2028 -23169 4865 23822 -426 -15049 -1250 2310 -6199 6909 8230 -18206
$$ packed form
301b2896J0687N1341l9122m5152N2263L0722m9766j8251M4564R932l4850N633
313d895J8978j9177l844J4272o664o095M986J655o24N643K902j2380J335J5243
327A1335r417j0112N198k904M254J1510n864j4454N058K5514k806l1323k545K0925
341D369Q536j1206j8809N499K3022K732j6110j2752J1113J9318p401j7907n516
354a5112Q904J7450k933j9962l031J9586J8594j5674k6366J3596J9693j2019j2441
367i715O131O355m783O073R553j8904o120K5208k702k1880M485R964q883k013
381g231J6551n765k0861J8077J8777k1882r278J4375L64p439M182o75j3353J3363
395g95K5792k2969k5197K8034J8957k4248j4623J3799L560q509J3108J321k6436
$$ plain form
408 -18206 -5294 26965 4420 -24477 -17 20901 -8315 -19727 11834 5594 -20174 2836
420 2836 16190 -9227 -4076 19413 -369 -22394 7696 21273 -17015 -17154 17090 6040 -9906
433 -9906 9281 9239 -10575 208 16362 -8192 -18373 14826 8816 -24436 -2945 22327 -2572
446 -2572 -14055 9101 6928 -14564 2469 15697 -16528 -19072 15696 9545 -13631 -281 12272
459 12272 -4253 -4921 16679 3205 -22206 -901 16025 -4384 -7688 6351 -481 -4860 14594
472 14594 10211 -22344 -9551 25508 3260 -24923 -3628 10819 -925 204 4555 -10256 -5902
485 -5902 22975 9125 -26115 -9185 16934 3944 -7155 -1841 -3265 -22 16119 9735 -16759
498 -16759 -6566 18025 148 -14388 3165 5639 -9088 -2480 11892 530 -9267 6217 5614
$$ packed form
408a8206J2912L2259k2545k8897K4460K0918k9216j1412L1561o240k5768K3010
420B836J3354k5417N151K3489j9782k2025L0090J3577l8288j39L4244j1050j5946
433i906J9187m2j9814J0783J6154k4554j0181L3199o010l3252K1491K5272k4899
446b572j1483K3156k173k1492J7033J3228l2225k544L4768o151k3176J3350J2553
459A2272j6525o68K1600j3474k5411K1305J6926k0409l304J4039o832m379J9454
472A4594m383l2555J2793L5059k2248k8183K1295J4447j1744J129M351j4811M354
485e902K8877j3850l5240J6930K6119j2990j1099N314j424L243J6141o384k6494
498a6759J0193K4591j7877j4536J7553K474j4727O608J4372j1362r797J5484o03
$$ plain form
511 5614 -11091 -1969 8182 -5692 -10160 2787 4087 -4980 3179 11049 -4744 -8669 7460 5163
525 5163 -4978 -2094 -2452 -5268 5510 14796 -1903 -15122 4754 14220 -3069 -6161 1605 -3054
539 -3054 -5548 3379 4493 -6021 -2195 6895 -2659 -2300 9618 -1115 -14396 -1611 10526 1099
553 1099 -6660 -760 -534 782 12282 4241 -13141 -1336 12343 1207 -10058 -3814 3869 1606
567 1606 1683 2734 -3162 -95 5561 -1522 -6023 30 3301 -2402 -6936 -1257 2372 470 3755 2136
583 2136 -3550 742 3791 -2164 -6420 -1763 3119 596 3467 6060 -3839 -5160 6603 7608 -2247
598 -2247 -6836 -2158 2215 1383 -61 -4440 -4112 7534 8265 -3930 -7608 -1351 2560 -279 -2497
613 -2497 -1326 -1411 2153 3648 -3816 -2442 5615 3526 -2382 -610 2836 -1086 -5312 -277 3027 2595
$$ packed form
511E614j6705R122J0151j3874m468J2947J300r067Q159P870j5793l925J6129k297
525E163j0141K884l58k816J0778R286j6699j3219J9876R466j7289l092P766m659
539c054k494Q927J114j0514L826R090r554L59J1918j0733j3281J2785J2137r427
553A099p759N900K26J316J1500q041j7382J1805J3679j1136j1265O244P683k263
567A606P7J051n896L067N656p083m501O053L271n703m534N679L629j902L285j619
583B136n686M292L049n955m256M657M882k523K871K593r899j321J1763J005r855
598b247m589M678M373q32j444m379L28J1646P31j2195l678O257L911k839k218
613b497J171q5L564J495p464J374Q057k089n908J772L446l922m226N035L304m32
$$ plain form
629 2595 3505 -1041 -3473 2128 3747 -799 -4668 -2411 2335 1258 -2011 -4246 -3699 2997 6087 1567
645 1567 -1768 -2515 -249 -859 -3709 -616 2466 693 1070 2131 1675 403 451 1564 -916 -2019 1561
662 1561 188 -2490 -2378 -871 4064 6139 1208 -4435 -5295 -118 2794 -1296 -3648 -3280 905 5996
678 5996 2456 -4796 -5052 2657 7830 1145 -5707 -3358 1198 2796 262 -2240 1473 4545 2168
693 2168 -741 -2538 -1124 1290 685 -917 -2025 -223 1419 -1551 -1889 540 1854 2224 -548 -2733
709 -2733 -1150 -914 -1924 -1357 1125 3115 519 -359 1948 962 -61 868 181 -360 -1033 -595 244 37
727 37 1281 1401 834 1637 -364 -2152 -1555 -2029 -1622 -321 144 697 142 8 -75 -627 1071 1254 -1000
746 -1000 -2206 -1846 1264 2296 -1239 -1470 2626 4413 1883 -2436 -2497 896 1826 168 -2770 -1994 2252
$$ packed form
629B595R10m546k432N601J619m546l869K257M746j077l269k235N47O696L090m520
645A567l335p47K266o10k850L093L082j773L77J061m56j272M8J113k480j103L580
662A561j373k678J12J507M935K075m931n643q60N177K912m090k352L68M185N091
678E996l540p252k56P709N173o685o852K349M556J598k534k502L713L072k377
693B168k909j797J414K414o05j602j108J802J642k970l38K429J314L70k772k185
709b733J583K36j010N67K482J990k596q78K307r86j023R29o87n41o73M38Q39k07
727C7J244J20n67Q03k001j788N97m74M07J301M65N53n55j34q3n52J698J83k254
746a000j206L60L110J032l535k31M096J787k530m319o1L393R30j658k938P76M246
$$ plain form
763 2252 2278 -817 -2079 -865 2059 2086 -1346 -3538 -2316 1153 884 -2121 -1011 1669 2033 1343 -314
780 -314 -929 239 883 692 -899 -1347 657 1401 1257 290 -510 1591 2153 -327 -2326 -2457 -333 771
798 771 -709 -1231 -810 952 2066 -133 -1886 -1153 412 1130 -1105 -2494 -36 1602 1446 88 -22
815 -22 2117 1745 44 -629 -1104 450 808 -816 -747 468 1516 1077 -877 -542 316 322 -325 -2140 -2048
834 -2048 392 324 -493 -452 259 1307 490 -231 -325 -704 -101 474 -260 -184 284 1167 1750 595 409 557
854 557 175 61 -1009 -818 -301 -244 -195 -613 -249 870 303 -374 -554 -834 -501 -126 -872 -1548 -464 1453
874 1453 1476 -726 206 1479 1039 -146 -757 -230 576 727 -96 -888 597 2245 823 -715 -420 -89
892 -89 243 -212 -1688 -1700 -176 976 -113 -1215 331 1217 67 -592 -764 -51 -98 -87 158 -424 226
$$ packed form
763B252K6l095j262J214K924K7l432k192J222L469k69l005J110K680L64o90j657
780c14o15J168O44j91j591m48K004P44j44r67q00K101N62k480j999j31K124J104
798G71j480n22M21J762J114k199j753P33J565P18k235j389K458J638j56j358j10
815b2K139l72j701o73m75J554L58j624O9J215J048m39j954L35Q58Oo47j815R2
834b048K440o8q17M1P11J048q17p21r4l79O03N75p34P6M68Q83N83j155j86J48
854E57l82j14j070J91N17N7M9m18L64J119n67o77j80k80L33L75p46o76J084J917
874A453K3k202R32J273m40j185o11N27Q06J51q23p92J485J648j422j538K95L31
892h9L32m55j476j2J524J152j089j102J546Q86j150o59j72P13m7J1K45n82O50
$$ plain form
911 226 1795 1259 177 -74 237 411 478 -402 -1273 -597 1110 829 -675 -357 538 501 109 -945 -1460
930 -1460 -763 419 -86 -1775 -922 1457 1272 -73 -548 86 1048 827 -415 -1237 40 1646 719 -560
948 -560 507 1521 967 78 -261 -580 -168 308 -532 -1281 -201 727 -157 -566 49 237 -400 -471 -488 -585
968 -585 -490 183 -143 46 937 624 280 598 677 -56 -473 167 465 -488 -234 364 357 225 383 -251 -317 211
990 211 -122 -1285 -1266 212 294 -714 -493 143 534 158 -209 -365 -51 367 -67 -878 149 1188 618
1009 618 -172 274 1007 852 272 -544 -494 305 686 -448 -1055 100 874 77 -529 -226 -39 -91 -570 -912
1029 -912 -702 186 120 -544 23 726 684 -59 -109 377 478 253 -300 -151 302 882 32 -204 311 728 -10
1050 -10 -446 -181 -121 -417 -786 -293 17 -6 -203 -386 -1 523 -406 -881 -215 458 119 -483 -69 291 706
$$ packed form
911B26J569n36j082k51L11J74O7q80q71O76J707k81j504L18Q95l7l92j054n15
930a460O97J182n05j689Q53K379j85j345m75O34R62k21j242q22J277J606r27j279
948e60J067J014n54q89l39l19M12M76q40p49J080R28q84m09O15J88o37p1j7r7
968e85R5O73l26J89Q91l13l44L18P9p33m17O40K98r53K54N98pj32J58o34o6N28
990B11l33j163J9J478Q2j008K21O36L91l76l67j56L14M18m34q11J027J039n70
1009F18p90M46P33j55n80q16N0P99L81j134o07J155P74p97o06L03J87n2m79l42
1029i12K10Q88o6o64N67P03m2p43n0M86J01k25n53J49M53N80q50k36N15M17p38
1050a0m36K65O0k96l69M93L10k3j97j83L85N24r29m75O66O73l39o02M14L60M15
$$ plain form
1071 706 545 51 -7 939 1008 -582 -639 327 918 -15 -637 -25 717 273 -406 -962 -339 470 -250 -1281
1091 -1281 -509 308 384 -643 -406 259 399 439 -16 -731 -25 670 -84 -431 299 1145 455 -250 307 780
1111 780 411 -98 -486 -232 297 -172 -1008 -393 624 171 -924 -291 444 -247 -954 -454 -51 58 289
1130 289 -122 -635 392 1089 33 -500 463 759 262 -348 -190 344 728 303 -568 -228 940 149 -1058
1149 -1058 -608 598 231 -914 -862 314 175 -253 -226 -456 17 642 -370 -738 31 753 124 -548 252
1168 252 818 559 56 -398 146 1092 439 -742 -718 803 923 -916 -1127 326 730 -17 -991 -740 85
1187 85 394 -168 -910 -548 758 553 -596 -268 327 422 242 194 -72 52 433 -55 -247 501 931 -404
1207 -404 -469 853 484 -519 -903 88 194 -48 -298 -344 -31 364 -554 -823 14 198 -267 -774 -303 836
$$ packed form
1071G06j61m94n8R46O9j590n7R66N91r33o22O12P42m44o79n56O23Q09p20j031
1091a281P72Q17P6j027K37O65J40M0m55p15P06O95p54l47P30Q46o90p05N57M73
1111G80l69n09l88K54N29m69q36O15J017m53j095O33P35o91p07N00M03J09K31
1130B89m11n13J027O97j056n33R63K96m97o10J58N34L84m25q71L40J168p91j207
1149a058M50J206l67j145N2J176j39m28K7k30M73O25j012l68P69P22o29o72Q00
1168B52N66k59n03m54N44R46o53j181K4J521J20j839k11J453M04p47r74K51Q25
1187H5L09n62p42L62J306k05j149L28N95R5j80m8k66J24L81m88j92P48M30j335
1207d04o5J322l69j003l84R91J06k42k50m6L13L95r18k69Q37J84m65n07M71J139
$$ plain form
1227 836 550 -158 -562 56 1171 686 -818 -786 624 1449 141 -1310 88 1158 370 -562 -914 -131
1245 -131 422 -218 -696 -423 343 516 -924 -875 -11 180 -162 -744 -459 517 467 47 -511 209 1182 142
1265 142 -732 169 588 127 -391 307 924 -14 -301 -333 -267 241 -42 -618 -233 268 68 -509 -681 -155 195
1286 195 -14 -259 -470 199 658 -499 -602 422 975 185 -1082 -197 1452 541 -442 -131 674 1083 -384
1305 -384 -902 -145 213 288 -685 -522 713 567 -346 -1048 -621 637 479 -735 -1162 -239 1306 942 -1080
1324 -1080 -556 1237 1318 -217 -1139 -3 1056 198 -367 51 581 801 -229 -481 -163 38 287 17
1342 17 -674 -265 -74 264 -80 -514 -192 -46 25 146 -260 -475 -549 11 1058 461 -801 -548 553 1783
1362 1783 242 -1471 23 1356 673 -730 -1106 349 1075 25 -594 -546 608 907 -811 -1138 -107
$$ packed form
1227H36k86p08m04O18J115m85j504L2J410Q25j308j451J398J070p88r32l52P83
1245a31N53o40m78K73P66J73j440M9Q64J91l42n82K85R76n0m20n58P20R73j040
1265A42q74R01M19m61n18O98O17r38k87l2O6N08k83n76L85N01k00n77j72N26L50
1286A95k09k45k11O69M59j157j03J024N53p90j267Q85J649r11r83L11Q05M09j467
1305c84n18P57L58P5r73J63J235j46r13p02M27J258j58j214m27R23J545l64k022
1324a080N24J793Q1j535r22J136J059q58n65M18N30K20j030k52L18K01K49k70
1342A7o91M09J91L38l44m34L22J46P1J21m06k15p4N60J047n97j262K53J101J230
1362A783j541j713J494J333o83j403l76J455P26j050o19M8J154K99j718l27J031
$$ plain form
1379 -107 552 385 -1119 -1303 438 1123 391 -916 -541 1261 1006 -942 -848 91 1166 449 -328 566
1397 566 650 387 99 -245 -30 202 -502 -309 -148 425 87 -642 -30 401 -56 -152 -845 -327 335 -206 -475
1418 -475 -405 466 705 -546 -231 745 512 -371 -324 346 664 -182 -654 -142 554 987 -199 -879 285 587
1438 587 -92 -917 -955 353 469 -273 -1109 -525 1033 961 -871 -869 370 973 -168 -1487 -58 1346 691
1457 691 -266 -378 607 1293 329 -787 -780 419 1061 -454 -1149 -148 548 627 -255 -1108 -148 586 -205 -1029
1477 -1029 -712 366 267 -578 344 182 -192 186 27 432 -133 -593 139 518 109 -150 -425 805 978
1496 978 -59 -335 -317 342 521 -652 -872 -509 470 1022 -747 -1282 566 1316 93 -1699 -740 1077
1514 1077 529 -806 -1108 287 1657 693 -749 -281 625 906 -72 -1129 -471 489 744 179 -701 -165
$$ packed form
1379a07O59j67j504j84J741O85p32j307L75J802k55j948R4R39J075p17p77Q94
1397E66Q4k63k88l44K15K32p04J93J61N73l38p29O12M31m57r6o93N18O62n41k69
1418d75P0Q71K39j251L15R76k33q83M7O70L18q46m72N12O96M33j186o80J164L02
1438E87o79q25l8J308J16p42q36N84J558p2j832KJ239O03j141j319J429J404o55
1457F91r57j12R85O86r64j116PJ199O42j515o95J001O96P9q82q53R60P34p91q24
1477a029L17J078r9q45R22j62l74L78j59M05n65m60P32L79m09k59k75J230J73
1496I78j037k76J8O59J79j173k20L63R79N52j769n35J848P50j223j792R59J817
1514A077n48j335l02J395J370r64j442M68R06K81r78j057O58R60K55n65q80N36
$$ plain form
1532 -165 1034 712 -613 -1164 116 783 -855 -1042 113 150 33 -58 117 659 -79 -407 -75 320 165
1551 165 -665 -349 712 169 45 628 403 371 -27 -179 117 -299 -240 -215 -569 196 543 370 -703 -820
1571 -820 557 809 -936 -1301 -311 889 253 -1115 -450 988 1070 -158 -799 407 995 -233 -614 -458
1589 -458 158 970 131 -606 -38 787 1166 -522 -1404 -161 698 147 -987 -1118 746 678 -49 -305 -209
1608 -209 527 -38 -918 -400 143 42 -58 69 339 556 588 711 6 -226 440 -124 50 -49 -452 48 208
1629 208 555 587 -165 -707 -296 198 21 -1136 -845 429 293 -342 -506 244 1250 340 -863 -223 320
1648 320 346 -360 -1040 -28 1299 982 -81 -1056 421 1420 303 -1042 -1338 283 1265 -537 -1337 11
1666 11 1135 966 -556 -856 -16 189 -299 -678 -621 257 541 396 -41 -496 496 1025 185 -61 -303 -177
$$ packed form
1532a65J199l22j325n51J280O67j638j87J155L7j17r1J75N42p38l28L32L95j55
1551A65q30L16J061n43j24N83k25l2l98j52K96m16N9K5l54P65L47j73j073j17
1571h20J377K52j745l65R90J200o36j368O65J438Q2j228o41J206N88j228l81J56
1589d58O16Q12q39p37N68Q25L79j688q82J243Q59n51j134j31J864o8p27k56R6
1608b09P36n65q80N18N43j01j00J27K70K17L2J23p05k32O66n64J74r9m03N00J60
1629B08L47L2p52n42M11M94j77j157K91J274j36o35j64P50J006r10j203O40N43
1648C20K6p06o80J012J327l17j063r75J477R99j117j345k96J621R82j802q00J348
1666A1J124j69j522l00Q40K05m88l79N7Q78K84j45m37m55R92N29q40k46k42J26
$$ plain form
1686 -177 90 -81 92 186 24 260 429 463 -337 -1053 18 410 -470 -624 -357 154 214 -256 184 680 194
1707 194 -627 -1037 -20 735 -98 -231 -506 329 1605 940 -891 -1199 237 1594 283 -1574 -1057 350
1725 350 940 -133 -690 389 626 -427 -394 -134 127 -554 -1152 -8 849 639 65 -821 -186 985 1108
1744 1108 275 -1069 -1047 803 940 -126 -731 -71 1282 873 -86 -449 -494 -384 -49 40 74 -523 -785 561
1764 561 626 53 -256 -111 422 -84 -836 -366 -253 136 202 111 410 474 603 69 -711 99 770 154 -533
1785 -533 -826 344 1054 -122 -764 55 1167 764 -1462 -1423 178 576 144 -1083 -758 676 868 176
1803 176 -577 -543 584 779 -371 -851 -421 506 694 -214 72 587 580 96 -480 -94 -20 -469 -203 -116 104
1824 104 212 -132 86 131 -101 228 85 -669 -697 -371 214 457 -367 95 348 670 905 -252 -634 -227
$$ packed form
1686a77K67j71J73R4j62K36J69L4q00p16J071L92q80j54K67N11O0m70M40M96m86
1707A94q21m10J017P55q33j33k75Q35J276o65j831l08J436J357j311j857N17J407
1725C50N90j073n57J079K37j053L3K60K61o81n98J144Q57k10n74q86O35J171J23
1744A108q33j344K2J850J37j066o05O60J353m09r59l63m5J10L35Q9L4n97k62J346
1764E61O5n73l09J45N33n06p52M70J13L89O6r1K99O4J29n34p80Q10O71o16o87
1785e33k93J170P10j176o42Q19J112m03k226L9J601L98m32j227L25J434J92o92
1803A76p53L4J127J95j150m80M30R27J88r08K86N15pm84n76L86P4m49K66Q7K20
1824A04J08l44K18M5k32L29j43p54k8L26N85K43q24M62K53L22K35j157l82M07
$$ plain form
1844 -227 -75 756 -170 -653 210 991 820 -496 -728 516 806 -331 -977 -866 503 518 -294 -379 -29
1863 -29 482 496 -443 -650 221 438 237 -862 -711 738 868 0 -416 47 945 443 -656 -536 -295 175
1883 175 -98 -354 78 144 254 406 -432 -250 -42 -34 -213 -780 -521 292 218 232 172 -32 425 318 405 192
1905 192 -692 -427 236 302 165 -96 296 877 115 -360 -166 228 57 -868 -666 492 229 55 -339 15
1925 15 704 114 -400 -740 -722 385 453 -516 -770 39 1172 698 -697 -220 622 690 -158 -850 -231 662
1945 662 133 -483 -5 478 726 -47 -341 -257 -319 249 -188 -838 -419 -39 831 108 -700 181 630 288 -244
1966 -244 -635 -237 177 -6 112 42 -82 515 597 555 -381 -817 271 630 -385 -700 -400 724 694 -285
1986 -285 -52 56 239 -59 -714 -611 -220 147 315 -534 -405 746 762 -49 -655 -397 781 207 -736 -879
$$ packed form
1844b27J52Q31r26m83Q63P81j71j316k32J244K90j137o46J11J369J5q12q5L50
1863b9N11J4r39k07Q71K17k01j099J51J449J30q68m16M63Q98n02j099J20K41M70
1883A75k73k56M32O6J10J52q38J82K08Qj79n67K59Q13p4J4o0k04M57j07Q7k13
1905A92q84K65O63O6j37k61L92N81p62m75J94L94j71r25K02J158k63j74l94L54
1925A5O89n90n14l40J8J107O8r69k54Q09J133m74j395M77Q42O8q48o92O19Q93
1945F62n29o16M78M83K48p73k94Q4o2N68m37o50M19L80Q70p23q08Q81M49l42n32
1966b44l91L98M14j83J18p0j24N97Q2m2r36m36J088L59j015l15L00J124l0r79
1986b85K33J08J83k98o55J03L91L67J68q49J29J151J6q11o06K58J178n74r43j43
$$ plain form
2006 -879 209 1142 273 -429 212 277 405 135 -757 -334 44 99 59 -582 -133 575 319 119 -329 -172 258
2027 258 -318 -517 -102 -278 4 111 200 595 234 174 322 -113 -236 -61 -197 35 -484 -35 709 275 134
2048 134 -146 -138 250 -138 -519 -586 -367 266 254 -160 -8 38 459 597 -603 -278 108 227 -311 -538 128
2069 128 791 242 -13 -26 319 595 -1 -539 -272 -156 504 -280 -649 204 481 663 -193 -734 47 433
2089 433 -125 -475 -730 434 624 -1 17 178 349 565 -89 -472 -289 -146 396 -143 -497 -253 620 800
2109 800 -5 -678 -90 34 101 -161 -774 -239 149 276 173 -128 -241 339 301 -238 -735 -423 329 41 -496
2130 -496 -126 564 1049 154 -457 332 352 152 -178 -672 -390 220 548 264 -469 -160 547 234 -193 -667
2150 -667 -406 264 -196 -419 56 381 271 -18 67 589 34 49 -323 -480 -63 26 110 111 -431 231 912 47
$$ packed form
2006h79J088R33q69p02O41O5J28k70q92M23L78N5m0o41M49P08k56k00m48J57M30
2027B58n76j99M15j76K82J07Q9L95l61o0J48m35j23J75j36K32n19M49P44m34j41
2048A34k80QL88l88l81o7K19O33j2m14J52M6M21J38j200L25L86J19n38k27O66
2069A28O63n49k55j3L45K76n96n38K67J16O60p84l69Q53K77J82q56n41P81L86
2089D33n58l50k55J164J90o25J8J61J71K16o54l83J83J43N42n39l54K44Q73J80
2109H00q05o73N88J24O7k62o13N35L88J27j03l01j13N80l8n39m97L12P52k88n37
2130d96L70O90M85q95o11P89K0k00l30m94K82O10L28k84p33L09P07l13m27m74
2150f67K61O70m60k23M75L25j10k89Q5N22n55J5l72j57M17Q9Q4Jn42O62O81q65
$$ plain form
2172 47 -132 -390 -36 20 -231 -462 -175 3 298 -29 159 195 -311 50 13 -514 -384 -73 -43 36 -211 547
2194 547 716 37 -323 -266 207 241 -225 -225 -191 115 486 55 -59 240 93 208 -166 -799 -321 293 39 -282
2216 -282 -325 418 490 61 -151 -273 10 364 -284 -532 -179 183 417 202 -200 172 462 645 -133 -519 -117
2237 -117 159 -220 -133 -344 371 384 -65 15 -84 69 -61 -570 -554 -239 -28 332 39 -128 63 369 415 -429
2259 -429 -512 30 159 -84 -372 -412 238 579 310 226 -186 -72 265 -237 -276 -563 -82 405 -57 -209 38
2280 38 271 357 -248 -331 -58 30 -54 -290 -288 167 415 395 170 -246 287 481 -4 -416 -412 89 252 -253 -190 126
2304 126 363 370 -57 -146 -62 -130 -228 -431 -573 181 218 166 -62 -210 323 293 -113 -225 -156 -64 126 -126 29 392
2328 392 255 265 180 114 121 -289 -211 -123 -158 220 115 -147 -87 -52 465 179 -364 -355 -204 17 -56 -365 -103 225
$$ packed form
2172D7j79k58L54N6k51k31K87J78K95l27J88L6n06L61l7n27J30L11L0P9k47P58
2194E47J69o79l60N7M73L4m66%L4L06L71m31j14K99j47J15l74o33M78O14k54l21
2216b82m3P43P2m29k12j22K83L54o48k48L53L62K34k15m02L72K90J83p78l86M02
2237a17K76l79Q7k11P15J3m49Q0r9J53j30n09J6L15K11L60k93j67J91L06M6q44
2259d29q3N42J29k43k88m0O50L41k69q4m12J14L37n02l9k87M81M87m62j52K47
2280C8K33Q6o05q3K73Q8q4k36KM55K48k0k25m16N33J94m85m12MN01J63n05O3L16
2304A26K37Pm27q9Q4o8r8k03j42P54L7n2k28j48N33l0m06j12O9R2J90k52J55L63
2328C92j37J0q5o6Pm10P8Q8l5L78j05k62O0L5N17k86n43RJ51K21p3l09K62L28
$$ plain form
2352 225 466 583 193 -227 -45 198 61 -315 -618 100 220 178 -96 -46 493 228 -268 -287 -164 73 16
2373 16 -549 -310 -18 333 392 -93 -239 -20 330 85 -533 -513 195 306 13 -58 59 641 397 -123 -156 -199
2395 -199 258 -77 -388 -130 -6 245 408 72 -207 100 177 -27 -399 -405 -49 92 -9 9 -65 384 303 69
2417 69 79 -79 -39 81 -123 -244 -221 93 404 40 -39 145 288 216 -189 -449 -115 -61 -36 -164 -64 201 180
2440 180 230 -110 -259 209 73 -177 -260 -144 196 306 -211 -128 186 325 5 -383 -262 122 147 -85 -246
2461 -246 38 426 166 -53 82 -33 356 -22 -440 -410 8 65 128 -154 -71 167 163 -30 -71 -62 -53 -33 -203 -78
2485 -78 -49 175 289 84 40 85 142 -18 -208 -133 -51 41 96 -200 -187 132 298 294 -91 -357 -149 108 -135 -471
2509 -471 -305 344 208 19 49 48 410 113 -275 -364 92 147 96 -277 -23 275 534 147 -246 -200 155 -68
$$ packed form
2352B25K41J17l90m20J82K43j37l76l03P18J20m2k74N0N39k65m96j9J23K37n7
2373A6n65K39K92L51N9m85j46K19L50k45o18K0P08J11k93p1J17N82k44n20l3m3
2395a99M57l35l11K58J24K51J63l36k79L07P7k04l72oL56J41j01J8p4M49q1k34
2417F9J0j58M0J20k04j21K3L14L11l64p9J84J43p2m05k60L34N4K5j28J00K65k1
2440A80N0l40j49M68j36k50q3J16L40J10n17Q3L14J39l20l88J21L84K5k32j61
2461b46K84L88k60k19J35j15L89l78m18L0M18N7O3k82Q3K38mj93m1RRK0j70J25
2485g8K9K24J14k05m4M5N7j60j90P5Q2R2N5k96J3L19J66ml85k66K08K57k43l36
2509d71J66O49j36j89L0jL62k97l88q9M56N5n1l73K54K98K59l87l93M6L55k23
$$ plain form
2531 -68 -306 -555 -99 262 141 56 -5 209 355 228 -287 -65 -127 184 4 -157 29 71 108 268 -78 71
2553 71 83 7 -60 -195 -332 166 283 113 -48 58 73 188 -12 -182 -386 -51 48 -72 -229 217 334 258
2575 258 -38 -64 155 173 27 -298 -139 126 280 71 -79 119 334 376 -224 -342 -75 49 -163 -291 -76
2596 -76 104 343 107 -115 5 124 -38 -112 -273 103 14 -290 -245 117 314 271 1 -13 84 -104 -88 -8 -107
2619 -107 89 -64 147 176 145 236 29 95 -56 -241 -264 -130 -33 9 -43 -89 215 173 79 -145 41 -112 272 -233
2643 -233 -194 67 145 68 -170 -110 402 403 -17 -344 -105 37 93 16 -192 168 271 60 -198 64 151 150 -166 -280
2667 -280 -254 111 78 -63 -272 91 310 51 -25 -132 -209 -149 -51 -197 -144 142 131 116 140 231 -13 -134 -196 -179
2691 -179 -6 -34 -32 213 -47 -43 -50 125 178 -201 -212 -113 169 -55 -262 -124 124 426 149 -47 32 118 132 -390
$$ packed form
2531f8k38k49M56L61j21q5o1K14J46j27n15K22o2L11j80j61J86M2L7J60l46J49
2553G1J2p6o7j35j37M98J17j70j61J06J5J15k00j70k04L35R9j20j57M46J17p6
2575B58k96k6K19J8j46l25J59K65J54k09j50J98K15M2o00j18K67J24k12j28K15
2596g6J80K39k36k22J20J19j62p4j61L76q9l04M5L62J97m3k70j4R7j88J6Q0r9
2619a07J96j53K11K9l1R1k07O6j51j85k3J34R7M2n2m6L04m2r4k24J86j53L84n05
2643b33L9K61P8p7k38O0N12Jm20l27K39J42N6p7k08L60J03k11k58K62Q7jl16j14
2667b80K6L65l3j41k09L63K19k59p6j07p7O0R8j46N3K86j1j5K4R1k44j21o2J7
2691a79J73k8KK45k60MpJ75N3l79j1R9K82k24k07J38K48L02k77j96P9Q6J4n22
$$ plain form
2715 -390 -107 -211 -12 183 -282 -106 282 169 150 -195 -124 16 -138 -190 -187 5 208 166 -185 52 181 223
2737 223 -185 -205 -57 -122 -33 -32 9 148 136 285 236 30 93 -102 -111 -175 -213 -172 94 -41 -14 192 213 50 -218
2762 -218 39 -310 -306 -159 168 98 -34 -24 134 239 39 -249 -33 128 -91 -250 -269 123 251 -7 -38 37
2784 37 141 326 -117 -216 -49 67 13 -330 -39 184 227 32 -190 -61 75 62 -304 -314 15 78 140 46 98
2807 98 181 226 -83 17 56 44 -190 -178 -96 -88 271 -4 -24 239 154 -83 -4 -171 -14 -118 54 -192 153 104
2831 104 -139 -46 216 3 -17 -87 -20 48 -140 -42 80 32 121 26 180 70 58 164 -129 -104 29 -2 46 -148
2855 -148 -151 308 101 -169 -128 44 -106 -126 -118 76 121 45 -63 80 -25 90 139 108 -48 -17 -7 -76 -206 99
2879 99 138 107 56 144 -63 32 -236 -124 -275 -30 12 -471 19 231 18 172 -26 74 -18 -183 -55 41 188
$$ packed form
2715c90K83j04J99J95m65J76L88j13j9l45P1J40j54n2LJ92K03m2l51K37J29M2
2737B23m08k0J48o5Q9JM1J39j2J49m9k06O3j95ro4l8M1K66j35K7K06K1j63k68
2762b18K57l49MJ47L27p0j32J0J58J05k00k88K16J61k19j59j9L92J28k58l1P5
2784C7J04J85m43r9J67J16n4l43K91K23M3j95k22J29J36j3l66j0L29O3O2r4N2
2807I8Q3M5l09J00L9j2k34J2Q2QL59k75k0K63q5k37P9j67J57j04J72k46L45m9
2831A04k43R3K62k13k0p0O7O8j88R8J22m8Q9r5J54j10j2J06k93K5J33l1M8j94
2855a48lM59k07k70M1J72j50k0QJ94M5p6j08J43j05J15M9l1j56L1J0o9j30L05
2879I9L9l1n1Q8k07R5k68J12j51K45M2m83M90K12k13J54j98J00r2j65J28R6J47
$$ plain form
2902 188 -3 -28 82 308 -6 134 -90 109 -43 -103 -118 12 73 23 -144 -170 203 362 284 -259 -366 203
2924 203 34 -191 -74 167 298 132 17 -13 225 168 18 1 82 -64 91 -121 -201 51 190 199 -15 -16 0
2947 0 109 -208 -148 -64 -133 -159 -30 110 201 -119 78 36 -209 132 -102 -20 185 9 -144 20 184 220 -38
2970 -38 95 -73 60 7 -28 -351 -127 166 189 -71 -190 146 83 -127 -79 -121 136 -110 -197 65 108 80 -34
2993 -34 -190 73 249 -100 8 -30 69 123 226 59 93 53 95 37 -127 125 -214 9 -391 22 223 169 -50
3016 -50 -26 196 131 -111 -200 27 -34 -215 -57 149 -22 279 -47 105 72 203 80 -39 -191 70 159 183 -189
3039 -189 -19 314 143 -51 27 -85 -93 -361 -360 -2 117 -72 -209 110 143 136 -129 -118 162 146 58 -167 -51 50
3063 50 2 213 -219 -104 177 23 -90 -222 186 11 -11 -3 114 192 133 -58 -21 115 79 -102 -126 -64 17 -225
$$ packed form
2902A88j91k5J10K26l14J40k24J99j52o0j5J30O1n0j67k6L73J59p8n43j07N69
2924B03j69k25J17K41J31j66j15l0K38n7j50j7Q1j46J55k12q0K52J39Rk14jJ6
2947@J09l17O0Q4o9k6J29J40R1l20J97m2k45L41k34Q2K05j76j53J64J64L6k58
2970c8J33j68J33n3l5l23K24K93K3k60j19L36o3k10M8m2K57k46q7K62M3k8j14
2993c4j56K63J76l49J08l8R9N4J03j67L4m0M2n8j64K52l39K23m00M13K01n4k19
3016e0K4K22o5k42q9K27o1j81J58K06j71L01l26J52l3J31j23j19j52K61Q9K4l72
3039a89J70L33j71j94P8j12qk68JL58J19j89j37L19L3pk65J1K80j6q8k25J16J01
3063E0m8K11m32J15K81j54j13j32M08j75k2QJ17P8n9j91L7J36l6j81k4O2Q1k42
$$ plain form
3087 -225 -65 102 -83 -83 -3 -52 156 -137 -67 64 18 202 214 -304 -20 168 79 -69 -236 37 185 44 -43
3110 -43 -302 158 245 -161 -309 -173 85 174 47 -96 -47 28 115 -192 -225 89 180 109 -11 29 227 79 -180
3133 -180 -146 128 -63 38 24 88 162 9 2 119 165 15 -20 37 28 -167 -155 -73 -15 98 -83 129 -46 64 163
3158 163 -234 -127 57 215 137 -136 21 216 117 -94 3 -43 71 -179 -348 83 24 59 -77 65 91 81 -52
3181 -52 42 -139 95 47 20 -42 -90 -100 92 -40 -93 158 144 111 -172 -172 257 93 -201 -75 147 209 -62 -123 71
3206 71 -10 30 -25 -229 30 -4 22 -83 -204 -46 106 4 -28 -302 -65 193 -67 -31 81 -16 320 52 234
3229 234 169 -228 3 238 72 -277 -77 20 145 -422 -229 -31 226 -11 -339 -52 141 -46 107 -84 -246
3250 -246 58 90 274 28 -119 210 260 -119 -225 -120 188 171 -227 0 134 196 -21 -105 15 -160 21 130
$$ packed form
3087b25J60J67j85%Q0m9K08k93P0J31m6J84J2n18K84J88q9j48j67K73J48j41q7
3110d3k59M60Q7m06j48J36K58Q9j27j43M9P5Q7l07l3L14R1p1j20M0J98j48k59
3133a80L4K74j91J01j4O4P4j53pJ17M6j50l5N7rj95J2Q2N8J13j81K12j75J10R9
3158A63l97J07J84J58p8k73J57J95r9k11R7m6J14k50j69M31n9L5j36J42K6j0j33
3181e2R4j81K34m8k7o2m8j0J92j32n3K51j4l3k83%M29j64k94J26K22O2k71o1J94
3206G1q1M0n5k04K59l4K6j05j21J58J52j02l2k74K37K58k60L6J12r7L36k68J82
3229B34o5l97K31K35j66l49K00R7J25n67J93J98K57k37l28K87J93j87J53j91j62
3250b46L04L2J84k46j47L29N0l79j06J05L08j7l98K27J34O2k17q4J20j75J81J09
$$ plain form
3272 130 -143 -196 39 50 93 -104 -139 101 -101 -125 -44 -241 60 147 17 160 105 -73 164 176 -67 -78 -174 111
3296 111 -44 105 16 27 104 -1 -307 22 174 5 1 -194 39 202 19 -17 -210 167 139 -55 -272 36
3318 36 6 -37 -140 130 209 87 -69 18 -63 77 89 -192 -80 17 39 -88 -115 174 -40 80 139 -298 54 92
3342 92 58 -56 -174 52 114 -115 -66 50 29 314 -207 82 -144 -97 120 93 -135 -291 118 -7 161 -148
3364 -148 114 37 36 104 -79 -169 -6 -170 318 146 -244 110 84 -33 -325 -66 357 125 -184 -193 160 177 280
3387 280 -141 164 258 207 20 -346 -132 43 -7 101 -86 -209 378 332 30 -222 -95 227 -132 -274 -88
3408 -88 150 125 -17 8 129 152 -13 -4 -24 -59 -96 166 244 112 -180 192 255 95 -202 -160 59 118 -80 -23 -258
3433 -258 75 232 84 5 -154 37 202 -209 -42 -78 -57 74 -199 -97 52 221 79 -25 -29 243 -58 31
$$ packed form
3272A30k73n3K35J1M3j97l5K40k02k4Q1j97L01Q7j30J43n5j78K37J2k43j1r6K85
3296A11j55J49q9J1P7j05l06L29J52j69mj95K33J63j83l6j93L77k8j94k17L08
3318C6l0m3j03K70P9j22j56Q7q1J40J2k81J12R7K2j27k7K89k14J20N9m37L52L8
3342I2l4j14j18K26O2k29M9J16k1K85n21K89k26M7K17k7k28j56M09j25J68l09
3364a48K62p7jO8j83r0J63j64M88j72l90L54k6j17k92K59M23k32l09rL53J7J03
3387B80m21L05R4n1j87l66K14J75n0J08j87j23N87m6l02k52J27L22l59j42J86
3408h8K38k5j42K5J21K3j65Rk0l5l7K62P8j32k92L72O3j60k97M2K19N9j98N7k35
3433b58L33J57j48p9j59J91J65m11J67l6K1J31k73J02J49J69j42j04mK72l01Q9
$$ plain form
3455 31 10 -77 14 13 3 95 -7 73 47 -130 -109 11 62 -235 -134 -66 88 26 187 98 206 191 -174 -141 -6 -139
3481 -139 -23 26 -139 47 -47 192 -33 -106 5 29 100 -208 -111 76 53 34 -113 -201 35 86 160 24 -68 12
3505 12 -108 48 -135 -27 34 202 13 -366 104 145 97 -62 -221 -28 257 173 83 -79 -81 67 285 -155 -138
3528 -138 -125 263 -68 -348 -183 74 19 164 -218 28 82 113 45 -64 -134 60 42 -20 -208 51 207 277 -11
3551 -11 -188 -59 118 11 -276 109 0 144 -22 -92 97 18 -127 10 -160 -95 -5 24 157 -249 66 113
3573 113 97 22 -256 -7 235 -49 -25 12 130 110 159 -55 116 -143 10 71 -264 -9 -135 125 29 -17 -67
3596 -67 234 189 42 -24 89 13 -154 -128 -304 -159 68 -81 -43 29 76 216 12 -150 115 153 -13 -103 -42 155
3620 155 223 -29 -66 -47 18 99 -107 -82 -179 -133 144 33 -62 -25 135 117 -94 -230 169 89 -38 -16 24 172 257
$$ packed form
3455C1k1q7R1jj0R2j02Q0k6j77K1J20N1k97J01O8J54o2J61q9J08j5l65L3J35j33
3481a39J16M9j65J86r4K39k25p3J11K4P1l08R7J87k3j9j47q8K36N1P4j36r2Q0
3505A2j20J56j83J08O1J68j89l79M70M1m8j59j59J93K85q4r0j62kJ48K18m40J7
3528a38J3L88l31k80J65K57n5J45l82K46N4L1o8j09p0J94j8o2j88K59J56P0k88
3551a1j77J29J77j07k87L85j09J44j66p0J89p9j45J37j70O5R0K9J33m06L15M7
3573A13j6p5k78K49K42k84K4L7J18k0M9k14J71k59J53O1l35K55j26K60r6m6n0
3596f7L01m5j47o6J13p6j67K6j76J45K27j49L8P2M7J40k04j62K65L8j66r0O1J97
3620A55O8k52l7J9O5Q1k06K5r7M6K77j11r5L7J60j8k11j36L99q0j27K2M0J48Q5
$$ plain form
3645 257 149 120 25 43 92 -78 -53 -90 97 35 68 -46 -199 163 210 -118 -203 -62 49 -56 -60 -81 -124 122 -104
3670 -104 29 -36 91 177 3 -139 -32 18 122 -11 -30 149 136 194 -14 -130 72 26 100 -221 -231 46 47 228
$$ packed form
3645B57j08k9r5J8M9j70K5l7J87o2L3j14j53L62M7l28q5J41J11j05mk1m3K46k26
3670a04J33o5J27Q6j74j42J07N0J04j33j9J79j3N8k08j16K02m6P4l21j0K77JJ81
$$ [...]
8191a7
##END NTUPLES=NMR FID
##END=
