##TITLE=1H_TG-2365-D
 CDCl3
 8 sc, 
 17.2.2023
##JCAMPDX= 6.0         $$ Bruker NMR JCAMP-DX V2.0
##DATA TYPE= NMR SPECTRUM
##DATA CLASS= NTUPLES
##ORIGIN= UXNMR, Bruker Analytische Messtechnik GmbH
##OWNER= root
$$ XWIN-NMR		Version 3.5
$$ Fri Feb 17 14:46:15 2023 Russian Standard Time (UT+4h)  she@DPX200
##.OBSERVE FREQUENCY= 200.13135
##.OBSERVE NUCLEUS= ^1H
##.ACQUISITION MODE= SIMULTANEOUS
##.ACQUISITION SCHEME= undefined
##.AVERAGES= 8
##.DIGITISER RES= 18
##SPECTROMETER/DATA SYSTEM= spect
##.PULSE SEQUENCE= zg30
##.SOLVENT NAME= DMSO
##.SHIFT REFERENCE= (INTERNAL, DMSO, 0, 15.8714)
##AUDIT TRAIL= $$ (NUMBER, WHEN, WHO, WHERE, WHAT)
$$ ##TITLE= Audit trail, XWIN-NMR		Version 3.5
$$ ##JCAMPDX= 5.01
$$ ##ORIGIN= Bruker BioSpin GmbH
$$ ##OWNER= she
$$ F:/spectra/data/she/nmr/H-F/1/pdata/1/auditp.txt
$$ ##AUDIT TRAIL=  $$ (NUMBER, WHEN, WHO, WHERE, WHAT)
(   1,<2023-02-17 14:44:54.46 +0400>,<she>,<DPX200>,
      <created by zg, POWCHK disabled, PULCHK disabled
       configuration hash MD5:
       00 E9 B6 7A A2 85 ED C7 34 08 36 98 17 FE 4E 26
       data hash MD5: 16K
       57 9F 2E 55 D8 22 74 E1 8E 2F DF F5 71 36 F6 71>)
(   2,<2023-02-17 14:44:57.20 +0400>,<she>,<DPX200>,
      <Start of raw data processing
       efp BC_mod = 2 LB = 0.24 FT_mod = 6 PKNL = 1 PHC0 = -19270.68 PHC1 = 12.40078 SI = 16K 
       data hash MD5: 16K
       48 32 B8 43 AE 4F 30 80 41 71 60 34 59 30 3F EC>)
(   3,<2023-02-17 14:45:19.76 +0400>,<she>,<DPX200>,
      <pk PHC0 = 0.1060943 PHC1 = 0 
       data hash MD5: 16K
       5B 8B F9 6C 9B 9E F3 77 8A BF B7 1C 67 E8 CF 0A>)
(   4,<2023-02-17 14:45:22.50 +0400>,<she>,<DPX200>,
      <abs ABSG = 5 
       data hash MD5: 16K
       B0 EB AE 4C 39 77 13 7E 6E BA 68 83 15 1F 56 6D>)
$$ ##END=
$$ 
$$ hash MD5
$$ 3F 87 3B 7A F1 A1 BB 1F 48 42 79 7A 3B D5 27 63
##$RELAX= 
##$RELAX= 
##$RELAX= 
##$RELAX= 
##$RELAX= 
##$RELAX= 
$$ Bruker specific parameters
$$ --------------------------
##$DU= <F:/spectra>
##$EXPNO= 1
##$NAME= <H-F>
##$PROCNO= 1
##$TYPE= <nmr>
##$USER= <she>
##$AMP= (0..31)
100 100 100 100 100 100 100 100 100 100 100 100 100 100 100 100 100 100 
100 100 100 100 100 100 100 100 100 100 100 100 100 100 
##$AQSEQ= 0
##$AQ_mod= 1
##$AUNM= <au_zg>
##$AUTOPOS= <>
##$BF1= 200.13
##$BF2= 200.13
##$BF3= 200.13
##$BF4= 200.13
##$BF5= 200.13
##$BF6= 200.13
##$BF7= 200.13
##$BF8= 200.13
##$BYTORDA= 1
##$CFDGTYP= 0
##$CFRGTYP= 5
##$CHEMSTR= <none>
##$CNST= (0..31)
1 1 145 1 1 1 1 1 1 1 1 1 1 1 1 1 1 1 1 1 1 1 1 1 1 1 1 1 1 1 1 1 
##$CPDPRG= <>
##$CPDPRG1= <>
##$CPDPRG2= <>
##$CPDPRG3= <>
##$CPDPRG4= <mlev>
##$CPDPRG5= <mlev>
##$CPDPRG6= <mlev>
##$CPDPRG7= <mlev>
##$CPDPRG8= <mlev>
##$CPDPRGB= <>
##$CPDPRGT= <>
##$D= (0..31)
0 1.2 0 0 0 0 0 0 0 0.06 0 0.03 0 0 0 0 0.0002 0 0 0 0 0 0 0 0 0 0 0 0 
0 0 0 
##$DATE= 1676630693
##$DBL= (0..7)
120 120 120 120 120 120 120 120 
##$DBP= (0..7)
150 150 150 150 150 150 150 150 
##$DBP07= 0
##$DBPNAM0= <>
##$DBPNAM1= <>
##$DBPNAM2= <>
##$DBPNAM3= <>
##$DBPNAM4= <>
##$DBPNAM5= <>
$$ [...]
##$SUBNAM3= <"">
##$SUBNAM4= <"">
##$SUBNAM5= <"">
##$SUBNAM6= <"">
##$SUBNAM7= <"">
##$SUBNAM8= <"">
##$SUBNAM9= <"">
##$SW= 18.05172834244
##$SWIBOX= (0..15)
0 0 2 0 0 0 0 0 0 0 0 0 0 0 0 0 
##$SW_h= 3612.71676300578
##$TD= 16384
##$TD0= 1
##$TE= 0
##$TE2= 300
##$TE3= 300
##$TEG= 300
##$TL= (0..7)
0 120 120 120 120 120 120 120 
##$TP= (0..7)
150 150 150 150 150 150 150 150 
##$TP07= 0
##$TPNAME0= <>
##$TPNAME1= <>
##$TPNAME2= <>
##$TPNAME3= <>
##$TPNAME4= <>
##$TPNAME5= <>
##$TPNAME6= <>
##$TPNAME7= <>
##$TPOAL= (0..7)
0.5 0.5 0.5 0.5 0.5 0.5 0.5 0.5 
##$TPOFFS= (0..7)
0 0 0 0 0 0 0 0 
##$TUNHIN= 0
##$TUNHOUT= 0
##$TUNXOUT= 0
##$USERA1= <user>
##$USERA2= <user>
##$USERA3= <user>
##$USERA4= <user>
##$USERA5= <user>
##$V9= 5
##$VALIST= <valist>
##$VCLIST= <CCCCCCCCCCCCCCC>
##$VD= 0
##$VDLIST= <DDDDDDDDDDDDDDD>
##$VPLIST= <PPPPPPPPPPPPPPP>
##$VTLIST= <TTTTTTTTTTTTTTT>
##$WBST= 1024
##$WBSW= 4
##$XGAIN= (0..3)
0 0 0 0 
##$XL= 0
##$YL= 0
##$YMAX_a= 526672
##$YMIN_a= -345671
##$ZGOPTNS= <>
##$ZL1= 120
##$ZL2= 120
##$ZL3= 120
##$ZL4= 120
##$ABSF1= 15.72926
##$ABSF2= -2.322589
##$ABSG= 5
##$ABSL= 3
##$ALPHA= 0
##$AQORDER= 0
##$ASSFAC= 0
##$ASSFACI= 0
##$ASSFACX= 0
##$ASSWID= 0
##$AUNMP= <proc_1d>
##$AZFE= 0.1
##$AZFW= 0.1
##$BCFW= 0
##$BC_mod= 2
##$BYTORDP= 0
##$COROFFS= 0
##$CY= -3
##$DATMOD= 1
##$DC= 0
##$DFILT= <>
##$DTYPP= 0
##$F1P= 0
##$F2P= 0
##$FCOR= 1
##$FTSIZE= 16384
##$FT_mod= 6
##$GAMMA= 0
##$GB= 0
##$INTBC= 1
##$INTSCL= 3.70164e-10
##$ISEN= 128
##$LB= 0.24
##$LEV0= 0
##$LPBIN= 0
##$MAXI= 10000
##$MC2= 0
##$MEAN= 0
##$ME_mod= 0
##$MI= 1.114404
##$NCOEF= 0
##$NC_proc= -7
##$NLEV= 6
##$NOISF1= 3.799351
##$NOISF2= 2.8
##$NSP= 0
##$NTH_PI= 0
##$NZP= 0
##$OFFSET= 15.87139
##$PC= 1
##$PHC0= -19270.57
##$PHC1= 12.40078
##$PH_mod= 1
##$PKNL= yes
##$PPARMOD= 0
##$PSCAL= 0
##$PSIGN= 0
##$REVERSE= no
##$SF= 200.129980016806
##$SI= 16384
##$SIGF1= 3
##$SIGF2= 2
##$SINO= 5.538805
##$SIOLD= 16384
##$SREGLST= <1H.CDCl3>
##$SSB= 0
##$STSI= 16384
##$STSR= 0
##$SW_p= 3612.71676300578
##$SYMM= 0
##$S_DEV= 0
##$TDeff= 16384
##$TDoff= 0
##$TI= <>
##$TILT= no
##$TM1= 0
##$TM2= 0
##$TOPLEV= 0
##$USERP1= <user>
##$USERP2= <user>
##$USERP3= <user>
##$USERP4= <user>
##$USERP5= <user>
##$WDW= 1
##$XDIM= 16384
##$YMAX_p= 278787488
##$YMIN_p= -206756
$$ End of Bruker specific parameters
$$ ---------------------------------
##NTUPLES= NMR SPECTRUM
##VAR_NAME=  FREQUENCY,     SPECTRUM/REAL,   SPECTRUM/IMAG
##SYMBOL=    X,             R,               I
##VAR_TYPE=  INDEPENDENT,   DEPENDENT,       DEPENDENT
##VAR_FORM=  AFFN,          ASDF,            ASDF
##VAR_DIM=   16384,         16384,           16384
##UNITS=     HZ,            ARBITRARY UNITS, ARBITRARY UNITS
##FACTOR=    0.220516191357247, 1,           1
##FIRST=     3176.34103212596, 0,            0
##LAST=      -436.375730879819, 0,           0
##MIN=       -436.375730879819, -206756,     0
##MAX=       3176.34103212596, 278787488,    0
$$ Real data points
##PAGE= N=1
##DATA TABLE= (X++(R..R)), XYDATA
$$ [...]
9078 -31817 23028 -52133 46567 58568 26254 74392 52404 67045 48337 45447 56367 62642
9066 62642 25366 -6668 -3642 35497 20195 7580 58087 59639 9932 22219 32964 13298
9054 13298 26628 45933 3882 -5508 32073 13869 -33925 13071 -16394 20872 24465 -8513
9042 -8513 27015 56232 35132 26309 42481 46167 68630 29273 2750 3208 14380 94783 78468
9029 78468 30622 91567 72848 38830 -10797 33296 11297 64098 39158 69704 129915 75559
9017 75559 16671 32803 78869 92867 97022 112591 98229 30432 32272 48407 64867 63615
9005 63615 69967 79746 58952 23022 224 40994 111687 99911 52295 45789 41654 50806 37799
8992 37799 101544 113704 63310 -4140 -15973 -30268 35701 67481 82275 97988 50301 68931
8980 68931 135707 163091 96761 38305 123146 95761 36458 34485 73777 97656 53131 51781
8968 51781 91491 63036 14544 39989 89875 49220 68541 63229 46232 54049 -16516 -30148
8956 -30148 19288 48504 58391 104118 140716 163799 103418 115031 107423 56149 -3201 29075
8944 29075 10958 45375 64414 38655 10735 44963 18464 36289 110241 68737 9172 64131
8932 64131 82094 46854 47330 95003 60874 60201 75982 89879 95365 99868 98618 158592 106016
8919 106016 38399 53046 77681 76196 76226 113008 83473 97787 110030 97570 65265 95310
8907 95310 132081 92191 48428 70541 139493 116354 61634 84715 73266 86368 168266 172139
8895 172139 162522 98894 85574 76107 109599 53313 74389 102110 41973 -4499 166 94896
8883 94896 78007 94554 73986 78243 136926 181011 185414 206564 190721 141213 97067 69758
8871 69758 49116 108447 69252 86878 175718 147071 94368 124882 102149 108992 129243 92428
8859 92428 71031 138217 99435 85617 148092 127034 147861 167629 151611 197199 149732 133041
8847 133041 139111 111868 57109 150305 198310 212464 254841 233954 198542 152864 119242 111506
8835 111506 140163 82905 68751 152966 134787 215011 167728 123698 170136 101613 97421 116761
8823 116761 150579 110084 165046 233493 269921 218267 161640 103010 120275 170560 185224 177214
8811 177214 166900 172469 170161 183729 196462 222871 200718 200589 200587 145414 124408 129565 180527
8798 180527 221594 271616 252317 199386 259441 249058 238558 219939 204644 246852 246276 289682
8786 289682 300037 272727 232427 255687 248296 225111 260431 299850 295023 315693 280692 302844
8774 302844 366961 335366 289214 325024 399265 370932 354200 319084 330546 355723 370460 402090
8762 402090 378847 373147 394113 481468 460738 542380 549152 585259 509047 472175 554792 560562
8750 560562 527021 533462 569450 568181 616775 643665 708058 712516 690362 718601 717128 653550
8738 653550 683835 677029 783744 852699 905620 858614 890464 940805 1029201 1110975 1089198 1173283
8726 1173283 1262459 1343854 1378639 1451384 1555127 1629328 1782607 1929375 2110938 2239414
8716 2239414 2460467 2610145 2708532 2863341 3087362 3333565 3501999 3687488 3753311 3788256
8706 3788256 3659185 3514892 3440358 3290041 3131870 3013574 2893131 2757268 2571761 2419657
8696 2419657 2292327 2103138 1931878 1755522 1630865 1514522 1404922 1309932 1133609 1079482
8686 1079482 1035142 994870 921069 826456 800420 742923 775930 717000 622737 654337 594946
8675 594946 591662 580849 537531 553950 520431 506483 441561 508698 541765 522794 472468 491502
8663 491502 552311 479274 464311 442352 350667 342248 379211 278523 283177 251096 280455 338740
8651 338740 360357 355073 312958 345311 315946 287893 306288 336877 324816 321805 375838 354406
8639 354406 328011 276096 310312 327631 330602 307059 285806 291855 254166 224917 205432 242326
8627 242326 223665 141451 160378 192377 218061 210469 241750 246904 268931 281382 259296 245162
8615 245162 224837 218035 256584 207439 236945 321944 278033 309578 275662 310317 322254 341266
8603 341266 283584 206250 195111 228161 238634 302980 304474 226976 221146 273641 205626 197035
8591 197035 239286 272178 173883 162967 159040 166537 193177 152178 163634 183815 262640 259710
8579 259710 269590 256024 228429 172481 146014 157917 230458 235646 282356 167933 197517 210948
8567 210948 204155 131424 204609 262112 197356 158076 226813 244789 133944 90668 103200 160203
8555 160203 150164 230773 219517 218292 275863 306447 309602 247251 246002 254604 190394 164117
8543 164117 119642 109844 164094 215627 184879 168829 173616 238885 168581 209224 128102 157448
8531 157448 179316 190257 239870 212666 202526 224793 166682 161849 168934 209539 166209 198822
8519 198822 191757 175746 252480 174086 153296 230680 287939 253179 255525 198475 197623 203561 175606
8506 175606 148959 184659 205739 182735 252375 290636 311882 218496 220320 246018 175600 222118
8494 222118 264331 281564 283484 272807 231776 222498 216662 278213 292305 223860 221982 275436
8482 275436 273903 249830 198084 207567 205289 179681 229010 293898 240742 237111 218875 211642 223010
8469 223010 156355 132245 160436 212094 215858 265569 211416 123384 138839 153362 249737 273000
8457 273000 290215 240767 312840 308425 306524 253170 260204 313461 269289 265185 291907 280350
8445 280350 290834 252365 284633 261938 304291 289239 336528 336030 247373 226024 214091 293599
8433 293599 305934 312613 338538 288808 258907 280670 272104 370138 380283 360878 330161 295685
8421 295685 333563 335130 269046 277167 227123 258686 319060 288974 216533 265809 262264 242254
8409 242254 218659 249003 279258 277877 185823 222844 258064 306718 279793 218619 207862 291935
8397 291935 363354 295981 283051 287463 278823 275765 346469 296152 308921 315375 298074 248836
8385 248836 299871 331372 335915 296722 298290 303452 289238 282676 298527 296373 233113 281198 304002
8372 304002 250399 223442 289207 305725 265655 212335 238959 282483 295220 251974 233518 249326
8360 249326 271729 265359 229948 169821 276216 314133 304602 280192 311904 369515 336636 350072
8348 350072 310559 362078 369976 343778 338896 312194 319991 320996 291907 334065 349011 243428
8336 243428 303106 314020 278448 333827 408435 378433 359952 371063 381096 372020 361474 422259
8324 422259 395758 320692 305834 356970 342823 317419 409731 437953 434564 439768 467775 377244
8312 377244 323374 324842 289956 335362 359185 326988 271886 307612 315062 340130 338014 318813
8300 318813 374527 403205 453071 375024 343158 368714 429799 437661 430806 471642 467306 468489
8288 468489 396528 438963 485828 493762 390143 451018 428519 409269 378573 357548 326007 335216
8276 335216 386219 385749 367884 349179 371058 428040 436283 448739 440211 411330 397974 471111
8264 471111 493467 479704 446807 408398 401402 424773 526184 506167 484228 491141 530831 563546
8252 563546 520176 464344 484610 546060 549895 446048 476987 524354 501138 466628 531446 527831
8240 527831 524627 588267 606634 523861 509185 489599 528059 584321 606001 635768 592599 600564
8228 600564 624227 596724 468038 565184 562147 510957 539962 546676 559512 649037 633579 518601
8216 518601 554768 584434 671862 634657 594899 588250 600947 642581 589389 555709 584583 602555
8204 602555 614401 588671 601390 689433 612017 643242 668207 684998 600239 619059 501796
8193 501796 838502 1110105 621672 517589 618291 671398 642965 663708 694519 665081 689338
8182 689338 756001 666689 711896 695853 726992 682837 694758 795046 808552 762067 687659
8171 687659 692387 715434 710085 685458 773721 768328 725109 742078 698078 752541 741896 766971
8159 766971 829603 800164 827524 697120 722328 799701 786669 813791 794161 770983 777698 742252
8147 742252 701806 756505 852812 863107 793750 839780 796850 726510 790553 851698 823300 830236
8135 830236 819255 825912 911917 894449 841278 808046 896346 862578 855480 907173 872689 841756
8123 841756 906331 832894 854341 926378 903236 876629 871447 914715 930430 931199 879816 878278
8111 878278 859731 898943 943507 959386 953666 944412 991282 1040353 949933 1009084 1017885 1039329
8099 1039329 992676 1029836 1070753 1065314 1059317 974352 997784 1049275 1043220 1062936 1032045 1078583
8087 1078583 1077307 1072307 1053795 1050096 1098503 1071618 1089680 1051249 1080379 1022369 1097640 1127260
8075 1127260 1181763 1174318 1148859 1144678 1180608 1164889 1122688 1104911 1104856 1146753 1182418 1227878
8063 1227878 1215716 1227506 1227358 1132785 1199436 1216192 1206169 1252563 1232603 1228959 1183397 1175387
8051 1175387 1239622 1225457 1224553 1208088 1160014 1229068 1296683 1334297 1296188 1358115 1356293 1359059
8039 1359059 1353504 1308223 1278978 1285542 1376036 1457002 1464235 1416784 1388840 1454137 1470307 1368408
8027 1368408 1355559 1342418 1442653 1515925 1440483 1429451 1435653 1449138 1435878 1415254 1396243
8016 1396243 1395076 1478217 1484224 1464276 1456917 1539113 1523001 1514199 1556226 1518517 1551561 1532548
8004 1532548 1539834 1562480 1558516 1573417 1602599 1591017 1634293 1575436 1577866 1596578 1652724 1629824
7992 1629824 1602296 1619705 1617995 1660660 1656316 1624217 1629779 1685528 1707469 1726986 1642075 1732814
7980 1732814 1738858 1694993 1741488 1782937 1745540 1717794 1664133 1742032 1772997 1793355 1842086 1849287
7968 1849287 1819124 1760059 1774300 1848226 1835313 1818058 1782930 1667745 1730463 1695449 1722182
7957 1722182 1799627 1739217 1782770 1838580 1833396 1859337 1816575 1826078 1857211 1832550 1826745 1945817
7945 1945817 1879440 1912176 1962765 1958531 1937801 1898312 1989090 1999436 2017908 2005448 1914024 1898458
7933 1898458 1969913 1966685 1942610 1993392 2036004 1994440 1991302 2069383 2044884 2014768 2006549 2015099
7921 2015099 2005062 1908720 1933892 2036573 2012242 2064969 2056342 2022232 2072618 2019594 2033810
7910 2033810 2085748 2001486 1980264 2012273 2033374 2060998 2136264 2159736 2121634 2082293 1973359
7899 1973359 1996094 2036761 2091833 2117442 2159283 2140142 2203246 2157631 2160146 2166397 2144627 2150292
7887 2150292 2169661 2178092 2112950 2112624 2137174 2121817 2134022 2125924 2164551 2203616 2146114 2209381
7875 2209381 2143320 2125090 2180924 2124521 2100845 2162473 2143179 2154550 2133308 2162937 2153206 2172060
7863 2172060 2166806 2204321 2165346 2145052 2116193 2150156 2189856 2154606 2098419 2071385 2115039 2127849
7851 2127849 2189811 2211174 2180472 2084885 2053570 2107016 2083177 2198215 2175755 2132269 2110932
7840 2110932 2109687 2152858 2220968 2114345 2016229 2063783 2057622 2153329 2172619 2144441 2213682 2198358
7828 2198358 2155110 2146723 2138027 2119187 2107795 2226774 2171113 2123226 2204098 2224749 2124628
7817 2124628 2203872 2168616 2184979 2260685 2728519 2444151 2127791 2202876 2167051 2129647 2159007
7806 2159007 2155844 2122005 2158638 2135522 2181050 2070171 2054224 2114125 2213562 2215995 2142271 2139600
7794 2139600 2132409 2131457 2140176 2119810 2112564 2130067 2151491 2073461 2095178 2176015 2166478 2108367 2134967
7781 2134967 2137809 2078222 2053401 2028097 2028986 2031199 2065915 2136999 2038075 2038422 2072596 2086686 2086626
7768 2086626 2130477 2153130 2124020 2138437 2138752 2110804 2097208 2040689 2083999 2097964 2082510 2107276
7756 2107276 2051953 2037175 2068973 2059435 2032661 2114775 2084787 2067096 2065640 2053973 2044333 2024088
7744 2024088 2137882 2057285 1985827 2003266 2041112 2101247 2157755 2142317 2034863 2063120 2130827
7733 2130827 2150573 2056971 1964433 1995473 2015341 2053315 2048593 2024020 2070741 2075683 2036342 2021031
7721 2021031 2070248 2083121 2044055 2023331 2013640 1978845 1893606 1948120 2006441 2016907 2003016 2036582
7709 2036582 2043375 2036394 1981233 1980201 1931940 1993346 2010980 1966792 2036775 2003864 1989516 2020564
7697 2020564 2074144 2053459 2046683 2051937 2024406 2020374 2060481 2023819 2048720 2040258 2003238 1948543
7685 1948543 1927891 1996888 1981413 1974816 2066782 2029090 2039259 2087994 2065780 2059967 1996569 1988886
7673 1988886 1976978 1992241 2024330 1993395 2032441 2011182 2000908 2036812 2085425 2066379 2101039
7662 2101039 2066048 1992733 2051353 2018751 1983725 2020583 2091467 2064793 2061702 2028826 2047947 2011217
7650 2011217 1971580 1979169 1941301 2019636 2024935 2029360 2047920 2053203 2014866 2034715 2056724 2015569
7638 2015569 1997648 2022653 2000638 2009871 1963106 1968237 1995906 2015406 2039267 2071767 2013546 1946595
7626 1946595 1987542 1993529 1945471 1998552 2035186 1955148 1919824 1909782 1909107 1915446 2031708 2022176
7614 2022176 2046232 2020032 1991510 2000461 1982570 1950343 2036823 2058558 2012847 2021130 2017231 2023408
7602 2023408 2004903 2005395 2036874 1984672 1975266 1996526 2021640 2017299 1990187 2039229 1992988 1990147
7590 1990147 2037478 2042698 2060819 1996007 2010590 2019334 2040029 2048433 2002250 2004303 1977077 2012129
7578 2012129 2037025 2056202 2000380 1974465 2011062 2051669 2023663 1998314 2029499 2057754 2106890
7567 2106890 2037271 2056833 2175646 2042214 2055679 2039411 2069312 2040761 2060405 2078698 2109223
7556 2109223 2139244 2074881 2076006 2059019 2073273 2059111 2132599 2077132 2022051 1994839 2052701 2131249
7544 2131249 2162972 2144447 2172144 2134393 2110599 2091185 2037973 2077078 2137938 2155566 2115181
7533 2115181 2122751 2140178 2116122 2175186 2216003 2130711 2185229 2215326 2131657 2097257 2176296 2163842
7521 2163842 2104834 2170420 2155245 2091279 2084366 2141348 2127882 2172209 2144581 2150394 2192532 2151745
7509 2151745 2143099 2156985 2151851 2128653 2167818 2186439 2195082 2211371 2217979 2229396 2277258 2233477
7497 2233477 2206275 2196999 2154187 2141190 2174220 2171818 2193775 2259819 2242852 2260342 2248302 2206539
7485 2206539 2348157 2368225 2290865 2264431 2244202 2240370 2239592 2189504 2224612 2296760 2297489 2253631
7473 2253631 2245050 2214942 2251418 2229736 2249678 2296393 2288644 2414202 2373910 2341127 2385296 2356575
7461 2356575 2321917 2366217 2351204 2336314 2336039 2368397 2371121 2356704 2348754 2337700 2293232 2309622
7449 2309622 2317793 2310981 2319038 2385296 2368576 2323621 2421912 2398678 2377422 2341345 2361442 2343662
7437 2343662 2357133 2373764 2359345 2433156 2443255 2386425 2442942 2470929 2457788 2475872 2471238 2475419
7425 2475419 2476221 2460077 2447889 2382690 2365897 2416502 2429740 2521349 2502412 2390810 2374421 2504226
7413 2504226 2476581 2462745 2483508 2490849 2498747 2549142 2546320 2517102 2518021 2555255 2611290 2618140 2585813
7400 2585813 2602759 2593429 2576370 2560280 2524578 2559806 2604121 2563565 2522756 2561367 2574317 2612748
7388 2612748 2626053 2618267 2613701 2628980 2672676 2648748 2663645 2703218 2738654 2756225 2741358 2699112
7376 2699112 2620970 2665048 2699109 2675629 2687843 2744777 2730302 2652366 2575605 2654464 2670257
7365 2670257 2722372 2709710 2778116 2790684 2756803 2797568 2754578 2760266 2791839 2754652 2790370 2775641
7353 2775641 2761992 2766537 2731355 2724616 2718719 2779295 2826424 2812753 2833048 2776030 2705480 2753745
7341 2753745 2776503 2823814 2843177 2863614 2858050 2914480 2969377 2925102 2868711 2865383 2794587 2817528
7329 2817528 2837443 2817870 2844344 2849830 2800175 2842003 2854651 2824408 2843583 2916077 2963601 2908161
7317 2908161 2930782 2923305 2906359 2927820 2964506 3011447 2975904 2995571 2989122 3017231 3014151 2955117
7305 2955117 2960594 2979388 2958888 2944134 2992025 3007398 2987637 3033589 2985904 2982314 2929313 2925464
7293 2925464 2908149 2897114 2991727 2913702 2919457 2907351 2890132 2890806 2966024 2957911 3027092 2991897
7281 2991897 3025673 3055471 3035103 2978751 2983956 2983026 2989021 2971165 2988730 3078863 3070203 3053350
7269 3053350 3039202 3056398 3066895 3073445 3007492 3018653 3040676 3027972 3034257 3064806 3075257 3014475
7257 3014475 3067455 3138005 3195154 3095182 3008526 3096645 3094014 3102892 3081000 3186842 3122309 3151862
7245 3151862 3239826 3190630 3153202 3131145 3127865 3181239 3210878 3243264 3237746 3253680 3270633 3295831
7233 3295831 3306913 3265355 3265733 3266748 3302632 3305139 3330113 3363395 3431690 3499170 3439310 3399168
7221 3399168 3452203 3510332 3448708 3453321 3502375 3542774 3582378 3582948 3641169 3704120 3725825 3704366
7209 3704366 3687568 3668925 3663420 3785056 3803150 3825432 3894834 3890682 3937491 3895986 4005485
7198 4005485 4022337 4039457 4047234 4161417 4187534 4131701 4145295 4178307 4272955 4249728 4275808
7187 4275808 4265686 4274395 4226058 4190684 4276343 4319603 4342237 4456100 4472194 4391675 4364126
7176 4364126 4508445 4518493 4500520 4543295 4585004 4601501 4612084 4551351 4596720 4694496 4706182
7165 4706182 4687028 4744619 4729206 4625838 4693058 4626856 4661178 4683661 4646688 4547216 4608830
7154 4608830 4605924 4564726 4651535 4599212 4598567 4547327 4484323 4526488 4499922 4430678 4479852 4489306
7142 4489306 4474052 4435852 4406657 4405750 4406431 4413952 4376613 4332640 4273649 4178671 4168795 4158270 4101504
7129 4101504 4038464 4038196 4060119 4088644 4106201 4012288 3990247 3977719 3928679 3903207 3942195 3904705
7117 3904705 3834681 3827269 3821745 3785561 3788928 3764682 3667733 3649751 3648853 3659780 3670609 3633119
7105 3633119 3592056 3556341 3571584 3566200 3600512 3520428 3466180 3520488 3513211 3506887 3476848 3469107
7093 3469107 3462695 3471797 3540620 3512722 3420634 3425732 3441253 3428018 3496032 3467984 3437439 3468636
7081 3468636 3506399 3533334 3541211 3515016 3517305 3506431 3456025 3436160 3511357 3499983 3494311 3480300
7069 3480300 3492426 3489161 3517089 3575438 3501099 3542653 3519757 3579163 3661983 3637050 3591369 3611485
7057 3611485 3564330 3572086 3542792 3470113 3491134 3575126 3525220 3516417 3634375 3579723 3532397 3491624
7045 3491624 3454912 3475735 3502751 3502228 3464002 3387937 3418005 3373925 3372811 3453587 3447659 3380398
7033 3380398 3340813 3394428 3414987 3445089 3427842 3394526 3396777 3370833 3384978 3407370 3353823 3317607
7021 3317607 3203839 3217455 3206246 3258846 3239304 3202057 3221016 3214351 3120252 3062788 3101982
7010 3101982 3074355 3121127 3131737 3092679 3041482 3019315 3000647 3030893 3021097 2986942 2994557 2940429
6998 2940429 2913025 2975853 2962911 2911190 2868777 2815728 2821623 2828096 2827223 2873128 2870549 2765430
6986 2765430 2698338 2694289 2689468 2754012 2713477 2675619 2659876 2582078 2603592 2612493 2642670 2603180
6974 2603180 2575559 2587513 2517910 2495812 2501553 2533211 2527080 2546029 2487071 2489927 2476861 2418642
6962 2418642 2441342 2399045 2368875 2357470 2399247 2400984 2415050 2383489 2337264 2283579 2287217 2343614
6950 2343614 2350119 2306968 2242145 2250656 2248224 2252002 2228730 2216224 2206855 2211457 2210584 2235616 2215413
6937 2215413 2187602 2184418 2222846 2220855 2275948 2219236 2211012 2178980 2157897 2247525 2252096 2243696
6925 2243696 2215817 2240280 2191514 2259700 2234140 2176329 2211325 2233451 2224770 2217656 2161575 2206741
6913 2206741 2187367 2191333 2244473 2214500 2209450 2152686 2157427 2244049 2238711 2255966 2266752 2267209 2234369
6900 2234369 2172491 2203092 2156816 2191325 2203280 2197944 2219812 2239554 2218595 2237512 2263630 2220503
6888 2220503 2181998 2213529 2218859 2291326 2273160 2237721 2244878 2185467 2162777 2210603 2289680 2225409
6876 2225409 2192255 2195190 2209083 2301301 2257610 2302393 2309431 2283392 2244853 2192754 2238041 2201647
6864 2201647 2233692 2231691 2214731 2253928 2306828 2317478 2357262 2307624 2282647 2264316 2333720 2347043
6852 2347043 2344362 2392101 2425343 2400166 2386226 2407649 2387127 2355441 2391526 2419523 2400213 2417705
6840 2417705 2400580 2439285 2469158 2478980 2448314 2529729 2478462 2420583 2487638 2537909 2558212 2582653
6828 2582653 2667256 2680384 2730974 2770963 2726062 2731206 2738690 2755415 2747827 2788952 2828935 2814870
6816 2814870 2875803 2936808 2963772 3015100 3038731 3077181 3116805 3130873 3134434 3166085 3297527
6805 3297527 3341568 3344335 3453213 3468489 3515999 3576529 3611343 3645064 3668524 3694128 3768895
6794 3768895 3853048 3862669 3886801 3968715 4019158 4043136 4131552 4217333 4338761 4354342 4395642
6783 4395642 4490570 4580484 4557540 4580877 4687969 4733489 4815180 4818909 4829103 4858812 4898884
6772 4898884 4949889 4961507 5079257 5123954 5120974 5181975 5221064 5342317 5333935 5320584 5410472
6761 5410472 5480781 5567490 5617346 5691652 5728426 5782905 5890385 5939250 5971300 6081242 6120858
6750 6120858 6185358 6165664 6123081 6193563 6267870 6355693 6374178 6443389 6404197 6404731 6464546 6407201
6738 6407201 6450222 6506233 6588491 6552788 6527844 6524320 6454649 6457272 6438096 6475682 6513140 6556645
6726 6556645 6577838 6544856 6478081 6500346 6569688 6536260 6525157 6606911 6625135 6572074 6548234
6715 6548234 6536367 6542404 6563106 6545690 6532003 6565599 6466571 6377935 6354341 6424372 6416258 6362772
6703 6362772 6356405 6330559 6337817 6362469 6383795 6375422 6440936 6413273 6402398 6450118 6485991 6472818
6691 6472818 6421038 6459018 6501393 6507447 6511048 6526142 6500836 6482684 6404238 6422127 6463413 6370851
6679 6370851 6273614 6167249 6187682 6180885 6138142 6037364 5902358 5857401 5696959 5632187 5585541
6668 5585541 5523556 5443992 5357618 5369279 5334239 5271390 5243339 5201721 5232397 5165911 5154345
6657 5154345 5058050 4956381 5044990 5032116 4989561 4972133 4963782 4987328 4995687 4930446 4973505 4945448
6645 4945448 4901218 4844587 4852643 4777446 4831860 4757918 4660606 4620772 4628930 4715418 4720823 4676367
6633 4676367 4665585 4730774 4783993 4826631 4868622 4911109 4932388 5004843 5136223 5206928 5282851
6622 5282851 5373326 5454044 5587852 5735672 5822418 5927030 6005310 6050122 6056131 6066867 6127036
6611 6127036 6083232 5993203 6007898 6023837 6015250 6109825 6099205 6115490 6107166 6094554 6134346 6158904
6599 6158904 6277466 6341117 6453732 6552271 6629295 6732709 6834005 6851223 6908771 6965443 6920794
6588 6920794 6892310 6935141 6801817 6725290 6706131 6531832 6524458 6501500 6512257 6468913 6504769
6577 6504769 6547462 6643899 6672064 6727698 6746955 6870170 6936630 6966955 7053531 7138344 7245768
6566 7245768 7382254 7420019 7350591 7369573 7435868 7447061 7396460 7289825 7256211 7161723 7099415
6555 7099415 7073681 7074822 7104318 7154322 7246040 7296640 7341699 7362132 7445098 7539848 7625005 7651861
6543 7651861 7689449 7740308 7775150 7786887 7784346 7764083 7792048 7744706 7687707 7680498 7710219 7606982
6531 7606982 7496542 7398888 7360335 7369073 7257884 7276218 7314942 7318610 7252518 7207429 7326367
6520 7326367 7413942 7422972 7462712 7546546 7528991 7561229 7562670 7598015 7591796 7578669 7593883 7595242
6508 7595242 7587918 7567059 7570007 7546790 7552429 7514743 7384191 7343808 7287227 7197483 7168847 7061828
6496 7061828 6953721 6948909 6896102 6783580 6731858 6638616 6573428 6539758 6524089 6494587 6496761
6485 6496761 6493463 6433969 6455137 6413516 6381700 6378199 6327818 6241566 6257108 6279312 6217042 6198951
6473 6198951 6122811 6100857 6075941 6054186 6105193 6085191 6055272 6033172 6038537 6087665 6019488 6020073
6461 6020073 6042995 6022472 5958680 5926173 5951965 6030163 6066587 6060172 6043356 6153274 6129770
6450 6129770 6142295 6166591 6169170 6163641 6099078 6143405 6193667 6245667 6243195 6283461 6237621 6268487
6438 6268487 6276198 6297859 6348688 6397888 6415790 6446115 6446612 6489271 6513656 6579925 6646297 6661150
6426 6661150 6702238 6766082 6810523 6844961 6908921 7026691 7051122 7166341 7224986 7293244 7394430
6415 7394430 7526418 7589868 7597072 7710239 7786961 7874061 7995739 8086804 8209879 8327486 8405737
6404 8405737 8575704 8703274 8811960 8949002 9101632 9307905 9459998 9548563 9776772 9878066
6394 9878066 10046694 10220794 10433574 10700762 10798141 10893791 11147476 11266316 11454707 11600467
6384 11600467 11612127 11647424 11777799 11942469 11962522 12087315 12207589 12278528 12362751 12446912
6374 12446912 12525636 12639492 12688180 12705721 12901751 13017325 13075037 13130991 13191122 13198084 13235166
6363 13235166 13261348 13321237 13292523 13233729 13209718 13233291 13206172 13153437 13199769 13141148 13109888
6352 13109888 13086084 13051865 13082935 13109153 13124635 13150960 13183607 13236462 13194481 13297811 13400709
6341 13400709 13487116 13552551 13574148 13701613 13830822 13923592 14097605 14251646 14320054 14442034
6331 14442034 14605044 14684017 14896618 15094178 15210102 15357412 15528524 15623062 15791364 15965654
6321 15965654 16084371 16111560 16204011 16378118 16377247 16496605 16617509 16635416 16736478 16820212 16838787
6310 16838787 16981775 17073589 17208607 17353877 17467370 17600279 17733421 17822986 18001309 18214527
6300 18214527 18321630 18529465 18687635 18837589 18985216 19168544 19332081 19477585 19775998
6291 19775998 19985362 20198386 20440732 20633689 20850629 21163063 21432947 21726707 22086553
6282 22086553 22338532 22648317 23105393 23490288 23868075 24180377 24492830 24836264 25185782
6273 25185782 25528475 25696183 25857270 26004091 25998368 25979935 25920720 25753438 25605049 25382154
6263 25382154 25017627 24757552 24397051 24119007 23894606 23612819 23343748 23037096 22835962
6254 22835962 22645932 22454029 22263925 22076890 21996449 21854585 21693655 21647273 21622581 21549916
6244 21549916 21460355 21509267 21577244 21636675 21705640 21831755 21945946 22161017 22242634 22400169
6234 22400169 22520666 22633820 22735084 22797751 22925734 22983491 22995800 22945534 22880864 22826801
6224 22826801 22810923 22718822 22599055 22506944 22346430 22212142 22107279 22004839 21899919 21791604
6214 21791604 21786658 21751735 21660624 21610379 21503753 21483618 21501664 21525155 21501797 21522720 21505030
6203 21505030 21507134 21514506 21420630 21386607 21291514 21172021 20953118 20791400 20733876 20527612 20303579
6192 20303579 20140349 19969792 19869258 19731470 19514702 19396209 19227678 19059912 19001259 18829216
6182 18829216 18719582 18655498 18673544 18578839 18546763 18479435 18393708 18338488 18349516 18237803 18177083
6171 18177083 18231265 18183041 18109761 18040854 17990823 17863480 17798190 17777222 17724589 17762403 17785500
6160 17785500 17703844 17691768 17687544 17752972 17687842 17629073 17703098 17732434 17743920 17759341 17755474 17756435
6148 17756435 17756707 17729250 17719535 17646547 17692350 17721041 17647769 17667517 17757372 17817114 17896579 17933905
6136 17933905 17890501 17999524 18033103 18111746 18240448 18309615 18361056 18410060 18473803 18582721 18574292
6125 18574292 18596150 18677891 18748714 18769893 18842766 18847595 18893372 19007197 19120965 19328012 19512323
6114 19512323 19555837 19697077 19898096 20130833 20321845 20510933 20716058 20987819 21301311 21595057
6104 21595057 21913679 22240449 22549452 22827545 23124126 23377151 23602172 23756184 24093889
6095 24093889 24279228 24449961 24577337 24720559 24865283 24984535 25016866 25057816 25115523 25299974
6085 25299974 25360841 25393471 25522801 25678055 25864498 25980729 26166883 26287766 26415636 26502590
6075 26502590 26611704 26805090 27018846 27075072 27279056 27425635 27435152 27563058 27702665 27781264
6065 27781264 27873640 27924788 27968275 28011249 28128233 28163329 28112324 28133640 28043216 28003863 27883064
6054 27883064 27742622 27557833 27269784 26968624 26830419 26516332 26207965 25974652 25741036
6045 25741036 25585816 25521314 25390926 25323787 25281825 25325810 25417900 25515384 25656002 25789562
6035 25789562 25952969 26107143 26287455 26464594 26640507 26950022 27163147 27242907 27366000 27403951
6025 27403951 27372346 27220709 27061082 26717656 26342481 25893696 25446144 24908744 24439574 24044284
6015 24044284 23635792 23360230 23036501 22772950 22608817 22394907 22227276 22053292 21968600 21811700
6005 21811700 21740239 21649141 21484609 21425525 21431392 21471808 21444768 21340306 21311306 21132932 20994242
5994 20994242 20816190 20507631 20187886 19907487 19600864 19208346 18875372 18648948 18374746
5985 18374746 18076893 17900183 17692803 17543056 17434231 17219428 17010049 16849484 16736845
5976 16736845 16658841 16589700 16552062 16518309 16462181 16425319 16369185 16306462 16362088 16254540 16144234
5965 16144234 16089588 16065852 16083241 15985160 15799464 15698914 15649213 15660006 15639880 15639071 15726951
5954 15726951 15880118 16110963 16385473 16554758 16862018 17158512 17455486 17715757 17769914 17892156
5944 17892156 17801602 17507710 17212786 16840146 16437159 16136275 15878588 15665231 15522342 15443216
5934 15443216 15417865 15403550 15412375 15542533 15582280 15809708 16161896 16464171 16862532 17287262
5924 17287262 17782008 18382662 19109189 19962156 20944067 22094059 23340512 24585078 25702310
5915 25702310 26590153 27142668 27276826 27018089 26300627 25345399 24168167 22928298 21761406
5906 21761406 20765624 19959991 19250387 18694811 18203604 17765176 17532489 17386378 17336923 17312286
5896 17312286 17365025 17442652 17640070 17917433 18199088 18593662 19084406 19739444 20615654 21570539
5886 21570539 22634288 23716235 24655221 25350300 25802674 25833561 25426909 24674840 23562957
5877 23562957 22274051 20970886 19693739 18475079 17461043 16631772 15919574 15391965 14874075
5868 14874075 14389254 14043645 13745797 13480691 13266216 13154898 13071880 12905292 12849010 12940893
5858 12940893 13055222 13181937 13349426 13550206 13807832 14238960 14549050 14735824 14855650
5849 14855650 14932801 14815156 14525665 14135231 13727783 13281776 12828537 12414762 12051217 11786364
5839 11786364 11627282 11394415 11193666 10983056 10926158 10843699 10745341 10641488 10663345 10690031
5829 10690031 10633225 10603506 10478987 10407740 10487740 10457440 10372421 10424186 10498118 10556156 10574268
5818 10574268 10533521 10505177 10561194 10661983 10772469 10766420 10863463 10910184 11039026 11159055 11220906
5807 11220906 11355937 11528216 11636107 11717629 11836050 12020375 12128173 12175019 12353432 12470017
5797 12470017 12619772 12767590 12982162 13137398 13172905 13301113 13430086 13557215 13693145 13835245
5787 13835245 13974331 14057832 14151805 14263810 14396908 14659692 14743091 14790622 14974653 15051069
5777 15051069 15067341 15175289 15236915 15197595 15142670 15045712 14915879 14860195 14744141 14646864 14548855
5766 14548855 14421266 14295987 14153586 14002882 13857083 13731378 13568292 13464523 13368264 13321118
5756 13321118 13307355 13262068 13192885 13089730 13095105 13107724 13033606 13033380 13022138 12926762 12946324 12952954
5744 12952954 12910808 12887861 12954319 12933361 12854460 12827048 12791096 12721570 12649281 12518551 12416970
5733 12416970 12355589 12292667 12154777 12078296 12021475 11880827 11796256 11754739 11606361 11468436
5723 11468436 11438671 11238318 11109478 10942729 10827671 10703354 10574262 10385760 10223981 10120355
5713 10120355 9932476 9703189 9420076 9274127 9094710 8832345 8699358 8542393 8392476
5704 8392476 8173795 8043698 7907844 7782515 7675868 7606105 7488129 7337357 7301308 7163600
5694 7163600 7067823 7008972 6875110 6751527 6668220 6611164 6570501 6555203 6564368 6505997 6355536
5683 6355536 6221915 6145906 6151802 6065840 5956275 5980502 5903247 5788466 5717717 5689012 5656022
5672 5656022 5585537 5549434 5564300 5480794 5441991 5467532 5438425 5428587 5346731 5270036 5328343 5353908
5660 5353908 5297380 5242262 5248434 5242165 5208240 5268989 5256170 5254827 5221908 5278476 5344663 5329138
5648 5329138 5325093 5281833 5301142 5309517 5348809 5322312 5326872 5308593 5322935 5383771 5359496 5391801
5636 5391801 5452070 5449034 5537264 5552873 5558627 5596327 5639811 5666222 5773557 5863311 5966328
5625 5966328 5955428 5911740 5993566 6077836 6159356 6148459 6218802 6251335 6355371 6380621 6529115
5614 6529115 6604523 6664948 6728635 6762248 6823783 6860134 6940553 7051448 7141073 7183738 7330228
5603 7330228 7365967 7448090 7597819 7713565 7729418 7854424 7915079 7982331 8115062 8169909 8182877
5592 8182877 8384051 8554559 8615766 8742895 8852466 9052355 9257751 9401669 9604809 9794195
5582 9794195 9984518 10287649 10451885 10596985 10910111 11232872 11558755 11759153 12016746 12267955
5572 12267955 12525284 12766075 12960892 13199989 13316377 13441986 13550502 13593045 13650450 13706267
5562 13706267 13724874 13691086 13671841 13718633 13642304 13654282 13670821 13743343 13748445 13787399 13952430
5551 13952430 14110846 14220783 14317076 14531402 14752912 15041725 15322244 15557834 15905269 16204447
5541 16204447 16539557 16834539 17140469 17476222 17769849 18017742 18239692 18494696 18703545
5532 18703545 18868999 19063146 19093471 19123917 19242746 19298804 19319794 19278445 19226160 19147750 18991228
5521 18991228 18724864 18570234 18423718 18256553 17988856 17758731 17566357 17431336 17247212
5512 17247212 17123743 17072317 17006429 17019767 17100146 17090604 17140371 17212993 17344713 17486606 17661756
5501 17661756 17828749 17999364 18163160 18333740 18514096 18567679 18754600 18857233 18859299 18834093
5491 18834093 18788098 18744335 18679744 18566319 18479357 18328332 18161163 17958312 17803450 17662858
5481 17662858 17573907 17496651 17406848 17306424 17283800 17245539 17257832 17262757 17334880 17411252 17477779
5470 17477779 17597898 17706937 17851248 18083565 18321831 18575332 18839435 19100383 19388248
5461 19388248 19666431 20036612 20387967 20641144 20970443 21255491 21477453 21677508 21904029
5452 21904029 22114737 22271300 22371743 22391537 22479362 22554465 22529364 22564214 22600497 22544963 22593122
5441 22593122 22612963 22699629 22736243 22789955 22842423 22975701 23114704 23243870 23396456 23614132
5431 23614132 23845968 23980541 24141573 24357338 24630512 24904497 25167469 25317426 25521489
5422 25521489 25757196 25946239 26071497 26203250 26386427 26612220 26758859 26879122 26918162 26944895
5412 26944895 26924153 26844786 26831393 26716313 26570196 26478603 26380732 26140260 26129849 25994158
5402 25994158 25861221 25760725 25739300 25698679 25730332 25828870 25801688 25815263 25952873 26079122
5392 26079122 26203827 26344476 26561663 26794606 26945880 27174541 27270343 27509414 27736335 27951931
5382 27951931 28140058 28331276 28507330 28671263 28813149 28928683 29048135 29127768 29176957 29108489
5372 29108489 28991360 28873583 28742798 28587147 28431007 28262595 28081390 27883776 27767133
5363 27767133 27640084 27481153 27379898 27345108 27281019 27276522 27403258 27475143 27596722 27909910
5353 27909910 28191221 28483317 28840535 29247368 29608479 29993847 30405585 30715540 31001544
5344 31001544 31376757 31645404 31916584 32031002 32105934 32154484 32113608 32082091 31961013 31825939
5334 31825939 31633563 31418063 31169829 30905359 30696630 30484813 30183844 29972620 29775358
5325 29775358 29595401 29396762 29339871 29269951 29220629 29202464 29256488 29421190 29455363 29521454 29673236
5314 29673236 29660668 29676688 29704787 29725874 29700851 29680312 29733652 29704540 29697327 29680840 29622252
5303 29622252 29462515 29367751 29300179 29169898 29134087 29043531 28949255 28836580 28784151 28821473 28839992
5292 28839992 28941926 29089583 29224768 29372280 29530195 29827253 30033476 30166311 30330768
5283 30330768 30438807 30451725 30617706 30616284 30672525 30684255 30576060 30519824 30353233 30145990
5273 30145990 29941659 29706307 29555493 29471547 29434383 29482317 29489878 29488065 29508328 29501090 29545255
5262 29545255 29661015 29724255 29809634 29970182 30049109 30124917 30342455 30487047 30601088 30778233
5252 30778233 31000639 31191502 31303294 31429342 31598537 31708662 31752756 31895865 31946393 31918413
5242 31918413 31904218 31940240 32085319 32285807 32495697 32686965 32888546 33095086 33369499 33482157
5232 33482157 33642040 33734013 33665696 33602149 33494730 33249220 33066850 32702083 32344218 31974265
5222 31974265 31657670 31358518 30997872 30692308 30419712 30110248 29950189 29806210 29713957 29640999
5212 29640999 29659780 29698095 29755010 29926616 30135255 30240908 30401557 30639264 30845465 31014467
5202 31014467 31186154 31375271 31583497 31728524 31794280 31821213 31868555 31874355 31736091 31573382
5192 31573382 31376758 31064296 30719245 30348828 29857294 29377581 28940538 28509469 28050157
5183 28050157 27657590 27280036 27047735 26767565 26584707 26403270 26285103 26241918 26188697 26096547
5173 26096547 26159679 26299502 26369566 26537215 26752233 26890168 26982056 27151199 27362966 27503332
5163 27503332 27525746 27571147 27581724 27524100 27517587 27534122 27576728 27623006 27683553 27741340 27817292
5152 27817292 27966456 27970402 27992493 28044332 28067942 28117121 28148376 28263752 28302654 28421393 28489575
5141 28489575 28529412 28562535 28639362 28750118 28832940 29059872 29197936 29294544 29547585 29800308
5131 29800308 30074331 30330043 30597630 30813523 30968209 31128735 31236050 31324380 31371740 31408801
5121 31408801 31415561 31382683 31374484 31444752 31536979 31658253 31726264 31801504 31914833 31977373 32075981
5110 32075981 32056041 31977604 31966555 31868138 31671841 31520016 31447310 31397433 31288300 31132057
5100 31132057 31006283 30841612 30704358 30562505 30418238 30265004 30153971 30115171 30099220 30115995
5090 30115995 30128559 30163454 30183282 30241247 30324616 30284414 30261807 30178942 29927213 29733714 29517761
5079 29517761 29224757 28788164 28339846 28002968 27646817 27244519 26852262 26288198 25742120
5070 25742120 25273710 24808530 24332508 23830577 23402832 23144368 22844591 22521097 22303691
5061 22303691 22160484 22041619 21949174 21840827 21669085 21646431 21656752 21578713 21571084 21597585 21624727
5050 21624727 21730034 21812888 21944086 22021001 22060678 22254145 22345931 22371570 22466556 22574148
5040 22574148 22735223 22989981 23294436 23546855 23938733 24463743 25089716 25740147 26537709
5031 26537709 27398768 28141505 28780737 29288807 29579393 29666060 29528881 29151051 28706454 28098067
5021 28098067 27462359 26893979 26229152 25604970 24890828 24196722 23424994 22595304 21730460
5012 21730460 20840746 20042138 19242301 18445971 17687108 17072583 16464712 15816028 15358748
5003 15358748 14818315 14312384 13826010 13360769 13006313 12743499 12384580 11999978 11679848
4994 11679848 11396503 11133829 10893673 10645454 10457146 10214997 10013351 9854437 9643251
4985 9643251 9545679 9298555 9200839 9054706 8911808 8784747 8643587 8574931 8425744 8343624
4975 8343624 8279008 8149461 7988430 7886057 7813881 7686691 7590197 7521059 7420847 7362465
4965 7362465 7325737 7309853 7225882 7199609 7127488 6986400 6890479 6867100 6902476 6867394 6802939
4954 6802939 6749672 6793198 6807132 6756181 6698404 6702291 6730165 6735505 6687122 6740178 6839014 6885973
4942 6885973 6876542 6960934 7009008 7034325 7039143 7100741 7151241 7230784 7284615 7313997 7372434 7495100
4930 7495100 7603505 7689370 7884068 8047491 8141419 8344415 8512181 8636056 8918637 9131040
4920 9131040 9390864 9729376 9981196 10219476 10513238 10801101 11083917 11309435 11507407 11648687
4910 11648687 11698936 11734559 11709905 11681433 11702541 11759047 11759313 11787923 11939231 12092714 12161367
4899 12161367 12306625 12553873 12722718 12837461 12919674 12983780 12998637 12956375 12771430 12652069
4889 12652069 12545333 12325230 12064479 11915947 11858520 11732014 11662782 11606800 11555337 11550848
4879 11550848 11536820 11447412 11428676 11528713 11630627 11623285 11687801 11806247 11954654 12138817
4869 12138817 12231756 12407561 12716171 12984791 13274312 13612217 14027192 14471672 14933966 15467617
4859 15467617 16048015 16674533 17271043 17897633 18522835 19136553 19599758 20023568 20293116
4850 20293116 20412825 20510559 20416838 20216929 20009680 19699119 19396400 19110748 18930097 18862991
4840 18862991 18859581 18988064 19221231 19463255 19671131 19795861 19877755 19944666 20039407 20064069
4830 20064069 20172502 20291733 20372894 20467570 20604702 20657763 20504739 20329896 20098858 19706724
4820 19706724 19126819 18500137 17828768 17230909 16541795 16013856 15520186 15069791 14806915
4811 14806915 14473165 14170642 13961762 13845250 13760728 13681879 13662871 13686313 13674603 13672260 13759023
4800 13759023 13898587 13943119 13889093 13938421 13961101 14007927 14125674 14201771 14299206 14455836 14651971
4789 14651971 14829713 15089993 15413183 15669704 15921216 16268436 16631092 16979030 17369877
4780 17369877 17838733 18199805 18552988 18990188 19477460 19796524 20209126 20768775 21320379
4771 21320379 21817766 22279144 22824126 23432239 23991161 24570107 25326983 26083531 26942197
4762 26942197 27942356 29175334 30434722 31825368 33437347 35203945 37214241 39443153
4754 39443153 42035521 44890926 48128677 51867813 56101527 60767431 65845250 71164872
4746 71164872 76477097 81345923 85063531 87238296 87743695 86750339 84022648 79541736
4738 79541736 73880478 67655637 61518254 55730369 50559415 45940807 41850820 38461626
4730 38461626 35537724 33047441 30830092 28911214 27243227 25802732 24455737 23169489
4722 23169489 22104409 21080151 20179133 19396083 18717537 18062231 17390065 16837534 16306479
4713 16306479 15855324 15420582 15010052 14682443 14342856 14035048 13672346 13399721 13118172
4704 13118172 12858577 12615998 12368529 12258503 12093749 11901342 11686531 11601167 11494556 11366579
4694 11366579 11293466 11139105 11072129 10955081 10892771 10908613 10811477 10783170 10748486 10753831 10647430
4683 10647430 10601974 10628768 10566220 10554157 10623321 10576382 10576441 10561601 10531753 10541558 10563639 10546883
4671 10546883 10509604 10558620 10543457 10590072 10580709 10591246 10567743 10555136 10523980 10430814 10430176 10383334
4659 10383334 10322004 10259973 10214973 10071235 9948178 9927441 9863939 9846299 9760215 9626673 9612855
4648 9612855 9570836 9556504 9567193 9559654 9516289 9543841 9572239 9535902 9514423 9496362 9483917 9487868
4636 9487868 9497318 9483470 9529012 9542379 9480451 9401629 9391649 9361751 9391617 9382411 9294611 9200180
4624 9200180 9161410 9075972 8973574 8897754 8856834 8767283 8640272 8604024 8613748 8566155 8589799
4613 8589799 8616170 8605493 8526838 8513555 8450072 8492315 8448444 8445516 8443020 8447586 8494523 8523450
4601 8523450 8480091 8413575 8411405 8481771 8542380 8496525 8544594 8513732 8566979 8580395 8595158 8616758
4589 8616758 8604666 8614251 8634119 8686164 8689005 8677773 8716050 8730754 8717719 8692462 8718363 8792579
4577 8792579 8884710 8844520 8849466 8863529 8880192 8896517 9013966 9109591 9172870 9272314 9403304
4566 9403304 9444825 9615781 9804701 9867997 9972386 10142209 10320192 10375852 10545057 10749239
4556 10749239 10919427 11023251 11138837 11302933 11489522 11620831 11685626 11885868 12101158 12212130
4546 12212130 12410202 12699833 12933598 13124251 13371371 13619200 13864008 14184528 14519641
4537 14519641 14761562 14970092 15234253 15468098 15809806 16089809 16365898 16693332 17009467
4528 17009467 17337476 17737037 18247819 18689348 19198290 19694543 20229951 20715016 21154609
4519 21154609 21648198 22036380 22480739 22964747 23422942 23896263 24425876 24986650 25551406
4510 25551406 26192411 26938593 27660835 28322649 29176208 30067827 30999272 31973910 33001668
4501 33001668 34067631 35232091 36502561 37777861 39081869 40404645 41716281 43066169
4493 43066169 44560143 46128606 47777049 49527264 51401183 53496186 55843471 58403317
4485 58403317 61324451 64518025 68097454 72069807 76498707 81440465 86737489 92675341
4477 92675341 99331066 106784919 115306499 124894640 135794053 147817217 160337184 172318037
4469 172318037 182746193 190767556 196030264 197881978 195592817 189245009 179387547 167171808
4461 167171808 153483976 139563308 126542453 114813078 104475336 95376953 87346574
4454 87346574 80259414 74064398 68609046 63754289 59406970 55611418 52191901 49003859
4446 49003859 46127263 43521124 41216685 38989021 36964145 35036280 33346905 31819660
4438 31819660 30325788 28941094 27696919 26644800 25572093 24654000 23795443 23025961 22336771
4429 22336771 21666120 21029817 20383753 19718140 19219590 18782325 18266627 17761975 17321148
4420 17321148 16937947 16590910 16264716 15910907 15575439 15263973 14985061 14684664 14424998
4411 14424998 14187009 14011847 13731957 13505952 13340917 13231053 13036240 12872353 12603685
4402 12603685 12403427 12167029 12034715 11894608 11649078 11527331 11378099 11244636 11072412
4393 11072412 10942693 10796639 10675651 10507695 10438914 10373646 10248070 10127134 10032282 9866149
4383 9866149 9778612 9712780 9614098 9542393 9501208 9409479 9256068 9208992 9174006 9143589 8985505
4372 8985505 8850632 8734594 8670688 8594355 8509317 8405939 8309339 8321587 8209120 8089181
4362 8089181 7972439 7921339 7821727 7777157 7725731 7631609 7506913 7458208 7372526 7297586 7261838
4351 7261838 7087227 7066288 6998652 6936256 6842500 6716610 6727468 6685521 6622131 6517279 6529666
4340 6529666 6562850 6506536 6492640 6500169 6510153 6453222 6377807 6343674 6357641 6329228 6239626 6246880
4328 6246880 6258796 6241066 6233226 6220520 6159346 6141761 6079308 6050441 6074508 6077494 6051649 6103000
4316 6103000 6127874 6114767 6090107 6124992 6113292 6184983 6157855 6173736 6233739 6170592 6194777
4305 6194777 6198260 6177079 6143743 6071334 6045259 6023831 5989475 6050985 5996604 5993086 5972580 5921728
4293 5921728 5927220 5971090 5961056 6016140 6050429 6180047 6188777 6240368 6296479 6285626 6362385 6360360
4281 6360360 6323704 6381102 6395024 6429372 6526477 6555962 6549515 6464495 6538442 6584560 6644882 6733006
4269 6733006 6801894 6790706 6752425 6805930 6822455 6862014 6859463 6919772 6990284 6996377 7087118 7185648
4257 7185648 7261201 7297403 7332737 7392409 7544718 7671475 7815823 7896351 7997509 8170735
4247 8170735 8258629 8318206 8358134 8407869 8408445 8389687 8351100 8379344 8317118 8285273 8331196 8293555
4235 8293555 8268959 8238336 8325694 8456802 8458996 8523920 8518915 8578944 8735289 8839557 8890524
4224 8890524 8977834 9102094 9213186 9285757 9430851 9487977 9618728 9686469 9718232 9895644
4214 9895644 10035031 10112019 10166558 10354678 10516224 10711312 10848040 11017072 11233364 11426643
4204 11426643 11591759 11762552 11918436 12156372 12397718 12608826 12827788 13093965 13346294
4195 13346294 13515307 13736295 14059785 14325329 14546238 14788706 15082639 15366708 15652784
4186 15652784 16017408 16362271 16711815 17079611 17429396 17830527 18206321 18592984 19001945
4177 19001945 19426788 19887531 20260110 20752869 21295774 21797135 22374211 22921635 23453330
4168 23453330 24022517 24615007 25219718 25949765 26642381 27309908 28008298 28660636 29334098
4159 29334098 30002982 30724557 31360336 32070535 32747441 33448603 34173525 34895744 35629032
4150 35629032 36444469 37208962 38003283 38860046 39678561 40478558 41365019 42200338 43002130
4141 43002130 43949252 44896688 45835811 46769096 47632073 48566326 49471878 50379427 51261536
4132 51261536 52113192 52976696 53734909 54643986 55469247 56283063 57111757 57815106 58583374
4123 58583374 59356545 60100566 60775514 61469429 62094349 62596096 63198672 63755116 64276151
4114 64276151 64719752 65133948 65473849 65814904 66086261 66340276 66419520 66551745 66574323 66550493
4104 66550493 66399137 66178493 65890698 65620105 65334351 64929240 64474588 63912890 63356332
4095 63356332 62712753 62007112 61237774 60445545 59591036 58625966 57735154 56776515 55776247
4086 55776247 54811490 53780769 52727899 51660975 50528160 49400056 48292849 47082654
4078 47082654 46050651 44940742 43881301 42731873 41607209 40589108 39509715 38551552
4070 38551552 37568605 36572474 35661748 34788245 33976135 33243726 32381298 31626058 30979037
4061 30979037 30360976 29682757 29149113 28669496 28202186 27818979 27437186 27110016 26733785
4052 26733785 26424282 26241120 26082952 25809950 25656994 25508492 25509697 25521253 25494148 25469420
4042 25469420 25482851 25540660 25590299 25596750 25779838 25896937 26062894 26334523 26533596 26727341
4032 26727341 26972116 27236901 27507482 27857464 28241398 28487037 28869775 29285070 29603744
4023 29603744 30002791 30417839 30940895 31509737 32141210 32856521 33597331 34309098 34905296
4014 34905296 35449285 35989335 36526347 37063741 37661930 38294259 38983553 39641591 40377368
4005 40377368 41172221 41978183 42849716 43720142 44675686 45736037 46957961 48123468 49364678
3996 49364678 50695403 52131431 53582504 55079035 56795829 58526952 60235636 62215370
3988 62215370 64245965 66165841 68125733 70102624 72129387 74258115 76680851 79292986
3980 79292986 82156606 85482740 89054893 92760664 96916790 101566633 106709737 112468427
3972 112468427 118777124 125447366 132420643 140264094 149378054 160240519 173149832 188137533
3964 188137533 205214860 223581516 241307401 256539702 269039993 277425445 278787488
3957 278787488 273120195 261704268 246530985 228734038 210303739 193218502 178304544
3950 178304544 165745509 155316503 146563604 139199746 132997252 127530401 122896717 118893505
3942 118893505 115435735 112449360 109815217 107489933 105551522 103787469 102237734 100925983
3934 100925983 99886794 99016887 98307611 97807379 97498279 97337828 97266071 97295659 97611115
3925 97611115 98022278 98545892 99125329 99785780 100650753 101560918 102576426 103699782 104848918
3916 104848918 106068578 107335820 108791097 110214740 111700795 113295716 114922200 116529461
3908 116529461 118253901 119868190 121614209 123322886 124956957 126560098 128131240 129767704
3900 129767704 131257500 132706197 134143736 135532137 136815514 137994944 139076808 140155595
3892 140155595 141014018 141774207 142352804 142898649 143294917 143666127 143937550 143992186 143923789 143713711
3882 143713711 143355932 142914364 142378554 141615018 140848080 139880375 138739752 137611686 136403720
3873 136403720 135075323 133567813 132102682 130469260 128758280 126987020 125240506 123457984
3865 123457984 121520971 119642131 117716082 115791641 113784456 111809620 109792732 107892201
3857 107892201 106050330 104211231 102407723 100581890 98861076 97158171 95607312 94052829
3849 94052829 92517632 91116251 89811150 88627168 87463135 86325861 85337705 84393723
3841 84393723 83477594 82615681 81777829 81164975 80625943 80057834 79558392 79053561 78637373
3832 78637373 78185082 77798481 77442826 77133924 76871791 76700555 76512338 76325925 76252396 76152088
3822 76152088 76091849 76072268 76117006 76150901 76232508 76429445 76701734 77038799 77407237 77793215
3812 77793215 78244356 78618506 79203291 79835282 80424017 81034978 81774141 82511556 83243457
3803 83243457 84009806 84816683 85508004 86232553 87119913 88019583 88823917 89564907 90379437
3794 90379437 91217370 91958288 92692454 93421132 94120251 94810850 95462612 96058976 96624716
3785 96624716 97169006 97643384 97958068 98205209 98356988 98414639 98330568 98064004 97810233 97401580
3775 97401580 96888392 96327467 95580524 94771040 93944889 92978896 91987471 90869265 89664005
3766 89664005 88397690 87132054 85794468 84533747 83178185 81816874 80510332 79185437
3758 79185437 77846333 76696675 75535344 74478929 73574288 72762848 72087473 71507786 71002286
3749 71002286 70639502 70355593 70183747 70178407 70243135 70398545 70572923 70810591 71130875 71436191
3739 71436191 71610878 71888542 72098142 72171929 72238942 72242462 72096947 71898993 71605061 71210847
3729 71210847 70738768 70178182 69512345 68800797 67925713 66981416 65950006 64795889 63641606
3720 63641606 62360487 60988646 59557414 58071271 56624035 55150742 53659508 52186911
3712 52186911 50749963 49424613 48096678 46774458 45477074 44352948 43270803 42242734
3704 42242734 41276912 40384301 39564255 38710264 37969508 37199157 36561498 35926820 35388213
3695 35388213 34909992 34454459 34018841 33703378 33331820 32985523 32671955 32371616 32117487
3686 32117487 31915667 31777107 31542126 31420248 31322202 31204164 31095378 31034189 31017667 30949692
3676 30949692 30986405 31061419 31093834 31116681 31175884 31244748 31265003 31366848 31350763 31372776 31252547
3665 31252547 31228491 31303463 31298030 31257146 31284763 31306606 31428974 31557043 31658900 31800874 31889307
3654 31889307 31989298 32104657 32301286 32459871 32648624 32807016 33005686 33281112 33484774 33783870
3644 33783870 34041704 34322095 34654329 34937911 35230608 35533822 35889248 36277361 36727202
3635 36727202 37139443 37456503 37918466 38403455 38849055 39296993 39828201 40398205 40983472
3626 40983472 41577464 42173516 42789183 43479440 44153420 44802924 45618163 46349512 47131517
3617 47131517 47826413 48683796 49519880 50369497 51258800 52221932 53195423 54124650 55071817
3608 55071817 56011665 56991209 58081733 59182531 60237668 61367617 62497759 63694863
3600 63694863 64937492 66121052 67226939 68428252 69772476 71052892 72406406 73845686
3592 73845686 75139457 76568236 78058363 79596682 81215629 82884190 84494752 86229445
3584 86229445 88054325 89939986 91863361 93882101 96015109 98233365 100644165 103129734
3576 103129734 105669263 108311400 111229877 114236223 117410565 120708854 124155245 127685457
3568 127685457 131448424 135408501 139575681 143822660 148172668 152637642 157186257 161767341
3560 161767341 166244692 170860629 175390289 179887510 184281292 188529222 192748323 196896935
3552 196896935 200965646 204959115 208933348 212796370 216504887 220113916 223635522 226902675
3544 226902675 229998114 232908899 235518864 238057133 240226788 242191480 243960756 245571704
3536 245571704 247142732 248487437 249569343 250615464 251462501 252233559 252831159 253350804 253768464
3527 253768464 253977309 254094087 254109401 254084791 253878740 253685378 253333368 252850433 252353295 251805963
3517 251805963 251304274 250724067 250082046 249414737 248749010 248208988 247704163 247227773 246848981
3508 246848981 246522370 246341797 246331040 246420095 246581084 246886146 247320659 247775512 248359022 249145462
3498 249145462 249968727 250907548 251915109 252994644 254212553 255433860 256754290 258100222
3490 258100222 259450260 260840491 262288692 263662726 264950500 266234854 267461433 268628677
3482 268628677 269737990 270738103 271638623 272396803 273087445 273657515 274147706 274484689 274681310
3473 274681310 274807347 274759813 274573831 274279318 273946301 273581132 273082540 272512159 272053406
3464 272053406 271453835 270738217 270085773 269439410 268769487 268075683 267397694 266769717 266172906
3455 266172906 265470779 264831704 264216312 263559060 262828458 262115944 261332690 260589072 259706729
3446 259706729 258726783 257795818 256852091 255700287 254436309 253155306 251723887 250205655
3438 250205655 248592738 246858921 244987676 243012183 240887885 238658493 236260507 233749380
3430 233749380 231173367 228501748 225833721 223061460 220269646 217622716 214929197 212303930
3422 212303930 209735049 207275173 204945979 202730089 200640383 198794451 197056060 195458582
3414 195458582 194124115 192997835 192112307 191465717 191038310 190838799 190843053 191115413 191677159
3405 191677159 192436616 193399503 194566200 195841057 197185171 198569338 200039634 201432345
3397 201432345 202815182 204100419 205254242 206419388 207505290 208509101 209388286 210261057
3389 210261057 211099816 211829376 212445419 213033163 213558556 213852453 214153630 214489327 214692719
3380 214692719 214812602 214944060 214998544 215019552 215028698 214965547 214877262 214701776 214395966 213929288
3370 213929288 213248731 212266659 210953606 209294521 207273534 204934894 202186822 199131466
3362 199131466 195817905 192204822 188289841 184296640 180136498 175703623 171069552 166314876
3354 166314876 161468177 156304386 150970230 145581140 140043867 134419931 128872950 123400031
3346 123400031 117997613 112750284 107734819 102998714 98509504 94330115 90492550 86867040
3338 86867040 83468230 80341701 77483540 74789350 72224305 69849644 67741799 65738477
3330 65738477 63892074 62194457 60632233 59198997 57898987 56710444 55718433 54747308
3322 54747308 53969315 53319217 52734040 52272620 51924482 51726490 51739890 51887442 52123510 52686539
3312 52686539 53396723 54096670 54637778 55042644 55244619 55055067 54386543 53376528 52066244
3303 52066244 50552675 48990082 47506597 46211323 45095740 44149033 43358110 42816448 42395997
3294 42395997 42055641 41893714 41871014 41984914 42169340 42460586 42871017 43300376 43886506 44591942
3284 44591942 45483300 46732902 48277420 50086963 52108119 54171941 56068420 57555798
3276 57555798 58529652 58713871 57987817 56494478 54338649 51757070 48936803 46234336 43826571
3267 43826571 41765957 39993925 38512976 37241014 36279764 35448362 34715631 34148438 33725587
3258 33725587 33459188 33303878 33141048 33044971 32981039 33015474 33167237 33388090 33783624 34235622
3248 34235622 34821348 35348064 35844103 36254967 36468029 36184669 35537274 34494057 33124995
3239 33124995 31703866 30047299 28392573 26994295 25724729 24592859 23593941 22692972
3231 22692972 21929340 21232265 20616392 20057057 19564313 19122158 18771384 18414907 18017706
3222 18017706 17727406 17395690 17061528 16768503 16421007 16193722 15847945 15503155 15178200
3213 15178200 14853840 14558311 14269200 13949963 13687569 13518727 13237386 13024137 12866530
3204 12866530 12611048 12413308 12268387 12018818 11833811 11657497 11444852 11307804 11146318
3195 11146318 11052180 10868014 10735503 10603635 10435703 10306201 10191491 10129257 10034327 9883988
3185 9883988 9682856 9682800 9683330 9559565 9466806 9326374 9215377 9162530 9116125 8974314 8820133
3174 8820133 8840568 8817316 8739636 8602732 8515081 8462642 8422521 8260557 8196630 8199209 8111563
3163 8111563 7926382 7835742 7821662 7777182 7663898 7540512 7472191 7399012 7330389 7312676 7247964
3152 7247964 7181098 7146913 7121459 7080371 6934248 6929556 6910254 6871656 6892547 6811975 6844930
3141 6844930 6873988 6740672 6723598 6729523 6702603 6666280 6674479 6626981 6554281 6585160 6669866 6703123
3129 6703123 6664700 6749206 6782092 6796922 6839087 6780444 6863464 6826406 6744285 6638700 6632455
3118 6632455 6516219 6366209 6259858 6116385 6043087 5936555 5786062 5702043 5603495 5568652
3108 5568652 5469781 5349882 5280474 5178233 5110441 4981616 4870663 4867771 4875803 4823969 4788814
3097 4788814 4753677 4686658 4658615 4633900 4573064 4607684 4602682 4604781 4555300 4526167 4486089 4531430
3085 4531430 4447049 4323578 4323366 4330948 4288505 4224972 4188654 4145681 4061086 4010657 4027895 3988094
3073 3988094 3845047 3801145 3822599 3743912 3675971 3636295 3522393 3479334 3515751 3496504 3436072
3062 3436072 3390930 3303189 3219636 3190363 3137953 3117012 3130478 3093499 3052001 2982370 2889435
3051 2889435 2844494 2872891 2820355 2739549 2690096 2665899 2602110 2548984 2516061 2500250 2511745
3040 2511745 2431653 2379440 2371925 2368751 2323801 2294971 2297862 2207236 2216008 2196796 2187800 2176826
3028 2176826 2138592 2126150 2157546 2122999 2094045 2057241 1997689 2031033 2020610 2032496 2033386 2023840
3016 2023840 1994823 1994307 1908963 1978942 1857651 1848325 1906071 1870842 1836751 1853197 1860502 1849039
3004 1849039 1803614 1756584 1741932 1695412 1716936 1736606 1757756 1758911 1745636 1715248 1678440 1622309
2992 1622309 1663998 1759640 1704921 1673201 1676794 1690751 1603014 1596205 1587505 1530401 1590251 1627719
2980 1627719 1608273 1578930 1640216 1539073 1430629 1542392 1495188 1457884 1500158 1483728 1419876
2969 1419876 1465396 1457994 1390439 1373336 1302662 1307570 1311165 1314648 1363158 1394362 1369821 1319292
2957 1319292 1304259 1261319 1269734 1253719 1199022 1238248 1267277 1350144 1383982 1277099 1223424
2946 1223424 1283094 1211139 1202613 1171028 1232522 1231948 1158262 1174687 1188739 1181784 1117365 1076596
2934 1076596 1127275 1050311 1055294 1027046 1070602 1099675 1060627 1017352 1088938 1088872 1014402 1035826
2922 1035826 944975 964621 967815 912129 934309 964512 962805 983617 993320 1024795 1015641 997524
2910 997524 1005869 942245 949501 990631 1016455 985339 915009 960357 996596 956106 906414 940217
2898 940217 981272 918224 877983 912326 844872 817674 913330 968778 959625 946637 947798 945841
2886 945841 974628 982592 954902 904628 862086 853014 893024 940946 891864 884353 914272 883136
2874 883136 856209 868455 902184 936763 844329 831204 927333 947325 922525 934358 892709 884368
2862 884368 899814 939945 951494 980300 1056409 1105329 1013450 1008813 983866 906052 917724 930556
2850 930556 970553 930815 918674 885999 864291 876485 926630 878789 836011 847714 807020 806293
2838 806293 857084 844198 786367 766712 763646 737098 758511 846708 860908 852696 918041 943141
2826 943141 885441 826117 875683 861748 836557 817497 790122 778067 810614 824476 721721
2815 721721 697816 736571 785057 849913 915566 846090 777293 785703 813458 750488 741971 720195
2803 720195 730483 753777 773025 803983 837513 848597 857760 788013 791034 782547 788209 734512
2791 734512 647102 689699 686647 706339 737658 715252 767925 827237 845072 878531 736016 764192
2779 764192 820977 792880 772867 747407 694131 631356 566987 568812 599604 568770 629770 607845
2767 607845 569100 638633 640580 676208 693306 658949 604728 587563 581422 603011 606034 552276
2755 552276 500139 529231 576377 555198 539261 498482 520161 569185 549295 536056 516355 483277
2743 483277 436034 488172 523596 505253 488314 496174 491865 470779 416776 403737 407586 435191
2731 435191 443660 395402 358123 387606 447999 419294 437276 397148 320514 312670 307888 344072
2719 344072 377967 354042 341588 382773 354089 301330 278872 268877 294021 298002 276252 296991
2707 296991 244112 227364 254070 295387 295841 268723 219074 260648 259997 241112 225882 163213
2695 163213 144329 228588 297201 223672 243754 273210 257274 232933 272440 212123 116746 109901
2683 109901 135900 121028 178426 141594 133710 156921 154376 191230 196735 167753 223902 259032
2671 259032 266724 241708 239342 217427 242164 175080 144150 200106 169196 177846 165797 173788
2659 173788 183653 118999 96992 77736 106517 207093 201931 147070 145484 83436 40032 79204
2647 79204 23865 45743 15730 44636 110221 164233 194903 102465 135067 148902 134404 115072
2635 115072 111503 60501 103798 104039 133579 86236 40685 56844 25701 97724 83653 36754
2623 36754 11154 56661 43894 19903 141022 100852 23028 82029 106804 162605 90517 85890
2611 85890 107582 74235 31573 69370 72478 63932 20512 86214 78855 61903 56052 85269 82283
2598 82283 63111 68184 17534 35072 121404 69197 109031 146859 106412 111014 -5187 19447
2586 19447 28957 25585 41763 62643 48501 81596 116677 77850 63025 69822 103847 34729
2574 34729 29489 52940 1579 -44166 -5475 51753 78215 57930 75006 79115 22583 58434
2562 58434 -23849 2898 21668 24709 29484 48429 98084 84199 72400 29060 44780 27230
2550 27230 -3473 -31756 -18580 57642 23773 -32856 -57462 -99379 -76065 -5671 -61573 -1872
2538 -1872 35330 46182 -22154 -64285 -32693 4003 37316 66439 103118 51192 46657 32262
2526 32262 84971 106948 44591 11895 26149 31684 26689 -3768 -33491 -7925 11928 52059
2514 52059 15292 9202 -11757 -3969 22325 -67980 -122826 -73782 34109 47039 -34145 -83235
2502 -83235 15254 6815 -8567 1906 -32351 -3145 17894 -38979 -103024 -117795 -31661 -47541
2490 -47541 -12378 -16477 -51386 41759 -5634 -48570 -66509 -21000 -25478 8402 50210 59888
2478 59888 18652 24584 13113 18551 41818 9128 13201 -66803 -52877 -24250 -58171 -27113
2466 -27113 -22282 -63562 -33695 -58602 -25162 19635 20232 48405 6754 -32010 50769 82295
2454 82295 43334 25095 61423 19405 42891 92753 69523 51532 35428 106226 18366 -31751
2442 -31751 24309 -3897 -24009 -22948 -34884 -29888 24421 43715 16122 -42107 -52901 -35442
2430 -35442 -54510 -22302 -66721 -18669 21109 16595 55713 34428 19807 -2662 15790 5119
2418 5119 -65427 -86159 -100115 -30698 -28751 -24488 -19156 -56980 -14419 -79632 -16132 1304 9069
2405 9069 38550 26081 -23434 -65606 -52623 -112155 -59669 20942 58844 -35739 -116147 -63465
2393 -63465 4983 10688 -39985 -121407 -96958 -59474 -63370 -53370 -44592 -37434 -111514 -97987 -26163
2380 -26163 11352 -5308 -74937 -39830 -37195 -31691 -70963 -112789 -39497 -52431 -26213 -42168
2368 -42168 -45906 -62786 -42010 -4256 15594 26622 9157 -24914 -55476 -87015 -66710 -57297
2356 -57297 -27933 -49743 -93609 -111475 -139715 -90442 -54673 -24860 -65633 -65538 -54650 -47493 -92651
2343 -92651 -65980 -33092 12003 21565 -48526 -53202 15633 24896 6136 4969 -259 13905 14297
2330 14297 -79769 -143064 -74369 -42157 -25474 -34952 46933 34313 53914 1797 -12269 21807
2318 21807 -20815 -12495 -54679 -87442 -64543 -38600 -150391 -148827 -89245 -89179 -47848 -25216 -4271
2305 -4271 -44611 -58813 -106506 -142759 -93787 -78376 -75730 -48551 -78178 -101168 -34078 -73940
2293 -73940 -54878 -113770 -163041 -112879 -78807 -45074 -37420 -114868 -150600 -206756 -177444 -87589
2281 -87589 -76883 -89680 -54939 -15117 -49956 -58784 -65659 12490 -23540 -37819 31400 -56308
2269 -56308 -110525 -110457 -76037 -35882 -29912 932 -63117 -63621 -34064 -6041 -19900 -55319 -75407
2256 -75407 -53688 -23424 -25953 6940 -20566 34077 -2726 -47398 -13771 -14635 -49155 28996
2244 28996 48464 38602 42691 -1107 2874 21437 33817 -6661 -21415 -59673 -18059 -20379 6311
2231 6311 57959 41250 -21733 -52095 23908 20918 9256 58357 -29575 -105599 -148895 -159486
2219 -159486 -64802 -49486 -40671 -66831 -104906 -11635 -37596 -106234 -70214 -78349 -84868 -127343
2207 -127343 -116762 -93583 -96829 -153605 -114142 -57273 -64519 -53167 -51297 22864 -16859 -40079
2195 -40079 -13668 -26519 -15321 -17966 -55033 -82038 -101087 -24579 64420 12265 -55335 -62934
2183 -62934 25366 32908 9770 9759 -51770 -24359 15411 49815 27540 11143 3208 45181 -10897
2170 -10897 -28516 -5083 4391 19854 42230 -42833 -18266 -59925 -37774 -23217 -29235 30870
2158 30870 8879 7302 -78652 -100538 -11671 59540 65613 10931 -8042 -10649 11048 8749 7089
2145 7089 -8186 -42675 -4420 12464 4198 -51444 23696 14961 55194 22413 28969 28038 8498
2132 8498 12884 87704 75954 91648 7242 -20046 -22655 -10296 53198 71947 80386 15535 12987
2119 12987 14688 18056 34482 16735 -5217 -95598 14050 21144 8477 -7674 -15273 3654
2107 3654 -1429 104482 104666 112314 96992 90251 56124 60011 57967 96938 95264 139064 136538 102765
2093 102765 95232 141821 126310 108589 87206 80789 119186 77494 95986 110859 108444 88482
2081 88482 135806 170624 125545 128237 157204 179032 138570 134400 207158 246038 243834 259314
2069 259314 277839 238584 149704 155825 236634 320377 246483 214585 254918 244078 249578 288893
2057 288893 372511 405241 347366 337570 438088 492559 485310 478617 460789 458571 409475 429366
2045 429366 463227 516852 499268 544941 530781 576001 678399 770383 725779 710191 792301
2034 792301 806241 815762 825161 811085 844447 988505 939341 952229 950236 1069929 1132851 1111828
2022 1111828 1137890 1185973 1272943 1268600 1311640 1373536 1417746 1484255 1587331 1667331 1754715
2011 1754715 1820430 1888562 2036736 2170498 2215138 2250482 2296906 2426548 2541191 2693608
2001 2693608 2833677 3018396 3223396 3393289 3654135 3843129 4127176 4453705 4742010 5051613
1991 5051613 5336429 5699539 6264622 6798596 7445723 8348235 9243813 10095544 10991438 11707097
1981 11707097 12211493 12418373 12292388 11738601 11061217 10184984 9107586 8167792 7343038
1972 7343038 6637097 5915838 5298263 4833686 4474636 4141257 3813244 3527296 3189781 3028810
1962 3028810 2798590 2585144 2467089 2268524 2101723 1913734 1805118 1761803 1671878 1586855
1952 1586855 1490837 1379376 1293635 1197719 1145733 1095654 1047889 980461 947172 941561 890184
1941 890184 778648 813335 786495 699935 736050 661018 682791 724777 648273 591531 620945
1930 620945 583902 550204 587265 540062 543441 566955 518144 430463 411838 430568 449526 493998
1918 493998 482955 439836 473032 439113 358819 370298 356240 320430 268332 228080 226575 239517
1906 239517 236931 242624 278463 270345 284244 292266 256600 277142 236920 230389 247100 251820 270864
1893 270864 260417 211211 201020 226825 205734 216321 182026 148121 131536 164256 182888 149240
1881 149240 132104 242892 234205 173330 186666 202282 178333 186647 94710 123515 138793 97449
1869 97449 110771 117585 123874 157774 113541 87301 59960 47461 128971 145631 70918 26568
1857 26568 78524 45876 98737 51821 62467 122363 145544 96272 45865 77936 100487 57938
1845 57938 33718 -73484 -65789 12920 -80649 -59595 -21546 12405 -60692 -24134 -48316 -73303
1833 -73303 -6340 -3335 34377 -1298 -30892 -29888 -57287 -19648 11808 3524 -31359 -13723
1821 -13723 56276 78775 -3283 -82747 -105955 -139319 -64190 -21935 4641 33911 3431 -21707
1809 -21707 -5109 -73369 -48354 -17976 -8733 16835 -5607 -51015 15766 20872 57769 18881
1797 18881 45709 75685 9312 -62753 -34686 21597 -50004 -63972 -51288 8184 -38043 -74801
1785 -74801 -30368 -73600 -35032 -1579 -28299 -81363 -118613 -41646 -41499 -61962 -26156 -57475
1773 -57475 -71767 27312 -31948 -144514 -162413 -92243 -4973 -14644 -37762 -91914 -80015 -106084
1761 -106084 -99941 -22824 -21506 -91722 -100657 -34032 -48626 -17055 -33468 -21791 -10529 -58178
1749 -58178 -93848 -15544 -19275 -119747 -146990 -136598 -105729 -17353 10894 -41967 -57388 -19747
1737 -19747 -66788 -48859 -30574 -36770 -12873 73 16718 -106517 -84876 21389 49502 -59585
1725 -59585 -45473 -11641 -37858 -83046 -54426 2653 5474 89306 46601 13983 53705 29617
1713 29617 19128 18801 23957 38642 -58201 -73698 -50433 -23382 17331 73356 19890 -94472
1701 -94472 -106413 -76416 -54703 -69925 -11627 -17347 -58042 -90389 -81654 -28704 -117261 -79086
1689 -79086 -15586 -17084 -66706 -68566 -93825 -69702 -46014 -67401 -72614 -54017 -49094 -20093 29224
1676 29224 -21424 -45622 -14136 -33211 -58064 -30404 -63412 -118127 -83546 -81291 -75602 -69828
1664 -69828 -154439 -160659 -55418 -20718 -55643 14056 55650 -13177 -46189 -5618 -57571 -52471
1652 -52471 -88523 -87264 -28099 -56916 -22063 -30104 -99055 -135046 -77312 -61378 -39999 -32469
1640 -32469 -70769 -126137 -98120 -110359 -80494 -23633 -140449 -123702 -130548 -117695 -86758 -57758
1628 -57758 -104889 -85531 -89264 -38079 -28349 -41590 -20668 -17533 8849 -1790 -102014 -111051
1616 -111051 -105496 -85936 -10285 -6433 -7632 22967 -28003 -21875 18662 -22777 -53248 -34073
1604 -34073 -34491 -48807 -53680 -49168 -4539 -1948 -101927 -113967 -87427 -114024 -113211 -97531 -66857
1591 -66857 -88784 -78378 -60070 46558 -11706 -25529 9673 35400 -15131 -59100 -75217 -81971
1579 -81971 -61355 -74593 -123865 -136817 -84101 -95894 -97831 -42126 -79798 -99248 -103014 -86160
1567 -86160 -52925 -49859 -45711 -78124 -89853 -122119 -118729 -72979 -103465 -106645 -33849 -79152 -31310
1554 -31310 -4540 -31457 -48260 -29210 -85310 -109308 -89246 -90013 -87803 -73249 -77698 -84454 -25800
1541 -25800 -83462 -40595 -64323 -96676 -82726 -51560 -87197 -108971 -65808 -88215 -107502 -46619
1529 -46619 35287 3808 -69506 -41128 -25446 -29493 -55679 -33305 -53146 16530 -11168 -103690
1517 -103690 -105061 -119834 -68424 -24983 -40848 -49963 -16211 -35050 -114711 -122606 -93137 -61979
1505 -61979 8221 -16739 -64480 -39686 -63891 -17077 -11097 -100018 -114834 -128633 -138045 -131538
1493 -131538 -81478 -58366 -59150 -91707 -134482 -182424 -47118 -92986 -99189 -145071 -171529 -74800
1481 -74800 -16986 -61534 -98932 -130681 -93898 -82152 -75064 -30233 -50051 -36888 -16971 -35357
1469 -35357 -37322 -66190 -92892 -118172 -34990 -53962 -75718 -21309 -43802 -83004 -116430 -49430
1457 -49430 -25232 -40397 -40464 -90712 -115347 -11088 -55634 -65365 -55454 -19643 -32394 -23405 -66030
1444 -66030 -50143 -31913 -76236 -50894 -43102 -15994 -55266 -53845 -44039 -49314 -42529 -82460 -87393
1431 -87393 -110837 -117950 -126637 -27988 -26139 -37569 -35386 -81938 -72371 -65633 -68151 -22866 -73406
1418 -73406 845 -17277 -97110 -79826 -81548 1024 -20105 -57091 -109288 -107426 -98826 -53243
1406 -53243 -50890 -99493 -60859 -99772 -128486 -99491 -61147 -90992 -128675 -74538 -67647 -96646
1394 -96646 -57908 -57297 -44954 -57534 -70458 -76769 -124898 -149677 -80442 -57934 -40100 -54587
1382 -54587 -55806 -16058 -32598 -50561 -85258 -4339 31004 17155 38300 72321 21773 -4392
1370 -4392 -22650 -28940 794 30612 -66025 -17464 -9183 -724 -9310 -66215 -19664 17405 -30768
1357 -30768 -10866 -9349 -85137 -62461 6621 17617 -10374 -46992 -10737 -528 -25871 -43154
1345 -43154 -116693 -81125 -78606 -90301 -50729 -57800 -57834 -42091 -15851 -43053 -63331 -47039 -46959
1332 -46959 -24329 -50022 -50220 -26953 -1612 -90880 -78111 -73793 -97716 -49513 -59372 -26372 -91712
1319 -91712 -61075 -46510 -48991 -78703 -64214 -76976 -29577 -18521 -77850 -59769 -69287 -42897
1307 -42897 -14380 -2309 -60002 -58733 -57501 -63852 -70469 -12240 -63656 -89843 -114108 -88805 -125471
1294 -125471 -52512 20479 -9216 -5275 -40233 -75587 -43453 -13893 9463 -2301 -21169 17228
1282 17228 -8549 -50786 -62246 -92272 -40540 -38693 -85692 -85494 -92911 -65711 -59660 -56698 -28100
1269 -28100 -3461 -9650 -11105 -19565 21842 -18722 -65610 -29496 -80122 -65419 -67507 -39009 -65620
1256 -65620 -151277 -124891 -91873 -83104 -89730 -74322 -76967 -91462 -75657 -45407 -82267 -67700
1244 -67700 -107409 -115953 -133441 -98154 -43519 3140 -57281 -44646 -69835 -44087 8567 -40801
1232 -40801 4099 -4539 -10850 -47146 -73035 -28131 28955 9459 25512 38313 -42712 -117387
1220 -117387 -31911 -5619 -12249 -11090 -65823 -85984 -96067 -85235 -72581 -54970 -61687 -50284
1208 -50284 -56956 -53404 -25685 3175 -12678 -14472 -32064 -60068 -125889 -61934 -73370 -39735
1196 -39735 -30694 -122625 -90467 -133274 -101978 -131867 -51145 1978 -3322 -42035 -17166 -52143
1184 -52143 -119551 -64296 -35209 -54058 -120785 -106300 -80020 -86648 -34143 -10831 -25591 10837
1172 10837 -20555 -64851 -20709 -41674 -20647 34050 -21720 -35101 -42085 -84835 -73532 -51555
1160 -51555 -1637 4373 -23496 -47517 -53712 -7281 -15932 14732 -28157 -24213 -110999 -72565 -130973
1147 -130973 -111211 -84174 -96576 -107448 -65605 -31507 -91644 -39425 -50528 -4398 -60067 -47534
1135 -47534 -39849 -15665 -41319 7889 36685 -9661 -47260 -5648 6605 32993 13917 -37930
1123 -37930 -10572 3464 -32774 -51018 -3482 -18989 -63692 -25146 23920 59301 1617 29953
1111 29953 51220 -4809 -122130 -64140 -35091 -54023 -67498 -94173 -122431 -65015 -4 -79574
1099 -79574 -72242 -85463 -30640 -47549 -32459 -42396 -66497 -12075 7427 36911 63111 -8615
1087 -8615 -59683 -13366 -28077 -68680 -88433 -39858 -12340 -95870 -3631 20355 17049 -15591
1075 -15591 13291 60269 46237 40821 16139 -10667 17176 -29137 -15627 7868 36041 20909
1063 20909 71713 29972 -28489 -73588 -17326 47749 2256 2903 32405 36434 -12890 -41600
1051 -41600 -11363 16763 9959 -25503 -81127 46436 -51946 1478 32602 3173 -27487 15126
1039 15126 25853 -3167 54520 13530 -8391 30564 28826 -37732 -43693 -119934 -102563 -119050
1027 -119050 -125413 -53635 -41913 -45611 34550 24651 -30344 -2514 21224 6279 -16274 11813
1015 11813 -20086 -40080 8962 31232 12419 13208 28280 -26038 -62091 -55933 -9562 -4067 16067
1002 16067 49033 32390 74827 -4945 -22588 -23219 16701 -35750 -32464 61573 19035 14990 -3764
989 -3764 -71381 -47892 -33137 59694 106286 114112 115792 56501 20500 -23042 -35755 -15097 -34504
976 -34504 19027 -11647 -3196 13585 -37231 -63735 -74772 -15793 -31379 -9999 55375 4514
964 4514 -12639 289 -7901 27583 -36593 -36377 -24027 -4194 -4822 13824 -22938 -51229 483
951 483 -42716 -56778 -39591 -426 12236 19601 -4853 -13487 12929 37035 -14525 17034 47375
938 47375 -23461 -11038 -40734 17457 -15 -2594 -31245 -71905 -19586 -16071 -12587 15587 56728
925 56728 39199 -27828 26729 11481 -46993 -56897 -10185 -25138 -27891 -35306 -73981 -57183 -43133
912 -43133 9217 10859 -27623 -40353 -51989 29763 18901 60734 -11709 -86911 24490 74620
900 74620 32924 -30212 9005 22140 19944 52743 36522 24801 34064 53525 41496 65862
888 65862 59282 24262 13929 -19743 3186 15628 6093 -90060 -56214 -35541 -20257 -44625
876 -44625 -33085 -14813 -29218 -1648 -6532 -3602 2655 -4067 -13441 17268 28078 5330 49462
863 49462 68445 85226 56603 32999 7 -108208 -115471 -55326 -58836 -6588 1302 23501
851 23501 89399 116496 46896 61376 65415 35479 98089 107466 39360 10940 17949 9911 -1562
838 -1562 -65898 -30627 -50365 -24477 -1270 -51449 -19035 26309 40788 43555 26224 27536 104793
825 104793 88698 42026 38369 -27710 -38317 -7088 17368 46288 54519 81882 58442 53076
813 53076 35186 -14450 3016 -60664 32700 41084 25709 45665 69499 49113 91179 28601
801 28601 -14394 48718 19471 83380 120354 106386 44683 70828 22771 -17381 23228 31872
789 31872 36047 -26615 -35986 12071 66605 67743 -8322 -16435 -37919 -1317 -29722 -68841 11864
776 11864 -27157 -69506 -10969 75232 87651 -29210 -6898 -21821 13836 -5086 9819 55590
764 55590 -14211 3698 15623 4134 -74615 -25775 -9741 34506 78297 84421 75463 34181
752 34181 41598 45807 -13432 -14499 -32189 -41308 39001 91549 91139 65991 36002 19062 -24201
739 -24201 -28657 4175 -36005 -25612 26200 23868 -30104 37328 8156 58668 -5420 -41243
727 -41243 6501 67513 13961 46589 34075 82338 78956 41014 66037 81283 84393 6587
715 6587 10889 11967 105855 52469 -13193 -1179 59326 71764 34330 -37426 -5916 -27005 -37418
702 -37418 26676 100628 55465 16400 110523 148880 62306 13847 36669 42544 54976 28165
690 28165 -70999 -57860 58742 103853 54106 48845 31568 12342 11170 20642 -16647 47300
678 47300 118430 128746 86102 124279 70266 -65983 -57932 17640 29846 31160 94286 23887
666 23887 -45681 -8480 6637 60079 56306 -21618 15641 39275 33863 53831 70506 120254
654 120254 77651 67313 27935 24009 44040 41369 54417 7514 51942 81505 25489 111705
642 111705 87931 33655 -900 32877 90252 41612 115355 37369 -24507 936 52880 66330
630 66330 56621 14720 16367 86083 111399 55148 70285 24194 21637 -29485 -15138 33159 -63451
617 -63451 -44005 74014 131427 181730 72418 24963 105186 173100 57266 113306 114010 27351
605 27351 -19791 -42909 -14999 -41561 18849 38188 39011 121045 133590 113779 100334 100940 202699
592 202699 158461 106837 109951 152736 127855 74995 96144 91144 53659 87307 134058 117684
580 117684 97937 70169 268 81582 30314 13076 34094 14079 87876 57958 55961 87061
568 87061 49494 50710 67861 80662 47868 20809 -31598 5019 28123 44902 81551 49701
556 49701 97596 88855 45345 31813 3544 16630 30882 39064 105966 -27251 -90066 57793
544 57793 105463 52794 46055 46225 89622 71041 101653 68691 -23955 26403 -792 12210 114762
531 114762 131797 91533 92214 90711 122879 108663 123831 47400 89879 50498 33964 53892
519 53892 68509 87765 92530 51434 -14737 49613 86780 92026 40496 61821 69241 3897 -3771
506 -3771 -17665 -7522 26007 27527 87608 81917 118159 105148 20498 52181 51519 67162 72527
493 72527 32518 106085 108577 68732 39566 85982 113524 67544 57541 85080 89502 63366
481 63366 112595 100683 121333 112485 76346 88337 58226 151783 124531 65765 76333 73592
469 73592 70790 56097 78439 -4028 10741 48326 39741 83811 44979 -9783 24974 46906
457 46906 45930 73868 51932 53182 60722 87089 102936 115969 128302 61386 80446 76593 77783
444 77783 69490 98684 140257 143170 140921 52354 51482 61377 49261 125313 97541 71614 98988
431 98988 56607 55657 28264 44115 31445 72496 102625 80056 54886 50105 -23425 4948 16381
418 16381 -2361 3287 61302 62354 102607 65318 45118 73220 71941 71815 85558 106560 12000
405 12000 -36251 19049 120756 111396 109047 71521 71139 81606 130846 132114 128718 132476 109062
392 109062 121150 127183 143096 134174 61485 64907 124478 74097 49124 132958 131436 82243 69322
379 69322 87582 49895 144346 123147 74446 80415 -16743 46216 110708 75688 77588 88012
367 88012 95293 85383 107220 79071 73019 97639 90384 68174 89431 91482 80948 2509 36368
354 36368 127877 174423 153421 161177 123024 55370 54204 45492 84367 136708 109329 32157 74953
341 74953 82410 92082 49937 63865 50895 10749 82416 141596 167147 137983 173378 160217
329 160217 120983 68099 83938 124239 99083 142639 123685 144835 194487 189513 119021 59347
317 59347 48400 69341 53130 15377 16963 91915 172547 146677 66500 129955 105296 136170
305 136170 151950 104012 113471 99330 93897 53801 76877 60986 1854 24416 24176 21114 58029
292 58029 124742 74088 53948 61421 83764 100537 102614 159514 170764 148157 117550 74977
280 74977 115857 125301 133152 144544 73333 53150 81893 10718 42983 136766 174141 141155
268 141155 70372 100718 68324 59346 53826 92995 46015 55370 125826 84179 48503 58348 96768
255 96768 97148 163055 80156 45754 69566 15562 21181 56202 39563 28601 43284 134139 158301
242 158301 113256 95931 74382 137073 152564 192369 130900 119200 78269 91905 94844 62557
230 62557 82340 132469 111532 73063 106106 142698 144529 76986 101106 143270 136882 170409
218 170409 122666 111459 115311 155294 147955 171644 168100 190874 172477 111620 37068 28760 73164
205 73164 98991 179333 128146 133142 105262 43649 69408 100747 132025 114528 78147 111339
193 111339 126971 164544 183010 140459 143340 144321 98553 45140 33393 110743 93180 18827
181 18827 71168 74803 137878 112458 62538 107047 145500 122246 74213 96112 60542 122689
169 122689 131121 78023 20210 21967 34515 58304 81989 32691 88434 113444 78761 117193
157 117193 114898 138582 72613 28212 -11995 51943 118613 178831 156441 110588 99306 92909
145 92909 114132 153199 120450 159993 198805 146066 136979 146780 93695 78285 173040 135888
133 135888 115202 123109 94804 139607 113764 115414 75551 80254 52721 39335 95973 119720
121 119720 161167 135899 149867 120689 95122 96489 126620 62937 42876 82569 62978 86677
109 86677 113573 114730 139530 128447 125324 93628 166098 123379 72643 79584 95153 113588 185416
96 185416 183830 129798 119111 112163 76552 101707 101097 62670 62702 92668 73523 86885 90621 117021
82 117021 127198 95815 70107 66902 68272 49768 58083 46428 80387 107310 126266 171826 127987
69 127987 112313 144074 48968 61839 87300 110433 141301 166289 136198 113486 86359 120259
57 120259 151932 105022 88116 91178 74964 53290 51471 79796 117511 133618 99775 123074
45 123074 103650 109780 132121 135088 144991 162775 105508 124710 127419 134286 172061 139594 125263
32 125263 143039 142732 136835 146194 144803 167414 153228 138365 84605 98280 116397 140148 159350
19 159350 123326 100087 113111 89040 87720 57222 65902 98559 130114 91574 84480 101772 121051
6 121051 127226 108019 67351 92804 120355 101772
0 101772
$$ Imaginary data points
##PAGE= N=2
##DATA TABLE= (X++(I..I)), XYDATA
16383 -3736506 -3668010 -3643557 -3550761 -3532797 -3483048 -3424501 -3359259 -3310350 -3262131 -3263423 -3175467
16372 -3175467 -3105190 -3063964 -2989250 -2946000 -2902301 -2854529 -2822671 -2779977 -2704054 -2688540 -2656735
16361 -2656735 -2587367 -2486484 -2461853 -2468348 -2399312 -2292220 -2228382 -2222047 -2160994 -2100101 -2098249
16350 -2098249 -2018265 -2017587 -1981800 -1904625 -1858473 -1786690 -1749816 -1724183 -1654161 -1598936 -1568068 -1517984
16338 -1517984 -1482276 -1387202 -1344059 -1285128 -1223810 -1194595 -1146888 -1095759 -1028894 -1019682 -993561
16327 -993561 -954180 -906955 -875812 -825378 -828142 -810245 -736209 -604342 -550545 -550333 -471586 -415273
16315 -415273 -422889 -362979 -307803 -265861 -216027 -237353 -206311 -98178 -45819 -15293 4678
16304 4678 -11440 81257 156211 196818 188705 231073 230698 275537 382354 392941 424808 461590
16292 461590 525209 584599 617905 664449 647074 732366 815991 813689 841109 840488 900225 920914
16280 920914 1006816 1041397 1113332 1103722 1151090 1196997 1219482 1221616 1237583 1313128 1355492 1365860
16268 1365860 1376906 1429483 1478881 1501764 1441771 1485786 1585151 1618492 1666882 1704858 1763617
16257 1763617 1781277 1742850 1772843 1778841 1854904 1979565 1988579 1950177 2002569 2039870 2025078
16246 2025078 2065426 2131730 2175894 2254760 2226357 2251464 2232912 2253821 2283021 2323160 2324033 2345673
16234 2345673 2401802 2443968 2484399 2454478 2488796 2512071 2476405 2516202 2560927 2607064 2610712
16223 2610712 2669135 2704525 2690772 2661469 2648889 2676549 2759829 2830744 2860399 2853644 2854774 2828223
16211 2828223 2828991 2864887 2922209 2967413 3006753 2980873 3022119 3043995 3071608 3102549 3055712 3166243
16199 3166243 3173596 3137682 3141635 3137868 3168847 3231613 3232449 3266298 3316520 3324333 3274848 3280497 3344746
16186 3344746 3382285 3360042 3377779 3402049 3446831 3373736 3382316 3407308 3431174 3443784 3518372
16175 3518372 3527451 3473120 3509875 3543348 3564830 3513378 3440253 3568447 3671956 3623474 3546062
16164 3546062 3617846 3736504 3726215 3745031 3729723 3655237 3677929 3707215 3660099 3709777 3727785
16153 3727785 3744878 3797700 3779640 3738167 3811874 3835734 3852462 3844416 3846108 3896402 3896685 3864458
16141 3864458 3828062 3830524 3856626 3922987 3922143 3901431 3861082 3837141 3925667 3947549 3973302 3974765
16129 3974765 3939046 3980929 4012817 4041879 4024335 3970192 3938421 3983048 4001051 3977933 3975589
16118 3975589 4007229 4041386 4012064 3953766 3936843 3973842 3990687 3995598 4032489 4056792 4038869
16107 4038869 4066880 4088784 4147021 4127953 4068164 4074520 4082138 4060072 4058898 4096146 4107022 4157647
16095 4157647 4068294 4034323 4081366 4153779 4175805 4147355 4137858 4137156 4106878 4098275 4121412 4150281
16083 4150281 4167247 4158220 4155906 4116792 4063382 4130366 4235320 4231312 4191291 4205261 4236067 4148638
16071 4148638 4117661 4079542 4135439 4186866 4238279 4222734 4213233 4151693 4197970 4236245 4191219
16060 4191219 4165412 4159764 4130297 4155469 4168147 4200856 4221980 4212234 4191359 4212465 4205510 4207808
16048 4207808 4261291 4225075 4258772 4244997 4239513 4258252 4276386 4268847 4216153 4214740 4210349 4208104
16036 4208104 4225197 4244257 4295894 4257405 4227534 4256729 4230653 4208953 4173233 4149610 4215734
16025 4215734 4288340 4272265 4226882 4243278 4226781 4238943 4276190 4326568 4289106 4252751 4223771
16014 4223771 4226310 4230846 4308806 4276532 4272990 4262967 4295320 4306037 4262677 4205010 4218494 4292506
16002 4292506 4259363 4276631 4309499 4229069 4215345 4242697 4258461 4242538 4265045 4230144 4242439
15991 4242439 4219893 4206982 4209196 4224354 4296351 4287771 4263455 4299165 4283053 4190133 4213079 4174582
15979 4174582 4309736 4316424 4270869 4292473 4339665 4357616 4343254 4312017 4268658 4225885 4182990
15968 4182990 4200746 4212430 4259196 4292845 4242598 4278751 4260239 4251710 4233752 4268177 4330453
15957 4330453 4380863 4303853 4330010 4321011 4236854 4275443 4265632 4298629 4322887 4327277 4298782 4328610
15945 4328610 4313363 4249095 4237204 4269374 4306157 4281276 4248432 4218750 4241495 4271097 4301365
15934 4301365 4349172 4287616 4214215 4219058 4230586 4234030 4302200 4352120 4304643 4198812 4252554
15923 4252554 4292417 4233567 4240767 4265360 4278677 4311466 4360320 4286734 4281431 4320797 4263451 4273503
15911 4273503 4320287 4256681 4292021 4284724 4295479 4304869 4270157 4276855 4241717 4312675 4351487 4308092
15899 4308092 4328214 4390348 4339894 4308025 4317806 4295584 4284199 4294238 4263304 4229659 4232285 4258805
15887 4258805 4217352 4213578 4236000 4289568 4245117 4300946 4321673 4283415 4302074 4276576 4261679
15876 4261679 4269448 4291084 4287534 4249448 4272253 4248010 4295406 4383953 4370146 4287233 4270186 4314744
15864 4314744 4279387 4252480 4260581 4266670 4301414 4402733 4355131 4234268 4240303 4225267 4211983
15853 4211983 4293466 4319859 4324465 4328839 4321852 4278479 4258417 4313199 4355820 4387631 4316711 4225494
15841 4225494 4317149 4340889 4318752 4268959 4251385 4288646 4330585 4365521 4364921 4331744 4316029 4292836
15829 4292836 4276596 4361490 4330999 4335599 4321471 4286432 4281198 4287402 4314923 4307119 4295789 4306352
15817 4306352 4355145 4372908 4338226 4348734 4377608 4298041 4279123 4312943 4272388 4274328 4313654
15806 4313654 4266593 4272946 4295316 4247465 4286280 4367293 4331663 4250037 4246991 4313451 4318637 4310425
15794 4310425 4280779 4318308 4373459 4397353 4364343 4366138 4374399 4327478 4289665 4356154 4389860 4387126
15782 4387126 4370084 4365872 4329830 4301530 4330138 4330176 4277678 4204116 4251361 4392284 4363285 4332058
15770 4332058 4360913 4396112 4384382 4367697 4380366 4335171 4320816 4367131 4349926 4316294 4278112
15759 4278112 4241853 4292561 4317490 4363620 4376135 4348398 4351751 4353442 4324583 4333315 4393091 4356911
15747 4356911 4296281 4296162 4312163 4333667 4346261 4324600 4327904 4397225 4351683 4285604 4337500 4308134
15735 4308134 4325938 4348634 4370097 4391050 4323252 4345035 4379438 4360253 4359354 4374370 4335113 4416450
15723 4416450 4376960 4358106 4374913 4337037 4313319 4323590 4352581 4331092 4330118 4330624 4342963 4387072
15711 4387072 4307624 4286692 4260784 4329285 4369111 4406784 4427136 4367303 4357099 4379339 4371468
15700 4371468 4400613 4412795 4433893 4411446 4399649 4364051 4393673 4394528 4369959 4394875 4412885 4405702
15688 4405702 4423683 4411820 4424854 4497291 4440353 4388208 4349526 4314257 4280888 4364913 4403898
15677 4403898 4396147 4381478 4382877 4369773 4387765 4463668 4474735 4416421 4457904 4428702 4373259 4371148
15665 4371148 4381666 4352790 4326895 4355380 4390651 4376425 4413633 4437713 4448742 4464481 4440244
15654 4440244 4441272 4388580 4381153 4410100 4442084 4382909 4355283 4385113 4428584 4495427 4386905
15643 4386905 4347309 4369621 4419794 4406240 4395934 4431649 4434325 4428416 4462671 4402831 4341753 4392362
15631 4392362 4457140 4380175 4318185 4347196 4350683 4338894 4359485 4381743 4360212 4389175 4400047
15620 4400047 4354625 4308545 4331701 4378174 4373484 4349053 4302877 4321895 4370786 4357869 4384772
15609 4384772 4362669 4309738 4310627 4324630 4380507 4420224 4440375 4433366 4430819 4473335 4468040 4447910
15597 4447910 4418278 4393668 4354485 4409591 4392058 4384578 4438888 4436512 4411320 4436860 4467721 4463547
15585 4463547 4406511 4401851 4391115 4365440 4347788 4371164 4372059 4397704 4375876 4368398 4418064 4416455
15573 4416455 4438849 4362414 4408194 4457760 4428306 4432321 4454191 4443392 4411168 4381465 4365191
15562 4365191 4390777 4494905 4499992 4474908 4428204 4386592 4387894 4390935 4425141 4512298 4525099 4499136
15550 4499136 4447338 4458176 4431712 4374423 4407624 4435922 4453877 4501423 4457978 4486076 4463507
15539 4463507 4431211 4452668 4493443 4450348 4410942 4381512 4397159 4418525 4371064 4444150 4423990
15528 4423990 4424858 4366449 4411618 4399613 4421170 4420991 4404501 4474645 4463904 4409627 4457165 4488665
15516 4488665 4464777 4457659 4497019 4440731 4466640 4508918 4530715 4494783 4470852 4460172 4408417
15505 4408417 4407236 4365892 4400808 4432596 4437465 4337756 4363957 4423005 4434326 4498138 4444959 4436944
15493 4436944 4500675 4491984 4507531 4449353 4405360 4400895 4413979 4454309 4424780 4411276 4426315 4431386
15481 4431386 4458760 4444746 4462390 4454564 4462129 4502875 4505160 4486180 4416658 4440387 4510011 4465892
15469 4465892 4403212 4454983 4389621 4449600 4466210 4417993 4437302 4455021 4453078 4389930 4433034
15458 4433034 4475490 4492747 4457856 4386800 4399867 4476664 4501515 4451745 4500647 4515274 4563551
15447 4563551 4545946 4469723 4503113 4479517 4445349 4484550 4487534 4473009 4486411 4422694 4380532
15436 4380532 4394060 4380602 4459220 4450682 4489129 4477145 4454324 4522145 4537784 4540547 4447930 4450649
15424 4450649 4433474 4503800 4555834 4476113 4444494 4475458 4473636 4452514 4460534 4490618 4477997 4456492
15412 4456492 4484560 4425195 4467505 4499361 4470787 4425976 4485275 4484710 4490381 4492373 4370123 4363722
15400 4363722 4398692 4453323 4503154 4524549 4563829 4513051 4429476 4462951 4477493 4525413 4462277
15389 4462277 4451880 4439418 4482867 4504636 4452973 4509145 4537595 4488647 4527667 4542819 4537177
15378 4537177 4520083 4526549 4521028 4520719 4500345 4578710 4588266 4549992 4455640 4558454 4604115 4559608
15366 4559608 4522582 4527386 4593646 4592276 4529107 4473229 4541434 4569250 4491678 4517489 4548866 4503069
15354 4503069 4481223 4518699 4481684 4415763 4463134 4473350 4472979 4467670 4505763 4498601 4491195 4503465
15342 4503465 4532804 4546144 4509335 4527760 4531785 4502756 4510162 4543970 4539426 4514273 4532902 4481521
15330 4481521 4497832 4495616 4471794 4479084 4530337 4468965 4477864 4492607 4501449 4435840 4459602 4478870
15318 4478870 4496673 4520399 4472206 4500650 4470031 4522346 4576778 4494770 4445696 4462801 4557142
15307 4557142 4543685 4506033 4521735 4491554 4482107 4520383 4502862 4473570 4542012 4595226 4537277
15296 4537277 4536634 4555125 4596023 4540105 4524152 4538639 4547324 4556725 4488925 4464850 4508457 4498148
15284 4498148 4516505 4523731 4485127 4550541 4538147 4525393 4559667 4552380 4602444 4526186 4559193 4537899
15272 4537899 4557688 4587684 4569362 4533689 4480188 4579444 4611562 4649630 4597140 4606128 4568612
15261 4568612 4548684 4589222 4592234 4619422 4640749 4527455 4515431 4594921 4596408 4640847 4600735
15250 4600735 4524294 4518472 4586113 4608050 4584390 4561951 4554871 4581869 4532451 4566247 4564502 4616928
15238 4616928 4575151 4499383 4521641 4575087 4536038 4440184 4511772 4547383 4601708 4547937 4488796
15227 4488796 4461960 4465246 4515987 4541560 4568539 4532225 4563507 4518527 4562276 4584625 4576173 4642856
15215 4642856 4578334 4584300 4626190 4510370 4463997 4516618 4569225 4552419 4599098 4608406 4577339
15204 4577339 4566943 4626772 4566309 4551091 4684658 4659350 4598879 4585956 4598227 4560852 4595372
15193 4595372 4661506 4646235 4599344 4541742 4623121 4660051 4649206 4576779 4536644 4565439 4546840
15182 4546840 4593970 4562988 4553495 4587967 4528108 4577221 4559438 4614938 4614865 4618718 4615720 4603979
15170 4603979 4615337 4634936 4568394 4533646 4602308 4577325 4606687 4618522 4619980 4592031 4620478
15159 4620478 4589813 4585023 4593517 4651010 4619382 4621087 4574111 4596401 4623977 4598456 4552798 4579405
15147 4579405 4655893 4623719 4576308 4638228 4619572 4569988 4582348 4598294 4606200 4602401 4584320 4553523
15135 4553523 4553110 4579641 4575871 4571727 4547535 4581078 4566760 4505312 4578221 4653670 4613028 4517029
15123 4517029 4561137 4577502 4565187 4573676 4638573 4640766 4656980 4631425 4578466 4533313 4521468 4557454
15111 4557454 4526111 4540434 4597168 4593371 4560613 4563548 4617846 4620466 4561472 4651282 4688223 4676350
15099 4676350 4602393 4517029 4512721 4549579 4625521 4600582 4665607 4703854 4659329 4681477 4593896
15088 4593896 4555149 4634283 4648298 4666226 4677904 4648571 4635072 4642817 4578824 4540323 4584643
15077 4584643 4619194 4655989 4627813 4575187 4618000 4707770 4704689 4618928 4621217 4642632 4622310 4669651
15065 4669651 4580635 4597873 4706543 4668928 4691777 4648410 4625032 4618465 4623978 4622158 4617211 4635000
15053 4635000 4661272 4635442 4632636 4664891 4594122 4616944 4651966 4640044 4628385 4645490 4581763
15042 4581763 4594795 4625275 4664618 4641510 4670192 4632506 4613139 4676746 4725127 4677020 4644829
15031 4644829 4720135 4693059 4612495 4614303 4628257 4661933 4731073 4709371 4668665 4598341 4689472
15020 4689472 4724661 4653032 4650193 4605482 4589470 4608118 4596911 4638874 4654941 4617202 4573820
$$ [...]
##END NTUPLES=NMR SPECTRUM
##END=
