##TITLE=1H_TG-2365-C1
 CDCl3
 8 sc, 
 9.2.2023
##JCAMPDX= 6.0         $$ Bruker NMR JCAMP-DX V2.0
##DATA TYPE= NMR SPECTRUM
##DATA CLASS= NTUPLES
##ORIGIN= UXNMR, Bruker Analytische Messtechnik GmbH
##OWNER= root
$$ XWIN-NMR		Version 3.5
$$ Thu Feb  9 14:41:57 2023 Russian Standard Time (UT+4h)  she@DPX200
##.OBSERVE FREQUENCY= 200.13135
##.OBSERVE NUCLEUS= ^1H
##.ACQUISITION MODE= SIMULTANEOUS
##.ACQUISITION SCHEME= undefined
##.AVERAGES= 8
##.DIGITISER RES= 18
##SPECTROMETER/DATA SYSTEM= spect
##.PULSE SEQUENCE= zg30
##.SOLVENT NAME= DMSO
##.SHIFT REFERENCE= (INTERNAL, DMSO, 0, 15.8119)
##AUDIT TRAIL= $$ (NUMBER, WHEN, WHO, WHERE, WHAT)
$$ ##TITLE= Audit trail, XWIN-NMR		Version 3.5
$$ ##JCAMPDX= 5.01
$$ ##ORIGIN= Bruker BioSpin GmbH
$$ ##OWNER= she
$$ F:/spectra/data/she/nmr/H-F/1/pdata/1/auditp.txt
$$ ##AUDIT TRAIL=  $$ (NUMBER, WHEN, WHO, WHERE, WHAT)
(   1,<2023-02-09 14:39:28.67 +0400>,<she>,<DPX200>,
      <created by zg, POWCHK disabled, PULCHK disabled
       configuration hash MD5:
       00 E9 B6 7A A2 85 ED C7 34 08 36 98 17 FE 4E 26
       data hash MD5: 16K
       C3 92 CC 00 6D 40 B2 B1 AD 77 95 FA F2 16 D6 E7>)
(   2,<2023-02-09 14:39:31.53 +0400>,<she>,<DPX200>,
      <Start of raw data processing
       efp BC_mod = 2 LB = 0.24 FT_mod = 6 PKNL = 1 PHC0 = -19113.37 PHC1 = 2.800783 SI = 16K 
       data hash MD5: 16K
       D8 8A 19 27 63 F4 71 7C 05 67 DE 33 EB CC 64 63>)
(   3,<2023-02-09 14:39:49.59 +0400>,<she>,<DPX200>,
      <pk PHC0 = 6.968908 PHC1 = 0 
       data hash MD5: 16K
       4C 15 BC D5 00 12 29 54 34 B8 52 30 19 FE 42 55>)
(   4,<2023-02-09 14:39:52.81 +0400>,<she>,<DPX200>,
      <abs ABSG = 5 
       data hash MD5: 16K
       33 A4 31 81 6B 38 02 E7 FD 5F 90 09 E2 41 6D 1B>)
$$ ##END=
$$ 
$$ hash MD5
$$ FC 40 D4 C8 D3 71 A1 CB 5F E8 96 72 46 51 93 C5
##$RELAX= 
##$RELAX= 
##$RELAX= 
##$RELAX= 
##$RELAX= 
##$RELAX= 
$$ Bruker specific parameters
$$ --------------------------
##$DU= <F:/spectra>
##$EXPNO= 1
##$NAME= <H-F>
##$PROCNO= 1
##$TYPE= <nmr>
##$USER= <she>
##$AMP= (0..31)
100 100 100 100 100 100 100 100 100 100 100 100 100 100 100 100 100 100 
100 100 100 100 100 100 100 100 100 100 100 100 100 100 
##$AQSEQ= 0
##$AQ_mod= 1
##$AUNM= <au_zg>
##$AUTOPOS= <>
##$BF1= 200.13
##$BF2= 200.13
##$BF3= 200.13
##$BF4= 200.13
##$BF5= 200.13
##$BF6= 200.13
##$BF7= 200.13
##$BF8= 200.13
##$BYTORDA= 1
##$CFDGTYP= 0
##$CFRGTYP= 5
##$CHEMSTR= <none>
##$CNST= (0..31)
1 1 145 1 1 1 1 1 1 1 1 1 1 1 1 1 1 1 1 1 1 1 1 1 1 1 1 1 1 1 1 1 
##$CPDPRG= <>
##$CPDPRG1= <>
##$CPDPRG2= <>
##$CPDPRG3= <>
##$CPDPRG4= <mlev>
##$CPDPRG5= <mlev>
##$CPDPRG6= <mlev>
##$CPDPRG7= <mlev>
##$CPDPRG8= <mlev>
##$CPDPRGB= <>
##$CPDPRGT= <>
##$D= (0..31)
0 1.2 0 0 0 0 0 0 0 0.06 0 0.03 0 0 0 0 0.0002 0 0 0 0 0 0 0 0 0 0 0 0 
0 0 0 
##$DATE= 1675939168
##$DBL= (0..7)
120 120 120 120 120 120 120 120 
##$DBP= (0..7)
150 150 150 150 150 150 150 150 
##$DBP07= 0
##$DBPNAM0= <>
##$DBPNAM1= <>
##$DBPNAM2= <>
##$DBPNAM3= <>
##$DBPNAM4= <>
##$DBPNAM5= <>
$$ [...]
##$SUBNAM3= <"">
##$SUBNAM4= <"">
##$SUBNAM5= <"">
##$SUBNAM6= <"">
##$SUBNAM7= <"">
##$SUBNAM8= <"">
##$SUBNAM9= <"">
##$SW= 18.05172834244
##$SWIBOX= (0..15)
0 0 2 0 0 0 0 0 0 0 0 0 0 0 0 0 
##$SW_h= 3612.71676300578
##$TD= 16384
##$TD0= 1
##$TE= 0
##$TE2= 300
##$TE3= 300
##$TEG= 300
##$TL= (0..7)
0 120 120 120 120 120 120 120 
##$TP= (0..7)
150 150 150 150 150 150 150 150 
##$TP07= 0
##$TPNAME0= <>
##$TPNAME1= <>
##$TPNAME2= <>
##$TPNAME3= <>
##$TPNAME4= <>
##$TPNAME5= <>
##$TPNAME6= <>
##$TPNAME7= <>
##$TPOAL= (0..7)
0.5 0.5 0.5 0.5 0.5 0.5 0.5 0.5 
##$TPOFFS= (0..7)
0 0 0 0 0 0 0 0 
##$TUNHIN= 0
##$TUNHOUT= 0
##$TUNXOUT= 0
##$USERA1= <user>
##$USERA2= <user>
##$USERA3= <user>
##$USERA4= <user>
##$USERA5= <user>
##$V9= 5
##$VALIST= <valist>
##$VCLIST= <CCCCCCCCCCCCCCC>
##$VD= 0
##$VDLIST= <DDDDDDDDDDDDDDD>
##$VPLIST= <PPPPPPPPPPPPPPP>
##$VTLIST= <TTTTTTTTTTTTTTT>
##$WBST= 1024
##$WBSW= 4
##$XGAIN= (0..3)
0 0 0 0 
##$XL= 0
##$YL= 0
##$YMAX_a= 566704
##$YMIN_a= -1038102
##$ZGOPTNS= <>
##$ZL1= 120
##$ZL2= 120
##$ZL3= 120
##$ZL4= 120
##$ABSF1= 15.74469
##$ABSF2= -2.307159
##$ABSG= 5
##$ABSL= 3
##$ALPHA= 0
##$AQORDER= 0
##$ASSFAC= 0
##$ASSFACI= 0
##$ASSFACX= 0
##$ASSWID= 0
##$AUNMP= <proc_1d>
##$AZFE= 0.1
##$AZFW= 0.1
##$BCFW= 0
##$BC_mod= 2
##$BYTORDP= 0
##$COROFFS= 0
##$CY= -3
##$DATMOD= 1
##$DC= 0
##$DFILT= <>
##$DTYPP= 0
##$F1P= 0
##$F2P= 0
##$FCOR= 1
##$FTSIZE= 16384
##$FT_mod= 6
##$GAMMA= 0
##$GB= 0
##$INTBC= 1
##$INTSCL= 3.70164e-10
##$ISEN= 128
##$LB= 0.24
##$LEV0= 0
##$LPBIN= 0
##$MAXI= 10000
##$MC2= 0
##$MEAN= 0
##$ME_mod= 0
##$MI= 1.114404
##$NCOEF= 0
##$NC_proc= -7
##$NLEV= 6
##$NOISF1= 3.799351
##$NOISF2= 2.8
##$NSP= 0
##$NTH_PI= 0
##$NZP= 0
##$OFFSET= 15.8119
##$PC= 1
##$PHC0= -19106.4
##$PHC1= 2.800783
##$PH_mod= 1
##$PKNL= yes
##$PPARMOD= 0
##$PSCAL= 0
##$PSIGN= 0
##$REVERSE= no
##$SF= 200.129991924681
##$SI= 16384
##$SIGF1= 3
##$SIGF2= 2
##$SINO= 5.538805
##$SIOLD= 16384
##$SREGLST= <1H.CDCl3>
##$SSB= 0
##$STSI= 16384
##$STSR= 0
##$SW_p= 3612.71676300578
##$SYMM= 0
##$S_DEV= 0
##$TDeff= 16384
##$TDoff= 0
##$TI= <>
##$TILT= no
##$TM1= 0
##$TM2= 0
##$TOPLEV= 0
##$USERP1= <user>
##$USERP2= <user>
##$USERP3= <user>
##$USERP4= <user>
##$USERP5= <user>
##$WDW= 1
##$XDIM= 16384
##$YMAX_p= 531611314
##$YMIN_p= -1246951
$$ End of Bruker specific parameters
$$ ---------------------------------
##NTUPLES= NMR SPECTRUM
##VAR_NAME=  FREQUENCY,     SPECTRUM/REAL,   SPECTRUM/IMAG
##SYMBOL=    X,             R,               I
##VAR_TYPE=  INDEPENDENT,   DEPENDENT,       DEPENDENT
##VAR_FORM=  AFFN,          ASDF,            ASDF
##VAR_DIM=   16384,         16384,           16384
##UNITS=     HZ,            ARBITRARY UNITS, ARBITRARY UNITS
##FACTOR=    0.220516191357247, 1,           1
##FIRST=     3164.43544710291, 0,            0
##LAST=      -448.281315902871, 0,           0
##MIN=       -448.281315902871, -1246951,    0
##MAX=       3164.43544710291, 531611314,    0
$$ Real data points
##PAGE= N=1
##DATA TABLE= (X++(R..R)), XYDATA
$$ [...]
6080B5847863n22446l7158j83350k50219k30686l5563j03947k15978j86755l0407
$$ 25847863 25325417 25288259 25104909 24854690 24624004 24588441 24484494 24268516 24081761 24051354
6070B4051354j00139l16703j12800O3909k79850k35564o3641r5957L9480l99347
$$ 24051354 23951215 23634512 23521712 23585621 23305771 23070207 23006566 22910609 22950089 22550742
6060B2550742L7753m7266k40589J47128j54494l4262j79844k83995j28986p5243
$$ 22550742 22588495 22541229 22300640 22447768 22293274 22259012 22079168 21795173 21666187 21590944
6050B1590944k5679j33423k47312j2291K6166L9032p3708m1037J4796n8321r0415
$$ 21590944 21565265 21431842 21184530 21172239 21198405 21237437 21163729 21122692 21137488 21079167 20988752
6039B0988752k21799n1006J60201n8981k9173q269j50714J7247Q593R5370K31940
$$ 20988752 20766953 20715947 20876148 20817167 20787994 20779725 20629011 20646258 20654851 20750221 20982161
6028B0982161j01837P9878J44222n1786J97717o4509k3694K69108K59612K64136
$$ 20982161 20880324 20960202 21104424 21052638 21250355 21185846 21162152 21431260 21690872 21955008
6018B1955008l5107m8459J36658L66404J93952K33728L92817L47299M58083N06234
$$ 21955008 21919901 21871442 22008100 22374504 22568456 22802184 23195001 23542300 24000383 24506617
6008B4506617O03113Q40140P11479Q37789R01253J047968R17901P03182R62294
$$ 24506617 25109730 25949870 26661349 27499138 28400391 29448359 30366260 31069442 32031736
5999C2031736Q36675P77081K72745L7729K08204j95069l26857o19196p16776p44863
$$ 32031736 32868411 33645492 33918237 33955966 34164170 33969101 33642244 33023048 32306272 31561409
5989C1561409n19614l93453m96761j05423m1200J87101K69149L86919M79695O08148
$$ 31561409 31041795 30648342 30151581 30046158 30004958 30192059 30461208 30848127 31327822 31935970
5979C1935970Q29405Q32423J590293J477260J578094K043712K243462K452579
$$ 31935970 32765375 33597798 35188091 36665351 38243445 40287157 42530619 44983198
5971D4983198K420573K580542K160086K260746K050450J517649Q82780L01116
$$ 44983198 47403771 49984313 52144399 54405145 56455595 57973244 58856024 59157140
5963E9157140q46213j120333j628231k226225k852380l081247k936812k260121
$$ 59157140 58310927 57190594 55562363 53336138 50483758 47402511 44465699 42205578
5955D2205578j698917j493034j047080q41915m37723l14444j2487J91736L97148
$$ 42205578 40506661 39013627 37966547 37124632 36686909 36372465 36359978 36551714 36948862
5946C6948862N71252J147739R12950J307955J690233J751355K247266K244426
$$ 36948862 37520114 38667853 39580803 40888758 42578991 44330346 46577612 48822038
5938D8822038K381569K334229J835238J747242J443532Q31941J66670q17715j524922
$$ 48822038 51203607 53537836 55373074 57120316 58563848 59395789 59562459 58744744 57219822
5929E7219822j675635k556594l224208l346887l258991k785895k338729j589376
$$ 57219822 55544187 52987593 49763385 46416498 43157507 40371612 38032883 36443507
5921C6443507j512393j407998r03941r49614n80255l36690o87702m24858j00986
$$ 36443507 34931114 33523116 32619175 31669561 31089306 30752616 30064914 29640056 29539070
5912B9539070K15041L53203N17888K82134L34578O00366M71224O82459P10393
$$ 29539070 29754111 30107314 30625202 30907336 31241914 31842280 32313504 32995963 33706356
5903C3706356M32989L52900J88664j09179l64388n59543l95682q75317j254483
$$ 33706356 34139345 34492245 34680909 34571730 34207342 33647799 33252117 32376800 31122317
5894C1122317j459009j176980j184085r54659n46399m75203l60882m95303l79883
$$ 31122317 29663308 28486328 27302243 26347584 25801185 25325982 24965100 24469797 24089914
5885B4089914m35819j63013j47557l02146k28091p1570j07101K9485k89497L55331
$$ 24089914 23654095 23491082 23343525 23041379 22813288 22741718 22634617 22664102 22374605 22729936
5875B2729936Q3823j06496m7921j27799l1297J36803L33041O2641J85180K45663
$$ 22729936 22813759 22707263 22659342 22531543 22500246 22637049 22970090 23032731 23217911 23463574
5865B3463574O0935k09K61372K26164o513J42921J67630J32162K03919K0447P1550
$$ 23463574 23524509 23524300 23785672 24011836 24005323 24148244 24315874 24448036 24651955 24672402 24743952
5854B4743952M0999l7116j71832n3803M7132j5344j18747j98487m7544p8002J1716
$$ 24743952 24784951 24747835 24576003 24522200 24569332 24553988 24435241 24236754 24189210 24111208 24122924
5843B4122924j43980J12905K82607m3876J28184J80174k8553J42587M74761L11251
$$ 24122924 23978944 24091849 24374456 24330580 24458764 24638938 24610385 24752972 25227733 25538984
5833B5538984J70470J02070J83312J4853M19133M52280J61819K11527L37960K58118
$$ 25538984 25709454 25811524 25994836 26009689 26428822 26881102 27042921 27254448 27592408 27850526
5823B7850526K66920L1050J99455m7985P132j238O8824J43610Q9993l2M60k0563
$$ 27850526 28117446 28148496 28347951 28299966 28307098 28305860 28374684 28518294 28608287 28608255 28608715 28588152
5811B8588152l5658j24360k0972k77023l57859j49627k69338j41139m16185n70862
$$ 28588152 28552494 28428134 28407162 28130139 27772280 27622653 27353315 27212176 26795991 26225129
5801B6225129n0344k52588m70186j02608l8235j67551k49329L2338k64065k2413
$$ 26225129 26174785 25922197 25452011 25349403 25311168 25143617 24894288 24926626 24662561 24640148
5791B4640148J91642k9751k6351J10632j0885N3647R1814J97300R1206K0188j14299
$$ 24640148 24831790 24802039 24775688 24886320 24875435 24929082 25020896 25218196 25309402 25329590 25215291
5780B5215291J99208j65901l4992K5258m44174j32835j01440p7200m32684l11945
$$ 25215291 25414499 25248598 25213606 25238864 24794690 24661855 24560415 24483215 24050531 23738586
5770B3738586m03279l84341j40933l57323k27112l25873j51970l63009j4715j6399
$$ 23738586 23335307 22950966 22810033 22452710 22225598 21899725 21747755 21384746 21370031 21353632
5760B1353632k18879k34816k68988p9722N0734l343J8445K6302J42157M6303j02410
$$ 21353632 21134753 20899937 20630949 20551227 20601961 20598618 20617063 20643365 20785522 20831825 20729415
5749B0729415J75800m6620J45548N484j28221O6515K54065J308k16549L15054
$$ 20729415 20905215 20858595 21004143 21009627 20881406 20947921 21201986 21203294 20986745 21301799
5739B1301799J98779N6445J62029L45120J87051J4002j5983q595K40889L13787
$$ 21301799 21500578 21557023 21719052 22064172 22251223 22265225 22249242 22240647 22481536 22795323
5729B2795323P5115l4993M09843R7412J26478K11740K50742K92132P2216K43084
$$ 22795323 22870438 22835445 23245288 23342700 23469178 23680918 23931660 24223792 24296008 24539092
5719B4539092J57151M168M65833K83558L14573J81530M00227J13735J66081L30070
$$ 24539092 24696243 24700411 25166244 25449802 25764375 25945905 26346132 26459867 26625948 26956018
5709B6956018K08764M01057K37474L62097J83344K62054O11097K12955p9159J14193
$$ 26956018 27164782 27565839 27803313 28165410 28348754 28610808 29221905 29434860 29355701 29469894
5699B9469894N42401L04219L72148L60211L29346M83432L94937N13761M27151
$$ 29469894 30012295 30316514 30688662 31048873 31378219 31861651 32256588 32770349 33197500
5690C3197500M93618M80570M34854L84918N55726L60551N88129L60769N70258
$$ 33197500 33691118 34171688 34606542 34991460 35547186 35907737 36495866 36856635 37426893
5681C7426893M29515L97089O26859M79006M19541N05129M66974O55386M47454
$$ 37426893 37856408 38253497 38880356 39359362 39778903 40284032 40751006 41406392 41853846
5672D1853846K89017N47322O26838N42004N48594L55306J94869N68378K50254
$$ 41853846 42142863 42690185 43317023 43859027 44407621 44762927 44957796 45526174 45776428
5663D5776428K58079N07026L61410K05801K84687L03239L34732M62274M11413
$$ 45776428 46034507 46541533 46902943 47108744 47393431 47696670 48031402 48493676 48905089
5654D8905089K67153K53984K25130K98349Q00254N74635N28227M56709N39908
$$ 48905089 49172242 49426226 49651356 49949705 50749959 51324594 51852821 52309530 52849438
5645E2849438N45660M26381L99410N28058M37514L74341K22371M67055L83352
$$ 52849438 53395098 53821479 54220889 54748947 55186461 55560802 55783173 56250228 56633580
5636E6633580L85370K73533K84578J02132k2587J04136n6720j81184k76604j30808
$$ 56633580 57018950 57292483 57577061 57679193 57656606 57760742 57704022 57522838 57246234 57115426
5626E7115426k71674J3133j66687j73936j41634n1113j49784J13951k20112k28481
$$ 57115426 56843752 56856885 56690198 56516262 56374628 56323515 56173731 56287682 56067570 55839089
5616E5839089J77501j98051p9105L79017n7542J46894J15771k7006J07979O5615
$$ 55839089 56016590 55818539 55739434 56118451 56060909 56207803 56323574 56296568 56404547 56470162
5606E6470162K25496N04438N64624K41269J90267L15294L00299K89345K32211
$$ 56470162 56695658 57200096 57764720 58005989 58196256 58511550 58811849 59101194 59333405
5597E9333405M43467J55261M12173R6736N1847j23797k37961k8728j30125k35090
$$ 59333405 59776872 59932133 60344306 60441042 60492889 60369092 60131131 60102403 59972278 59737188
5587E9737188p17582k22661k85814l51178l85446n99069l03065m14559l48006
$$ 59737188 59019606 58796945 58511131 58159953 57774507 57175438 56872373 56457814 56109808
5578E6109808k79670j67685l6278J04087o7083l5891K04705J06527N87786N92511
$$ 56109808 55830138 55662453 55626175 55730262 55663179 55627288 55831993 55938520 56526306 57118817
5568E7118817N57194M00823N99265L07613J78045M88550L07275m4917K1277L6694
$$ 57118817 57676011 58076834 58676099 58983712 59161757 59650307 59957582 59912665 59933942 59970636
5558E9970636m6739q1991n19994m17807k31528m28324o26277n82298n81785n74737
$$ 59970636 59923897 59841906 59321912 58904105 58672577 58244253 57617976 57035678 56453893 55879156
5548E5879156o68579p38730m57089l64984m72863k65466k59378j18182K4491Q4450
$$ 55879156 55210577 54471847 54014758 53649774 53176911 52911445 52652067 52533885 52558376 52642826
5538E2642826k6308Q2193M25789L59666M30751N78557K70345L16566M14040K39249
$$ 52642826 52616518 52698711 53124500 53484166 53914917 54493474 54763819 55080385 55494425 55733674
5528E5733674K17002J07647k6001O3770p7845k21749k80556k67517m87990p39628
$$ 55733674 55950676 56058323 56032322 56096092 56018247 55796498 55515942 55248425 54760435 54020807
5518E4020807n02506n29187p99177r58144q32423r92183p19005q64424o11623
$$ 54020807 53518301 52989114 52189937 51231793 50399370 49407187 48688182 47823758 47212135
5509D7212135q47609o76197m56998m40161l89503m00798j10872k15379j47333
$$ 47212135 46364526 45688329 45231331 44791170 44401667 44000869 43889997 43674618 43527285
5500D3527285M6435J04476k2534N4081k7973P7358J35430N537J93082N3030K03755
$$ 43527285 43573720 43678196 43655662 43709743 43681770 43759128 43894558 43900095 44093177 44146207 44349962
5489D4349962J12262k33195n9920L2097j73966n4116p0545k88533k41286m80723
$$ 44349962 44462224 44229029 44169109 44201206 44027240 43973124 43902579 43614046 43372760 42892037
5479D2892037l75901j76528l33176m46511m85253j86089m01973m25238j53677
$$ 42892037 42516136 42339608 42006432 41559921 41074668 40888579 40486606 40061368 39907691
5470C9907691j21420j07466l18775j53196j93863m23721j76088J10813o9908m05910
$$ 39907691 39786271 39678805 39360030 39206834 39012971 38589250 38413162 38523975 38454067 38048157
5460C8048157Q048j03399k45415j19570j8162l7956K82119O5965K21316J19326
$$ 38048157 38056205 37952806 37707391 37587821 37569659 37531703 37813822 37879787 38101103 38220429
5450C8220429j34732K807K34700K19702Q328J67506j75810Q1859j23204j88137
$$ 38220429 38085697 38088504 38323204 38542906 38551234 38718740 38542930 38624789 38501585 38313448
5440C8313448j38711j20565l16493k86333m01483k55889l85929l89913k55919
$$ 38313448 38174737 38054172 37737679 37451346 37049863 36793974 36408045 36018132 35762213
5431C5762213n8644l39559k42678m08405k44772k17807j59430j78248J09220J5842
$$ 35762213 35703569 35364010 35121332 34712927 34468155 34250348 34090918 33912670 34021890 34037732
5421C4037732p163K75773J53544Q4833K2101K79468K6324J59293J07426L38200
$$ 34037732 34030569 34306342 34459886 34544719 34566820 34846288 34872612 35031905 35139331 35477531
5411C5477531J59975J50324Q1324k54050r5311k16737m2488k09718k05517j24456
$$ 35477531 35637506 35787830 35869154 35615104 35519793 35303056 35260568 35050850 34845333 34720877
5401C4720877k30421l4955j97158j93022o1021l967N5837J49648o5894J20257
$$ 34720877 34490456 34455501 34258343 34065321 34004300 34000333 34056170 34205818 34139924 34260181
5391C4260181K85979K31279L93739R9985K51061N63444M93245L03438L32468L57242
$$ 34260181 34546160 34777439 35171178 35271163 35522224 36085668 36578913 36882351 37214819 37572061
5381C7572061L54997L91324N51004M41853K7991N9997J35535K08325J67976J32702
$$ 37572061 37927058 38318382 38869386 39311239 39339230 39399227 39534762 39743087 39911063 40043765
5371D0043765j5832j96859j72189O3175j57698k52827j41909j60062j44576l07517
$$ 40043765 40027933 39831074 39658885 39722060 39564362 39311535 39169626 39009564 38864988 38557471
5361C8557471J9213l8321j38896K23541K13405K76135K67256J89467J47323L93105
$$ 38557471 38576684 38538363 38399467 38623008 38836413 39112548 39379804 39569271 39716594 40109699
5351D0109699O14567M78668K57449M14011N56790L23655M91772M25134K91434
$$ 40109699 40724266 41202934 41460383 41874394 42431184 42754839 43246611 43671745 43963179
5342D3963179M81273L56349K87962M20104K77758N13990L20154K53030K86142
$$ 43963179 44444452 44800801 45088763 45508867 45786625 46300615 46620769 46873799 47159941
5333D7159941L52524O03360L67764O75314N07833N80400L19489O16451L43090
$$ 47159941 47512465 48115825 48483589 49158903 49666736 50247136 50566625 51183076 51526166
5324E1526166K48911J36003K23382P7397q7093n3482k06129k24574O9478P7924
$$ 51526166 51775077 51911080 52134462 52211859 52124766 52071284 51865155 51640581 51710059 51787983
5314E1787983q3172j57820j9854L05307J47617R8388K13623L80301M53070L50258
$$ 51787983 51704811 51546991 51527137 51832444 51980061 52078449 52292072 52672373 53125443 53475701
5304E3475701M73099R15143O42497Q94141J033755J165052R22303R75626J072817
$$ 53475701 53948800 54863943 55506440 56400581 57434336 58599388 59521691 60497317 61570134
5295F1570134J266075P46563P84452P29677N59221N10213K19642O9207J74017
$$ 61570134 62836209 63582772 64367224 65096901 65656122 66166335 66385977 66455184 66629201
5286F6629201k44832k78064k44880m98158n39734p83717p92237r56555q92649
$$ 66629201 66384369 66106305 65861425 65363267 64823533 64039816 63247579 62291024 61398375
5277F1398375r77419q45888r88500r00340o36337m99986l36036l52906l97734
$$ 61398375 60420956 59575068 58586568 57686228 57049891 56549905 56213869 55860963 55463229
5268E5463229n0736m84113j81614l6226L2577k9469J6080J54491o9650q6286r8794
$$ 55463229 55412493 54928380 54746766 54710540 54743117 54713648 54729728 54884219 54814569 54728283 54629489
5257E4629489k80976j93054m73557l11826o54382o29274o49155q99809r09668
$$ 54629489 54348513 54155459 53681902 53370076 52715694 52086420 51437265 50537456 49627788
5248D9627788r49910j090062j197013p93816q68655j015657r92318q60564p52916
$$ 49627788 48677878 47587816 46390803 45596987 44728332 43712675 42720357 41859793 41106877
5239D1106877n23978r26184o75035p34986n03194o71601m29752n21913m02662
$$ 41106877 40582899 39656715 38981680 38246694 37743500 37071899 36642147 36120234 35717572
5230C5717572k44776m83839l02794j5515j16204J44502j49040k35779p1467j64125
$$ 35717572 35472796 34988957 34686163 34670648 34554444 34698946 34549906 34314127 34242660 34078535
5220C4078535j52281j82953k73597l50061o1718k5878n93283m00452k02894k97546
$$ 34078535 33926254 33743301 33469704 33119643 33057925 33032047 32438764 32038312 31835418 31537872
5210C1537872n54481k57198l54703l10690k86256l75061m66607l33147m07907
$$ 31537872 30983391 30726193 30371490 30060800 29774544 29399483 28932876 28599729 28191822
5201B8191822l24979l12072l21125k80126k10582o041j91073l34363l20369P0438
$$ 28191822 27866843 27554771 27233646 26953520 26742938 26736897 26545824 26211461 25891092 25961530
5191B5961530k87903l43617j47018K846n35566l50639m34476p4544k79074k57015
$$ 25961530 25673627 25330010 25182992 25185838 24650272 24299633 23865157 23790613 23511539 23254524
5181B3254524L475m05785l64324k85354L6180j49564l32728j67579j80032J12025
$$ 23254524 23257999 22852214 22487890 22202536 22238716 22089152 21756424 21588845 21408813 21520838
5171B1520838j39186J32716J38960J29529N7994j923L8364P2814J36430k424q3388
$$ 21520838 21381652 21514368 21653328 21782857 21840851 21838928 21877292 21950106 22086536 22084112 22000724
5160B2000724J1192J18296k01072L4843J73603l09399r4909j93480n665k15085
$$ 22000724 22011916 22130212 21929140 21963983 22137586 21828187 21733278 21539798 21534133 21319048
5150B1319048M0446q4244k83181j02290K90126k03688m8535j15908j58671Q4046
$$ 21319048 21359494 21275250 20992069 20889779 21179905 20976217 20927682 20811774 20653103 20737149
5140B0737149M5807j98663k80862j07752k18055j54464k07769q1183l24979j84721
$$ 20737149 20782956 20584293 20303431 20195679 19977624 19823160 19615391 19534208 19209229 19024508
5130A9024508j41018K2720j37984J09999R1691J67735O2400r6333m8977J66092
$$ 19024508 18883490 18906210 18768226 18878225 18969916 19137651 19200051 19103718 19054741 19220833
5120A9220833N0715K81553M22796J74022R011K19695M40876O89157L25208K74716
$$ 19220833 19271548 19553101 19975897 20149919 20158930 20378625 20819501 21508658 21833866 22108582
5110B2108582K45805M66191N80104M05378L61136Q17329R23881P17666Q71421
$$ 22108582 22354387 22820578 23400682 23806060 24167196 24984525 25908406 26626072 27497493
5101B7497493Q80413N88648O65592J008921Q81314Q98410J222781J052435J033181
$$ 27497493 28377906 28966554 29632146 30641067 31522381 32420791 33643572 34696007 35729188
5092C5729188J215643J335316J773632J920173J959046K816538K846724L079390
$$ 35729188 36944831 38280147 40053779 41973952 43932998 46749536 49596260 52675650
5084E2675650L323890M009421M365155M221610M616015M679928M089677L622467
$$ 52675650 55999540 60008961 64374116 68595726 73211741 77891669 81981346 85603813
5076H5603813L424785K506500J356124J65472j033905k038736l164971m219743
$$ 85603813 89028598 91535098 92891222 93056694 92022789 89984053 86819082 82599339
5068H2599339m898178n338146n176238n263111m549478m450786l848720l062336
$$ 82599339 77701161 72363015 67186777 61923666 57374188 52923402 49074682 46012346
5060D6012346k885181k509282j877299k103104j745830j301560j438621j123296
$$ 46012346 43127165 40617883 38740584 36637480 34891650 33590090 32151469 31028173
5052C1028173q60192r81136j121385p53311n91356p51380q21453r63271n33511
$$ 31028173 30167981 29186845 28065460 27312149 26720793 25969413 25147960 24184689 23651178
5043B3651178m56984n20828l77642l13939l04982n02052l78908m22974k04577
$$ 23651178 23194194 22673366 22295724 21981785 21676803 21174751 20795843 20372869 20168292
5034B0168292m00919k15787j83926m25909r5249M597m7915j51554k36120k00551
$$ 20168292 19767373 19551586 19367660 18941751 18846502 18851099 18803184 18651630 18415510 18214959
5024A8214959o4805j93355o659k07707l27243N3157j06773k4034k43011j10040
$$ 18214959 18150154 17956799 17950140 17742433 17415190 17468347 17361574 17337540 17094529 16984489
5014A6984489k8400K8275K6876r2851J18472l7333n8271K78456K53804j4668Q8904
$$ 16984489 16956089 16984364 17011240 16918389 17036861 16999528 16941257 17219713 17473517 17458849 17547753
5003A7547753J04221n9130M7854K36158K34169L95191N1862J33257J82939L96144
$$ 17547753 17651974 17592844 17640698 17876856 18111025 18506216 18558078 18691335 18874274 19270418
4993A9270418K26938K09864L27135L64454L82885J64009L62428L46530M78200
$$ 19270418 19497356 19707220 20034355 20398809 20781694 20945703 21308131 21654661 22132861
4984B2132861J17550J09620N87739L78910L55201M28340L72253M94357O07854
$$ 22132861 22250411 22360031 22947770 23326680 23681881 24110221 24482474 24976831 25584685
4975B5584685N61620L84158N95701P96904P83986Q52284R07982R94399J114064
$$ 25584685 26146305 26530463 27126164 27923068 28707054 29559338 30467320 31461719 32575783
4966C2575783J175934J007806J131083J284972J356297J193883J072593P04190
$$ 32575783 33751717 34759523 35890606 37175578 38531875 39725758 40798351 41502541
4958D1502541P66172Q74099O80031M74641L51934L26427L08459J52320K20912
$$ 41502541 42268713 43142812 43822843 44297484 44649418 44975845 45284304 45436624 45657536
4949D5657536M61430L69322N24910M56388O36301O12855L96808L79685M18190
$$ 45657536 46118966 46488288 47013198 47469586 48105887 48718742 49115550 49495235 49913425
4940D9913425P8338J0007R2906j66551l86215l62155o47398m09494l56667l19351
$$ 49913425 49991763 50001770 50094676 49928125 49541910 49179755 48532357 48122863 47766196 47446845
4930D7446845n14871k63366j91383m9753J46980L90739J03231L21018M75888M64032
$$ 47446845 46931974 46668608 46477225 46427472 46574452 46965191 47068422 47389440 47865328 48329360
4920D8329360N63824Q01847Q77411P68246J239970J039669J322394J274651J326961
$$ 48329360 48893184 49695031 50572442 51340688 52580658 53620327 54942721 56217372 57544333
4911E7544333J905554J871043K389886K485936K426071K785958L005498K995300
$$ 57544333 59449887 61320930 63710816 66196752 68622823 71408781 74414279 77409579
4903G7409579K945844L052425K865813K675863K404719K106162J516600J008009
$$ 77409579 80355423 83407848 86273661 88949524 91354243 93460405 94977005 95985014
4895I5985014O81730M75298j12968j18664j36123k95025q08139j033580j470002
$$ 95985014 96666744 97142042 97029074 96910410 96774287 96479262 95671123 94637543 93167541
4886I3167541k079025k466265k912328l160223l408488l443139l561922l719585
$$ 93167541 91088516 88622251 85709923 82549700 79141212 75698073 72136151 68416566
4878F8416566l467820l321217l021520k843608k464455k072275j610364j716579
$$ 68416566 64948746 61627529 58606009 55762401 53297946 51225671 49615307 47898728
4870D7898728j496507j247458j020175r73711r11424o85638o41596o43604m01530
$$ 47898728 46402221 45154763 44134588 43160877 42249453 41563815 40922219 40278615 39877085
4861C9877085l84652m73302l95764k38607j62491o1104O2756r3841L7415n9155
$$ 39877085 39492433 39019131 38623367 38384760 38222269 38161165 38223921 38130080 38167495 38108340
4851C8108340J54312K97033j24509j102K15540J36057J03449j46148P6155K24295
$$ 38108340 38262652 38559685 38435176 38434074 38649614 38785671 38889120 38742972 38819127 39043422
4841C9043422K7015J72449J93270K17004M63233K38211K16526L49831K05878L20555
$$ 39043422 39070437 39242886 39436156 39653160 40116393 40354604 40571130 40920961 41126839 41447394
4831D1447394M84801M76821Q30244P10684P25147O65286J014605J260618J253466
$$ 41447394 41932195 42409016 43239260 43949944 44675091 45340377 46354982 47615600 48869066
4822D8869066J287359J569542J616753J763698K121550K499599K575786K713885
$$ 48869066 50156425 51725967 53342720 55106418 57227968 59727567 62303353 65017238
4814F5017238K890382L076068L221941L219261L343704L350207K963412K440268
$$ 65017238 67907620 70983688 74205629 77424890 80768594 84118801 87082213 89522481
4806H9522481K064338J254058R06459N70699K64661L265L00442J004010K051477
$$ 89522481 91586819 92840877 93747336 94318035 94582696 94585961 94886403 95890413 97941890
4797I7941890L502511M437119N690737O678692P764477R174964J0209153J0352700
$$ 97941890 101444401 105881520 111572257 118250949 126015426 135190390 145399543 155752243
4789A55752243R914919R010978Q403524P082563M749484N94165m592644p256011
$$ 155752243 165667162 174678140 183081664 190164227 194913711 195507876 190915232 183659221
4781A83659221r269062j2719499j5599925j5978766j4267257j1803569r778507
$$ 183659221 174390159 161670660 146070735 130091969 115824712 104021143 94242636
4774I4242636p868454o245388n438940m772823m018362l621150l183081k777591
$$ 94242636 86374182 80128794 74689854 69917031 65898669 62277519 59094438 56316847
4766E6316847k633807k201880j943477k187926j569355j219788j448273j563600
$$ 56316847 53683040 51481160 49537683 47349757 45780402 44560614 43112341 41548741
4758D1548741j187805j250564q10346o75995q04525p35493o32875o97984o53018
$$ 41548741 40360936 39110372 38300026 37624031 36819506 36084013 35451138 34753154 34100136
4749C4100136n06590o44272n34440q12187n76893m95096l21845m29858o81265
$$ 34100136 33593546 32949274 32414834 31602647 31025754 30530658 30208813 29778955 29097690
4740B9097690l87942l47074j12012j97378m37254m83049k28708k34476k65791
$$ 29097690 28709748 28362674 28250662 28053284 27616030 27132981 26904273 26669797 26404006
4731B6404006j19186j39135k46198k61043l01293j42499k71966l72383j28724
$$ 26404006 26284820 26145685 25899487 25638444 25337151 25194652 24922686 24550303 24421579
4722B4421579k57190n04220k33964m4078l35050k22029k25600j67878j27076p0818
$$ 24421579 24164389 23660169 23426205 23382127 23047077 22825048 22599448 22431570 22304494 22233676
4712B2233676j93344k14588r9346j4270j46294j97960J0641k12793k74845j33981
$$ 22233676 22040332 21825744 21726398 21712128 21565834 21367874 21378515 21165722 20890877 20756896
4702B0756896R2870j09443j83261l9793j30327j78307J75815q6661r8454r7544
$$ 20756896 20849766 20740323 20557062 20517269 20386942 20208635 20384450 20297789 20199335 20101791
4692B0101791q939K6136p5252J26819K7423k14290j76201j0123j57759j25171
$$ 20101791 20092852 20118988 20043736 20170555 20197978 19983688 19807487 19797364 19639605 19514434
4682A9514434N5069P1868j17117Q3437k63457j69837P3607r856j48265J56991
$$ 19514434 19569503 19641371 19524254 19607691 19344234 19174397 19248004 19238148 19089883 19246874
4672A9246874q9721J78435m4985P5417j4140j30348J87935k38692j36987M20051
$$ 19246874 19157153 19335588 19290603 19366020 19351880 19221532 19409467 19170775 19033788 19453839
4662A9453839J59152j29475J02667K9781J32090J30984N9257K5981J26648K33375
$$ 19453839 19612991 19483516 19586183 19615964 19748054 19879038 19938295 19964276 20090924 20324299
4652B0324299J75688K47331K06027K00590J94111K20713K72918K32299J70301
$$ 20324299 20499987 20747318 20953345 21153935 21348046 21568759 21841677 22073976 22244277
4643B2244277N07155L7836L20422O36523K75369L03836L97917M08340L77944M04235
$$ 22244277 22751432 22789268 23109690 23746213 24021582 24325418 24723335 25131675 25509619 25913854
4633B5913854L49508N14419M84868N70651O07287N56800M44618M46306L40108
$$ 25913854 26263362 26777781 27262649 27833300 28440587 28997387 29442005 29888311 30228419
4624C0228419L32298O9950M32719N44623L13105L91534N41213L38390M77420M13275
$$ 30228419 30560717 30630667 31063386 31608009 31921114 32312648 32853861 33192251 33669671 34082946
4614C4082946L82385L32491K76739M30176M79788K26506M07502O50670L26460
$$ 34082946 34465331 34797822 35074561 35504737 35984525 36211031 36618533 37269203 37595663
4605C7595663J0235L28736L81464N76731N43866Q32457N35062N16750O82239Q09255
$$ 37595663 37605898 37934634 38316098 38892829 39436695 40269152 40804214 41320964 42003203 42812458
4595D2812458J090642P70085R35440J109136R47189R84343J278364J132193J232265
$$ 42812458 43903100 44673185 45608625 46717761 47664950 48649293 49927657 51059850 52292115
4586E2292115J320338J385295J652188J929899J658368J908121J990857K112912
$$ 52292115 53612453 54997748 56649936 58579835 60238203 62146324 64137181 66250093
4578F6250093K001507K104093K355201K323514K481666K926870L255802L185188
$$ 66250093 68251600 70355693 72710894 75034408 77516074 80442944 83698746 86883934
4570H6883934L290854L524354L635803L844214M199061M046304M240450M637646
$$ 86883934 90174788 93699142 97334945 101179159 105378220 109424524 113664974 118302620
4562A18302620M803780M970297N354219N679206O451130P175614P732034R264340
$$ 118302620 123106400 128076697 133430916 139110122 145561252 152736866 160468900 169733240
4554A69733240J0929958J2514960J4202911J5584077J7432418J9577877K1537110
$$ 169733240 180663198 193178158 207381069 222965146 240397564 259975441 281512551
4547B81512551K2453443K2755966K3157354K2703051K1787708J9453976J6008902
$$ 281512551 303965994 326721960 349879314 372582365 394370073 413824049 429832951
4540D29832951J1116978N138056n04830o213011j1747001j7091433k2416385k7507954
$$ 429832951 440949929 446087985 445583155 439370144 427623143 410531710 388115325 360607371
4532C60607371l1044420l1240618k9553911k6971858k3577526j9910801j6936742
$$ 360607371 329562951 298322333 268768422 241796564 218219038 198308237 181371495
4525A81371495j5001448j3326213j1702770j0424230r143723p935805p438876
$$ 181371495 166370047 153043834 141341064 130916834 121773111 113837306 106398430
4518A06398430o590152n749535n166313m938787m370866m115391l454094l060316
$$ 106398430 99808278 94058743 88892430 83953643 79582777 75467386 72013292 68952976
4510F8952976l132723k545538k209243k142685k204143j998531j615954j736495
$$ 68952976 65820253 63274715 61065472 58922787 56718644 54720113 53104159 51367664
4502E1367664j747207j633379j576408j514569j318673j196174j393809j257669
$$ 51367664 49620457 47987078 46410670 44896101 43577428 42381254 40987445 39729776
4494C9729776j088909j065071q78386r76376j084659p32505q17319q82881o66253
$$ 39729776 38640867 37575796 36697410 35721034 34636375 33903870 33086551 32203670 31537417
4485C1537417o07777o38060q08823p20720n40804o81019l64961l95076m96774
$$ 31537417 30929640 30291580 29482757 28762037 28221233 27540214 27175253 26780177 26283403
4476B6283403m11314n81918o92072k59361m13679l68202k44701n79059l58148
$$ 26283403 25872089 25290171 24598099 24338738 23925059 23556857 23312156 22733097 22374949
4467B2374949l54887n79722k70000o55857l43627j96261l51304m23059k82286
$$ 22374949 22020062 21440340 21170340 20514483 20170856 19974595 19623291 19200232 18917946
4458A8917946m96549l96451k7612k09138m01509m04849l13680j02427J7275j93737
$$ 18917946 18421397 18024946 17997334 17788196 17386687 16981838 16668158 16565731 16583006 16389269
4448A6389269l00198l08419j9119K6455l38325k70393j24454q5060k8992k04740
$$ 16389269 16089071 15780652 15761533 15787988 15449663 15179270 15054816 14969756 14940764 14736024
4438A4736024j66117j56058j36404M9975j76947l679j33969q2466k81192j76608
$$ 14736024 14569907 14413849 14277445 14327420 14150473 14146794 14012825 13930359 13649167 13472559
4428A3472559j8603n0058Q7418k03849n3892r7321j21572j84765k3928j41981
$$ 13472559 13453956 13403898 13491316 13287467 13233575 13136254 13014682 12829917 12805989 12664008
4418A2664008j95147k68155K85062N9287k50459j89490q4523k77311N7839j44626
$$ 12664008 12468861 12200706 12485768 12545055 12294596 12105106 12020583 11743272 11801111 11656485
4408A1656485J00312k83854j66498J15095j14228N1630j38978k46962j57173J35935
$$ 11656485 11756797 11472943 11306445 11421540 11307312 11358942 11219964 10973002 10815829 10951764
4398A0951764j29281k72040j8436o7836j22856l9777M3428n5361o0816j12859
$$ 10951764 10822483 10550443 10532007 10464171 10341315 10301538 10344966 10289605 10228789 10115930
4388A0115930j13301N8170r188J05672J02695q0110k04169k39164p1017K24651
$$ 10115930 10002629 10060799 10051611 10157283 10259978 10179868 9975699 9736535 9665518 9890169
4378I890169J31487l17480R4527L12432j17592P3779J56613m6087l02146N9363
$$ 9890169 10021656 9704176 9798703 10111135 9993543 10067322 10223935 10177848 9875702 9935065
4368I935065J79651j85020m9778m1334l14515k3919k2730O2429K348Q4393M7487
$$ 9935065 10114716 9929696 9879918 9838584 9524069 9500150 9477420 9539849 9542197 9626590 9674077
4357I674077j25714R0250M8046J01203k15026J5412j41650m4447M6448m995M6953
$$ 9674077 9548363 9638613 9686659 9787862 9572836 9588248 9446598 9402151 9448599 9443604 9490557
4346I490557J35502K39657J1086J18559p0220l12969j16016K10533l5115k6894
$$ 9490557 9626059 9865716 9876802 9995361 9925141 9612172 9496156 9706689 9671574 9644680
4336I644680J12198J60186j59203J67361P2228J6824J3283r8848q2406J66754
$$ 9644680 9756878 9917064 9757861 9925222 9997450 10014274 10027557 9928709 9846303 10013057
4326A0013057J11879n5644K08600J63943k7711r6006J07470J69318K78232P1431
$$ 10013057 10124936 10069292 10277892 10441835 10414124 10318118 10425588 10594906 10873138 10944569
4316A0944569p5326j02010L4543P9182K71145J54084K59169k251J30778L08601
$$ 10944569 10869243 10767233 10801776 10880958 11152103 11306187 11565356 11563105 11693883 12002484
4306A2002484K04904k8882Q492J96788p1412K9484K94424J4788K11117J56421
$$ 12002484 12207388 12178506 12186998 12383786 12312374 12341858 12636282 12651070 12862187 13018608
4296A3018608J75508K15480j75642L80627L5617K03984L96780K88032j36783L04338
$$ 13018608 13194116 13409596 13233954 13614581 13650198 13854182 14250962 14538994 14402211 14706549
4286A4706549K29997L37347K34645K53509L10144L69007J85980J85121L50367
$$ 14706549 14936546 15273893 15508538 15762047 16072191 16441198 16627178 16812299 17162666
4277A7162666N1340J52941M10637O04191K37290K63437K34500J26774M20816M87169
$$ 17162666 17214006 17366947 17777584 18381775 18619065 18882502 19117002 19243776 19664592 20151761
4267B0151761K88362J96754N78800N82362L89000L59903L48926K83875O04192
$$ 20151761 20440123 20636877 21215677 21798039 22187039 22546942 22895868 23179743 23783935
4258B3783935O51805L19747L47165K96696N64948P82144O17105N87202N96248
$$ 23783935 24435740 24755487 25102652 25399348 25964296 26746440 27363545 27950747 28546995
4249B8546995O51858O41250N82103R21546O06467N91247O98914Q02630Q74795
$$ 28546995 29198853 29840103 30422206 31343752 31950219 32541466 33240380 34043010 34917805
4240C4917805P07649J067655R15407N88589Q15798J002226Q84864J175012Q32399
$$ 34917805 35625454 36693109 37608516 38197105 39012903 40015129 40899993 42075005 42907404
4231D2907404P43075R96649Q64064J237155J112196J211649Q27498J037618J139238
$$ 42907404 43650479 44647128 45511192 46748347 47860543 49072192 49899690 50937308 52076546
4222E2076546J353540J278158J382127J484905J403766J495108J668516J606999
$$ 52076546 53430086 54708244 56090371 57575276 58979042 60474150 62142666 63749665
4214F3749665J627838J772837J704367J521704J877315J808918J798370J578532
$$ 63749665 65377503 67150340 68854707 70376411 72253726 74062644 75861014 77439546
4206G7439546J747741J818678J794371J686898J691408J832408J795024J957244
$$ 77439546 79187287 81005965 82800336 84487234 86178642 88011050 89806074 91763318
4198I1763318J614949J764190J402768J138431J220818J596566J224963J024463
$$ 91763318 93378267 95142457 96545225 97683656 98904474 100501040 101726003 102750466
4190A02750466R76155R84523Q14052O54021P66779O99403N84450K45478L83709
$$ 102750466 103726621 104711144 105525196 106179217 106945996 107645399 108229849 108475327 108859036
4181A08859036J00830k40290k00275l00224k49043n14086n13808n15228q92811
$$ 108859036 108959866 108719576 108519301 108219077 107970034 107455948 106942140 106426912 105534101
4172A05534101p45159r71811r60580j035853j210256r42035j297706j431276j575681
$$ 105534101 104788942 103817131 102856551 101820698 100610442 99668407 98370701 96939425 95363744
4163I5363744j339222j528508j449519j465163j679001j424665j592743j684350
$$ 95363744 94024522 92496014 91046495 89581332 87902331 86477666 84884923 83200573
4155H3200573j698817j580554j503904j563134j692758j549404j335138j464542
$$ 83200573 81501756 79921202 78417298 76854164 75161406 73612002 72276864 70812322
4147G0812322j311262j383254j396405j458389j276577j170067j136139j034342
$$ 70812322 69501060 68117806 66721401 65263012 63986435 62816368 61680229 60645887
4139F0645887j154094r82010r84579r38112o84195r53943p60642o72539o76985
$$ 60645887 59491793 58509783 57525204 56587092 55902897 54948954 54188312 53515773 52838788
4130E2838788m74807n85491k71834l74269l86363n18533l88385k97325l00691
$$ 52838788 52363981 51778490 51506656 51132387 50746024 50227491 49839106 49541781 49241090
4121D9241090J9782j05137k55867J47248J20040j2081J99496N15569J72872K12005
$$ 49241090 49260872 49155735 48899868 49047116 49167156 49155075 49354571 49870140 50043012 50255017
4111E0255017M14706M56256O27001M33706N70386Q89911P55997O23241P58765
$$ 50255017 50669723 51125979 51752980 52186686 52757072 53646983 54402980 55026221 55784986
4102E5784986R51428J202977J154409J068307J284864J020832J174125J329078
$$ 55784986 56736414 57939391 59093800 60162107 61446971 62467803 63641928 64971006
4094F4971006J116247J437278J577782J341552J467825J729846J497492J711997
$$ 64971006 66087253 67524531 69102313 70443865 71911690 73641536 75139028 76851025
4086G6851025J825845J670736J739390J335776J494863J611087J700682J709076
$$ 76851025 78676870 80347606 82086996 83422772 84917635 86528722 88229404 89938480
4078H9938480J401620J525123J553430J605108J394318J357006J122866J419688
$$ 89938480 91340100 92865223 94418653 96023761 97418079 98775085 99897951 101317639
4070A01317639J181208J207821J136210P99333J176598Q91045K93922O20598L84814
$$ 101317639 102498847 103706668 104842878 105642211 106818809 107709854 108003776 108624374 109009188
4061A09009188L43429J25277Q0949K63669k6672l11552m04823m29652o03603q03835
$$ 109009188 109352617 109477894 109558843 109822512 109795840 109484288 109079465 108649813 108046210 107242375
4051A07242375q46615n03373q42111j053787q16490r26026q88855r48453j050318
$$ 107242375 106395760 105892387 105050276 103996489 103179999 102253973 101365118 100416665 99366347
4042I9366347j035800j099214j152895q82971j021227j118671j248170q21858
$$ 99366347 98330547 97231333 96078438 95195467 94174240 93055569 91807399 90985541
4034I0985541p42255r21094r53327o57130p83629o55725m06398n87188m29949
$$ 90985541 90243286 89322192 88368865 87711735 86928106 86272381 85865983 85278795 84848846
4025H4848846l07977k70831m21964J3545k9552J19399K15498K52630J83301L72368
$$ 84848846 84540869 84270038 83848074 83861619 83832067 83951466 84166964 84419594 84602895 84975263
4015H4975263M65312P64461P54753Q38567R80786J057102J244055J160558R47893
$$ 84975263 85440575 86205036 86959789 87798356 88779142 89836244 91080299 92240857 93188750
4006I3188750J364407J561426J608706J563434J769970J835065J740708K130308
$$ 93188750 94553157 96114583 97723289 99286723 101056693 102891758 104632466 106762774
3998A06762774K219264K322617K459168K365264K556931K470724K587905K821275
$$ 106762774 108982038 111304655 113763823 116129087 118686018 121156742 123744647 126565922
3990A26565922K919041K881198L161628K830691K763669L282953L201453L178507
$$ 126565922 129484963 132366161 135527789 138358480 141122149 144405102 147606555 150785062
3982A50785062L544364L492018L282389L488451L269955L101127L510736L471063
$$ 150785062 154329426 157821444 161103833 164592284 167862239 170963366 174474102 177945165
3974A77945165L540846L388688L226224L366723L370500L049489K924351K981929
$$ 177945165 181486011 184874699 188100923 191467646 194838146 197887635 200811986 203793915
3966B03793915L335137K976681K798405K899740K524951K724070K717568K248589
$$ 203793915 207129052 210105733 212904138 215803878 218328829 221052899 223770467 226019056
3958B26019056J842298K057168J996230J565957J452307J413850J328042J175598
$$ 226019056 227861354 229918522 231914752 233480709 234933016 236346866 237674908 238850506
3950B38850506N83642O84653L70458L96359L75046l8007m49311n12641r60434
$$ 238850506 239434148 240118801 240489259 240885618 241260664 241222657 240773346 240260705 239300271
3941B39300271q11247r80782j477185j684558j648973j906300k006163k068690
$$ 239300271 238489024 237508242 236031057 234346499 232697526 230791226 228785063 226716373
3933B26716373k643146k449100k670471k502749k720322l075489l053288l324121
$$ 226716373 224073227 221624127 218953656 216450907 213730585 210655096 207601808 204277687
3925B04277687l192579l085961l249287l424641l343294l359697l240929l333099
$$ 204277687 201085108 197999147 194749860 191325219 187981925 184622228 181381299 178048200
3917A78048200l250909l130125l194179k853959k872783k843736k601879k339925
$$ 178048200 174797291 171667166 168472987 165619028 162746245 159902509 157300630 154960705
3909A54960705k201557k250385k133525j778844j953424j773743j198083j208856
$$ 154960705 152759148 150508763 148375238 146596394 144642970 142869227 141671144 140462288
3901A40462288p98891o76890o05076o29322l18579J84578R6985L63601O75856
$$ 140462288 139663397 138986507 138381431 137752109 137433530 137618108 137715093 138078694 138754550
3892A38754550O83425Q48713R36970J024317J381957J401907J395559J477214
$$ 138754550 139437975 140286688 141223658 142247975 143629932 145031839 146427398 147904612
3884A47904612J492966J665303J248788J455712J416123J305387J174289J060789
$$ 147904612 149397578 151062881 152311669 153767381 155183504 156488891 157663180 158723969
3876A58723969R49784Q34282R12419Q08881J053417P58005P79133O74466N46011
$$ 158723969 159673753 160508035 161420454 162229335 163282752 164040757 164819890 165494356 166040367
3867A66040367N83328P29740R87175O14834M81541R39015Q07581R42313R65397
$$ 166040367 166623695 167353435 168340610 168955444 169436985 170376000 171183581 172125894 173091291
3858A73091291J205253J053791J217467J220328J318883J440126J152660J252063
$$ 173091291 174296544 175350335 176567802 177788130 179107013 180547139 181699799 182951862
3850A82951862J275450J057071J190565J287739J025695J078920Q91932J046431
$$ 182951862 184227312 185284383 186474948 187762687 188788382 189867302 190759234 191805665
3842A91805665O46512M84721O36025K94566r0470k60350o44889r27275r97134
$$ 191805665 192452177 192936898 193572923 193867489 193777019 193516669 192871780 191944505 190947371
3833A90947371j306520j820148j969732k086188k194582k545550k749609k649716
$$ 190947371 189640851 187820703 185850971 183764783 181570201 179024651 176275042 173625326
3825A73625326l034172l037073l031044l306498l633970l219928l388289l806184
$$ 173625326 170591154 167554081 164523037 161216539 157582569 154362641 150974352 147168168
3817A47168168l476271l427367l240858l591064l546209l398930l364862k959359
$$ 147168168 143691897 140264530 137023672 133432608 129886399 126487469 123122607 120163248
3809A20163248k981293k849649k727731k409106k516194k356847k380606j869344
$$ 120163248 117181955 114332306 111604575 109195469 106679275 104322428 101941822 100072478
3801A00072478j727395j865543j827885j419697j149842j268525j144270r89276
$$ 100072478 98345083 96479540 94651655 93231958 92082116 90813591 89669321 88680045
3793H8680045q47450r58182r71322o87958l20202m58833n00586n19991k70717
$$ 88680045 87832595 86874413 85903091 85215133 84894931 84436098 83935512 83415521 83144804
3784H3144804k95070l68719k19637j77800k90961k69980j65252J5498j81269o7043
$$ 83144804 82849734 82481015 82261378 82083578 81792617 81522637 81357385 81372883 81191614 81124571
3774H1124571k37991j22482L3599p8567K4725M4439j30263o0966p9085J47760
$$ 81124571 80886580 80764098 80797697 80719130 80743855 80788294 80658031 80597065 80517980 80665740
3764H0665740Q0113n6080M4739j10709Q2153J18068Q2083L32762L44289K20916
$$ 80665740 80745853 80689773 80734512 80623803 80705956 80824024 80906107 81238869 81583158 81804074
3754H1804074L10012K93285M16548K93042N57676N32933N32765Q25244N79921
$$ 81804074 82114086 82407371 82823919 83116961 83674637 84207570 84740335 85565579 86145500
3745H6145500P23174Q41648Q48451R06368J060563J115678J176790J010024Q92259
$$ 86145500 86868674 87710322 88558773 89465141 90525704 91641382 92818172 93828196 94720455
3736I4720455J200402J493423J455685J468970J386128J583622J567657J547742
$$ 94720455 95920857 97414280 98869965 100338935 101725063 103308685 104876342 106424084
3728A06424084J560431J660191J884595J850643J928623K052283K302608K305780
$$ 106424084 107984515 109644706 111529301 113379944 115308567 117360850 119663458 121969238
3720A21969238K035594K471876K811196K793275L257499L072087L042701L242306
$$ 121969238 124004832 126476708 129287904 132081179 135338678 138410765 141453466 144695772
3712A44695772L816974L801951L826921M451791M454600M216756M905038N203318
$$ 144695772 148512746 152314697 156141618 160593409 165048009 169264765 174169803 179373121
3704A79373121M946811M727422M964569M922044M947842M997964M459734M310763
$$ 179373121 184319932 189047354 194011923 198933967 203881809 208879773 213339507 217650270
3696B17650270M062823L621262L172911K929621K350859J698402J292301R73390
$$ 217650270 221713093 225334355 228507266 231436887 233787746 235486148 236778449 237751839
3688B37751839N29032j38040p76557q22992j438589k007045k147508k621415k853628
$$ 237751839 238280871 238142831 237366274 236543282 235104693 233097648 230950140 228328725 225475097
3679B25475097l217588l376420l600256l558723l845140m085536m032609l847208
$$ 225475097 222257509 218881089 215280833 211722110 207876970 203791434 199758825 195911617
3671A95911617l774965l542348l298624l234157k954889k497565k180736j858685
$$ 195911617 192136652 188594304 185295680 182061523 179106634 176609069 174428333 172569648
3663A72569648j562378j302942j120771r71501p18099m33118j71158o919J99229
$$ 172569648 171007270 169704328 168583557 167612056 166893957 166460839 166289681 166282762 166481991
3654A66481991N42371O12244N33063N17209R87851J175200J205937J241391J417619
$$ 166481991 167024362 167636606 168169669 168686878 169674729 170849929 172055866 173297257 174714876
3645A74714876J476049J411528J810755J742910J600639J928992K193805K365925
$$ 174714876 176190925 177602453 179413208 181156118 182756757 184685749 186879554 189245479
3637A89245479K251504K302272K713447K807566K781965L072726L183580L222325
$$ 189245479 191496983 193799255 196512702 199320268 202102233 205174959 208358539 211580864
3629B11580864L607877L660876M075365M115212M477811M624643M974218N044507
$$ 211580864 215188741 218849617 222924982 227040194 231518005 236142648 241116866 246161373
3621B46161373N406158N846796O088817O191733O581175O915834P159088P260757
$$ 246161373 251567531 257414327 263503144 269694877 276276052 283191886 290350974 297611731
3613B97611731P607953P752365Q111513Q313111Q473835Q774134Q676511Q761623
$$ 297611731 305219684 312972049 321083562 329396673 337870508 346644642 355321153 364082776
3605C64082776Q762434Q921398R081129Q924679Q714967Q243306Q090491Q308662
$$ 364082776 372845210 381766608 390847737 399772416 408487383 416730689 424821180 433129842
3597D33129842Q231574P790617P038753P005735O525737O077540N569339N189344
$$ 433129842 441361416 449152033 456190786 463196521 469722258 475799798 481369137 486558481
3589D86558481M681984M113400L933401L206358K449117K221112J888154J303693
$$ 486558481 491240465 495353865 499287266 502493624 504942741 507163853 509052007 510355700
3581E10355700P88089K78907m31262m59924o86463j214495j407465j577959j927687
$$ 510355700 511143789 511422696 510991434 510531510 509845047 508630552 507223087 505645128 503717441
3572E03717441k089195k122092k220638k353744k317510k052425k477341k461274
$$ 503717441 501628246 499506154 497285516 494931772 492614262 490561837 488084496 485623222
3564D85623222j999516k185126j995876j693241j866619j669409j402448j330229
$$ 485623222 483623706 481438580 479442704 477749463 475882844 474213435 472810987 471480758
3556D71480758j087754r84607p19421m84492l64506p9636j4356J41187L6926K44501
$$ 471480758 470393004 469408397 468688976 468204484 467839978 467760342 467745986 467887173 467924099 468168600
3546D68168600N50198M41641M68299P89155Q36723P55626R90040J066641J056250
$$ 468168600 468718798 469160439 469628738 470417893 471254616 472010242 473000282 474066923 475123173
3537D75123173J290354J283000J161556J359905J787055J931525J847751J924415
$$ 475123173 476413527 477696527 478858083 480217988 482005043 483936568 485784319 487708734
3529D87708734J887589K093973K033854J936847K147489K185381K123127K029445
$$ 487708734 489596323 491690296 493724150 495660997 497808486 499993867 502116994 504146439
3521E04146439K141092K130183J931428J878139J784983K002716J674397J769587
$$ 504146439 506287531 508417714 510349142 512227281 514012264 516014980 517689377 519458964
3513E19458964J774492J282154J310243J503153J322921R71740Q28990N78147
$$ 519458964 521233456 522515610 523825853 525329006 526651927 527623667 528452657 529030804
3505E29030804O67076O60609O05661L99228K04673M3263j9828j29620l75953p63589
$$ 529030804 529697880 530358489 530964150 531363378 531568051 531611314 531591486 531461866 531085913 530322324
3495E30322324j290726j540481k054572k563641l097607l698615m331053m561311
$$ 530322324 529031598 527491117 525436545 522872904 519775297 516076682 511745629 507184318
3487E07184318m946352n289009n471689n669409n715974n820711n992066n915841
$$ 507184318 502237966 496948957 491477268 485807859 480091885 474271174 468279108 462363267
3479D62363267n934118o092950o453255o490966o346421o127549n893863o110396
$$ 462363267 456429149 450336199 443882944 437391978 431045557 424918008 419024145 412913749
3471D12913749n643102m942126m258317m032409l420421k525176j965175j651493
$$ 412913749 407270647 402328521 398070204 394037795 390617374 388092198 386127023 384475530
3463C84475530j200982o22980o66992j96513l68836k87308l2111j88178j70293
$$ 384475530 383274548 382651568 381984576 381788063 381419227 381131919 381099808 380911630 380741337
3454C80741337j05225k28963o42870n55388p65200r31819r12972j046572j064920
$$ 380741337 380636112 380407149 379764279 379208891 378443691 377511872 376598900 375552328 374487408
3445C74487408j458456j874134k082149k240689k683677l265463l873897l816377
$$ 374487408 373028952 371154818 369072669 366831980 364148303 360882840 357008943 353192566
3437C53192566m196094m858229m792012m920188n177755n314258n568224n878353
$$ 353192566 348996472 344138243 339346231 334426043 329248288 323934030 318365806 312487453
3429C12487453n769620n952404o264186o384984o397129o674280o898506p131528
$$ 312487453 306717833 300765429 294501243 288116259 281719130 275044850 268146344 261014816
3421B61014816p243507p369376p549901p339759p220095p286124p179867p431980
$$ 261014816 253771309 246401933 238852032 231512273 224292178 217006054 209826187 202394207
3413B02394207o984533o629636o864310o328693o077323o310471n585008n202680
$$ 202394207 195409674 188780038 181915728 175587035 169509712 163199241 157614233 152411553
3405A52411553m867789m875423m906258m193670m020157l852021l471754l485061
$$ 152411553 147543764 142668341 137762083 133568413 129548256 125696235 122224481 118739420
3397A18739420l108272k656430k487056k728032k422475k025794j892814j960458
$$ 118739420 115631148 112974718 110487662 107759630 105337155 103311361 101418547 99458089
3389I9458089j844360j567457j412521j532072j396554j190917j106095p95994
$$ 99458089 97613729 96046272 94633751 93101679 91705125 90514208 89408113 88612119
3381H8612119q80079q71356m73105m80575k91844o1597j91395L28540O06755P06757
$$ 88612119 87732040 86860684 86387579 85907004 85615160 85553563 85362168 85690708 86297463 87004220
3371H7004220J242495J517236J779630J896046J820284K179647K037598J746050
$$ 87004220 88246715 89763951 91543581 93439627 95259911 97439558 99477156 101223206
3363A01223206J654340J391768R35882J41280o61820j160946j674160k331078
$$ 101223206 102877546 104269314 105205196 105346476 104684656 103523710 101849550 99518472
3355I9518472l140059l322910k947555k485928k159395j322605j036561n23577
$$ 99518472 96378413 93055503 90107948 87622020 85462625 84140020 83103459 82579882
3347H2579882m06230o5858R0513O66132P29138J356395J953400K222118K636572
$$ 82579882 82173652 82107794 82198307 82864439 83593577 84949972 86903372 89125490 91762062
3338I1762062L336427L807404M300340M502670M494752M465958M143519M033228
$$ 91762062 95098489 98905893 103206233 107708903 112203655 116669613 120813132 124846360
3330A24846360L176289K026312Q57462r03824k566491l208505m575687o144479
$$ 124846360 128022649 130048961 130906423 130002599 127436108 124227603 119651916 113507437
3322A13507437o937835o718104o236054n264529l923851k998412k628158j787884
$$ 113507437 106569602 99851498 93615444 88350915 84427064 81428652 78800494 77012610
3314G7012610j518427j222687j177984p81157m60108k13838L3191L03195N26681
$$ 77012610 75494183 74271496 73093512 72312355 71852247 71638409 71671600 71974795 72501476
3305G2501476Q64498P14689J408010J364374J264903J091341R84655J081637N48424
$$ 72501476 73365974 74080663 75488673 76853047 78117950 79209291 80193946 81275583 81824007
3296H1824007j10507q05856j757580j944684k156327l032807l867907l737468
$$ 81824007 81713500 80907644 79150064 77205380 75049053 72016246 68148339 64410871
3288F4410871l168714k361320k300709j844877j240201j047772q99845j085920
$$ 64410871 61242157 58880837 56580128 54735251 53495050 52447278 51547433 50461513
3280E0461513m15252p17905o15983n77948l72604o04410o12739p95418n95248
$$ 50461513 50046261 49328356 48712373 48134425 47761821 47157411 46544672 45749254 45154006
3271D5154006n37599q25650n72273n43324n55148l27919m27388l48778l38092
$$ 45154006 44616407 43790757 43218484 42675160 42120012 41792093 41364705 41015927 40677835
3262D0677835j67444k12611r3332L7280o722l8997N3985j34244J507j01233J32771
$$ 40677835 40510391 40297780 40204448 40241728 40235006 40196009 40249994 40115750 40117257 40016024 40148795
3251D0148795J19299j10718J72691M29282J78441J40287L22991J31428K89702
$$ 40148795 40268094 40157376 40330067 40759349 40937790 41078077 41401068 41532496 41822198
3242D1822198K22791L32140L24129K30946M10209Q8272K80016L35740L15601P12385
$$ 41822198 42044989 42377129 42701258 42932204 43342413 43430685 43710701 44046441 44362042 45074427
3232D5074427O86462M64203M56057N40249O87100O72643O12699M85703P11631
$$ 45074427 45760889 46225092 46681149 47221398 47908498 48581141 49193840 49679543 50391174
3223E0391174O12692O39244O97028O17979P08203P94794P84481Q41692R59805
$$ 50391174 51003866 51643110 52340138 52958117 53666320 54461114 55245595 56087287 57047092
3214E7047092P68499J087412J022254J085547R99708J346514J477810J201720
$$ 57047092 57815591 58903003 59925257 61010804 62010512 63357026 64834836 66036556
3206F6036556J301897J281515J384760J591136J490029J782060J574518J674567
$$ 66036556 67338453 68619968 70004728 71595864 73085893 74867953 76442471 78117038
3198G8117038J853017K105547K387872K570354K501990K648641K946311K913896
$$ 78117038 79970055 82075602 84463474 87033828 89535818 92184459 95130770 98044666
3190I8044666K843590K450243K507269K631109K202570J935670J215968P88877
$$ 98044666 100888256 103338499 105845768 108476877 110679447 112615117 113831085 114619962
3182A14619962M16512l58458n72253j308624j624186k229320k373166k370953
$$ 114619962 115036474 114678016 114105763 112797139 111172953 108943633 106570467 104199514
3174A04199514k943697k931590k984379l043499l263760k855721l087684l195335
$$ 104199514 101255817 98324227 95339848 92296349 89032589 86176868 83089184 79893849
3166G9893849l357971l495166l364984l305305l070269k771675k763099k459711
$$ 79893849 76535878 73040712 69675728 66370423 63300154 60528479 57765380 55305669
3158E5305669k276463k551451k077476j842831j725361j709258j533859j380857
$$ 55305669 53029206 50477755 48400279 46557448 44832087 43122829 41588970 40208113
3150D0208113j367647j366465r99468j075253p82651p94169j019698q80092q88673
$$ 40208113 38840466 37474001 36474533 35399280 34616629 33822460 32802762 31922670 31033997
3141C1033997m52825r53609r16761o48211q92610r14266r00763o41272p80779
$$ 31033997 30581172 29627563 28710802 28062591 27169981 26255715 25354952 24713680 23932901
3132B3932901o24849p33731n56050l60462o91936n88291n87808l99957m54266
$$ 23932901 23308052 22574321 22018271 21657809 20965873 20377582 19789774 19389817 18935551
3123A8935551k90653l8755l19830n87625k60212m25560j12639j65896m63183l22783
$$ 18935551 18644898 18606143 18286313 17698688 17438476 17012916 16900277 16734381 16271198 15948415
3113A5948415j61653k12719l41736k95326k74539q8735l91763j40556o51864m77546
$$ 15948415 15786762 15574043 15232307 14936981 14662442 14573707 14181944 14041388 13389524 12911978
3103A2911978Q8449l21014k58901j99734l29540k40851k05272l69726R242k33420
$$ 12911978 13000427 12679413 12420512 12220778 11891238 11650387 11445115 11075389 11084631 10851211
3093A0851211m67649j18507R0820o2138m13406j57031j91099m3045J04375j65551
$$ 10851211 10383562 10265055 10355875 10293737 9880331 9723300 9532201 9489156 9593531 9427980
3083I427980p5898j09860K3499p5776o3886N0472k35697k53617j8977L8975m1819
$$ 9427980 9352082 9242222 9265721 9189945 9126059 9176531 8940834 8687217 8668240 8707215 8665396
3072H665396o950Q2731k23929r4776K2902k48794o4111j27608J273L3836j46171
$$ 8665396 8658446 8741177 8517248 8422472 8445374 8196580 8132469 8004861 8006134 8039970 7893799
3061G893799N2739N2533k46502o0059k0251j56853l5563m5194q0122q9045K17084
$$ 7893799 7946538 7999071 7752569 7692510 7672259 7515406 7479843 7434649 7354527 7265482 7482566
3050G482566p3763j30328K6505r7839m5036K4330J64973j21638j76135Q0834k6774
$$ 7482566 7408803 7278475 7304980 7207141 7162105 7186435 7351408 7229770 7053635 7134469 7107695
3039G107695k42532J2522J18507J24366j81630j78668k0005P9898j35877j9746
$$ 7107695 6865163 6877685 6996192 7120558 6938928 6760260 6740255 6820153 6684276 6664530
3029F664530k06920j80131O7000j84761o7626J84994j86619M3222n0070O77R9462
$$ 6664530 6457610 6277479 6344479 6159718 6092092 6277086 6090467 6133689 6083619 6084296 6183758
3018F183758L7717P1981j33078k12955L5277O2919J12351R546J34612j66809j89334
$$ 6183758 6221475 6293456 6160378 5947423 5982700 6045619 6157970 6167516 6302128 6135319 5945985
3007E945985L7625q5145j04772J55399R973L4712J3966j18213p6930M8813q6823
$$ 5945985 5983610 5898465 5793693 5949092 5959065 5993777 6007743 5889530 5812600 5861413 5774590
2996E774590j00032J43733o4194p9898J02862Q536k6186N6889r7158L7128j37983
$$ 5774590 5674558 5818291 5754097 5674199 5777061 5785597 5759411 5816300 5719142 5756270 5618287
2985E618287J23424j21682j0417j31479K08696r1043o3859J51851J78333j1237
$$ 5618287 5741711 5620029 5609612 5478133 5686829 5595786 5531927 5683778 5862111 5850874
2975E850874l5954j29943J77062L7879j2491j57822O794K65595J03420N9361m4454
$$ 5850874 5814920 5684977 5862039 5899918 5887427 5729605 5736399 6001994 6105414 6164775 6120321
2964F120321j13006j58130L09656J31714k7082n4685Q9871J26125M5367k14429
$$ 6120321 6007315 5849185 6158841 6290555 6263473 6208788 6298659 6424784 6470151 6255722
2954F255722K23058K23781J28918J0417j45951K46472R4481M9360J642J42884
$$ 6255722 6478780 6702561 6831479 6841896 6695945 6942417 7036898 7086258 7087900 7230784
2944G230784K3456J42170O7516O1813p2639J5703K54622J57188P9935J40034K21727
$$ 7230784 7254240 7396410 7463926 7525739 7453100 7468803 7723425 7880613 7960548 8100582 8322309
2933H322309K33543K22898j17907j1101J31229J4713M00947J43667K59741N6515
$$ 8322309 8555852 8778750 8660843 8649742 8780971 8795684 9196631 9340298 9600039 9656554
2923I656554J09865K73087j2673J09996L72890M3847J49174L95757J08398L8460
$$ 9656554 9766419 10039506 10026833 10136829 10509719 10553566 10702740 11098497 11206895 11245355
2913A1245355J56943J82699K08355L10980N6653K36348L48152K37956o4150L18589
$$ 11245355 11402298 11584997 11793352 12104332 12160985 12397333 12745485 12983441 12919291 13237880
2903A3237880K28937L45307R2351K98832K29867J85802K18249M08627M86716L92831
$$ 13237880 13466817 13812124 13904475 14203307 14433174 14618976 14837225 15245852 15732568 16125399
2893A6125399K76553K25191L86884K82204N13259M00042N54519O49681N97845
$$ 16125399 16401952 16627143 17014027 17296231 17809490 18209532 18764051 19413732 20011577
2884B0011577N30952O06253Q60942O57569R31538Q29277Q26631Q60529P97750
$$ 20011577 20542529 21148782 22009724 22667293 23598831 24428108 25254739 26115268 26913018
2875B6913018J126238J050517R03782J262722J571903J167945J118442J322689
$$ 26913018 28039256 29089773 29993555 31256277 32828180 33996125 35114567 36437256
2867C6437256J327666J488774J211580J231234J126390Q13944O80222N64774M83066
$$ 36437256 37764922 39253696 40465276 41696510 42822900 43636844 44317066 44881840 45364906
2858D5364906N95568M24454J01252M97359K17659O3930M00299M66279K98930M75246
$$ 45364906 45960474 46384928 46486180 46983539 47201198 47265128 47665427 48131706 48430636 48905882
2848D8905882P23800O24818J105956J273846J210390J561516J539302J620703
$$ 48905882 49629682 50254500 51360456 52634302 53844692 55406208 56945510 58566213
2840E8566213J586969J770454J538093J520129J017477P22530L62983j73532r52099
$$ 58566213 60153182 61923636 63461729 64981858 65999335 66721865 67084848 66911316 65959217
2831F5959217j348285j732413k546523k838607l080064k709835k517826k398462
$$ 65959217 64610932 62878519 60331996 57493389 54413325 51703490 49185664 46787202
2823D6787202k260432j780580j456255j312545j020781q12192p18220o12166m29570
$$ 46787202 44526770 42746190 41289935 39977390 38956609 38144417 37426197 36814031 36384461
2814C6384461n56181l09922j70706j55391J47907p0585p5528k65037j57409m22391
$$ 36384461 35828280 35518358 35347652 35192261 35340168 35269583 35194055 34929018 34771609 34349218
2804C4349218n78396n66772q06449r16484j067467j094294j244972j428706j420788
$$ 34349218 33770822 33204050 32397601 31481117 30413650 29319356 28074384 26645678 25224890
2795B5224890j431239j031953j231385j295363j141102q95744r49957p78753p04679
$$ 25224890 23793651 22761698 21530313 20234950 19093848 18198104 17248147 16469394 15764715
2786A5764715p27185m69543o80181r13500n82795l23187m21211m82990m89441
$$ 15764715 15037530 14567987 13887806 12974306 12391511 12068324 11647113 11164123 10674682
2777A0674682l78456m43981k80050k62162m64350k18530l57258k70182j91578
$$ 10674682 10296226 9852245 9572195 9310033 8845683 8627153 8269895 7999713 7808135
2768G808135m96619q4770L6375k03982k14471j42121k71088j53812j71001m1634
$$ 7808135 7311516 7226746 7263121 7059139 6844668 6702547 6431459 6277647 6106646 6065012
2758F065012k87741l00511j62897k69817O7309Q9156k53552j39607l17938J08156
$$ 6065012 5777271 5476760 5313863 5044046 5111355 5200511 4946959 4807352 4489414 4597570
2748D597570j52333j71741J36770k53317O258M784j84096p3196J14183j12778
$$ 4597570 4445237 4273496 4410266 4156949 4163207 4167991 3983895 3910699 4024882 3912104
2738C912104j91675q3286j37307j31623K34331J8882j61318o6865K0254k06640
$$ 3912104 3720429 3637143 3499836 3368213 3602544 3621426 3460108 3393243 3413497 3206857
2728C206857p3176J32925p1245q7334o9163j45761j04931k7749k50987J02546
$$ 3206857 3133681 3266606 3195361 3108027 3038864 2893103 2788172 2760423 2509436 2611982
2718B611982l5606r1822q9606Q2315J68440m8838j81782j66447j5676Q7806j14434
$$ 2611982 2576376 2484554 2394948 2477263 2645703 2596865 2415083 2248636 2232960 2320766 2206332
2707B206332N1480M4914j63894J25830r156M9691k9846j50922j41349K3099N5500
$$ 2206332 2257812 2302726 2138832 2264662 2255506 2305197 2275351 2124429 1983080 2006179 2061679
2696B061679j31562m9099n4079J49636j465j32958P5291J11415j05248r6309j86829
$$ 2061679 1930117 1881018 1826939 1976575 1975110 1842152 1917443 2028858 1923610 1827301 1640472
2685A640472P5970N1065j11964m6694R8476j90588N6181M8431L4004j02378J2793
$$ 1640472 1716442 1767507 1655543 1608849 1707325 1516737 1572918 1621349 1655353 1552975 1565768
2674A565768O1948j05391q234K042j91471J72733R2688j74490O258N0568k5873
$$ 1565768 1627716 1522325 1514091 1516133 1324662 1497395 1590083 1415593 1421851 1472419 1446546
2663A446546q6771j15227M3991J08087k02028m3547n1152N5145J56161j36980
$$ 1446546 1359775 1244548 1288539 1396626 1194598 1151051 1099899 1155044 1311205 1174225
2653A174225j4380J27628k52054q7367R4482J05296m6627p6258K84262J13883
$$ 1174225 1159845 1287473 1035419 948052 1042534 1147830 1101203 1024945 1309207 1423090
2643A423090k22670J37242p0860k35809J4732N0126l7170l3068j02386P6878J41920
$$ 1423090 1200420 1337662 1266802 1030993 1045725 1095851 1058681 1025613 923227 1000105 1142025
2632A142025J00434k25344j3941j4825M2165k04046J54375L5868m9332m1671K9431
$$ 1142025 1242459 1017115 1003174 988349 1030514 826468 980843 1016711 967379 925708 955139
2621I55139J17189k25739r925J05394j05466j1533r5423Q6671j8995Q4644j28093
$$ 955139 1072328 846589 836664 942058 836592 825059 729636 816307 797312 881956 753863
2610G53863k3736j72705J64656k7028n9901P8464L1022J71467J45056N3458j66300
$$ 753863 730127 557422 722078 695050 635149 713613 744635 916102 1061158 1114616 948316
2599I48316l17906n6172R8611R9044J37564j54063m2488j6609r7366J75719J22686
$$ 948316 630410 574238 672849 771893 909457 755394 712906 696297 598931 774650 897336
2588H97336j79918j18110J01149J17697P112j62146r8796o0517j84698L51395
$$ 897336 717418 599308 700457 818154 825266 663120 564324 503807 319109 670504
2578F70504l3330N4361p8052K51894k7789j09155q5672K37769p5153l73518O1278
$$ 670504 637174 691535 613483 865377 837588 728433 642761 880530 805377 431859 493137
2567D93137K27287N8632j06315N0367K8855k1236p8547J36831R081K3658J95310
$$ 493137 720424 779056 672741 723108 751963 730727 652180 789011 798092 821750 1017060
2556A017060j01629l0152j34462r5223K3116M8318j15934r4699J32963N3803K6092
$$ 1017060 915431 885279 750817 655594 678710 727028 611094 516395 649358 703161 729253
2545G29253j92127k9494o1775M9749j16311j485J12223j52407K14935k32307j394
$$ 729253 537126 507632 445857 495606 379295 377810 490033 337626 552561 320254 318860
2534C18860J36836l4596r1031Q173j04949R2103J01287o7829J19244J17593L8184
$$ 318860 455696 421100 330069 338242 233293 325396 426683 358854 478098 595691 633875
2523F33875j88972m4524P9090L5471l880q3114r4407O2333J0308j7621M0491o5564
$$ 633875 444903 400379 479469 514940 511060 427946 333539 395872 406180 388559 429050 363486
2511C63486L9496J26912l19243k6920m1026j14545P5533N6876L4832N894k2957
$$ 363486 402982 529894 210651 183731 142705 28160 103693 160569 195401 201295 178338
2500A78338R0571l8505K1887M6304o3696J58691r802J42283j3653j75063l6306
$$ 178338 268909 230404 252291 298595 234899 393590 383788 526071 512418 337355 301049
2489C01049j8921p3908k6932R1636q4534K916j886p7704J3387j990K28548j06545
$$ 301049 282128 208220 181288 272924 188390 191306 189420 111716 125103 123113 351661 245116
2477B45116M6866j85992j51159M4728K31768m3072j50953O1280M8752j54409M399
$$ 245116 291982 105990 -45169 -441 231327 188255 37302 98582 147334 -7075 -2676
2466b676J2972J45433J65146k30045J90190j47799J1487P7800j95213j8918K2409
$$ -2676 10296 155729 320875 90830 281020 133221 144708 222508 27295 8377 30786
2455C0786R8490O0066k21843O6838j33558L3639J57845J22731m5987j23067n1072
$$ 30786 129276 189342 -32501 34337 -99221 -65582 92263 214994 169007 45940 -5132
2444e132Q8310r8205k7372J33865j76638N2014R942p4800J35931N8190n3045N3900
$$ -5132 83178 -15027 -42399 91466 -85172 -33158 -23216 -98016 37915 96105 43060 96960
2432I6960J63312j19506j01949M3892j86797J53248K2795j82557J24179j3573
$$ 96960 260272 140766 38817 82709 -104088 49160 71955 -110602 13577 4
2422DP4779K06271j54645J10917j97313K520N3044j01633q4081Q0226o8936j34508
$$ 4 74783 281054 126409 237326 40013 42533 95577 -6056 -90137 -9911 -78847 -213355
2410b13355j06469N5852M60465p8983l4756L66J08176j8591j34560q7732J17153
$$ -213355 -319824 -263972 196493 117510 82754 83120 191296 172705 38145 -49587 67566
2399F7566j33250q0737j34716K89595q2212N4234j19496M3172K23861L8606o3368
$$ 67566 -65684 -146421 -281137 8458 -73754 -19520 -139016 -95844 128017 166623 103255
2388A03255n3222J29283k26702j23851K14713K4121m8983K2904N2282n5747N3934
$$ 103255 50033 179316 -47386 -171237 43476 67597 18614 41518 93800 38053 91987
2377I1987J4970l4078J39495m6343j51366M9203Q5823j6798k81888N426K4181
$$ 91987 106957 72879 212374 166031 14665 63868 149691 132893 -148995 -143569 -119388
2366a19388Q2706K47546j05256q2961l6018K01057P6776l5140j00610j93564q4134
$$ -119388 -36682 210864 105608 22647 -13371 187686 264462 229322 128712 -64852 -148986
2355a48986J41457J65635L2958j16983o9133K9140k0392O4487M0965q1640L3121
$$ -148986 -7529 158106 191064 74081 4948 34088 13696 78183 119148 37508 70629
2344G0629r1030j1722L0527K4932j57454k499N1346J49279Q4325J03932M9433
$$ 70629 -20401 -32123 -1596 23336 -134118 -136617 -85271 64008 148333 252265 301698
2333C01698k19773m3667K3290j3570L6176m6256J56074m2108P0092l5237j54442
$$ 301698 81925 38258 61548 47978 84154 37898 193972 151864 221956 186719 32277
2322C2277j02828K0919N2051K2478j29673K04040n2923j60282J11565K41840K8527
$$ 32277 -70551 -49632 2419 24897 -104776 99264 46341 -113941 -2376 239464 267991
2311B67991j34664k1725O1263j48100Q0855M5432J49360K18801l2415q8287J1276
$$ 267991 133327 111602 172865 24765 105620 151052 300412 519213 486798 398511 409787
2300D09787k81326j2918N3834J31370k14047j28573J80553O1450J55262q9139
$$ 409787 128461 115543 169377 300747 86700 -41873 138680 200130 355392 266253
2290B66253j48113J12265K12883l00595j62302K40260o6163j26835O58J55195
$$ 266253 118140 230405 443288 142693 -19609 220651 154488 27653 28311 183506
2280A83506L208j34877n224o2508J45294K9131p5687o7352J91983j01390l6933
$$ 183506 186714 51837 46613 -15895 129399 158530 82843 15491 207474 106084 69151
2269F9151M993j30073J03651J07468O0953J83742j57734p0430k68793K11226N4159
$$ 69151 74144 -55929 47722 155190 216143 399885 242151 171721 -97072 114154 168313
2258A68313L8937O8420k55005j71239L10436N1721k41028o1563P5702J81426j59704
$$ 168313 207250 275670 20665 -150574 159862 211583 -29445 -91008 -15306 166120 6416
2247F416j17042P6375m033L25898j688M549j47994k501j23307j34773J81747Q3920
$$ 6416 -110626 -34251 -38284 287614 285926 290475 142481 139980 16673 -118100 63647 147567
2235A47567j4639O1283k20762j25267K47638j30429J58717j09163R1252m4537
$$ 147567 132928 194211 -26551 -151818 95820 -34609 124108 14945 106197 61660
2225F1660J28548m0110j09013j34812k06375Q5471K20676J49199N0794J07354
$$ 61660 190208 150098 41085 -93727 -300102 -214631 6045 155244 206038 313392
2215C13392k59827j72015J39746j5618j71612J60335R7712M1122O1174o1359k46388
$$ 313392 53565 -118450 21296 5678 -165934 -5599 92113 133235 194409 133050 -113338
2204a13338J06494J01740M1612R8845m744J56225O0505k82505J5177J17108m4317
$$ -113338 -6844 94896 136508 235353 230609 386834 447339 164834 180011 297119 252802
2193B52802N7856M3187L8902m8075o4734j63237J44878n3212K2882R7621o3950
$$ 252802 310658 353845 392747 344672 279938 116701 261579 208367 231249 328870 264920
2182B64920r9789J05419O0814m6476P7551k17773M1840R3551J8794M575J04206
$$ 264920 165131 270550 331364 284888 362439 144666 186506 280057 298851 303426 407632
2171D07632Q2344r8075n9318J31564K3116k23230o4360L0223l6275K41218J0074
$$ 407632 489976 391901 332583 464147 487263 264033 199673 229896 193621 434839 444913
2160D44913j48435J21256j45312j3153J00036j2514O1328M733M8945K7493K4014
$$ 444913 296478 417734 272422 259269 359305 346791 408119 412852 461797 489290 513304
2149E13304r592m0042j59265K68865J50202j08593o9027n8695R6788k7234j33969
$$ 513304 503712 463670 304405 573270 723472 614879 545852 487157 583945 556711 422742
2138D22742k9121J16407k4534K71639M9809j12266N0941J65453R4098J6325r5900
$$ 422742 393621 510028 485494 757133 806942 694676 745617 911070 1005168 1021493 925593
2127I25593J60723J4909M565j73255J19942R2286J43960M4572k0341J331j954
$$ 925593 1086316 1101225 1105790 932535 1052477 1144763 1288723 1333295 1312954 1314285 1312331
2116A312331J26904j16491N5818j05092J41648K67882j0277P1663j3353j25265
$$ 1312331 1439235 1322744 1378562 1273470 1415118 1683000 1672723 1744386 1731033 1605768
2106A605768J52776J59164k41877j12678K51134o501J80445R3660R7850L4661
$$ 1605768 1758544 1917708 1675831 1563153 1814287 1807786 1988231 2081891 2179741 2214402
2096B214402j1898J1354N4876J02968K7678j958l9327J70052K12191P3049K62775
$$ 2214402 2202504 2213858 2268734 2371702 2399380 2397422 2358095 2528147 2740338 2813387 3076162
2085C076162L4428j80766J98566O8020L8824M7634M41915R5325O5809J58661K63544
$$ 3076162 3110590 2929824 3128390 3196410 3235234 3282868 3724783 3820108 3885917 4044578 4308122
2074D308122J95398O3351K01096J52130K95709L05798L07539M37271K16658K28562
$$ 4308122 4503520 4566871 4767967 4920097 5215806 5521604 5829143 6266414 6483072 6711634
2064F711634L40047J54680K53924M58937O39144M81629K23154M24404O48261K28443
$$ 6711634 7051681 7206361 7460285 7919222 8558366 9039995 9263149 9687553 10335814 10564257
2054A0564257M86981N37963O14218Q24681O93289O64927Q21912J214111J387951
$$ 10564257 11051238 11589201 12203419 13028100 13721389 14386316 15208228 16422339 17810290
2045A7810290J472767J748147J779247K299901K471465K476468K629252K636384
$$ 17810290 19283057 21031204 22810451 25110352 27581817 30058285 32687537 35323921
2037C5323921K266766K216858J859105J248549L19352m70193j309032j889693
$$ 35323921 37590687 39807545 41666650 42915199 43234551 42764358 41455326 39565633
2029C9565633k118593l292848l786634l818056l416928k862244k228967j738023
$$ 39565633 37447040 34154192 30367558 26549502 23132574 20270330 18041363 16303340
2021A6303340j755778j242990j029859q97448r52558p59134o84593p36060m16640
$$ 16303340 14547562 13304572 12274713 11377265 10424707 9665573 8980980 8244920 7828280
2012G828280q02519m94343l95275l24955k86342m69770k55580r7518j89712l31434
$$ 7828280 7025761 6531418 6136143 5811188 5524846 5055076 4799496 4701978 4512266 4180832
2002D180832k50523l351j72747l04543k3901k33605j14335K18522l99461l77800
$$ 4180832 3930309 3926958 3754211 3449668 3425767 3192162 3077827 3296349 2896888 2519088
1992B519088k58804l4725J6225O6635K6204j39665j50131j79242P2086J0061j29321
$$ 2519088 2260284 2225559 2241784 2308419 2334623 2194958 2044827 1865585 1937671 1947732 1818411
1981A818411j95212k42446J14801N2270j35021J59752j61767l3004k43046p6655
$$ 1818411 1623199 1380753 1495554 1547824 1412803 1572555 1410788 1377784 1134738 1058083
1971A058083J63784N1285o6974k653k41360N6840L4133j43530j0582j12478j92214
$$ 1058083 1221867 1273152 1206178 1203525 962165 1019005 1053138 909608 899026 786548 594334
1960E94334K60287r1564j79801M4358l990Q2448K1123m5724M129k62936J5397
$$ 594334 854621 763057 583256 627614 623624 706072 727195 681471 685600 422664 438061
1949D38061J15634j42503J84985l7925M9289j08983k51290K5525J48231l2015
$$ 438061 553695 411192 596177 558252 607541 498558 247268 272793 421024 389009
1939C89009O2746j60345r211j82682O3556R8297J72673L5236M5944k15652J4003
$$ 389009 451755 291410 282199 99517 163073 261370 434043 469279 515223 299571 313574
1928C13574K07411j69981L4091r9161P2640J64232j48105j48912O7207k36283
$$ 313574 520985 351004 385095 285934 358574 522806 374701 225789 292996 56713
1918E6713o0010K1162j1004O8078L71698m1699k87247O0511j76183L881M3139
$$ 56713 -3297 17865 6861 74939 446637 404938 117691 178202 2019 5900 49039
1907D9039j39728q6350J94165Q5001k4450j30706k7648L6055N0672J9368J83509
$$ 49039 -90689 -177039 17126 102127 77677 -53029 -80677 -44622 6050 25418 208927
1896B08927q3712k26715j1221J85805k08722p8000J17411J773J0691j527p3834
$$ 208927 125215 -101500 -112721 73084 -135638 -213638 -96227 -94454 -83763 -85290 -159124
1885a59124j9807J77274J0377j96118k0631m1560P5739J29356j09587Q7107J24474
$$ -159124 -178931 -1657 8720 -187398 -208029 -249589 -173850 -44494 -154081 -66974 57500
1874E7500r9167q8349m5820Q4495J02859J2618j5302j57684K47169M2449j49865
$$ 57500 -41667 -130016 -175836 -91341 11518 24136 8834 -148850 98319 140768 -9097
1863i097q4093o4933Q2193J0599j3112j47892k15928j3265J40781k1640L8476
$$ -9097 -93190 -158123 -75930 -65331 -78443 -226335 -442263 -455528 -314747 -336387 -297911
1852b97911K16245j30225m9121J249K540l8646R4032O6402Q8784Q6824K23686
$$ -297911 -81666 -211891 -261012 -259763 -257223 -295869 -201837 -135435 -46651 40173 263859
1841B63859m8161j49160k13339p9391j63066K15362j9083l0196j59617R4730K49758
$$ 263859 215698 66538 -146801 -226192 -389258 -173896 -192979 -223175 -382792 -288062 -38304
1830c8304K9290j07036j49576N100j4772O2575j9438R6963K5616N195j01189k6452
$$ -38304 -9014 -116050 -265626 -260526 -275298 -212723 -232161 -135198 -109582 -104387 -205576 -232028
1818b32028j33401N9200K64739j1542P949r9468j39868k0958J4521J74595L1666
$$ -232028 -365429 -306229 -41490 -53032 -45083 -144551 -284419 -305377 -290856 -116261 -84595
1807h4595q7032j3678o4465J64950k5693j13412j19788Q9782L0172n9599M5451
$$ -84595 -171627 -185305 -249770 -84820 -110513 -223925 -343713 -253931 -223759 -283358 -237907
1796b37907j2162K96189m9182j14653j6684J82097l3050j58713j01662J9147o6399
$$ -237907 -250069 46120 -3062 -117715 -134399 47698 14648 -144065 -245727 -226580 -292979
1785b92979K7394M4744J58666J19946q926l03168Q1884O5124j47530P2675p8295
$$ -292979 -265585 -220841 -62175 57771 48845 -254323 -172439 -107315 -254845 -182170 -260465
1774b60465J52863M6528J66218j73458K0083j12315k27752K53729q6587l6025
$$ -260465 -107602 -61074 105144 -68314 -48231 -160546 -388298 -134569 -221156 -257181
1764b57181j0361K59408p55o2202k61413K09734K8684O0061l06496J37551M0541
$$ -257181 -267542 -8134 -8889 -71091 -332504 -122770 -94086 -34025 -340521 -202970 -162429
1753a62429J6308J04709j53531j85036j91411K04487J27989P0815J63302j74236
$$ -162429 -146121 -41412 -194943 -379979 -571390 -366903 -238914 -168099 -4797 -179033
1743a79033m590p5323j47279J13355M3713m9595j10693J43772p1974K2634p2357
$$ -179033 -183623 -258946 -406225 -292870 -249157 -298752 -409445 -265673 -337647 -315013 -387370
1732c87370R8939m5714q1603N737J59129l7220j4246K6973P6408m5247k4300J1212
$$ -387370 -288431 -334145 -415748 -410011 -250882 -288102 -302348 -275375 -198967 -244214 -268514 -257302
1720b57302o4104N1353n9759P126J59298J10261J25765m00923J820j70393J11681
$$ -257302 -321406 -270053 -329812 -322686 -163388 -53127 72638 -328285 -326465 -496858 -385177
1709c85177J01412M9874L4595k0369j48970J13648J88097l9286k94882j70541
$$ -385177 -283765 -233891 -199296 -219665 -368635 -254987 -66890 -106176 -401058 -571599
1699e71599J92972M0185j7020K15659j37616k44495Q0112J07055J84541J40849
$$ -571599 -378627 -338442 -355462 -139803 -277419 -521914 -441802 -334747 -150206 -9357
1689i357K6005K6913j03246j84046n4526K04683k50564m6638K91836o8803p2583
$$ -9357 16648 43561 -59685 -243731 -298257 -93574 -344138 -390776 -98940 -167743 -240326
1678b40326q781k90168P3205O1471j92816K23190j0150J96889j14439q8813o2050
$$ -240326 -249107 -539275 -466070 -404599 -597415 -374225 -384375 -187486 -301925 -390738 -452788
1667d52788J98093k16080r6572o4982J10556K73930K6022j97539J60818J19355
$$ -452788 -254695 -470775 -567347 -632329 -521773 -247843 -221821 -419360 -258542 -139187
1657a39187L1020k6381l1540n1784P3031Q4293j86311j11658J14570J56238k29422
$$ -139187 -108167 -134548 -166088 -217872 -144841 -60548 -246859 -358517 -243947 -87709 -317131
1646c17131j56396j49965J31751R0838k0966M4610M6988m0413J25977J00547j32190
$$ -317131 -473527 -623492 -491741 -400903 -421869 -377259 -330271 -370684 -244707 -144160 -276350
1635b76350m0185J68133p1382J0461O4157j08153n8503M3353r1351M4611O576
$$ -276350 -316535 -148402 -219784 -209323 -145166 -253319 -311822 -268469 -359820 -315209 -308633
1624c08633O7536L7984N219Q582j55404J16045j27139j26214K5084k5733P0185
$$ -308633 -241097 -203113 -197894 -189312 -344716 -228671 -355810 -482024 -456940 -482673 -412488
1613d12488K03119p0352M1863L6464o6714Q661P4471o8366O3492J44955j41178
$$ -412488 -209369 -279721 -237858 -201394 -268108 -259447 -184976 -253342 -189850 -44895 -186073
1602a86073O3663K7614K8127r4510n9663J10300j59218J59021j72532k00370J23887
$$ -186073 -122410 -94796 -66669 -161179 -220842 -110542 -269760 -110739 -283271 -483641 -359754
1591c59754P8111J20779R8943m0011j62352J0981k33680m6841P8293m9107R5292
$$ -359754 -281643 -160864 -61921 -101932 -264284 -253303 -486983 -533824 -455531 -504638 -409346
1580d09346Q6137j0651j83288J16424K38848n9017o4271M6099j1114M9755R357
$$ -409346 -323209 -333860 -517148 -400724 -161876 -220893 -285164 -239065 -250179 -200424 -191067
1569a91067j69766L5545K86496k3853o2939n8279j06731j8458j63542Q8726R5039
$$ -191067 -360833 -325288 -38792 -62645 -125584 -183863 -290594 -309052 -472594 -383868 -288829
1558b88829J9357q5360j82616J55437P223L4424M8081m2090J71056n5263j7079
$$ -288829 -269472 -354832 -537448 -382011 -374788 -340364 -292283 -334373 -163317 -218580 -235659
1547b35659R6227L600L0709m0255J33235p8032k74084r2260K71226N2232k0650
$$ -235659 -139432 -135832 -105123 -145378 -12143 -90175 -364259 -456519 -185293 -133061 -153711
1536a53711O8894j30328j71968Q8160R7204q4848K2722r3030K90J21483Q7238
$$ -153711 -84817 -215145 -387113 -298953 -201749 -286597 -263875 -356905 -356615 -235132 -147894
1525a47894J84934Q038k69771j2401O9325n3816j24514O3561j48478L30945k8222
$$ -147894 37040 45078 -224693 -237094 -167769 -221585 -346099 -282538 -431016 -100071 -128293
1514a28293l191m4404k15134J10863k75537n4205J30799L40145o9105K293L2908
$$ -128293 -131484 -175888 -391022 -280159 -555696 -609901 -479102 -138957 -208062 -205769 -172861
1503a72861m1104J84309M242j45605o4497J10309K5270j57271q6768o355O1632
$$ -172861 -213965 -29656 -25414 -171019 -235516 -125207 -99937 -257208 -343976 -350331 -288699
1492b88699Q6259l6737J23446j15371O7535N333o2310j62468J5936o2230L57222
$$ -288699 -202440 -239177 -115731 -231102 -163567 -158234 -220544 -383012 -367076 -429306 -72084
1481g2084j42496j15962N6226O6142j11169l1584J46241j08424j7799o835J74742
$$ -72084 -214580 -330542 -274316 -208174 -319343 -350927 -204686 -313110 -330909 -337744 -163002
1470a63002j79653N038Q6914l5236j03410N0011J00621j1887R0251L2748j53138
$$ -163002 -342655 -337617 -250703 -285939 -389349 -339338 -238717 -250604 -160353 -127605 -280743
1459b80743j46337K37476R9942j05846m0128m940J18675j47932m7048p0022J22909
$$ -280743 -427080 -189604 -89662 -195508 -235636 -240576 -121901 -269833 -316881 -386903 -263994
1448b63994P5747j08853p7742j27889J46511L94471j19943O899j08915r8782j3326
$$ -263994 -188247 -297100 -374842 -502731 -356220 38251 -81692 -74793 -183708 -282490 -295816
1437b95816M9157J23063Q4122k33481M7002R745J27496n0739j34838p9583k6060
$$ -295816 -246659 -123596 -39474 -272955 -225953 -216208 -88712 -139451 -274289 -353872 -379932
1426c79932J37045p0617m8484L4105K44086o1225j76546l0648k2467k3148J8840
$$ -379932 -242887 -313504 -361988 -327883 -83797 -145022 -321568 -352216 -374683 -397831 -378991
1415c78991J30982P6184N2463N789o1850o4205j25493M6141J5308n0104R9387
$$ -378991 -248009 -171825 -119362 -113573 -175423 -239628 -365121 -318980 -303672 -353776 -254389
1404b54389J29670M2837J27878o0053k51291k21099J18254K4334L9508R3893o0683
$$ -254389 -124719 -81882 45996 -14057 -265348 -486447 -368193 -343859 -304351 -210458 -271141
1393b71141k0182m1052M6686q6316R9419J6044L2826P9078r1337k4061L5262k3061
$$ -271141 -291323 -332375 -285689 -372005 -272586 -256542 -223716 -144638 -235975 -260036 -224774 -247835
1381b47835k5862J64957j00445R6743J03201r6165q550j89759k3473O8889J37115
$$ -247835 -273697 -108740 -209185 -112442 -9241 -105406 -113956 -303715 -327188 -258299 -121184
1370a21184n5452j45223P7692j05816j42874J49024L60115k15191j39653J1675
$$ -121184 -176636 -321859 -244167 -349983 -492857 -343833 16282 -198909 -338562 -326887
1360c26887o1960r2440j22032K21075P9249K59366O9480J18038j88126j79860
$$ -326887 -388847 -481287 -603319 -382244 -302995 -43629 25851 143889 -44237 -224097
1350b24097J37700j6634l2719r936Q8682j38499n6856R4727Q846j47867n4092
$$ -224097 -86397 -103031 -135750 -145686 -57004 -195503 -252359 -157632 -148786 -296653 -350745
1339c50745J3744K5728K5076j79276L6505J75659j58817R2504k03003M8988J05018
$$ -350745 -337001 -311273 -286197 -465473 -428968 -253309 -412126 -319622 -522625 -473637 -368619
1328c68619N9681k8041M4975J13686o4881L0048P156k00737J38574J57566q918
$$ -368619 -308938 -336979 -292004 -178318 -243199 -213151 -205995 -406732 -268158 -110592 -119510
1317a19510M5799R7457k15430j35603J5250Q3140Q9163r6552L4046L0124q9874
$$ -119510 -73711 23746 -191684 -327287 -312037 -228897 -139734 -236286 -202240 -172116 -261990
1306b61990N5855K333j74154j9892q9260R5472K6017l9970J51684j10391l9162
$$ -261990 -206135 -203802 -377956 -397848 -487108 -391636 -365619 -405589 -253905 -364296 -403458
1295d03458k2272Q7145L88896m1472m864j91368j92139M6145K04620j7569K9788
$$ -403458 -425730 -338585 50311 8839 3975 -187393 -379532 -333387 -128767 -146336 -116548
1284a16548M4187l8342j24379j53878O8094K0826Q3451J52875j91884J13512k889
$$ -116548 -72361 -110703 -235082 -388960 -320866 -300040 -216589 -63714 -255598 -142086 -144975
1273a44975J36886o1047j58199P4033J13840o2882r7620j36441K2153Q3078K14262
$$ -144975 -8089 -69136 -227335 -153302 -39462 -102344 -199964 -336405 -314252 -231174 -16912
1262a6912k5413j33030J15513j92621J87336j4501p4241k35333K13755O6375k7026
$$ -16912 -42325 -175355 -59842 -252463 -65127 -79628 -153869 -389202 -175447 -109072 -136098
1251a36098n7853k34264O7252j15481J23279Q9241J37569N2629p3768j02538j85645
$$ -136098 -193951 -428215 -360963 -476444 -353165 -263924 -126355 -73726 -147494 -250032 -435677
1240d35677J33351L9468k14726K10222j07609m4501K37224m3881o473k466n0209
$$ -435677 -302326 -262858 -477584 -267362 -374971 -419472 -182248 -226129 -232602 -235068 -285277
1229b85277Q314j28260J41618R0872R5991J4412l01144J3294O6677N8371q9545
$$ -285277 -276963 -405223 -263605 -172733 -76742 -62330 -363474 -350180 -283503 -225132 -314677
1218c14677n6716j784J74434o2492J4754m7207J08252q145J70326Q5997j30615
$$ -314677 -371393 -373177 -198743 -261235 -246481 -293688 -185436 -193581 -23255 62742 -67873
1207f7873m4217k9167M8091r1491j00464q5908J18951L79674p0376l6304o9047
$$ -67873 -112090 -141257 -93166 -184657 -285121 -371029 -252078 127596 57220 20916 -48131
1196d8131q4878k03561J26126Q9060k40636J2656j66453r4470K10981J07197j50825
$$ -48131 -133009 -336570 -210444 -121384 -362020 -349364 -515817 -610287 -399306 -292109 -442934
1185d42934J28940q5262J48175j63583N8465j5259J62748J04480k25139N6158
$$ -442934 -313994 -399256 -251081 -414664 -356199 -371458 -208710 -104230 -329369 -273211
1175b73211j12308P1416m3803J78152K238o695N252J20425l154q9582O521n7249
$$ -273211 -385519 -314103 -357906 -179754 -177516 -184211 -178959 -58534 -61688 -151270 -144749 -201998
1163b01998O6846J0642M5286l4655N6407k64511J16273J06144J73588j36324j53274
$$ -201998 -135152 -124510 -79224 -113879 -57472 -321983 -205710 -99566 74022 -62302 -215576
1152b15576j78753J12201K1q865J02799R3591J9799J37727j35366k85289J90275
$$ -215576 -394329 -282128 -282107 -290972 -188173 -94582 -74783 62944 -72422 -357711 -167436
1141a67436L6631J53518k85798l9332J7670M3678M0367J31451J3983j4596j17359
$$ -167436 -130805 22713 -263085 -302417 -284747 -241069 -200702 -69251 -55268 -69864 -187223
1130a87223K0458j1421K55171o3519j46015Q447o1528j77401m1945O4153L0073
$$ -187223 -166765 -178186 76985 13466 -132549 -124102 -185630 -363031 -404976 -340823 -310750
1119c10750J58596q9103l0359J72644o8894j91638n6256J00057o930J48687J08174
$$ -310750 -152154 -241257 -271616 -98972 -167866 -359504 -415760 -315703 -322633 -173946 -65772
1108f5772k0848o632j34146p5188N641N7140K37317R5717p6339J06884j07981
$$ -65772 -86620 -93252 -227398 -302586 -296945 -239805 -2488 93229 16890 123774 15793
1097A5793k50552J33654J56508k18966L9051p867Q6480J3192L1371k39808L5577
$$ 15793 -234759 -101105 55403 -163563 -124512 -132379 -45899 -32707 -1336 -241144 -205567
1086b05567N7203J7279l0036J2739J87243O8142k18507j38142J82837j08361N8866
$$ -205567 -148364 -131085 -161121 -148382 38861 107003 -111504 -249646 -66809 -175170 -116304
1075a16304J61435j75408J56888J0667j94545k0729K0963P6553n4774j2738j41503
$$ -116304 45131 -130277 26611 37278 -157267 -177996 -157033 -80480 -135254 -147992 -289495
1064b89495j2858K02243p312R0957m5915j9012N8365m3794r6460O2121J4604p187
$$ -289495 -302353 -100110 -107422 -16465 -62380 -81392 -23027 -66821 -163281 -101160 -86556 -93743
1052i3743M7598P697J76374P4171k90806j11756N3456n3542j6533Q7603J34775
$$ -93743 -46145 -38448 137926 212097 -78709 -190465 -137009 -190551 -207084 -119481 15294
1041A5294o4059j20241N196p2683J41658n4391r1673M5255K4197M4353j61167
$$ 15294 -48765 -169006 -163810 -236493 -94835 -149226 -240899 -195644 -171447 -127094 -288261
1030b88261J27815J76202j10557j09573K88041o6626j49436k27116J6851L00398
$$ -288261 -160446 15756 -94801 -204374 83667 17041 -132395 -359511 -342660 -42262
1020d2262k4485M7614P4182j95383N8376r896m3227K89814k86927j2519L21016
$$ -42262 -66747 -19133 55049 -140334 -81958 -91854 -135081 154733 -132194 -144713 176303
1009A76303r3424k1989j96398p5971K2048J33204J83483k48653n6976J11275j6250
$$ 176303 82879 60890 -135508 -211479 -189431 -56227 127256 -121397 -178373 -67098 -83348
998h3348K52565j65568o1676Q3115m8164k10489K00257J93197j4903l14341k8038
$$ -83348 169217 3649 -58027 25088 -23076 -233565 -33308 159889 144986 -169355 -197393
987a97393N4749J7741l9308j4987N1878M5021l203J19119R2224j920o0098j25860
$$ -197393 -142644 -124903 -164211 -179198 -127320 -82299 -85502 33617 125841 123921 63823 -62037
975f2037N2705j19594J0229J26545o476O617k2794l7146j5035J20396O173j23038
$$ -62037 -9332 -128926 -118697 7848 1372 7989 -14805 -51951 -66986 53410 59583 -63455
963f3455n7809j33646J20746j41972j79474j6956K77427m442j4692k8852j0283
$$ -63455 -121264 -254910 -134164 -276136 -455610 -472566 -195139 -199581 -214273 -243125 -253408
952b53408M3725k1334M7269J42491o3597O2742j65393n0742J0622N6900K96473
$$ -253408 -209683 -231017 -183748 -41257 -104854 -42112 -207505 -258247 -247625 -190725 105748
941A05748j35065j35879J4085J36606r9889J4177J17046N2075n2731k57011P6610
$$ 105748 -29317 -165196 -151111 -14505 -114394 -100217 16829 68904 16173 -240838 -164228
930a64228Q7595J03338o5421j47286k6749J37802M8066j5989J58932J39175k20520
$$ -164228 -76633 26705 -38716 -186002 -212751 -74949 -26883 -42872 116060 255235 34715
919C4715k57303J39607j8212m2751J60093K4364j10277j28795m1366J43556m5672
$$ 34715 -222588 -82981 -101193 -143944 16149 40513 -69764 -198559 -239925 -96369 -142041
908a42041J8782J79405j18407j7926J69417J3769M7014j85774k34934J36793J8889
$$ -142041 -123259 56146 -62261 -80187 89230 102999 150013 -35761 -270695 -133902 -115013
897a15013j0789n9675J5942J58732K61619j23490p4669l7613L2010o0334k2309
$$ -115013 -125802 -185477 -169535 -10803 250816 127326 52657 15044 47054 -13280 -35589
886c5589k76814j6815Q7655J75829p7799N9964k5751p9709n89M0844J29221N3011
$$ -35589 -312403 -329218 -241563 -65734 -143533 -83569 -109320 -189029 -189618 -148774 -19553 33458
874C3458J54750j4345k05659j94856J17924j24442M9490j56290J503K10364K67051
$$ 33458 188208 173863 -31796 -226652 -108728 -233170 -183680 -339970 -338467 -128103 138948
863A38948j44477n6735j07105K15429j37355r0172J06282j9125J4758P351J1105
$$ 138948 -5529 -62264 -169369 46060 -91295 -181467 -75185 -94310 -79552 -72201 -61096
852f1096Q0020J13191K4003p5825q3342k23767R3510N6447J82608k7586k61057
$$ -61096 18924 132115 156118 80293 -3049 -226816 -133306 -76859 105749 78163 -182894
841a82894J96472J63262j75199M4969m4688k35782K77416P3011j74047m147Q9154
$$ -182894 13578 176840 1641 46610 1922 -233860 43556 116567 -57480 -61627 27527
830B7527l7075Q7510j72031N1270J16264o9134J55742K4185j58892k994j84127
$$ 27527 -9548 77962 -94069 -42799 73465 4331 160073 184258 25366 22372 -161755
819a61755k9920J58127J40678j20532k28980n0255n6285K08425m5337n7908J3151
$$ -161755 -191675 -33548 107130 -13402 -242382 -292637 -348922 -140497 -185834 -243742 -230591
808b30591J96878P3660j74204O698J84952J21849j77437J66102j8822k44404p4839
$$ -230591 -33713 39947 -134257 -127559 57393 179242 1805 167907 149085 -95319 -170158
797a70158m8389J6790J91828Q5544j49216J3004J32494j7953p1818l1648n1898
$$ -170158 -218547 -201757 -9929 75615 -73601 -60597 71897 53944 -17874 -49522 -101420
786a01420J8537j01430M6200K31989o1594j40421m7002l4422q5107k9977J59641
$$ -101420 -82883 -184313 -138113 93876 32282 -108139 -155141 -189563 -274670 -304647 -145006
775a45006J55804m8050n6504J21591k5860j09636k2073l3078O5296n4225O5531
$$ -145006 10798 -37252 -93756 27835 1975 -107661 -129734 -162812 -97516 -151741 -86210
764h6210J31152J55236l4948k75235J13426r0879O4369k5270J37539K07951r5430
$$ -86210 44942 200178 165230 -110005 3421 -87458 -23089 -48359 89180 297131 201701
753B01701r4587n0641o7236q9309J51921n4742j81860O4293r1637P7219j9720
$$ 201701 107114 56473 -10763 -100072 51849 -2893 -184753 -120460 -212097 -134878 -154598
742a54598K6097J37441J54431p3479j63399P2378k50986l4538K64230K60673k43046
$$ -154598 -128501 8940 163371 89892 -73507 -1129 -252115 -286653 -22423 238250 -4796
731d796k12675K14675L8712p7148N1968k40866J50392K41387J07689j27815M1318
$$ -4796 -217471 -2796 35916 -41232 10736 -230130 -79738 161649 269338 141523 182841
720A82841j75261l1588M5981k45404K02007K9198p1793J07197j04324K03920j15998
$$ 182841 7580 -24008 21973 -223431 -21424 7774 -64019 43178 -61146 142774 26776
709B6776j29894R0306j15L7276l2296p2097M2053j3527N517M6218j88435J42296
$$ 26776 -103118 -12812 -12927 24349 -7947 -80044 -37991 -51518 -46001 217 -188218 -45922
697d5922o0158p375l1303J26191N1253k08065J78490P3191j98824K9701J07063
$$ -45922 -106080 -113455 -144758 -18567 32686 -175379 3111 76302 -122522 -92821 14242
686A4242J077p0851P5123J76221R369P318n2927j28152o4700o2670m6340K6006
$$ 14242 15319 -55532 19591 195812 205181 212499 159572 31420 -33280 -95950 -142290 -116284
674a16284P3450J9809j54474K60458J65969r0475j58048k02002p9990K75653J65477
$$ -116284 -42834 -23025 -177499 82959 248928 158453 405 -201597 -281587 -5934 159543
663A59543j20186n1973m1907J16304q211l1414j4795j47560q384m3345k30864
$$ 159543 39357 -12616 -54523 61781 53570 22156 7361 -140199 -148583 -191928 -422792
652d22792K11524Q5214j6255J49185J53661k78683J44139O8216J2615O0248o3029
$$ -422792 -211268 -126054 -142309 6876 160537 -118146 25993 94209 106824 167072 104043
641A04043l927j36854K36780K13098n2010k44008p9209N3167j7050q1705j24916
$$ 104043 100116 -36738 200042 413140 361130 117122 37913 91080 74030 -7675 -132591
630a32591J4479o4508m0282N1803L1785Q4976k9907K7165j04426P2388j67031
$$ -132591 -118112 -182620 -222902 -171099 -139314 -54338 -84245 -57080 -161506 -89118 -256149
619b56149J37889N2886K3897J38444j09154J68941m6397m3074J4550m9730Q7017
$$ -256149 -118260 -65374 -41477 96967 -12187 156754 110357 67283 81833 32103 119120
608A19120j22757J46107N387k60601J44243J20373j65390j44398J2727K26204
$$ 119120 -3637 142470 147857 -112744 31499 151872 -13518 -157916 -145189 81015
598H1015J20689j98627J17636j22076J12335P4871j0493j99174J06130O1978j22044
$$ 81015 201704 3077 120713 -1363 110972 185843 175350 -23824 82306 144284 22240
587B2240K6404J77607K3214m8886j46052r3049J9297P3018j1384m255Q3054r5739
$$ 22240 48644 226251 249465 200579 54527 -38522 -19225 53793 42409 38154 121208 25469
575B5469J09211j38537k35193Q7589K99444L732M8313R72R0061j04702q1542p9442
$$ 25469 134680 -3857 -239050 -151461 147983 151715 200028 201000 291061 186359 104817 25375
563B5375k76860j9926K84291J18413L654j63844k4643P0633R6357k4487k92134
$$ 25375 -251485 -271411 12880 131293 134947 -28897 -53540 17093 113450 88963 -203171
552b03171K65651J04049O838j00852K42122J8565l27534m0001O9625q8201p802
$$ -203171 62480 166529 173367 72515 314637 333202 5668 -34333 35292 -52909 -60711
541f0711J86657m0411P1317M0064j40596p229n09j980k5062m1168J09229j10929
$$ -60711 125946 85535 156852 196916 56320 49091 48582 46602 21540 -19628 89601 -21328
$$ [...]
##END NTUPLES=NMR SPECTRUM
##END=
