##TITLE=1H_TG-2365-A
 CDCl3
 8 sc, 
 26.1.2023
##JCAMPDX= 6.0         $$ Bruker NMR JCAMP-DX V2.0
##DATA TYPE= NMR SPECTRUM
##DATA CLASS= NTUPLES
##ORIGIN= UXNMR, Bruker Analytische Messtechnik GmbH
##OWNER= root
$$ XWIN-NMR		Version 3.5
$$ Thu Jan 26 14:27:22 2023 Russian Standard Time (UT+4h)  she@DPX200
##.OBSERVE FREQUENCY= 200.13135
##.OBSERVE NUCLEUS= ^1H
##.ACQUISITION MODE= SIMULTANEOUS
##.ACQUISITION SCHEME= undefined
##.AVERAGES= 8
##.DIGITISER RES= 18
##SPECTROMETER/DATA SYSTEM= spect
##.PULSE SEQUENCE= zg30
##.SOLVENT NAME= CDCl3
##.SHIFT REFERENCE= (INTERNAL, CDCl3, 0, 15.748)
##AUDIT TRAIL= $$ (NUMBER, WHEN, WHO, WHERE, WHAT)
$$ ##TITLE= Audit trail, XWIN-NMR		Version 3.5
$$ ##JCAMPDX= 5.01
$$ ##ORIGIN= Bruker BioSpin GmbH
$$ ##OWNER= she
$$ F:/spectra/data/she/nmr/H-F/1/pdata/1/auditp.txt
$$ ##AUDIT TRAIL=  $$ (NUMBER, WHEN, WHO, WHERE, WHAT)
(   1,<2023-01-26 14:25:51.07 +0400>,<she>,<DPX200>,
      <created by zg, POWCHK disabled, PULCHK disabled
       configuration hash MD5:
       00 E9 B6 7A A2 85 ED C7 34 08 36 98 17 FE 4E 26
       data hash MD5: 16K
       D8 96 EF A4 E5 71 D6 1E 35 83 E4 17 78 D1 D4 C4>)
(   2,<2023-01-26 14:25:54.32 +0400>,<she>,<DPX200>,
      <Start of raw data processing
       efp BC_mod = 2 LB = 0.24 FT_mod = 6 PKNL = 1 PHC0 = -19189.83 PHC1 = 10.20079 SI = 16K 
       data hash MD5: 16K
       2E B0 68 70 08 CB 38 5A 2A 72 0B 8F 26 DE F1 26>)
(   3,<2023-01-26 14:26:22.12 +0400>,<she>,<DPX200>,
      <pk PHC0 = -3.141745 PHC1 = 4.999998 
       data hash MD5: 16K
       1F 04 A0 6C 7F 59 5C 09 AC 1A 84 E7 B8 F6 A6 DA>)
(   4,<2023-01-26 14:26:26.03 +0400>,<she>,<DPX200>,
      <abs ABSG = 5 
       data hash MD5: 16K
       64 82 9F 31 62 1B 92 EF 64 74 B2 14 31 60 8B DB>)
(   5,<2023-01-26 14:26:44.64 +0400>,<she>,<DPX200>,
      <abs ABSG = 5 
       data hash MD5: 16K
       30 FE 1B BF 13 50 2E 33 DE 7F 28 FF 41 08 AA 75>)
$$ ##END=
$$ 
$$ hash MD5
$$ A4 94 25 AF 0B C2 48 8D 23 1D 81 86 63 4E 5F A1
##$RELAX= 
##$RELAX= 
##$RELAX= 
##$RELAX= 
##$RELAX= 
##$RELAX= 
$$ Bruker specific parameters
$$ --------------------------
##$DU= <F:/spectra>
##$EXPNO= 1
##$NAME= <H-F>
##$PROCNO= 1
##$TYPE= <nmr>
##$USER= <she>
##$AMP= (0..31)
100 100 100 100 100 100 100 100 100 100 100 100 100 100 100 100 100 100 
100 100 100 100 100 100 100 100 100 100 100 100 100 100 
##$AQSEQ= 0
##$AQ_mod= 1
##$AUNM= <au_zg>
##$AUTOPOS= <>
##$BF1= 200.13
##$BF2= 200.13
##$BF3= 200.13
##$BF4= 200.13
##$BF5= 200.13
##$BF6= 200.13
##$BF7= 200.13
##$BF8= 200.13
##$BYTORDA= 1
##$CFDGTYP= 0
##$CFRGTYP= 5
##$CHEMSTR= <none>
##$CNST= (0..31)
1 1 145 1 1 1 1 1 1 1 1 1 1 1 1 1 1 1 1 1 1 1 1 1 1 1 1 1 1 1 1 1 
##$CPDPRG= <>
##$CPDPRG1= <>
##$CPDPRG2= <>
##$CPDPRG3= <>
##$CPDPRG4= <mlev>
##$CPDPRG5= <mlev>
##$CPDPRG6= <mlev>
##$CPDPRG7= <mlev>
##$CPDPRG8= <mlev>
##$CPDPRGB= <>
##$CPDPRGT= <>
##$D= (0..31)
0 1.2 0 0 0 0 0 0 0 0.06 0 0.03 0 0 0 0 0.0002 0 0 0 0 0 0 0 0 0 0 0 0 
0 0 0 
##$DATE= 1674728750
##$DBL= (0..7)
$$ [...]
##$SUBNAM3= <"">
##$SUBNAM4= <"">
##$SUBNAM5= <"">
##$SUBNAM6= <"">
##$SUBNAM7= <"">
##$SUBNAM8= <"">
##$SUBNAM9= <"">
##$SW= 18.05172834244
##$SWIBOX= (0..15)
0 0 2 0 0 0 0 0 0 0 0 0 0 0 0 0 
##$SW_h= 3612.71676300578
##$TD= 16384
##$TD0= 1
##$TE= 0
##$TE2= 300
##$TE3= 300
##$TEG= 300
##$TL= (0..7)
0 120 120 120 120 120 120 120 
##$TP= (0..7)
150 150 150 150 150 150 150 150 
##$TP07= 0
##$TPNAME0= <>
##$TPNAME1= <>
##$TPNAME2= <>
##$TPNAME3= <>
##$TPNAME4= <>
##$TPNAME5= <>
##$TPNAME6= <>
##$TPNAME7= <>
##$TPOAL= (0..7)
0.5 0.5 0.5 0.5 0.5 0.5 0.5 0.5 
##$TPOFFS= (0..7)
0 0 0 0 0 0 0 0 
##$TUNHIN= 0
##$TUNHOUT= 0
##$TUNXOUT= 0
##$USERA1= <user>
##$USERA2= <user>
##$USERA3= <user>
##$USERA4= <user>
##$USERA5= <user>
##$V9= 5
##$VALIST= <valist>
##$VCLIST= <CCCCCCCCCCCCCCC>
##$VD= 0
##$VDLIST= <DDDDDDDDDDDDDDD>
##$VPLIST= <PPPPPPPPPPPPPPP>
##$VTLIST= <TTTTTTTTTTTTTTT>
##$WBST= 1024
##$WBSW= 4
##$XGAIN= (0..3)
0 0 0 0 
##$XL= 0
##$YL= 0
##$YMAX_a= 7933
##$YMIN_a= -9217
##$ZGOPTNS= <>
##$ZL1= 120
##$ZL2= 120
##$ZL3= 120
##$ZL4= 120
##$ABSF1= 15.74799
##$ABSF2= -2.30386
##$ABSG= 5
##$ABSL= 3
##$ALPHA= 0
##$AQORDER= 0
##$ASSFAC= 0
##$ASSFACI= 0
##$ASSFACX= 0
##$ASSWID= 0
##$AUNMP= <proc_1d>
##$AZFE= 0.1
##$AZFW= 0.1
##$BCFW= 0
##$BC_mod= 2
##$BYTORDP= 0
##$COROFFS= 0
##$CY= -3
##$DATMOD= 1
##$DC= 0
##$DFILT= <>
##$DTYPP= 0
##$F1P= 0
##$F2P= 0
##$FCOR= 1
##$FTSIZE= 16384
##$FT_mod= 6
##$GAMMA= 0
##$GB= 0
##$INTBC= 1
##$INTSCL= 3.70164e-10
##$ISEN= 128
##$LB= 0.24
##$LEV0= 0
##$LPBIN= 0
##$MAXI= 10000
##$MC2= 0
##$MEAN= 0
##$ME_mod= 0
##$MI= 1.114404
##$NCOEF= 0
##$NC_proc= -13
##$NLEV= 6
##$NOISF1= 3.799351
##$NOISF2= 2.8
##$NSP= 0
##$NTH_PI= 0
##$NZP= 0
##$OFFSET= 15.74799
##$PC= 1
##$PHC0= -19192.97
##$PHC1= 15.20079
##$PH_mod= 1
##$PKNL= yes
##$PPARMOD= 0
##$PSCAL= 0
##$PSIGN= 0
##$REVERSE= no
##$SF= 200.1300047136
##$SI= 16384
##$SIGF1= 3
##$SIGF2= 2
##$SINO= 5.538805
##$SIOLD= 16384
##$SREGLST= <1H.CDCl3>
##$SSB= 0
##$STSI= 16384
##$STSR= 0
##$SW_p= 3612.71676300578
##$SYMM= 0
##$S_DEV= 0
##$TDeff= 16384
##$TDoff= 0
##$TI= <>
##$TILT= no
##$TM1= 0
##$TM2= 0
##$TOPLEV= 0
##$USERP1= <user>
##$USERP2= <user>
##$USERP3= <user>
##$USERP4= <user>
##$USERP5= <user>
##$WDW= 1
##$XDIM= 16384
##$YMAX_p= 323580218
##$YMIN_p= -22515630
$$ End of Bruker specific parameters
$$ ---------------------------------
##NTUPLES= NMR SPECTRUM
##VAR_NAME=  FREQUENCY,     SPECTRUM/REAL,   SPECTRUM/IMAG
##SYMBOL=    X,             R,               I
##VAR_TYPE=  INDEPENDENT,   DEPENDENT,       DEPENDENT
##VAR_FORM=  AFFN,          ASDF,            ASDF
##VAR_DIM=   16384,         16384,           16384
##UNITS=     HZ,            ARBITRARY UNITS, ARBITRARY UNITS
##FACTOR=    0.220516191357247, 1,           1
##FIRST=     3151.64524379302, 0,            0
##LAST=      -461.071519212763, 0,           0
##MIN=       -461.071519212763, -22515630,   0
##MAX=       3151.64524379302, 323580218,    0
$$ Real data points
##PAGE= N=1
##DATA TABLE= (X++(R..R)), XYDATA
$$ [...]
6138B1410952n91434K25946n87073m11109k58291J66265M32802L14424L00454
6129B1002936m52251l52289M30644K56151j188791M48622P28873n70738p94832
6120A9508325n04522q1174L84041j12831m04876l19160k42668M92141q19041q76141
6110A7024094K8648o47210K5769O45752k9657p40200q935K82136j69081r01740
6100A5509576L82636j40063l94380R96309P5992n23007r40433k28592K34307j71528
6090A4800817l88077J68827k78857l30417N16944N77835k88292M85355m33068
6081A4831067K29419O00751m38769n27315M11365M51960l12227K93694p20876
6072A4819069N1983p67K18570r4403j0011K27326N01807M00494n95173R01957
$$ y = [21410952, 20819518, 21045464, 20458391, 20047282, 19788991, 19955256, 20388058, 20702482, 21002936, 20550685, 20198396, 20629040, 20885191, 19696400, 20145022, 20873895, 20303157, 19508325, 19003803, 18922629, 19306670, 19193839, 18788963, 18469803, 18227135, 18719276, 17900235, 17024094, 17052742, 16405532, 16431301, 17077053, 17047396, 16307196, 16298261, 16580397, 16411316, 15509576, 15892212, 15752149, 15357769, 16354078, 16430070, 15907063, 14966630, 14738038, 14972345, 14800817, 14412740, 14581567, 14302710, 13972293, 14489237, 15067072, 14778780, 15264135, 14831067, 15060486, 15661237, 15222468, 14695153, 15106518, 15558478, 15246251, 15539945, 14819069, 14871052, 14870285, 15088855, 14994452, 14984441, 15211767, 15713574, 16114068, 15518895, 16420852]
6062A6420852K16237P02201P16960J150605J341162L07513M58270J045172l97834
6053B1961138j930522p31930n46005p83702K2468l31178j113411J29142M9439
6044A6725439k77369j33658l51203L57728j03038O91694O00794O51937L61563
6035A8523887P36897L35240R6760R01833j13035J139233J449357K578400K262620
6026B7911192K053087K688745K612176J060155j059546k549143l078833l667001
6018B5970832k336609j215594j719406j675971j98568k73032N6265j207255l44050
6009A7056612m5544K33188k8325M01723j0358p9143J52156K05016K73185R3082
5999A8251592J223340J342814J455668J542027K203901K099070K787970K548665
$$ y = [16420852, 16637089, 17339290, 18056250, 19206855, 20548017, 20855530, 21313800, 22358972, 21961138, 20030616, 19298686, 18752681, 17968979, 17991447, 17660269, 16546858, 16676000, 16725439, 16448070, 16314412, 15963209, 16320937, 16217899, 16909593, 17510387, 18162324, 18523887, 19260784, 19596024, 19692784, 20594617, 20481582, 21620815, 23070172, 25648572, 27911192, 29964279, 32653024, 35265200, 36325355, 35265809, 32716666, 29637833, 25970832, 23634223, 22418629, 20699223, 19023252, 18824684, 18551652, 18607917, 17400662, 17056612, 17011068, 17244256, 17215931, 17617654, 17607296, 17528153, 17680309, 17885325, 18158510, 18251592, 19474932, 20817746, 22273414, 23815441, 26019342, 28118412, 30906382, 33455047]
5991C3455047R89187j493323k294479l053552k650644k168932j825199j971870
5983A8986235r80798o77967q57506o36700j547462q4906p10091o29014N28794
5974A3390585j41683k59478K46086L06162M32215q60148N10427J8849M19889J74170
5964A4237074K51459O86969J062173K165515J33914K05069n94828l61494q40167
5955A6945684j101780j215139r29837n54572l3247q37050p36075r66006P13590
5946A1285568l69172p40860l62130O8957L34735n28237P91778N66176l36210p55344
5936I955261p00775M38m09137N73244j01442L88541k41012r90258j86809J01160
5926H389211K52369k59460j30455j68042M08017J3845n18635M967j60750o81512
$$ y = [33455047, 34444234, 32950911, 30656432, 27602880, 24952236, 22783304, 20958105, 18986235, 18005437, 17327470, 16469964, 15833264, 14285802, 14200896, 13490805, 12861791, 13390585, 13248902, 12989424, 13235510, 13541672, 13973887, 13113739, 13624166, 13643015, 14062904, 14237074, 14488533, 15175502, 16237675, 18403190, 18537104, 18742173, 18147345, 17785851, 16945684, 15843904, 14628765, 13698928, 13144356, 13111109, 12274059, 11537984, 10571978, 11285568, 10916396, 10175536, 9813406, 9882363, 10217098, 9688861, 10480639, 11046815, 10710605, 9955261, 9254486, 9254924, 8845787, 9419031, 9317589, 9706130, 9465118, 8474860, 8288051, 8389211, 8641580, 8382120, 8251665, 8083623, 8491640, 8505485, 7986850, 7991817, 7831067, 7149555]
5916G149555M1071N21790o09078l30398P37824j34145n05891N01754k8587p06956
5906F636939q1779N02445k42418j87251K06766k58701p88882j68862N51900k70797
5896E899360k4569n1664q81599M38927O65919p48706L22616l6529M6852R0870
5886E721477j34872k48381k05611M20428q53700q9545L61598j64933j81315k41893
5876D383253M24009L11190J34750m08120k62104J02503r8641k60558j35439k04738
5866C986105O78259n17085j09420K80945n50762j58889M30419J8987L45077N31698
5856D935334K95822n18171q2193m50969M51426k4444o49913L62869Q3221r3980
5846D309002k16782n57687Q26087M73308q56138p0415j24462k65551P70928M77713
$$ y = [7149555, 7190626, 7712416, 7103338, 6772940, 7510764, 7376619, 6870728, 7372482, 7343895, 6636939, 6555160, 7057605, 6815187, 6627936, 6834702, 6576001, 5787119, 5618257, 6170157, 5899360, 5874791, 5823127, 4941528, 5380455, 6046374, 5297668, 5620284, 5583755, 5630607, 5721477, 5586605, 5338224, 5132613, 5553041, 4699341, 4609796, 4971394, 4806461, 4625146, 4383253, 4807262, 5118452, 5253202, 4845082, 4582978, 4685481, 4586840, 4326282, 4190843, 3986105, 4664364, 4147279, 4037859, 4318804, 3768042, 3609153, 4039572, 4058559, 4403636, 4935334, 5231156, 4712985, 4630792, 4179823, 4631249, 4606805, 3956892, 4319761, 4402982, 4309002, 4092220, 3534533, 4360620, 4833928, 3977790, 3907375, 3782913, 3517362, 4288290, 4766003]
5836D766003k72410p11431N58599P53156m3312r63734o1960K93401l46546m23809
5826C547957K11539P09226k76926J90384N50667n86817O4782K53797m53610J030312
5816E241311p59960j22412P3766J87151m22935k23876J75668J98785J46927m31268
5806D063157Q4657L53227L86879j93065P89468j37767j320610R08306L67664p9203
5796E222713j33946J45942N4032K59193N92583m30707n59683q0542L33725J80254
5786E583564n07120j31433k70177P24206L96290o63543p39425N02944j77672l01069
5776D416565m7606q7405M1568P87930J043178j010947l73606J14316m4078P03946
5766E543861M05578j10846K19888l45541N89054k34425m93350P4128J30892m03962
$$ y = [4766003, 4493593, 3782162, 4340761, 5093917, 5050605, 4086871, 4024911, 4318312, 3971766, 3547957, 3759496, 4468722, 4191796, 4382180, 4932847, 4346030, 4410812, 4664609, 4210999, 5241311, 4481351, 4358939, 4432705, 4619856, 4196921, 3973045, 4148713, 4347498, 4494425, 4063157, 4147814, 4501041, 4887920, 4694855, 5484323, 5346556, 4025946, 4934252, 5301916, 5222713, 5088767, 5234709, 5288741, 5547934, 6140517, 5709810, 5150127, 5069585, 5403310, 5583564, 5076444, 4945011, 4674834, 5399040, 5795330, 5131787, 4392362, 4895306, 4717634, 4416565, 4368959, 4281554, 4323122, 5111052, 6154230, 5143283, 4769677, 4883993, 4839915, 5543861, 5949439, 5838593, 6058481, 5712940, 6301994, 6067569, 5574219, 5648347, 5779239, 5375277]
5756E375277j57442J63065j24909M11629J50385m3639k47208N90821O71808J40921
5746F930708r18306j10701m16764j87204j47578P5890M62570j91257n15556K59060
5736E240862J72010k98935L51400J91559o29373J32272L12993r6561k3769k92239
5726E060219K64876J59005O43158l38865l76009O28189R62077J99840o67334J35041
5716F670197L74836k29605o63004L73956K05607k95157L01625n25531L70209j45267
5706F437866p45419o99721Q21598m38718P50297n51452r34266k903946J946796
5697C683035K136993j671838R42810O57484L04869j305581m39288R45299L43100
5688E596883L17840m09588l4654O12934K25599l30519l34240o49674J83303O63922
$$ y = [5375277, 5217835, 5380900, 5255991, 5667620, 5818005, 5774366, 5527158, 6117979, 6789787, 6930708, 6012402, 5901701, 5484937, 5297733, 5150155, 5226045, 5688615, 5497358, 4981802, 5240862, 5412872, 5113937, 5465337, 5656896, 5027523, 5159795, 5472788, 5376227, 5352458, 5060219, 5325095, 5484100, 6127258, 5788393, 5412384, 6040573, 7002650, 7202490, 6535156, 6670197, 7045033, 6815428, 6152424, 6526380, 6731987, 6436830, 6738455, 6212924, 6583133, 6437866, 5692447, 4992726, 5814324, 5375606, 6125903, 5574451, 4640185, 1736239, 3683035, 5820028, 4148190, 5091000, 5748484, 6053353, 4747772, 4308484, 5253783, 5596883, 5914723, 5505135, 5470481, 6083415, 6309014, 5978495, 5644255, 4994581, 5177884, 5841806]
5678E841806L06868J01040K09239M79197o52953j21809j27877Q10209K54635m90252
5668F610103j05937L23827n32215K80750K505q2617Q8484j37768q9810L89088
5658F746410N59607J08997M73526Q0870n88004L40456j27752k76158K84976p5915
5648G527013K91043N86512l23051n99502L32024N38560L65812l48056N66366M54017
5638I390738j031003k46734O71480L12609n62615J28002N25597J115892L66175
5629A0670141J70036n11487L8123Q4963m0117K49096P80822j73432K9965P80795
5619A2078905L92040q1391M17076J27201R59967J199492N64757l1871O88268J21644
5609A6436088O68203o45831K46108j22862L81032Q17178m18252m40646R8530l03520
$$ y = [5841806, 6148674, 6249714, 6458953, 6938150, 6285197, 6163388, 6035511, 6845720, 7100355, 6610103, 6504166, 6827993, 6295778, 6576528, 6579033, 6496416, 6584900, 6447132, 6357322, 6746410, 7306017, 7415014, 7888540, 7969410, 7381406, 7721862, 7594110, 7317952, 7602928, 7527013, 7818056, 8404568, 8081517, 7482015, 7814039, 8352599, 8718411, 8370355, 8936721, 9390738, 8359735, 8113001, 8784481, 9097090, 8534475, 8662477, 9188074, 10303966, 10670141, 10840177, 10328690, 10366813, 10451776, 10411659, 10660755, 11441577, 11268145, 11298110, 12078905, 12470945, 12389554, 12806630, 12933831, 13893798, 15093290, 15658047, 15626176, 16314444, 16436088, 17104291, 16458460, 16704568, 16581706, 16962738, 17779916, 17361664, 16921018, 17019548, 16716028]
5599A6716028n12617k55345l66440j114112K4659R84750N2521K45208k66617N51976
5589A6060011N21514n0392J21279K78614p5567J392756O31471J178020J033905
5580B1091611M51812O80683O13947R4560J434852J217439L14436r16787Q63647
5571B5846200J084618J35422l00115M23349m95548M64475K27570P67750j378767
5562B6774954j067842l27676m70189n31162p85423k46496l15748o96245j040362
5553B1293811j20044j17449j076742J20819K16730k53431j02458j333396R0293
5544A8718133J182134K02008k11014K82205M48121P24895N58667N72421L30938
5535B2808508L74244M99448K31421R11019n76394k49735O2042n0907q36230n70156
$$ y = [16716028, 16203411, 15948066, 15581626, 14467514, 14492173, 15476923, 15529444, 15774652, 15508035, 16060011, 16581525, 16531133, 16652412, 16931026, 16855459, 18248215, 18879686, 20057706, 21091611, 21543423, 22224106, 22838053, 22932613, 24367465, 25584904, 25899340, 24982553, 25846200, 26930818, 27066240, 26766125, 27189474, 26693926, 27158401, 27385971, 28153721, 26774954, 25707112, 25379436, 24909247, 24378085, 23592662, 23346166, 23030418, 22334173, 21293811, 21173767, 21056318, 19979576, 20100395, 20317125, 20063694, 19961236, 18627840, 18718133, 19900267, 20102275, 19891261, 20173466, 20621587, 21346482, 21905149, 22477570, 22808508, 23182752, 23682200, 23913621, 24824640, 24248246, 23998511, 24060553, 24009646, 23173416, 22603260]
5525B2603260j180403n14566l95717q02494p99509p40174K95529k56057q2241
5516A8127628r64966m00162j68533P69126m85338r7223K37248m17543m33306J17859
5506A6284790L22574J054439j74854L34594O17690K72488J01757p20568K36548
5497A8329458J00496N41686K03074o32643k20033L32295j2090j24805P5564l38498
5487A8254504R1343l06090k1485N5455j81051j388681N77544J470070J32426J04124
5477A8788159O83309K4637l62266m58989j86994j74058J140865N91546L46820
5468B0393029K12215J053958M37223o89614M00327J315446P96566O29192O22296
5459B5170638K37412K52010M54700K48478m51107L27994P45856M71180M6963p44747
$$ y = [22603260, 21422857, 20908291, 20512574, 19710080, 18910571, 18170397, 18465926, 18209869, 18127628, 17162662, 16762500, 16593967, 17363093, 16877755, 16780532, 17017780, 16600237, 16166931, 16284790, 16607364, 17661803, 17486949, 17821543, 18439233, 18711721, 18813478, 18092910, 18329458, 18429954, 18971640, 19174714, 18542071, 18322038, 18654333, 18642243, 18517438, 18593002, 18254504, 18345847, 18039757, 18018272, 18073727, 17892676, 16503995, 17081539, 18551609, 18684035, 18788159, 19471468, 19496105, 19133839, 18674850, 18487856, 18313798, 19454663, 20046209, 20393029, 20605244, 21659202, 22096425, 21406811, 21807138, 23122584, 23919150, 24548342, 25170638, 25408050, 25660060, 26114760, 26363238, 25912131, 26240125, 26985981, 27457161, 27504124, 26759377]
5449B6759377O6479n47770p39401j50986m94776N47494J45614k03177n3756O31076
5439B5960174J065637O34159L89278L51819r68293j49200J39213K89403L93393
5430B8105583Q31714J09899J033675J76980K27292L73114J05838N61150N61252
5421C2086497Q46152K02030N42372N05744o56298q5344J80347m42051M63334P14834
5411C4357617M885N58258J172264N54508J247042R29130j97635L92317J79244
5402C9197630K94442O2456m73550J73449p05773j176740q16118j378891K66451
5393C5443356q66498o11324j64528j098795J43355J28061m99769L02259l4604
5384C2741513n46937J60256L95763L49977k43455L90163J213904L88767j97658
$$ y = [26759377, 26825856, 26278086, 25538685, 25387699, 24892923, 25440417, 25586031, 25382854, 25329098, 25960174, 27025811, 27659970, 28049248, 28401067, 27432774, 27283574, 27422787, 27712190, 28105583, 28937297, 29047196, 30080871, 30257851, 30485143, 30858257, 30964095, 31525245, 32086497, 32932649, 33134679, 33677051, 34182795, 33526497, 33441153, 33621500, 33179449, 33642783, 34357617, 34362502, 34920760, 36093024, 36647532, 37894574, 38823704, 38626069, 39018386, 39197630, 39492072, 39554528, 39080978, 39254427, 38548654, 37371914, 36555796, 35176905, 35443356, 34576858, 33965534, 33801006, 32702211, 32845566, 32973627, 32473858, 32776117, 32741513, 32194576, 32354832, 32750595, 33100572, 32857117, 33247280, 34461184, 34849951, 34652293]
5375C4652293k31160k12909J107416j1944P8653L83411r70343J74894O20364r80435
5365C4610240l9699l24763j122735n43670r04223l55861O56268n27634J29153
5356C1577076K60016k88526P56085M43173p030K48332M84385M13362m1661L80552
5346C4225764r9784l5232O42999j491188j47725J011341P5131j00564o4562p57594
5336C3258586o20598M24234K70739M39454L94785Q73968j91178O57994R02056
5327C6410040L31300J256813J224704J029380J774979J608953J954611J306373
5319D6897153J584929O33712J163312J206860n4917J055670l27106M19650J47773
5310E2727036J90115p56057k200356k785244k005570j472616k130643j125566
$$ y = [34652293, 34421133, 34208224, 35315640, 35303696, 35382349, 35765760, 34795417, 34970311, 35590675, 34610240, 34570541, 34245778, 33123043, 32579373, 31675150, 31319289, 31975557, 31447923, 31577076, 31837092, 31548566, 32304651, 32747824, 32740794, 32989126, 33473511, 33886873, 33845212, 34225764, 34125980, 34090748, 34733747, 33242559, 33094834, 34106175, 34181306, 34080742, 34016180, 33258586, 32637988, 33062222, 33332961, 33772415, 34167200, 35041168, 34849990, 35507984, 36410040, 36741340, 37998153, 39222857, 40252237, 42027216, 43636169, 45590780, 46897153, 48482082, 49115794, 50279106, 51485966, 51431049, 52486719, 52159613, 52579263, 52727036, 52917151, 52161094, 49960738, 47175494, 45169924, 43697308, 41566665, 40441099]
5302D0441099p69838k39508j48395M69078N15811L31833j09583j51785Q34393
5293D1173105M83943N26736O81459J78898J2610J073821m79063n31528m62982
5284D2656999N07562R9103m41702m73778j087764j397972j531123r06655p65755
5275C6658915j288863j074583j237762q84949P7336m88557n22446q80299m22034
5266B9936758n62890m66330R1557l79611Q812j67770rM98245k32984j47213N09968
5255B9088533J471671Q09690J271050J005251O69538J549856K002202J449147
5247C9316938J211910N64667n6834j497666j333810L36811j294301j217115m98816
5238C5531784n28023n10725o36402k176114p37432m75236q44218r12763j103506
$$ y = [40441099, 39671261, 39431753, 39283358, 39752436, 40268247, 40600080, 40490497, 40338712, 41173105, 41657048, 42183784, 42865243, 43044141, 43056751, 44130572, 43651509, 43119981, 42656999, 43164561, 43263664, 42821962, 42348184, 41260420, 39862448, 38331325, 37424670, 36658915, 35370052, 34295469, 33057707, 32172758, 32250094, 31761537, 31239091, 30358792, 29936758, 29373868, 28907538, 28999095, 28619484, 28628296, 28460526, 28460517, 28958762, 28725778, 28578565, 29088533, 30560204, 31369894, 32640944, 33646195, 34315733, 35865589, 37867791, 39316938, 40528848, 41093515, 41036681, 39539015, 38205205, 38542016, 37247715, 36030600, 35531784, 35003761, 34493036, 33856634, 31680520, 30943088, 30467852, 29623634, 28710871, 27607365]
5229B7607365P39352K84022J310876J109727M6510J637017L78290Q37149J277952
5220C5228260O93891O35095j518119r73950K26808N13911p56394m3265j01270
5211C3904967n18659l72142n9067k73209m81771k70815j018128j323882m15850
5202B9171444j051599j790935j63420m04530q52724K86q06953j413101q93727
5193B1794741J99585K22761N41473N18058m002j57155K58472k54177M50475J193792
5183B4764023M0785L70709r6149p15877m32523m16142o93028m36719n14732J42226
5173B2012573j39256P23403j66028Q51779J192400q62206k53070j57603K81553
5164B3483545l99833M5990K61802Q52525R93577N76935J417888J556822P43693
$$ y = [27607365, 28346717, 28630739, 29941615, 31051342, 31097852, 32734869, 33113159, 33950308, 35228260, 35922151, 36557246, 35039127, 34065177, 34291985, 34805896, 34049502, 34006237, 33904967, 33386308, 33014166, 32955099, 32681890, 32200119, 31929304, 30911176, 29587294, 29171444, 28119845, 26328910, 26165490, 25760960, 24908236, 24908522, 24101569, 22688468, 21794741, 21994326, 22217087, 22758560, 23276618, 23272616, 23115461, 23373933, 23119756, 23570231, 24764023, 24804808, 25175517, 25079368, 24363491, 23930968, 23514826, 22821798, 22385079, 21870347, 22012573, 21873317, 22596720, 22430692, 23282471, 24474871, 23612665, 23359595, 23201992, 23483545, 23083712, 23129702, 23391504, 24244029, 25237606, 25814541, 27232429, 28789251, 29532944]
5155B9532944M6741J194536K086797K595983L026562K222748K162892L391071
5147D6260274N054145M539436M677463N439806N573834M835231J366310m40162
5139G7306337k141491k739398j176862j463445n01034J403573L572252O216248
5131H0476180N889539P567572Q237151O380987K147139l554753q044676j0315241
5123H8783898j0104041r437721q288698o291087n322519m373126m597348l896254
5115C6473104k272541j860258j791555j675570j950520j298181o59850j189887
5107B3774742Q2979q94692O0085n71635o26192k39488j58573j217291k73667j78156
5097A9758112j184892n32853N3393O95887m74445m82851k39165r47212p36693
$$ y = [29532944, 29579685, 30774221, 32861018, 35457001, 38483563, 40706311, 42869203, 46260274, 51314419, 55853855, 60531318, 65971124, 71544958, 76380189, 77746499, 77306337, 75164846, 72425448, 71248586, 69785141, 69284107, 70687680, 74259932, 80476180, 86365719, 93933291, 102170442, 108551429, 110698568, 107143815, 99099139, 88783898, 78679857, 69242136, 60953438, 54662351, 49339832, 44966706, 40369358, 36473104, 34200563, 32340305, 30548750, 28873180, 26922660, 25624479, 24964629, 23774742, 23857721, 22963029, 23023114, 22451479, 21825287, 21585799, 21427226, 20209935, 19936268, 19758112, 18573220, 18040367, 18093760, 18789647, 18315202, 17832351, 17593186, 16645974, 15909281]
5088A5909281k81905q65651k40323o54946n30656J06499j18261m63482J25622
5079A2986178j63229Q4874p91196o49943J10601K56073N404M1408J50418K3029
5069A2053617q12288j59062Q03419q8486J47308J47421p08538j36281k89097l85299
5059A0572714k80175J84452Q15682J90377k21188J136224M47343P7837l46198
5050A2577068q27526L69379K55422L68514j96310n02314L41988N79808m3339O73984
5040A3596674R56893K41475k78129J002234j85997q45118J298871N89586P64647
5031A7141136P75494O74981J50223N36865J658242Q66674J564122J572748Q50157
5022B5790642J974369K166055L032953K094341J453369M90194r29140j781052
$$ y = [15909281, 15627376, 14761725, 14521402, 13866456, 13335800, 13442299, 13324038, 12860556, 12986178, 12822949, 12907823, 12116627, 11466684, 11577285, 11833358, 11838762, 11880170, 12030588, 12053617, 11241329, 11082267, 11885686, 11797200, 11944508, 12091929, 11383391, 11247110, 10958013, 10572714, 10292539, 10476991, 11292673, 11483050, 11261862, 12398086, 12845429, 12923266, 12577068, 11749542, 12118921, 12374343, 12742857, 12546547, 12044233, 12386221, 12966029, 12922690, 13596674, 14553567, 14795042, 14516913, 15519147, 15333150, 14488032, 15786903, 16376489, 17141136, 17916630, 18591611, 18741834, 19278699, 20936941, 21803615, 23367737, 24940485, 25790642, 27765011, 29931066, 32964019, 35058360, 36511729, 37001923, 36072783, 34291731]
5014C4291731k052550j043170j089444n67628k63435q8157o60825K11427Q69292
5005B9607241M14421o81336P11570R31406n38355J393853K344615J217046J841262
4996C7241723J515480J405507M14565q03956j316082j746137j654289j547868
4988C3508943j412106j241119k12730m66755j002492q72933l05337j260171q35024
4979B5900276o46211j396802j089205j054207m34568j255732n98243k56869l86549
4970A8781890N8682N76041j91686K61265o43003K27027J4822n87786Q14011J180277
4960B0491540o35296K7797J50663M1350L7137O75796P71232J94147O11784J245685
4950B3611835N79889K57029J378500J100295J154652J365890J156979J633464
$$ y = [34291731, 32239181, 31196011, 30106567, 29538939, 29275504, 29187347, 28526522, 28737949, 29607241, 30021662, 29340326, 30051896, 30983302, 30444947, 31838800, 34183415, 35400461, 37241723, 38757203, 40162710, 40577275, 39773319, 38457237, 36711100, 35056811, 33508943, 32096837, 30855718, 30642988, 30176233, 29173741, 28300808, 27995471, 26735300, 25900276, 25254065, 23857263, 22768058, 21713851, 21279283, 20023551, 19425308, 19168439, 18781890, 18840572, 19416613, 19224927, 19486192, 18843189, 19070216, 19085038, 18497252, 19311263, 20491540, 19856244, 19884041, 20034704, 20076054, 20113191, 20788987, 21560219, 21754366, 22366150, 23611835, 24191724, 24448753, 25827253, 26927548, 28082200, 29448090, 30605069, 32238533]
4942C2238533J571949J303436J647766K396100L572562L302346M733273M691451
4934E5457416L119090K750066J652000m05491k88402n79271K96952Q06262J7509
4925F2826131j687766l136136m102593l550287l784946l133386m235805l723045
4917C5472167k272141k366661j970896q07001j776876j527882j082011n92558
4909B3076141o47913j18056m56412l00741j11168j110922m0474j33485n93208
4900A9563762o2801k90045l63886j29129J95851O32073j16411p29178J61437p65025
4890A8096648L17880L02458M83162J20880o22961K40442n40777m00903L04805
4881A8301634L19700J07626K11501l4332M40877k37929M33004J93598R06586Q93769
$$ y = [32238533, 33810482, 35113918, 36761684, 39157784, 42730346, 46032692, 50765965, 55457416, 58576506, 61326572, 62978572, 62573081, 62284679, 61705408, 62002360, 62808622, 62826131, 61138365, 58002229, 53899636, 50349349, 46564403, 43431017, 39195212, 35472167, 33200026, 30833365, 28862469, 28055468, 26278592, 24750710, 23668699, 23076141, 22428228, 22310172, 21853760, 21553019, 21441851, 20330929, 20290455, 20156970, 19563762, 19500961, 19210916, 18847030, 18717901, 18913752, 19545825, 19429414, 18700236, 18861673, 18096648, 18414528, 18716986, 19200148, 19321028, 18698067, 18938509, 18397732, 17996829, 18301634, 18621334, 18728960, 18940461, 18906129, 19347006, 19109077, 19542081, 19735679, 20642265, 21536034]
4871B1536034M5040r32813P96503N29311M06706P42213K75272P26569J185195
4862B5310030J402036J492992M93761J379392J369745O57559J488262J530484
4854C5124261K291473J186539J828138J509907J782595K132197K552200L509545
4846E1916855K994295L804858M240660N435808N831831P486102R663156J2004202
4838A03377767J5901972J8378036J9429835K1577652J9234993J1044649k841174
4831B06103730j5765817k2576142k3520111k0833427j8477694j4461616j0984962
4824G9483961q148840p181129o218226l907272l798090l380944l184070j761556
4816D1903834j791482j663586j732945j593505j847633j875451p30604k68398
$$ y = [21536034, 21581074, 20648261, 21444764, 21974075, 22380781, 23122994, 23398266, 24124835, 25310030, 26712066, 28205058, 28698819, 30078211, 31447956, 32105515, 33593777, 35124261, 37415734, 38602273, 40430411, 41940318, 43722913, 45855110, 48407310, 51916855, 54911150, 58716008, 62956668, 68392476, 74224307, 81710409, 91373565, 103377767, 119279739, 137657775, 157087610, 178665262, 197900255, 208944904, 206103730, 190337913, 167761771, 144241660, 123408233, 104930539, 90468923, 79483961, 71335121, 64153992, 57935766, 54028494, 50230404, 46849460, 43665390, 41903834, 40112352, 38448766, 36715821, 35122316, 33274683, 31399232, 30668628, 30400230]
4808C0400230n84824p62697o27916j266056o52842m04086K91m69324j022520q00499
4798B3809757n08489p70137r41902k89278j31978q60483j635251k48824K94620
4789A8718035j88500O05192j116446m05205o7851o91416l51060N09269J71192
4780A7183210m23216p80995J17708j192110r5053K05108k49664r0637p64969n60404
4770A3348978M66852P7198j1569j463152o45541l05762J86764M79338R57611l58951
4760A2731766o01131M7276q5482k7872o40616O08677m29973l26063m1510O6371
4750A1301443q62589J532355o51983K83386M06909j152707K80669m13431j85145
4741A0538907j287888p31447R86182K5219p5813M76695r90494K50683P0766j82563
$$ y = [30400230, 29815406, 29052709, 28424793, 27158737, 26505895, 26101809, 26102100, 25632776, 24610256, 23809757, 23301268, 22531131, 21589229, 21299951, 21167973, 20307490, 18672239, 18423415, 18718035, 18529535, 19134727, 18018281, 17613076, 17545225, 16853809, 16502749, 17012018, 17183210, 16759994, 15978999, 16096707, 14904597, 14809544, 15014652, 14764988, 14674351, 13909382, 13348978, 13815830, 13893028, 13881459, 12418307, 11772766, 11467004, 11653768, 12133106, 13090717, 12731766, 12130635, 12177911, 12092429, 12064557, 11423941, 12032618, 11602645, 11276582, 11235072, 11301443, 10438854, 11971209, 11319226, 11602612, 12009521, 10856814, 11137483, 10724052, 10538907, 9251019, 8519572, 9505754, 9530973, 9455160, 9931855, 8941361, 9192044, 9262810, 9080247]
4731I080247K17017K43623K45579k41253n76075o96082R2181L09209K22670j054059
4721G843057L74668J48334N55504J00550K99218n35421j80007m52385l37117J056383
4711H872784l31952n39068N32097j47286o83141k37249O76693L71597M79631m47709
4701H546397j138466P59571P70790o70183L14167L19397j151436L06318o33055
4692G423500p09352J98219J506351j59680l95026O52933K15482n58837L93872
4683H567462k78911l91999M86116Q9021K34105K4864J87198L86509K42925q3726
4673I463564K77031o41994P39864M19007O50902L49810K39307p67123m40535M23961
4663A0713794Q17502r3648j59621M90106M82724j91432m2651k28268R67724k80799
$$ y = [9080247, 9297264, 9540887, 9786466, 9545213, 8969138, 8273056, 8365237, 8674446, 8897116, 7843057, 8217725, 8366059, 8921563, 9022113, 9321331, 8785910, 8605903, 8153518, 7816401, 8872784, 8540832, 8001764, 8533861, 8386575, 7703434, 7466185, 8142878, 8514475, 8994106, 8546397, 7407931, 8167502, 8938292, 8268109, 8582276, 8901673, 7750237, 8056555, 7423500, 6714148, 6912367, 8418718, 8259038, 7864012, 8516945, 8732427, 8173590, 8567462, 8288551, 7896552, 8382668, 8471689, 8705794, 8730658, 8917856, 9304365, 9547290, 9463564, 9740595, 9098601, 9838465, 10257472, 10908374, 11258184, 11497491, 10730368, 10289833, 10713794, 11531296, 11437648, 11278027, 11768133, 12250857, 12059425, 12016774, 11788506, 12756230, 12475431]
4653A2475431l0812Q35077k37243J82440p5448j49928P22373R11648L04840p2057
4643A4866321J46545J31050r6471J025913l14605K55091O35089P71359R16905
4634A8337197p1322n92320M22495J108565L11100J08995K83196L39703J330692
4625B1578301J337100J318829N26423N66704N66651P95121N81627L271676M24044
4616C0966476J041552J692649J168363J065687K622040R38546J828437K392389
4608D3716139L221890L033144K654155M133299M111948M952915O381306O516297
4600G8721093P625768Q377494J0212379J2835295J4577323J9189863K2893659
4593A74432874K6395457K9804658L0553257K5052186R145756j1798378k3329548
$$ y = [12475431, 12444619, 13279696, 13042453, 13224893, 13149445, 12999517, 13721890, 14633538, 14938378, 14866321, 15012866, 15143916, 15047445, 16073358, 15758753, 16013844, 16648933, 17420292, 18337197, 18265875, 17673555, 18096050, 19204615, 19515715, 19624710, 19907906, 20247609, 21578301, 22915401, 24234230, 24760653, 25327357, 25894008, 26689129, 27270756, 30542432, 30966476, 32008028, 33700677, 34869040, 35934727, 38556767, 39495313, 41323750, 43716139, 46938029, 49971173, 52625328, 56758627, 60870575, 65823490, 72204796, 78721093, 86346861, 94724355, 104936734, 117772029, 132349352, 151539215, 174432874, 200828331, 230632989, 261186246, 286238432, 295384188, 283585810, 260256262]
4586B60256262k9498218l0739553k8365640k4507756k0529390j6678785j3348409
4579I6588511j0493693q797271p658714o477319m420428m339399l605270l000375
4571D7796042l098962k265153k113901k051235j721005k001168j617892j004922
4563C1921804j569891j788510j180051j288898J58421j249707o44091j448713
4555B2910364p92552o60671j020025p11705j680984K8381j76815j459442J81916
4546A6618467j47334n60564k66981j28240j49482p81996m05459K79987l51156
4537A4107242o73861p63557l85509L8903J01619J45685l85432q97663o95105K42012
4527A0834334j9161k91552p404p6479L57953o62810J30309o72835K41736J006693
$$ y = [260256262, 230758044, 200018491, 171652851, 147145095, 126615705, 109936920, 96588511, 86094818, 77297547, 69638833, 63161514, 58741086, 54401687, 50796417, 47796042, 44697080, 42431927, 40318026, 38266791, 36545786, 34544618, 32926726, 31921804, 30351913, 28563403, 27383352, 26094454, 26252875, 25003168, 24359077, 22910364, 22117812, 21457141, 20437116, 19725411, 18044427, 18072808, 17895993, 16436551, 16618467, 16471133, 15910569, 15643588, 15515348, 15365866, 14583870, 14178411, 14458398, 14107242, 13433381, 12669824, 12284315, 12323218, 12424837, 12570522, 12185090, 11287427, 10592322, 10834334, 10815173, 10523621, 10516217, 10439738, 10797691, 10134881, 10265190, 9592355, 9834091, 10840784]
4517A0840784p26853L89102q06688q53777l85204l8851o1533Q1578m76681K7264
4507G989141m9554r8417m3900j36015k23639m49136p62589j16764J06126K09551
4497F424804J08551j09035L20141j10085J28973M44242K65209n20705j05655k0527
4487F825913j030512k84973M392R67586L23280j030492r921O97868k57024j08446
4477F097671N93781o66706o13793n3262k97807j39987Q41679K71350J62773m81596
4467E714103L323n113O92978k92313m42552m49919K05630J94864Q7951P02792
4457F411744l54288Q1341o71200Q6506L41128O56591o2315l57982J81395p25362
4447E587558q1929K02790k1563R09288K80733j96901m52707n62715q39815m21798
$$ y = [10840784, 10113931, 10503033, 9696345, 8842568, 8457364, 8418513, 8356980, 8438558, 7961877, 7989141, 7939587, 7841170, 7797270, 7661255, 7437616, 6988480, 6225891, 6109127, 6215253, 6424804, 6533355, 6424320, 6744461, 6634376, 6763349, 7207591, 7472800, 6952095, 6846440, 6825913, 5795401, 5510428, 5514820, 6482406, 6805686, 5775194, 5765273, 6463141, 6206117, 6097671, 6691452, 6024746, 5410953, 5357691, 5059884, 4919897, 5761576, 6032926, 6195699, 5714103, 5717426, 5712313, 6405291, 6112978, 5670426, 5220507, 5426137, 5621001, 5708952, 6411744, 6057456, 6138797, 5467597, 5554103, 5895231, 6551822, 6489507, 6131525, 6312920, 5587558, 5505629, 5708419, 5686856, 6596144, 6876877, 6679976, 6227269, 5664554, 4824739, 4402941]
4437D402941l7694M48707O96006j67058R9344L5488k83849j66090N33111M45428
4427F006334k57833j23541l90736j39665L77765K5068k10325M87359n48260N04920
4417E731086j29929j08558R82172j11889M06953K02825o11326m74529j60896M47742
4407F173651q4339m47336M85930L29934J59523n9943J36383j84396l26127J043027
4397G226307J36361n43458n11651J77901L38624J16885L01317l65259k26210L80261
4387G031078j35966J99221l26256J252260m1916L3619l32210p53978L46743J66433
4377G439028j67115J92790N86146N0683p04370O4338N5050P89129L47098J45465
4367H798242J058093k75324J09069Q2031p98780l00220J02553L96002P8766Q4919
$$ y = [4402941, 4365247, 4813954, 5509960, 5342902, 5442246, 5477734, 5193885, 5027795, 5560906, 6006334, 5748501, 5624960, 5234224, 5094559, 5472324, 5497392, 5287067, 5774426, 5226166, 5731086, 5601157, 5492599, 6474771, 6362882, 6769835, 6972660, 6361334, 5886805, 5725909, 6173651, 6089312, 5641976, 6127906, 6457840, 6617363, 6557420, 6693803, 6509407, 6183280, 7226307, 7362668, 6819210, 6307559, 6485460, 6824084, 6940969, 7242286, 6877027, 6650817, 7031078, 6895112, 7094333, 6768077, 8020337, 7978421, 8012040, 7679830, 6925852, 7272595, 7439028, 7271913, 7464703, 8050849, 8101532, 7397162, 7461500, 7516550, 8305679, 8652777, 8798242, 9856335, 9581011, 9690080, 9772111, 8973331, 8673111, 8775664, 9171666, 9250432, 9335351]
4357I335351M83235o37836Q69865M55183m60484L4976L31613m17727o81657N94443
4347I906962Q85832M48837k45573K41753L84152J26480N196n11014n99875k00269
4337A0442481K126436O26069o40984j38156M52802K674J56764K57455R01473L53806
4327A4540820Q63072l9330L06630k56731j48805O15892O64859J94861J103611
4318A7844879J01374k9173N28016P82315j294312K39897J156611L21999j83305
4309A9468301K84142Q17454Q34301K2678K7831L91025R50712Q58933P6010Q06271
4299B4537658J284880O39081Q52331J024248Q7958P85727P42771J401201N62313
4290C1918168P30080R88311K811914L67157P81805K221558J599026M15673J655241
$$ y = [9335351, 9818586, 9180750, 10050615, 10505798, 10045314, 10080290, 10411903, 9994176, 9312519, 9906962, 10792794, 11241631, 10996058, 11237811, 11621963, 11748443, 11753639, 11242625, 10642750, 10442481, 12568917, 13194986, 12554002, 12415846, 12868648, 12871322, 13028086, 13285541, 14187014, 14540820, 15403892, 15364562, 15671192, 15414461, 15265656, 15881548, 16546407, 16741268, 17844879, 17946253, 17917080, 18445096, 19227411, 17933099, 18172996, 19329607, 19651606, 19468301, 19752443, 20569897, 21404198, 21426876, 21454707, 21845732, 22796444, 23655377, 23731387, 24537658, 25822538, 26461619, 27313950, 28338198, 28426156, 29211883, 29954654, 31355855, 31918168, 32648248, 33636559, 36448473, 36815630, 37597435, 39818993, 41418019, 41833692, 43488933]
4281D3488933J567223J207781J147121J203691J696342M16433K250980J959771
4273E4938275R49620J875802J370838J674544J112188J922536J528007J928263
4265F7300073J618960P91557P70526P76469K027324R90670K74949Q26149R21804
4256G6298481R58170M12406J034627R03717p74098p6650O23737L661p00043k76497
4246G8407511q95843m29333p02581j137205n31366r93642j255978j550914O4341
4237G0974990j210746j933997j209964j193150j423167m80294k175779j650221
4229E9697672j968824j220332n13049j079165j586285j805444j078715k252578
4221D8193280j243166r15768j743462r01717o51172k070882q19031o64032k166618
$$ y = [43488933, 45056156, 46263937, 47411058, 48614749, 50311091, 50727524, 52978504, 54938275, 55887895, 57763697, 59134535, 60809079, 61921267, 63843803, 65371810, 67300073, 68919033, 69710590, 70481116, 71257585, 73284909, 74275579, 74550528, 75376677, 76298481, 77256651, 77669057, 78703684, 79607401, 78833303, 78756653, 79380390, 79384051, 78684008, 78407511, 77511668, 77082335, 76379754, 75242549, 74711183, 73717541, 72461563, 70910649, 70974990, 69764244, 67830247, 66620283, 65427133, 64003966, 63523672, 61347893, 59697672, 57728848, 56508516, 55995467, 54916302, 53330017, 51524573, 50445858, 48193280, 46950114, 46034346, 44290884, 43389167, 42737995, 40667113, 39848082, 39184050, 37017432]
4212C7017432r06369m71234j943867j106532q61960q77324o49055j068187l65252
4203B8767652m14744j332386l07306k32180r24677r31686n63315j15944n66258
4194B3379156n61224n24528l24383j84881o51965q08111J55754l33907j193319
4185A8952592l1764o05380j79306k37733R4947k05885k70630j88979j16788k1911
4175A7189163k54685L64421p7396o71668q430K56346K89635J40153r11651J30654
4165A6446542P66512k11290j106782L86714l53086J87785K64913k18130k3396
4156A6139782l88292L86482j92120R76350M50417O67462L57772m34559O80140
4147A8643434n27164j30673P2907p3104J13622j106930o3669L96507k78158J147971
$$ y = [37017432, 36111063, 35639829, 33695962, 32589430, 31727470, 30850146, 30201091, 29132904, 28767652, 28352908, 27020522, 26713216, 26481036, 25556359, 24624673, 24061358, 23945414, 23379156, 22817932, 22293404, 21969021, 21784140, 21132175, 20324064, 20479818, 20145911, 18952592, 18920828, 18315448, 18136142, 17898409, 17993356, 17787471, 17516841, 17327862, 17211074, 17189163, 16934478, 17298899, 17221503, 16549835, 16541405, 16797751, 17087386, 17227539, 16315888, 16446542, 17213054, 17001764, 15894982, 16281696, 15928610, 16116395, 16381308, 16163178, 16139782, 15751490, 16137972, 15945852, 16922202, 17372619, 18040081, 18397853, 17963294, 18643434, 18116270, 17985597, 18058504, 17985400, 18099022, 16992092, 16928423, 17324930, 17046772, 18194743]
4137A8194743M83209J11744k8380K66316J110381K17668J97431k73741k05254
4128B0074117k45321J457886Q41765M97806k01743J78982O41802J013710L71103
4119B4630107O27571Q7125L83586R63390k54387M25941J413991R06125m1939K66406
4109B9407916K97100L56530Q02149R9468Q27666N41364N22357Q0640R77910M09090
4099C4322190O89803J358770n6005O69963N26889K05578j073382N01850R22528
4090C8068184Q37070N75538q28269J62023N71662J53513J035322l0224P22573
4081D1267392L62694j004029K7367P13024P88685L69410j07229P65745k64452
4072D2918607o64858L74692J397429J255174o68030m87606J068456k72442j03184
$$ y = [18194743, 18677952, 18789696, 18761316, 19027632, 20138013, 20355681, 20553112, 20279371, 20074117, 19828796, 21286682, 22128447, 22626253, 22424510, 22603492, 23245294, 24259004, 24630107, 25257678, 25344803, 25728389, 26691779, 26437392, 26863333, 28277324, 29183449, 29141510, 29407916, 29705016, 30061546, 30863695, 30963163, 31790829, 32332193, 32854550, 32935190, 33913100, 34322190, 35011993, 36370763, 36314758, 36984721, 37511610, 37717188, 36643806, 37145656, 38068184, 38905254, 39480792, 38652523, 38814546, 39386208, 39539721, 40575043, 40544819, 41267392, 41630086, 40626057, 40653424, 41366448, 42155133, 42524543, 42417314, 43183059, 42918607, 42253749, 42628441, 44025870, 45281044, 44613014, 44125408, 45193864, 44921422, 44818238]
4063D4818238L66182k56186N05939Q33698L3506R89242M98773P67021N42632R13020
4053E0012065J081871J138252J072394Q12853R25507J243816J688010J912806
4045E9887574Q51314R12894K652512J245161J803399J987462J672541K130447
4037G3143304K138321K803783K096984K842425K581602K642257K610105K357869
4029I3216650K721799L248714L246266L213722L219506K679334K893193L617829
4021A18057013L607202K562085L284976L601220L440601K762351L562496K044283
4013A42922227K683040K918168J992314J964060J684982K086581J894465K199649
4005A60345486K087448R13388Q64644M29265R50701O73813M85121p3040R1399
$$ y = [44818238, 45184420, 44928234, 45434173, 46267871, 46301377, 47290619, 47789392, 48556413, 49099045, 50012065, 51093936, 52232188, 53304582, 54117435, 55042942, 56286758, 57974768, 59887574, 60738888, 61651782, 64304294, 65549455, 67352854, 69340316, 71012857, 73143304, 75281625, 78085408, 80182392, 83024817, 85606419, 88248676, 90858781, 93216650, 95938449, 99187163, 102433429, 105647151, 108866657, 111545991, 114439184, 118057013, 121664215, 124226300, 127511276, 131112496, 134553097, 137315448, 140877944, 142922227, 145605267, 148523435, 150515749, 152479809, 154164791, 156251372, 158145837, 160345486, 162432934, 163346322, 164210966, 164640231, 165590932, 166264745, 166749866, 166676826, 166768225]
3996A66768225J39912o95155j157820j627902j957747n88305j542500k428312
3988A56910396k401584k207262j593202k823780k227468j816971k475316k500813
3980A38864000k613883m595685l261368k315978l663084l318437k739783l419321
3972A12936461k597498k047007k860196l359659k933095k033947l117584k726608
3964I1260867j802582j779572k096769j834367j680879k024550n59396j005846
3956G8476906j850462j455970p64354p84229m43004m23933p57510o72354m05582
3947G0919508k0648P48885k16756R81728J135081n74328J498611J816859J828734
3938G8117674J384999J255922J126210K280670K080003J146116J763668J137992
$$ y = [166768225, 166908137, 166212982, 165055162, 163427260, 161469513, 160881208, 159338708, 156910396, 154508812, 152301550, 150708348, 147884568, 145657100, 143840129, 141364813, 138864000, 136250117, 131654432, 128393064, 126077086, 122414002, 119095565, 116355782, 112936461, 110338963, 108291956, 105431760, 102072101, 99139006, 97105059, 93987475, 91260867, 89458285, 87678713, 85581944, 83747577, 82066698, 80042148, 79482752, 78476906, 76626444, 75170474, 74406120, 73621891, 73178887, 72754954, 71997444, 71325090, 70919508, 70898860, 71647745, 71430989, 72412717, 73547798, 72973470, 74472081, 76288940, 78117674, 79502673, 80758595, 81884805, 84165475, 86245478, 87391594, 89155262, 90293254]
3930I0293254P92290M67381J364286J803979q8984q1105Q51797q7841J24638l45225
3920I5094470m31774n3253m30848m65670l21226n2690p73546o68105p33677j574751
3910H9588930n80402n27365o03355r34274n63975l09336k01635q87319j11391
3901H4869878l44502m59238q6490J08500n63516J29293P37314L76774O06432O67225
3891H6041670J837663R00104P63732J116060R79639P67028J233469K296363K282325
3882I8218053K374054K488698K101517K401141K378838L105747K056733K445682
3874A17570463J782143P40637P72934L53457R960O14311o76138m67783j364707
3865A19335277q16349j865969j548420j105032k304987j964864k900460j821436
$$ y = [90293254, 91085544, 91552925, 92917211, 94721190, 94632206, 94551101, 95402898, 95315057, 95439695, 95094470, 94662696, 94609443, 94178595, 93712925, 93391699, 93339009, 92565463, 91897358, 91163681, 89588930, 89008528, 88481163, 87877808, 86943534, 86379559, 86070223, 85868588, 84981269, 84869878, 84525376, 84066138, 83979648, 84088148, 83524632, 83653925, 84391239, 84768013, 85374445, 86041670, 87879333, 88779437, 89543169, 90659229, 91638868, 92405896, 93639365, 95935728, 98218053, 100592107, 103080805, 105182322, 107583463, 109962301, 113068048, 115124781, 117570463, 119352606, 120093243, 120866177, 121219634, 121229594, 121843905, 121167767, 120699984, 119335277, 118518928, 116652959, 115104539, 113999507, 111694520, 109729656, 106829196, 105007760]
3857A05007760l852013l787582l894276m694448n194035m049539l389047l272789
3849G2874031l347244l162295k348255l063620k280644j964344k589793k534213
3841E1583623j535562k065295j160739j334083q36906j832877k144293J13956
3833D0787824M389j211042j653476p75987m18084j513062j147200j49289j238548
3824C2685525K37552j042633q25699o43164p72500L10569p8402j05331m90837
3815B9275080n13368m06726r64416p84621p9911o8503n43038l14906K67590m87513
3805B5379668N7225M37267J84293k08013o86816K08508l90685l17060Q65887K4992
3795B5555266m53456q7110j49236O27827N69015j79604k20651l9143L72544L01081
$$ y = [105007760, 101155747, 97368165, 93473889, 88779441, 83585406, 79535867, 76146820, 72874031, 69526787, 66364492, 64016237, 60952617, 58671973, 56707629, 54117836, 51583623, 50048061, 47982766, 46822027, 45487944, 44651038, 42818161, 40673868, 40787824, 40792213, 39581171, 37927695, 37151708, 36733624, 35220562, 34073362, 33924073, 32685525, 32923077, 31880444, 31054745, 30411581, 29639081, 29949650, 29871248, 29765917, 29275080, 28761712, 28354986, 27390570, 26605949, 26526038, 26457535, 25914497, 25599591, 25867181, 25379668, 25436893, 25874160, 26058453, 25850440, 25163624, 25372132, 24981447, 24664387, 25530274, 25555266, 25101810, 25014700, 24865464, 25493291, 26062306, 25882702, 25662051, 25622908, 25995452, 26296533]
3785B6296533n98976m7531n50216r1283J719889M60060l99609o3725p09209O00346
3775B6616279n37988Q2124J0384R79776J013157m63786q50441M0849J109300l95303
3765B7604351k91781k16490O25548Q90279J015475J73673J57039j24215P75793
3756C0609672N8002P8567M20500K42253L68554K59419N85762Q24946N98260M89237
3746C4535172K88916L47970J176832R21437k93501J232215P57568j90400J142153
3737C9918362L97322P43583J212303Q85530P63093O8904R52071J088264J069609
3728D7099041J831226R87339M39528N90970R80901R15979J779617P73048J161141
3719E6558790k80224N49601J663108J206130O66755m88025J554417R10315J301249
$$ y = [26296533, 25697557, 25650026, 25099810, 25008527, 26728416, 27188476, 26788867, 26725142, 26015933, 26616279, 26078291, 26160415, 26170799, 27150575, 28163732, 27699946, 26849505, 26890354, 27999654, 27604351, 27312570, 27096080, 27721628, 28611907, 29627382, 29801055, 29958094, 29833879, 30609672, 30667674, 30746241, 31166741, 31408994, 31777548, 32036967, 32622729, 33447675, 34045935, 34535172, 34824088, 35172058, 36348890, 37270327, 36976826, 38209041, 38966609, 38776209, 39918362, 40315684, 41059267, 42271570, 43157100, 43920193, 43989097, 44941168, 46029432, 47099041, 48930267, 49917606, 50357134, 50948104, 51929005, 52844984, 54624601, 55397649, 56558790, 56278566, 56828167, 58491275, 59697405, 60364160, 59876135, 61430552, 62340867, 63642116]
3710F3642116J226665P22155J352875J069393k92286Q17410R79930M91308J939081
3701G1948647K180017J658971J345571K38577J823235K430303K371924J644469
3693H5641714K399637K921099K335135J833519K512865L137929K512686L456396
3685A06750980L069689L847310M106579M717228M451910M009484M075541M627346
3677A39656067N144999N816961N189494M496408N667238M964590M450430M892436
3669A80278623M900724N505187M154585N060126M218500M049054M161779L798212
3661B16126790L941762K984186L289467L313339K661403L019931K441548R72883
3653B38751309J032958K271142M73046M40104M11879K4975J32023l84830J20877
$$ y = [63642116, 64868781, 65590936, 66943811, 68013204, 67720918, 68538328, 69518258, 70009566, 71948647, 74128664, 75787635, 77133206, 77371783, 79195018, 81625321, 83997245, 85641714, 88041351, 90962450, 93297585, 95131104, 97643969, 100781898, 103294584, 106750980, 109820669, 113667979, 117774558, 122491786, 126943696, 130953180, 135028721, 139656067, 144801066, 150618027, 155807521, 160303929, 165971167, 170935757, 175386187, 180278623, 185179347, 190684534, 194839119, 199899245, 204117745, 208166799, 212328578, 216126790, 220068552, 223052738, 226342205, 229655544, 232316947, 235336878, 237778426, 238751309, 239784267, 242055409, 242528455, 242968559, 243380438, 243405413, 243537436, 243152606, 243273483]
3644B43273483j115801L02589j8492p30946j160025j55441K14903q50701q66336
3635B38893233r52131r20648j024119j019925o7477j61751j765559j509248j56469
3626B31315906o42741r6997n10408l51846K38903J056619p0723l63203p41992
3617B29833518m54973J64873R54849R09838L30934L01180R46999K003460J221745
3608B36212423N71236J361126K018350J787332K245696R69737K033449J084224
3600B48283573J713623J341862J794291J038279L63153P52338J136934J803246
3592B58227299o9555j68199R84485j53500n25930r2236M82095n41184o79487k48468
3582B57215320j297550r66347p59874o94907j156294j057882j169053p2605L02165
$$ y = [243273483, 242157682, 242460271, 242441779, 241710833, 240550808, 240395367, 240610270, 239759569, 238893233, 237941102, 237020454, 235996335, 234976410, 234908933, 234747182, 232981623, 231472375, 231315906, 230673165, 230576168, 230065760, 229713914, 229952817, 231009436, 230938713, 230575510, 229833518, 229378545, 229543418, 230498267, 231408105, 231739039, 232040219, 232987218, 234990678, 236212423, 236783659, 238144785, 240163135, 241950467, 244196163, 245165900, 247199349, 248283573, 249997196, 251339058, 253133349, 254171628, 254534781, 255287119, 256424053, 258227299, 258157744, 257989545, 258974030, 258820530, 258294600, 258202364, 258684459, 258143275, 257463788, 257215320, 255917770, 254951423, 254191549, 253496642, 252340348, 251282466, 250113413, 250040808, 250342973]
3573B50342973n84246m28284M6400K39807R04848J62650k70992M09972R10037
3564B51733165J799158N73281M09722J547674J808738O02476N14914J59002L22486
3555B59470616J423106N18221J78378P65875O39352K86818M63158j046241q76664
3546B61822619m61582j189124j522399j970239k679865k434517l490351l225424
3538B44849118l196589l902323m190011l552906l852322l679264l670642l217450
3530B15587611l154381l349228l167462l135880k860931k256580l106926k844035
3522A91712188r86487j570511k001337j115545n58367o73946M59994O4417P36943
3513A86067349J572124J199943J904556J440014K796180M343030M351496M995862
$$ y = [250342973, 249758727, 249330443, 249376843, 249616650, 250521498, 250684148, 250413156, 250823128, 251733165, 253532323, 254105604, 254515326, 256063000, 257871738, 258474214, 258989128, 259148130, 259470616, 260893722, 261411943, 261590321, 262356196, 262995548, 263282366, 263745524, 262699283, 261822619, 261361037, 260171913, 258649514, 256679275, 253999410, 251564893, 248074542, 244849118, 241652529, 237750206, 233560195, 230007289, 226154967, 222475703, 218805061, 215587611, 212433230, 209084002, 205916540, 202780660, 199919729, 197663149, 194556223, 191712188, 190725701, 189155190, 187153853, 186038308, 185479941, 184805995, 185265989, 185330406, 186067349, 187639473, 188839416, 190743972, 192183986, 194980166, 199323196, 203674692, 208670554]
3505B08670554L958972M060210N417638N582722M998596O301609M644879M490171
3497B48125351M767239L937877M512173M806148N461696M857698M201694N118208
3489B85788084M843261N317600N657531N580361M860518L399215L231059K373871
3481C21051500K063859M64859q35363j647631k721355m099197m266346m344940
3473C05665386o231020n855969o141717p006049o342090o036988p210543p289283
3465B53551727r021232r181195p735258r165666j0497916r689888j0455441j1774591
3457A76030540r843387j0424973q404622p852691q158710p928057o607306o493102
3449A10317692n850728l817319l807751m016701k763867l205542l163747l969783
$$ y = [208670554, 212629526, 216689736, 222107374, 227690096, 232688692, 238990301, 243635180, 248125351, 252892590, 256830467, 261342640, 266148788, 271610484, 276468182, 280669876, 285788084, 290631345, 295948945, 301606476, 307186837, 312047355, 315446570, 318677629, 321051500, 323115359, 323580218, 322744855, 321097224, 318375869, 314276672, 310010326, 305665386, 299434366, 293578397, 287436680, 280430631, 274088541, 268051553, 260841010, 253551727, 244530495, 235349300, 227614042, 218448376, 207950460, 198260572, 187805131, 176030540, 166187153, 155762180, 147357558, 139504867, 131346157, 123418100, 116810794, 110317692, 104466964, 100649645, 96841894, 92825193, 90061326, 86855784, 83692037, 79722254]
3441G9722254m102879j912682j948997k049474j997458j990379j463651o58715
3433F3598019j633702q93655j358574r28061n72151L28901P8660K10702J29470
3424E8959609J429300K123715R04217J928798K502609J054978q98817k383637
3416F5620772l379320l023968l279280k547676k491742j372422n05606j989085
3408D7031673j252632p89212j260260M310N8958L5234M02450o96444p5003O56013
3398D4115087J45314P35286J444429J347961J473101K438970L443849M082745
3390E9226742N071024N632240N782430L954644k04514m529905n746395n229067
3382F3957199n751416m913716l322910l034303k852440j643892j616432k105956
$$ y = [79722254, 75619375, 73706693, 71757696, 69708222, 67710764, 65720385, 64256734, 63598019, 61964317, 61070662, 59712088, 58784027, 58211876, 58540777, 58619437, 58830139, 58959609, 60388909, 62512624, 63416841, 65345639, 67848248, 68903226, 68004409, 65620772, 62241452, 59217484, 55938204, 53390528, 50898786, 49526364, 49020758, 47031673, 45779041, 44989829, 43729569, 43733879, 43792837, 43828071, 44230521, 43534077, 43459074, 44115087, 44260401, 44995687, 46440116, 47788077, 49261178, 51700148, 55143997, 59226742, 64297766, 69930006, 75712436, 79667080, 79462566, 74932661, 69186266, 63957199, 58205783, 53292067, 49969157, 46934854, 44082414, 42438522, 40822090, 38716134]
3374C8716134j855560q25283o48799o43603j433721q41222k10883o66610m18938
3365C1171515P56322M3206K92233J371671P97466J606835Q23017J622492K771081
3356D1255838L484696J470511L01787j691421l334933l572933k012147j910511
3348C3990887k575927r09004j383355j707613j015966k150883r58323K22315p82486
3339B2729645k53637j178376r9856J65014n88907j038535r2098R57969p87483
3330A9813736j157333m39802o9095P60971j23396m53242J20857K31821l81424
3321A8303093J3133k89755J53335K64234O51394L34261p75213n93576m85566j43592
3311A7431748p7160J096473Q17133j99706j027711m90165P14652j164634L04509
$$ y = [38716134, 36860574, 36035291, 35386492, 34742889, 33309168, 32467946, 32257063, 31590453, 31171515, 31927837, 31971043, 32263276, 33634947, 34432413, 36039248, 36862265, 38484757, 41255838, 44740534, 46211045, 46512832, 44821411, 41486478, 37913545, 35901398, 33990887, 31414960, 30505956, 29122601, 27414988, 26399022, 24248139, 23289816, 23512131, 22729645, 22476008, 21297632, 21197776, 21362790, 20773883, 19735348, 19643250, 20601219, 19813736, 18656403, 18216601, 18147506, 18908477, 18785081, 18331839, 18452696, 18684517, 18303093, 18316226, 18026471, 18179806, 18444040, 19095434, 19429695, 18654482, 18060906, 17575340, 17431748, 17354588, 18451061, 19268194, 19068488, 18040777, 17550612, 18265264, 17100630, 17405139]
3302A7405139N09837P59937L83376J79553Q3276q81638L78796J79508n937L0355
3292A9022202J196640J017012o62510k30964O26700M41116n8766L91001N42364
3283B2284795J86932k38423R94762P59522K15717R21473K05957L53346k750O77327
3273B6358658J77793m39615r193K64089J441497Q77261J58384J943927J106451
3264C1879252K68873P58404k8581L16831J650307Q41173N32799P40139J147332
3255C8106529J062826R21926J439912J650925J919091J380821K165456K793719
3247E1441205K799356J888620J438009K370652K175600P52120L83633k17548r54558
3238F2077089j067090j394613j260473k106612j062984j890031j450068j297895
$$ y = [17405139, 17914976, 18674913, 19058289, 19237842, 19321118, 18439480, 18818276, 18997784, 18991847, 19022202, 20218842, 21235854, 20573344, 20342380, 20969080, 21410196, 21351430, 21742431, 22284795, 22471727, 22233304, 23228066, 23987588, 24203305, 25124778, 25330735, 25684081, 25681331, 26358658, 26536451, 26096836, 26087643, 26351732, 27793229, 28670490, 28828874, 30772801, 31879252, 32148125, 32906529, 32877948, 33194779, 34845086, 35686259, 36219058, 36959197, 38106529, 39169355, 40091281, 41531193, 43182118, 45101209, 46482030, 48647486, 51441205, 54240561, 56129181, 57567190, 59937842, 62113442, 62865562, 63249195, 63031647, 62077089, 61009999, 59615386, 58354913, 56248301, 55185317, 53295286, 51845218, 50547323]
3230E0547323j462418j596692j603047k054424k458547j445765k078336j592991
3222C6255103j330564j288675j723952q90044k264480j758359j187093j251567
3214B4560369r12269o78154j003571q70173k97246l95748q1672j341777k80333
3205A8699426l66617m20799o77508k80851n54393k03017l86301m26322o51203
3196A4732415M34388K23210p52841j94636p77134r85448J80325K06197j166003
3187A1900473m67596k82027j24382M01855J24891p66247j00260n31739Q2158p27281
3177I509845o65484l40035J58773q14311O52282n6046o02754L0848J68345L0580
3167H072043q61988L02533m82125n20727j09757L11765l25516k76060L15712r7569
$$ y = [50547323, 49084905, 47488213, 45885166, 43830742, 41372195, 39926430, 37848094, 36255103, 34924539, 33635864, 31911912, 31021868, 28757388, 26999029, 25811936, 24560369, 23648100, 22969946, 21966375, 21096202, 20798956, 20403208, 20321536, 18979759, 18699426, 18332809, 17912010, 17234502, 16953651, 16399258, 16196241, 15809940, 15383618, 14732415, 15166803, 15390013, 14637172, 14442536, 13665402, 12679954, 12860279, 13066476, 11900473, 11432877, 11150850, 11026468, 11428323, 11553214, 10786967, 10686707, 10154968, 10237126, 9509845, 8844361, 8504326, 8663099, 7848788, 8501070, 8445024, 7842270, 7873118, 8041463, 8072043, 7210055, 7512588, 7030463, 6509736, 6399979, 6711744, 6386228, 6110168, 6425880, 6328311]
3157F328311l77719m27778J531822J48637j459521Q29366j07828p95915j30066
3148E539309L52347O7353n41599q78577L12204O8148o91611K66469L06287m65298
3138D335032J02956l50783j57449p02191o0469Q32746N27987j06285m74287n4489
3128C892768J65319n76849R12929M2685j082406n10231Q16147M03774l69961p04676
3118B989499k42707O90124j3915L5574k13720J28680J84775Q39727j179596k84157
3108B934284Q43222j34756J56967K52719o06211o32569N11885o71004L30059M02385
3098C386981o70937P2979R73667J51637l8008k39969L72897p00570j42800J99136
3088C365013o05879k06919J91288R33327j65645O89741j125301J22332L82046
$$ y = [6328311, 5950592, 5522814, 7054636, 7203273, 5743752, 6573118, 6465290, 5669375, 5539309, 5891656, 5959009, 5417410, 4538833, 4851037, 4919185, 4227574, 4494043, 4800330, 4335032, 4437988, 4087205, 3929756, 3227565, 3167096, 3999842, 4527829, 4421544, 3947257, 3892768, 4058087, 3481238, 4394167, 4436852, 3354446, 2844215, 3660362, 4064136, 3694175, 2989499, 2746792, 3436916, 3423001, 3458575, 3244855, 3373535, 3558310, 4398037, 3218441, 2934284, 3777506, 3642750, 3799717, 4052436, 3446225, 2813656, 3325541, 2654537, 2984596, 3386981, 2716044, 2789023, 3762690, 3914327, 3876319, 3636350, 4009247, 3308677, 3165877, 3365013, 2759134, 2552215, 2743503, 3676830, 3511185, 4200926, 3075625, 3197957, 3580003]
3079C580003l43265l20089m26514J07198k0975k36387P31005l96538n58996j7008
3069B098434L07169q92165Q42635J68649O68337j11479n04885L8200j87852N48736
3059B975779N17605N91879L90220j087716r59359j65133j90500N77065O99779
3050C349619r27179K55433L44038k37851Q9594K38048n3786p43474l66129O53383
3040B601696O87438L1491m53199j207315K82823M85428M29305l25047M90140k64329
3030B758431J28956O8153k64250L340L49491n80902q7305K32325M70837N53R2465
3019C172094N3053j13593o24846M1396O300M61833m48826q41184p323O0439Q34160
3008B593503j68478j017372P33453P42792J55199k13190l37708K57937L22191
$$ y = [3580003, 3236738, 2916649, 2490135, 2597333, 2576358, 2339971, 3070976, 2674438, 2115442, 2098434, 2405603, 1513438, 2356073, 2524722, 3193059, 3081580, 2576695, 2614895, 2427043, 2975779, 3493384, 4085263, 4475483, 3387767, 2428408, 2263275, 2072775, 2649840, 3349619, 2422440, 2677873, 3021911, 2784060, 2873654, 3111702, 3057916, 2314442, 1948313, 2601696, 3289134, 3320625, 2867426, 1660111, 1942934, 2428362, 2857667, 2532620, 3022760, 2758431, 2887387, 2955540, 2691290, 2694630, 3044121, 2463219, 2375914, 2608239, 3079076, 3079629, 3172094, 3225147, 3111554, 2486708, 2528104, 2534404, 2996237, 2547411, 1706227, 1698904, 1759343, 2593503, 2425025, 1407653, 2141106, 2883898, 3039097, 2825907, 2488199, 2746136, 3068327]
2999C068327k46444l91534L63371R56213o20536n24286L49606L07160M44732J59568
2989C866177r04179K34942Q85178j4985l73440k29122K80609m39162k09540J105549
2979D202027l55272N5284R19780n92182R82736L900j77108k76306n73101K91109
2969D480867O23095N99367o14057K18848K05244K53991O3022o16609m5873J071742
2959F239637k61060Q91168K70436n63314L43573k5645r0818N16716J86092N7436
2949G564221k44398k21129M1902j06796L67610R00513K23391n30276M27273Q30643
2939I252954J160963K55743l07860N81014Q43632L97360Q98058K30399O50990
2930A3963253J082800L22817O1951J505570J296767J478098J614227j67583M48847
$$ y = [3068327, 2821883, 2430349, 2793720, 3749933, 3129397, 2605111, 2954717, 3261877, 3706609, 3866177, 2961998, 3196940, 4082118, 4067133, 3693693, 3464571, 3745180, 3306018, 3096478, 4202027, 3846755, 3902039, 4821819, 4229637, 5212373, 5216273, 5039165, 4762859, 4189758, 4480867, 5103962, 5703329, 5089272, 5308120, 5513364, 5767355, 5830377, 5213768, 5167895, 6239637, 5978577, 6869745, 7140181, 6576867, 6920440, 6894795, 6803977, 7320693, 7506785, 7564221, 7319823, 7098694, 7140596, 7033800, 7401410, 8301923, 8525314, 7995038, 8422311, 9252954, 10413917, 10669660, 10361800, 10942814, 11786446, 12183806, 13081864, 13312263, 13963253, 15046053, 15368870, 15430821, 16936391, 18233158, 19711256, 21325483, 21157900, 21606747]
2921B1606747N98687n61192R96027n3422R703l00912M5562j55204R48090n04683
2911B2629403M85089j64259K42559L18225M39942j88749O69539P76587j19229
2902B5089107N76477K091793M27437Q31338K237898J555901K332581K096804K904392
2893D0143728K476641o11306k127680k280055k344270k717127j664976j989456
2885B8885499k113586k188359j911213j20596r21210l81997j628230n55608n92881
2876A8471819n01289k6168j5774n43987J095820O64395J27548j85721j60503J54484
2866A9080624N01156m26133O42386M10405l53767n90240m9776j348223j634019
2857A6232413q2329j096492k060288q02098k31589l00269J20246j336925p16455
$$ y = [21606747, 22205434, 21644242, 22640269, 22586847, 22596550, 22295638, 22341200, 22185996, 23134086, 22629403, 23114492, 22950233, 23192792, 23511017, 23950959, 23762210, 24431749, 25208336, 25089107, 25665584, 27757377, 28184814, 29016152, 31254050, 32809951, 35142532, 37239336, 40143728, 42620369, 42009063, 39881383, 37601328, 35257058, 32539931, 30874955, 28885499, 26771913, 24583554, 22672341, 22551745, 21630535, 21248538, 19620308, 19064700, 18471819, 17970530, 17944362, 17928588, 17384601, 18480421, 19144816, 19272364, 19086643, 18926140, 19080624, 19581780, 19155647, 19798033, 20208438, 19854671, 19264431, 19214655, 17866432, 16232413, 16150084, 15053592, 12993304, 12191206, 11959617, 11659348, 11779594, 10442669, 9726214]
2848I726214m91866k39400k44987p11747L47463m8599o90843J18150n98737n36243
2838F629405Q0674l41835k78973o80785o42265l10821J033822l79484o6812m88045
2828D554881Q72560K8687j200931l93238M6264r66575N23129P62864l4096j13192
2818D080353l16621l04672o86675n83086p009Q45530O0275l59203j289554P36095
2808B175433M83328K60200j11511o31903N66167l78774K04957m90322m32140N29316
2798B174751J78547o88389k871N52450q78022J45791M53056L84392L05232J4320
2788B639257m42546Q1616k41336k93967M21137K07245j209570o89452n7513K92195
2778G07066R66385J52174r51012K47389O90184o8844p98417N96686n14916n0415
$$ y = [9726214, 9234348, 8994948, 8749961, 8038214, 8385677, 8337078, 7646235, 7764385, 7165648, 6629405, 6710079, 6368244, 6089271, 5408486, 4766221, 4455400, 5489222, 5109738, 5042926, 4554881, 5427441, 5456128, 4255197, 3861959, 3908223, 2941648, 3464777, 4227641, 4193545, 4080353, 3763732, 3459060, 2772385, 2189299, 2182290, 3027820, 3088095, 2728892, 1439338, 2175433, 2658761, 2918961, 2807450, 2175547, 2741714, 2362940, 2567897, 2077575, 1645435, 2174751, 2353298, 1664909, 1662038, 2214488, 1336466, 1482257, 1935313, 2319705, 2624937, 2639257, 2196711, 2278327, 2036991, 1743024, 2164161, 2371406, 1161836, 472384, 414871, 707066, 1673451, 1825625, 874613, 1122002, 1812186, 1743342, 944925, 1541611, 1026695, 976280]
2768I76280P7652m69607J88131R60037k20361N06824J55512o20167j01749l64295
2758A088257j63675n05629m99433N31574J22196O94309k66849p57581L33249k42031
2748C34387j95298L90899M88349j65377m57132K64041O5034j50724J35138l09574
2738C99743K29367j095881M42087O87447J273662m61140l659m25822n07276L34519
2728H73047k41965N1149K89701K82310n44000n44418K21464L61651M52536j79691
2718A021784r28925J125363k71862n77252N56397m67047j8007q8805K83780m30358
2708B05068K2957l3861l61050L72554k34752K9816N98731J46856n48066j44199
2698E4054L12316L78569k52894q734j2220M80908n59364L52021J75435n03862
$$ y = [976280, 1053932, 584325, 772456, 1732493, 1512132, 2018956, 2174468, 1554301, 1452552, 1088257, 924582, 418953, -80480, 451094, 573290, 1267599, 1000750, 243169, 576418, 334387, 139089, 529988, 1018337, 852960, 395828, 659869, 724903, 574179, 709317, 399743, 629110, -466771, -24684, 662763, 1936425, 1475285, 1471626, 1045804, 538528, 873047, 631082, 682231, 971932, 1254242, 710242, 165824, 387288, 748939, 1201475, 1021784, 92859, 1218222, 946360, 369108, 925505, 458458, 440451, 351646, 635426, 205068, 228025, 194164, -166886, 205668, -29084, 732, 599463, 746319, 198253, 54054, 366370, 744939, 492045, 483311, 471091, 951999, 392635, 744656, 920091, 416229]
2688D16229L50727n2741m83138J75294k95054L78214r4715o94458O63506K52819
2678F16683L55906p34329m40793P3740j67360j7082M34103k51649q19290O35989
2668c14082M4037m23561M94891l33874P5518M54159L5620N32352N64188k05267
2658I23981o74990Q8585O57717N89974J49902l81874k28342m11606l92927j46549
2648A73871J35000M46890r27686Q3932N30380o03725L12582j83308J80447J9985
2638A68368J61269K35726p89988l86099l51612P1070L13171k50181R82390R7380
2628B51494J37918m92991j80453O49936m70053O4979M29506r3891j01893o89590
2618d95038k73617q4240J20514M34032Q31068m71094k80688K89591L22743l94925
$$ y = [416229, 766956, 714215, 231077, 406371, 111317, 489531, 394816, -299642, 363864, 616683, 972589, 238260, -202533, -128793, -296153, -313235, 120868, -130781, -950071, -314082, -270045, -693606, -198715, -532589, -457071, -2912, 32708, 565060, 1129248, 923981, 248991, 337576, 995293, 1585267, 1735169, 1353295, 1124953, 713347, 320420, 173871, 308871, 755761, -171925, -87993, 442387, -161338, 151244, -32064, 148383, 168368, 329637, 565363, -224625, -610724, -962336, -891266, -578095, -828276, 154114, 251494, 389412, -103579, -284032, 365904, -104149, -39170, 390336, 296445, 194552, -495038, -768655, -852895, -732381, -298349, 532719, 61625, -219063, 70528, 393271, -1654]
2608a654l90584L17563K07994L14102J08483m60976m6766O18156K38973K40097
2598A145388p46100J96230j40953K42174l53232K45159K41482Q8624j290523K33568
2588a38183K39257M69996N57812k44012N95049l48980k9359m83483n28254J66460
2578B56303l7532j71928P10773m56793q5403k57188P88134l4502r56376N93560
2568C49048o81238M04068j33041N05640o2500j095723p0896Q44401J315405k04585
2558A170579l38163l11869N1277p4507j10080j45863n38226M08951l86331j06739
2548c80971Q23765l94658r78576L04972L44295N99893O29588q7375l48213l4295
2538D78425k95012J26303N23962l92020k68847n4774L17653l52386m62280L75139
$$ y = [-1654, -392238, -74675, 133319, 447421, 555904, 94928, 48162, 666318, 905291, 1145388, 399288, 595518, 454565, 696739, 343507, 588666, 830148, 918772, -371751, -138183, 101074, 571070, 1128882, 884870, 1479919, 1130939, 1101580, 618097, 89843, 256303, 218771, 46843, 757616, 300823, 215420, -41768, 746366, 711864, -244512, 349048, -332190, 71878, -61163, 444477, 381977, -713746, -784642, 59759, 1375164, 1170579, 832416, 520547, 571824, 497317, 387237, 241374, -296852, 112099, -274232, -380971, 442794, 48136, -930440, -625468, -281173, 318720, 948308, 860933, 512720, 478425, 183413, 309716, 833678, 441658, 172811, 118037, 435690, 83304, -378976, -3837]
2528c837m27303L9498N947P2246M78415j96893p2389L87836M52769n89916J2186
2517A58559r7189m17299O9716J06275l35378n5539Q69655j46798q13961L90068
2507b71891j85557K7377P23400l214J26080K56176n17344K33730J89942m72332
2497A06367o36330J0075N84892j00169m03872K22109Q3430J82083M69473l0115
2487D87943m86248q58385J62540N0707k28555P21967j10846l75629P98547K99517
2477D61558l63831L19831L48499L03421q31055j15170K20304L22678l93211j48837
2467A24187j92423l1405j97438k5395j97276M59937L36766q62278n9648J68243
2457d76730J05719K53604l89527Q7133j43954n54479M67666N49715l49600J00250
$$ y = [-3837, -431140, -391642, -385695, -313449, 164966, -31927, -104316, 283520, 736289, 146373, 158559, 61370, -355929, -286213, -179938, -515316, -570855, 298800, 152002, -661959, -271891, -457448, -430071, 293329, 290115, 416195, 672371, 155027, 388757, 578699, 106367, -529963, -519888, 65004, -35165, -439037, -216928, -133498, 48585, 518058, 487943, 1695, -856690, -694150, -643443, -871998, -150031, -260877, -636506, 162041, 461558, 97727, 417558, 766057, 1069478, 238423, 123253, 343557, 666235, 273024, 124187, -68236, -99641, -297079, -322474, -519750, -59813, 276953, -585325, -644973, -476730, -371011, -117407, -506934, -419801, -563755, -1118234, -650568, -100853, -450453, -350203]
2447c50203O84482L27868p06992J66986J29170n22433p726l45172k9531m38886
2437a092437Q01049K4108M60118m01244o41705K58538R63976m26460K36948o6976
2427A15915n29190k33734J14875k92720J470117q8919q92035M95856j26171L65238
2417C99232n12746n96256k11702M02674j72926m8357j49136Q65208q9434r9125
2407b12568k15517m49431J377046Q0641j72934K88960K63167l54618p86295J98549
2397A7000O55998o58869n78042n16504J010111L10443Q5324l12824j91000L73365
2387A95002J97047j77133k26570L08024p05254N65310j47886K12868p38856r62446
2377a479894J211764Q22992k60889k39978j39402k31722p8069R62011N59481Q19134
$$ y = [-350203, 334279, 662147, -44845, 122141, 251311, -271122, -278848, -624020, -653551, -1092437, -291388, -267280, 192838, -208406, -850111, -591573, 372403, -54057, 182891, 115915, -413275, -647009, -532134, -824854, 645263, 556344, -335691, 160165, 33994, 399232, -113514, -709770, -921472, -518798, -691724, -740081, -889217, -24009, -113443, -212568, -428085, -877516, 499530, 580171, 407237, 696197, 959364, 604746, -181549, 17000, 672998, 14129, -563913, -1080417, -70306, 240137, 325461, 12637, -178363, 195002, 392049, 214916, -11654, 296370, -408884, 156426, 8540, 221408, -517448, -1479894, -268130, 554862, 293973, 53995, -85407, -317129, -395198, 566813, 1126294, 1945428]
2367A945428p27594m06095q7503L99337k99751o87669M72925L1460j90889R06639
2357A356288M73601q35623M52179l07123o54274J02927k94172j16373P95232j25033
2347H47629K90537n3500l31518K59526l43128R0064K2415j28083K66603r101n24440
2336C87004j6306K31177r9173n9034K10807K1493n27898k21698Q29M29424O546
2325C63171L03426m98590n99082n14966Q14051P52727n03429J29627K3806K26309
2315D97050k6642K11566o58130j92683J87298P2300n9103M03756m01884o2766
2305b9238l17787M15288k34502l09699K33514k43445j85820K53550O72797J3062
2295B67720J28341P9356M35817o9023q47342p57521P36998M11109P78560J58458
$$ y = [1945428, 1217834, 811739, 724236, 1123573, 823822, 136153, 609078, 640538, 449649, 1356288, 1829889, 994266, 1446445, 1139322, 485048, 587975, 293803, 177430, 972662, 847629, 1138166, 1084666, 753148, 1012674, 669546, 759610, 782025, 653942, 920545, 911444, 387004, 370698, 601875, 502702, 443668, 654475, 675968, 148070, -73628, -72799, 356625, 363171, 666597, 168007, -431075, -946041, -131990, 620737, 117308, 246935, 270741, 497050, 470408, 681974, 23844, -168839, 18459, 90759, 31656, 435412, 33528, -29238, -347025, 68263, -166239, -475938, -242424, -485869, -671689, -418139, 254658, 267720, 396061, 475417, 911234, 842211, -5131, -762652, -25654, 385455, 1164015, 1322473]
2285A322473n48377o3450N71887r36044n16446O58399N89078r16197r8095K36748
2275B99976M03303P57937p53303o54519K53885m2007m27977L32450K98286L0103
2265D98134J42904M85640M77316k65211j043867K34493K59973k19393q37364l04703
2255e72078M64262M16399J32826J27769O3801L95373p2145o4838j08288j63039
2245F20042P643K87688l74970l62845J43824L78387j67673k89779M85763l38885
2235C89195k4677J160250m86870j60678L09830Q5402k96920j89457p09442o0910
2225A5723N34699p0136j27644j56813j96783M01636K76395N75189K65455j003580
2215E14141M61798L69628o28417l80954O22715J152201J3273r62159M02123m4737
$$ y = [1322473, 774096, 710646, 1282533, 346489, -169957, 488442, 1077520, 161323, 63228, 299976, 703279, 1461216, 707913, 53394, 307279, 265272, -162705, 169745, 468031, 498134, 641038, 1126678, 1603994, 1338783, 294916, 529409, 789382, 569989, -267375, -572078, -107816, 308583, 441409, 569178, 632979, 1028352, 956207, 891369, 783081, 620042, 627685, 915373, 540403, 177558, 321382, 699769, 532096, 242317, 728080, 389195, 364518, 1524768, 1037898, 877220, 1187050, 1272452, 975532, 786075, 76633, 15723, 550422, 480286, 352642, 195829, -954, 400682, 677077, 1252266, 1517721, 514141, 975939, 1345567, 717150, 336196, 958911, 2111112, 2124385, 1162226, 1564349, 1519612]
2205A519612n8013q58203R62950O223p24118K78546J13831N82343p64558m80515
2195E78098K16923L25693J36490N1974K5431O1793P1389L1581R90338M8585o55733
2184A882562p47318N38721J57402P6891m51109J79328J061001M99135r82023k48182
2174A966408K57789Q00290L92463k66187L05307M74988r1548K3200J68833l20328
2164C711215N15317K32174j40295L28273N68296j32018q5269j02661M58023J39030
2154E492085o61962J12101O71313n7297N47549l66579K79424l72280J117297j27335
2144F634316j99734R92854M74552M83830P16216P75390o94018k77857j28614J23210
2134H900145j67421m8857Q78798P77189Q37730K51580P80710M43321k34674o4852
$$ y = [1519612, 1461599, 603396, 1566346, 1572569, 848451, 1126997, 1240828, 1823171, 1058613, 578098, 795021, 1120714, 1257204, 1309178, 1334609, 1396402, 1467791, 1499372, 2489710, 2538295, 1882562, 1135244, 1673965, 1831367, 1908258, 1457149, 1636477, 2697478, 3196613, 2214590, 1966408, 2224197, 3024487, 3416950, 3150763, 3456070, 3931058, 3839510, 3862710, 4031543, 3711215, 4226532, 4458706, 4318411, 4646684, 5214980, 5082962, 4997693, 4895032, 5353055, 5492085, 4830123, 4942224, 5613537, 5556240, 6103789, 5737210, 6016634, 5644354, 6761651, 6634316, 6434582, 7427436, 7901988, 8385818, 9102034, 9877424, 9183406, 8905549, 8776935, 8900145, 8732724, 8683867, 9562665, 10339854, 11177584, 11429164, 12209874, 12653195, 12418521, 12353669]
2124A2353669J089446J005025J154789J118735R38534Q68411L07721P53653R64103
2115B0554086J325554K091513J107976J384759J431230K404247L156748K389423
2107C5845536L232559K740632M023404L524166M382967M305979N436333O627153
2099G0118729Q583585J0290893J2693441J8280640K1173068K3394171K7000702
2092A91535229K8660244J4901122j0564361k5123882k7747291k6978984k3468427
2085A21213650j8580680j4546678j1523077j0203213p303491m944969m348045
2078D9763497l544598l010435k790846k576982k928349l243600j834276j641780
2070B8192631k031481j301805j730026j730233p34137q20092p99768q66390r22422
$$ y = [12353669, 13443115, 14448140, 15602929, 16721664, 17660198, 18528609, 18836330, 19589983, 20554086, 21879640, 23971153, 25079129, 26463888, 27895118, 30299365, 33456113, 35845536, 39078095, 41818727, 45842131, 49366297, 53749264, 58055243, 63491576, 70118729, 78702314, 88993207, 101686648, 119967288, 141140356, 164534527, 191535229, 220195473, 235096595, 224532234, 199408352, 171661061, 144682077, 121213650, 102632970, 88086292, 76563215, 66360002, 59056511, 54111542, 49763497, 46218899, 43208464, 40417618, 37840636, 34912287, 31668687, 29834411, 28192631, 26161150, 24859345, 23129319, 21399086, 20664949, 19844857, 19045089, 18178699, 17256277]
2061A7256277r06079j118003J92998q97689m37490k06588j229454j081688l85088
2052A1187196j24832m33802O0875l34197k76419l44224k57365p82788k68593n48006
2042G877845P4082K00326K68813n19905m49005J06723L46106k15457j164648m8134
2032F476746O79385l19584o24227k41788m9130M0500J91373P32908m92643r06054
2022E487486j022130n99384j44671j68143P21173l13181k39824m14262j35748
2013C171316L62944j04297J21522n68775j373395P35129J354003J51706J9490
2004C869643p02498j178007K01721K94725n74033o1181L73779m60754k87717K795
1994A478473p4623M54567q7931L47834L64349l35584l72408K26214J61622M38316
$$ y = [17256277, 16350198, 15232195, 15425193, 14527504, 14090014, 13883426, 12653972, 11572284, 11187196, 11062364, 10628562, 10689437, 10355240, 10078821, 9734597, 9477232, 8694444, 8425851, 7877845, 7951927, 8152253, 8421066, 7901161, 7452156, 7558879, 7904985, 7689528, 6524880, 6476746, 7156131, 6836547, 6212320, 5970532, 5921402, 5961902, 6153275, 6886183, 6393540, 5487486, 4465356, 3865972, 3721301, 3553158, 4274331, 3961150, 3721326, 3307064, 3171316, 3534260, 3429963, 3551485, 2982710, 1609315, 2344444, 3698447, 3850153, 3869643, 3167145, 1989138, 2190859, 2485584, 1911551, 1850370, 2224149, 1763395, 1475678, 1478473, 1403850, 1858417, 1770486, 2118320, 2482669, 2147085, 1774677, 2000891, 2162513, 2600829]
1984B600829m41074p14432M97527L75855p45047p9120l0130M7822N84932K47625
1974B344787p6141p18788j24905P70317K30277l67370j88992p15785o7164N55627
1964A641863l15355n06176O10963M75381o94623k16957P8747l38828P723j3988
1954G28750m89567K31598k22215L30125P40643N895o67037j78650J46581J45883
1944G72006M84968m85760j91088L71222N07128N1999p11086K36754K32040l06385
1934I61798J14507O26178K63131j119792o78796R98267R10045p91672k80563m18544
1924E84559m47456L90801J21848r9117m73446R60085P0579p21904N32203R1492
1914A009644k35588l07131o35437M62919l91852L02312Q21224N18122p57076n96909
$$ y = [2600829, 2159755, 1445323, 1942850, 2318705, 1573658, 1494538, 1464408, 1512230, 2097162, 2344787, 2268646, 1549858, 1424953, 2195270, 2425547, 2058177, 1869185, 1153400, 1086236, 1641863, 1326508, 820332, 1431295, 1906676, 1212053, 995096, 1073843, 735015, 742738, 728750, 239183, 470781, 248566, 578691, 1319334, 1325229, 658192, 479542, 626123, 772006, 1256974, 771214, 580126, 951348, 1458476, 1510475, 799389, 1036143, 1268183, 961798, 1076305, 1702483, 1965614, 845822, 167026, 1165293, 2075338, 1283666, 1003103, 584559, 137103, 527904, 649752, 550635, 77189, 1037274, 1107853, 385949, 918152, 1009644, 774056, 466925, -168512, 294407, -97445, 204867, 1026091, 1544213, 787137, 190228]
1904A90228L25103J54681j74536m98113N23068j8692k48006J32711k24021j29475
1894C2948N16431r8092k07277J46599M7742P16440k83118M99163j2634n82589
1884G75613q60843L21616Q92234j052976k20982O05437K12310n4199o22484l23322
1874c27596M99346l13684j60382O53467M53913l29752P5275n59413P59633Q5317
1864H36124m54181J34553k20383l27170L63940p64359l0807J25744J40814j40772
1854c36497K9465n6070J33037m7106J56965N39030k96268K42183j32805l39166
1844a07232L29820o48611N52618O98252p78938n73806j93302N80047N47250O6711
1834D72809l99776R0837N01545N15687j48401k50916M20920j60458N80990J17724
$$ y = [190228, 515331, 670012, 495476, -2637, 520431, 501739, 253733, 386444, 162423, 32948, 549379, 451287, 244010, 390609, 438351, 1154791, 871673, 1370836, 1358202, 775613, -85230, 236386, 1128620, 75644, -145338, 460099, 672409, 618210, -4274, -327596, 171750, -141934, -302316, 351151, 805064, 475312, 550587, -8826, 750807, 836124, 381943, 516496, 296113, -31057, 332883, -431476, -462283, -336539, -195725, -336497, -307032, -363102, -230065, -277171, -120206, 418824, 122556, 364739, 231934, -107232, 222588, -426023, 126595, 824847, 45909, -527897, -721199, -141152, 406098, 472809, 73033, 163870, 665415, 1181102, 1032701, 781785, 1202705, 1042247, 1623237, 1740961]
1824A740961l51681N99716l31593K70554j31605o6536j300481J81581J037530
1815A648446k146p70748n79331P3792n49406L52911K17603p16142L18087O62996
1805F56062M32445R7735m53940o8512l55681k43836l2103o03984M92518N53436
1795D74140q32091k78258O24031m45958m89545N95160k14991N64184l1271Q29229
1785G94630p65125o31561M81536L27087k32655n6846J5036j97307N14187J39474
1775C88456L75180J2198J36700j405439N37615l2561o10360j8469k13616Q55758
1765B5462Q96084q39410M63668O83660j065843k35482K34335o74283M6926O8467
1755c96416N02714k05355l39714P11426N4810L02854o49324K91908N5835r46148
$$ y = [1740961, 1389280, 1988996, 1657403, 1927957, 1796352, 1729816, 429335, 610916, 1648446, 1646300, 875552, 296221, 370013, -179393, 173518, 391121, -325021, -6934, 656062, 1088507, 1186242, 732302, 663790, 308109, 64273, 32170, -571814, -79296, 474140, -357951, -636209, -12178, -458136, -947681, -352521, -567512, -3328, -34599, 794630, 29505, -602056, -120520, 206567, -26088, -82934, -67898, -265205, 248982, 388456, 763636, 775834, 912534, -492905, 44710, 12149, -598211, -616680, -830296, 25462, 921546, 82136, 545804, 1229464, 163621, -71861, 162474, -511809, -464883, -396416, 106298, -99057, -438771, 272655, 327465, 630319, -19005, 272903, 328738, -617410]
1745f17410L84476R1260l52926Q74950p1378k4708k09325m54079j12260L33991
1735a57409l12456P95356O74883n56645r4533l53534K53314m62209l09322K15735
1725c06820K32296l21955J40926K85974M7325m49142J34785K5144K75953M45659
1715E10145k55710K24489J2764L88616M56489j090194n22074O62583M22184J45934
1705I55226n19279p24470m09978J452L80172R99121J49006n42853k572J96885
1695D82710K96859n58181m16801m7177O1358K76324M33689J98802K64249l31488
1685F60344J70196n30717m05646L82875j032953m22089m02767K8401N01512R38138
1675a12706L21871L13128J17362q64037J81952n32843M68042J042266k06704l81150
$$ y = [-617410, -232934, -141674, -494600, 380350, 308972, 284264, 74939, -379140, -491400, -157409, -469865, 325491, 1000374, 443729, 349196, -4338, 248976, -213233, -522555, -306820, -74524, -396479, -255553, 30421, 77746, -371396, -236611, -211467, 64486, 510145, 254435, 478924, 491688, 880304, 1336793, 246599, -275475, 387108, 809292, 955226, 435947, -288523, -698501, -697049, -316877, 682244, 831250, 288397, 285825, 482710, 779569, 221388, -195413, -242590, -181232, 95092, 528781, 727583, 991832, 660344, 830540, 299823, -105823, 277052, -755901, -1177990, -1580757, -1552356, -1050844, -112706, 209165, 522293, 639655, -224382, -42430, -575273, -107231, 935035, 728331, 347181]
1665C47181J60026L47674j114205N64472J2874j31940N09800l32878j06097J06251
1655C63158m55980L65992m32123k5640M4535o5972P13387m6327J4469j9304l55402
1644A00793p885J363396q65679r10457k35676K49414J011091n80161L37094j125885
1634f63955o57711M94755K90022l3377O02106M53808p01185Q9681N0722k5589
1624a00723J57376j52921j1119K90628o54062O58738o6552K8359K96982L65895
1614H12601l91455k74790n83088m88808P97558k24209K91700L8610M53186m26175
1604E130j61058N08385l9889J5520L86512j32298j50682K1602n09178j95130K86331
1593C5245l21831K2702n82546P80028J129703l38896k25191n96299o61029l7676
$$ y = [347181, 507207, 854881, -259324, 305148, 318022, 186082, 695882, 363004, 256907, 363158, -92822, 273170, -158953, -184593, -140058, -206030, 507357, 461030, 475499, 456195, 100793, 92908, 1456304, 590625, -319832, -555508, -306094, 704997, 124836, 461930, -663955, -1321666, -826911, -536889, -570266, 31840, 485648, -215537, -125856, -75134, -100723, 56653, -96268, -107387, 183241, -470821, 187917, 121365, 149724, 446706, 812601, 421146, 146356, -436732, -925540, -127982, -352191, -60491, -21881, 431305, 5130, -155928, 352457, 312568, 328088, 714600, 582302, 431620, 453222, -55956, -251086, 35245, -286586, -263884, -846430, -66402, 1063301, 724405, 499214, -97085, -758114, -795790]
1583g95790R10938N00045m27319k64036K20679L37506l77112M13651O63348k74642
1573I07268J34496k51626J96543l65178L73862p60754l14711l94520p15936M89056
1563g01500P44351M31974J91431p07476m45061J74005p274J64508J07693l34594
1553c81943Q62452j99789K58581n27464M36905k4472j044537L9725N2672M45356
1543h2514L68754L64654J55726p37531r14660N68594M96118J412518j556385K08663
1533B83937J21048l76630p01927j78908J51222L08626O87128p50957k3301J65075
1523c14687n05219M7008m50524M71691K37911j1395O79188n2027O2908O26009
1513G90863r43640m32415K55676q01263M24158O38524p1418j96130Q02165n66441
$$ y = [-795790, 115148, 615193, 187874, -76162, 144517, 482023, 104911, 518562, 1181910, 907268, 1041764, 790138, 986681, 621503, 995365, 234611, -80100, -474620, -1190556, -701500, 42851, 474825, 666256, -41220, -486281, -312276, -319550, -155042, -47349, -381943, 480509, 280720, 539301, 11837, 448742, 424270, -620267, -580542, -527870, -82514, 286240, 650894, 806620, 69089, -845571, -276977, 219141, 1631659, 75274, 283937, 404985, 28355, -673572, -852480, -701258, -392632, 294496, -456461, -479762, -314687, -819906, -772898, -1223422, -751731, -513820, -525215, 153973, 101946, 164854, 790863, -152777, -585192, -329516, -1130779, -706621, -68097, -139515, -335645, 466520, -99921]
1503i9921k59879P87150j03086j53486l64457m76743q50083M76196N87453N19168
1493F2312K47809j319361k73483L99016J89332l2524R09339r26889R81269K45939
1483D82759m17913M62656J26314j340065L33412R32534l02130m5216j333387J51317
1473i49719M53564o9797R21968J46798L88444N3640l41096j40033J34331j78327
1463D19773p70606P8100Q1775M43050k63983k26886J61075j65680m54L9484k85100
1452d89452j41111l81328J88348M52312L10634m97516j84330j34757R81805O89386
1442G93991l63431j59319k20995j71492N14792j083222L17016J026298j62794
1433D90844J26862j62688M9256k66259L58081l44096l88163K14233o061L391k50869
$$ y = [-99921, -359800, 427350, 324264, 170778, -193679, -670422, -1520505, -1044309, -456856, 62312, 310121, -1009240, -1282723, -883707, -694375, -726899, 182440, -744449, 236820, 482759, 64846, 527502, 653816, -686249, -352837, 579697, 277567, 232351, -1101036, -949719, -496155, -565952, 356016, 502814, 891258, 944898, 603802, 463769, 598100, 419773, -350833, -272733, -190958, 252092, -11891, -238777, -77702, -243382, -243836, -204352, -489452, -630563, -1011891, -823543, -371231, -60597, -558113, -742443, -877200, 104605, 793991, 430560, 271241, 50246, -121246, 393546, -689676, -372660, 653638, 490844, 617706, 455018, 504274, 238015, 596096, 252000, -136163, 78070, 72009, 75400, -175469]
1422a75469P0301k57183J164668p6414j65872L68337m43608j30098j58310p63253
1412e66901J96820o9291m82068J074850o1278l17062l31583K01093l82651O53996
1402h4075K17380M44730m33213o06928Q12613M73090L8580j71069j27541J1333
1392E74900j113364k92857J88754P62020P06600j163455k22065l1030J22844P09857
1382B42204j30681R7811j067492J02904K74423K97534K89026m44285K53337N6257
1372b8962N10410j20866Q0317p23169J79990p58811k0843L06249n17170l9107
1362a131962L53041M18994p85030N38107L14862k92058L93097M03968N060m07252
1352a89173Q5080K95712R2321j6692K93963l1857M97464l83917j48894j29647
$$ y = [-175469, -105168, -362351, 802317, 725903, 560031, 928368, 484760, 354662, 196352, -566901, -370081, -439372, -921440, 153410, 92132, -224930, -556513, -355420, -738071, -84075, 133305, 578035, 144822, -462106, 350507, 823597, 862177, 691108, 563567, 574900, -538464, -831321, -642567, 119453, 826053, -337402, -559467, -590497, -467653, 242204, 111523, 209334, -858158, -755254, -480831, -183297, 105729, -338556, -85219, -28962, 481448, 360582, 440899, -282270, -102280, -861091, -881934, -575685, -1092855, -1131962, -778921, -359927, -1144957, -606850, -291988, -584046, -190949, 213019, 218079, -189173, -104093, 191619, 283940, 267248, 561211, 529354, 1026818, 642901, 494007, 364360]
1342C64360M32052j60119P355r8843m81100J84409J79248j45446k58196k25579
1332b01859P8514j04698M31105J81471J88102K45632q7048j03996q95713j117983
1322a386473M88911J491829k20155o31675n23044M71476Q79810O61122j051877
1313A79924o28909K22733J70601L99994j78215m12828k38542J95420N82970K9684
1303C22832Q3941Q7494k87682l14505M99728M07429p5572q31606J53364l7527
1293G896n4227L4522n74978P3848K33474O00958M62634o74180m47157O61517P31518
1282A055825m07337O7439j211645l7786N7941R2480N56173l58033J007188m66252
1272C55993j139274n7657O36678N6834n5485K26027K48537j62179L59277N52319
$$ y = [364360, 796412, 636293, 643648, 544805, 63705, 248114, 427362, 281916, 23720, -201859, -123345, -228043, 203062, 384533, 572635, 818267, 731219, 627223, -268490, -1386473, -897562, 594267, 374112, -257563, -780607, -309131, 570679, 1231801, 179924, -448985, -226252, -55651, 344343, 166128, -246700, -485242, -289822, 293148, 322832, 406773, 494267, 206585, -107920, 391808, 799237, 723665, -107941, 45423, 7896, -46331, -11809, -586787, -512939, -279465, 321493, 784127, 109947, -337210, 324307, 1055825, 648488, 715927, -495718, -533504, -475563, -383083, 173090, -184943, 822245, 355993, -783281, -840938, -204260, -147426, -202911, 23116, 271653, 109474, 468751, 1021070]
1262A021070P039o44728o42025L45736N5347l67463m96040J419O3415k29535M62079
1251d23686m18679k67837Q29525l21718r0765J38523k7929k36375Q2462N13210
1241b23269n16763L91496j5825K36691M72927n07000P8668J27208K50631k54542
1231D0222j051266J66916K20005j39159P81779k45756Q4706K72568N68045p2552
1221F25508o46051K8946O67004k37904n17825j42582J02337J66913o8414J71304
1211A49236p09582j92936L47855J267978j033572R0844p00750N11671M06801j750717
1201a613172O62766J196904q3452M63087N3879j151701o25489M20650l11980J34507
1191h54001K15426l68919L53365K53133N53235l21771L77552M06330l63664j191221
$$ y = [1021070, 1028109, 383381, -258644, 87092, 142439, -225024, -721064, -719645, -656230, -885765, -423686, -842365, -1110202, -280677, -602395, -693160, -554637, -582566, -818941, -736479, -223269, -740032, -348536, -364361, -127670, 345257, -161743, -83075, 44133, 294764, 40222, -1011044, -844128, -624123, -763282, 18497, -227259, -142553, 130015, 698060, 625508, -20543, 8403, 675407, 437503, -80322, -222904, -120567, 46346, -22068, 149236, -560346, -753282, -405427, 862551, -171021, -80177, -780927, -269256, 137545, -1613172, -950406, 246498, 163046, 626133, 680012, -471689, -1097178, -676528, -988508, -854001, -638575, -1007494, -654129, -400996, 152239, -169532, 208020, 614350, 250686, -940535]
1181i40535P74601J3578K4476M62489p80258l88126L56722N86826j057713L49472
1171e98468P93481l37626k0363L77157m66621q83769M68067J91318L78913l5269
1161a33180m33946R09309n13448o51481L12988m2507J47913M20481J18781J16679
1151B51589l67074j62627N06948j0865k99621n21518J90189L00246K74850o6834
1141I5283P3111N7562o95086p9191L51599l04798L70599J64597q10322J17802
1131f58844Q43965M9338J98073N89245r06990p12076Q40467K42945k79553J37972
1121C44542k72719m37519R08740o59599m03410M09687O12070R12890o70418j029412
1111b85148K14904N0799Q5047j84144m22679M41226q4992P19991P31812j358584
$$ y = [-940535, -165934, -152356, -127880, 334609, -445649, -833775, -477053, 109773, -947940, -598468, 195013, -142613, -162976, 214181, -252440, -1136209, -668142, -476824, -97911, -133180, -567126, 342183, -171265, -822746, -509758, -552265, -404352, 16129, 134910, 251589, -115485, -278112, 228836, 217971, -81650, -603168, -412979, -112733, 162117, 95283, 168394, 225956, -469130, -548321, -196722, -501520, -130921, 33676, -776646, -658844, 185121, 234459, 432532, 1021777, 114787, -597289, 243178, 486123, 206570, 344542, 71823, -365696, 543044, -116555, -519965, -110278, 501792, 1414682, 744264, -285148, -70244, -19445, 65602, -118542, -541221, -99995, -184987, 535004, 1266816, -91768]
1101i1768n77057k33054o8259R45049M63164j62364l06149J81203n96319n86973
1091a032527j62578R40740K24665n90710o36877N84642P55316O10826K65921m76990
1081D82428K1875m14656J66368k87511O7757O32934l49185K90012L93247K52392
1071A255661m19970k96569J82656O0534m27787l63037M11073o51480o85041P71270
1061a62690Q24154n99867j22253O03744p94703L28385j09192j152732Q57089M05863
1051G7798l31236n17264L74190k71005k74718R98902N15900j7454r83327l21420
1041g49634M38706K14557k82236k88159o00055R5485N15401J64455r1781m25321
1031a008582Q32515L99316L05689o7985L42085j99196j143291M97475M61377O87980
$$ y = [-91768, -668825, -901879, -970138, -25089, 438075, 275711, -30438, 150765, -445554, -1032527, -1195105, -254365, -29700, -620410, -1257287, -672645, 82671, 693497, 959418, 482428, 504303, 89647, 256015, -31496, 36261, 669195, 320010, 610022, 1003269, 1255661, 835691, 539122, 721778, 782312, 354525, -8512, 402561, -248919, -933960, -162690, 661464, 61597, -60656, 543088, -251615, 76770, -32422, -1185154, -328065, 77798, -253438, -770702, -396512, -667517, -942235, 56667, 572567, 555113, -428214, -749634, -310928, -96371, -378607, -666766, -1266821, -1171336, -655935, -491480, -583261, -1008582, -176067, 223249, 528938, 460953, 803038, 603842, -539449, -41974, 419403, 1107383]
1021A107383m77985m84458K92997O63431n99656q76178m71178N90070n26901L94995
1011c87480O70574o72220l17824K75236N09699m83597O5620L0234P05495n39633
1001a43896M40631l02577m92332J83771k70309J67835P15138J53313k96617j66452
991a1495l25180M24623q18957M93208J59376N35143Q98856j063034M57029K55825
981A005394j62613j75149j48168j94293N4018j028148K59137L80631m32100M95974
971E4683j76489j42314m24805O21667L90960k64687m03704j28937k84141L4911
961g22856N09313Q89003k70391j3092m4719n51629M95744m09272M40284n1021
951B71364l51398n11029M17782J67126n37607n25884l0518J163546K39070q82604
$$ y = [1107383, 629398, 144940, 437937, 1101368, 501712, -374466, -845644, -255574, -782475, -387480, 283094, -389126, -706950, -431714, 77985, -405612, -339992, -309758, 395737, -143896, 296735, -5842, -498174, -314403, -584712, -416877, 298261, 451574, 154957, -11495, -336675, 87948, -731009, -237801, -78425, 456718, 1355574, 292540, 749569, 1005394, 842781, 667632, 519464, 325171, 379189, -648959, -389822, -9191, -441291, 54683, -121806, -264120, -688925, -67258, 323702, 59015, -344689, -473626, -757767, -722856, -213543, 675460, 405069, 391977, 347258, -204371, 291373, -117899, 322385, 271364, -80034, -591063, -173281, -6155, -543762, -1069646, -1100164, 63382, 302452, -580152]
941e80152m48361J51734M99226P15570j61393o57123M15990o77484M47705K54094
931d0194p76800m45734J92877Q47749k15945L30885K10744l63573j54997K75109
921a39879J14520M30008M30237m5199l5723R8420J36836q15450l16002J38851
911c381L57096n19679Q16709o72965m95792K5445O74260O06809j024414J73311
901f2601j43689L60821J23629o49234o94925P96512o74140j76558O05273Q90378
891C75466j37695o15234N23170l86262j05981L3362J40107O56940J26037p04765
881i4855l86428M49064Q696l50748J24158J234395l52950o41330q82811L88355
871e04454P57693R6638q37480L25967l09708m9808J69146k86615P25398N1800
$$ y = [-580152, -1028513, -876779, -377553, 338017, 176624, -480499, -64509, -741993, -294288, -40194, -816994, -1262728, -1069851, -222102, -438047, -107162, 103582, -259991, -414988, -139879, -25359, 404649, 834886, 789687, 753964, 852384, 989220, 173770, -142232, -3381, 353715, -165964, 650745, -22220, -518012, -492567, 181693, 788502, -235912, -62601, -206290, 154531, 278160, -371074, -1065999, -269487, -943627, -1120185, -514912, 375466, 237771, -377463, 145707, -240555, -346536, -313174, -173067, 483873, 609910, -94855, -481283, -32219, -23523, -374271, -250113, 984282, 631332, -9998, -892809, -504454, 253239, 349877, -487603, -161636, -471344, -521152, -352006, -638621, 86777, 138577]
861A38577m42153l21006J31665O89281k23602R5546o04900K05798j93964P76376
851B51618O29472j361386n6314P14136n91357l81317J234811o92329q23908L7872
841a038702K74388K45730Q57659o0431J12125m3289p13336K60110R4014k74438
831b86170k15827N78596N29815K03139l96966p24769J51309n22920L60418L76373
821E2998N33964q05373r86228P81527J164299j95288k71019k79604N8960j78234
811a23998K17660n3442j35738R0299n10875M48079M7089j12051l58628N42442
801E0837j00690o57509j54815k95898J069890q14797k56688J544356M98990j046317
791a62641k04284M90439K09391k67318Q0006p55427N2457N5621j06684O25976
$$ y = [138577, -303576, -624582, -492917, 196364, -27238, 68308, -536592, -330794, -524758, 251618, 881090, -480296, -536610, 177526, -413831, -795148, 439663, -252666, -1076574, -1038702, -764314, -518584, 339075, 278644, 390769, 347480, -365856, -105746, -11732, -286170, -501997, 76599, 606414, 809553, 412587, -312182, -160873, -683793, -323375, 52998, 586962, -218411, -1204639, -423112, 741187, 545899, 274880, -4724, 54236, -123998, 93662, 40220, -95518, -5219, -516094, -68015, -20926, -132977, -491605, 50837, -49853, -707362, -862177, -1158075, -88185, -902982, -1159670, 384686, 883676, -162641, -366925, 123514, 332905, 65587, 145593, -609834, -557377, -501756, -608440, 17536]
781A7536M58144K58658r72949j70456K17090k26258O24524K90349k46344o2709
771A87585N9715L72785J67923q7739j56085l61129M3870R0709Q80935o5912o42787
760D89870m57584r59378K26434J78012k52589j52687k68724K69685P46928M50414
750B70381n6503k13138j53022J16907Q55082p71082k14058m27002L1397M52370
740a08668l52423K77386j32507L47351j77445l72776M14212M834K74538l98154
730b23652K88703J25349m1926K16118l86750m00894m5806K71673j32285L33371
720C901L07908j132687m26287N27081O80340L58619K69994J76434q01477j01417
710a37591N29481l74071M57683n62905N7536P00196k23248n33648k1679j88126
$$ y = [17536, 475680, 734338, -238611, -409067, -191977, -418235, 206289, 496638, 250294, 187585, 247300, 620085, 788008, 700269, 544184, 183055, 226925, 317634, 1198569, 1132657, 489870, 32286, -927092, -700658, -522646, -775235, -927922, -1196646, -926961, -180033, 270381, 213878, 740, -152282, -35375, 819707, 48625, -165433, -592435, -561038, -108668, -461091, -183705, -316212, 31139, -146306, -519082, -104870, -100036, 174502, -223652, 65051, 190400, 148474, 364592, -22158, -423052, -468858, -197185, -329470, 3901, 311809, -820878, -1247165, -720084, -39744, 318875, 588869, 765303, -36174, -137591, 391890, 17819, 475502, -87403, -29867, 670329, 447081, -86567, -108246, -296372]
700b96372L92M12568k71957L17400L47558j2433l12330N06872k65352p46969R11846
689E91223n68128J16087P08733l89443l02720q10951J044932n6321R24923j167188
679I1147n53428j49390L1740k82454j34144O85177j28554P41331o72045J54845
669b15775k20444J46226K42970o09703L96101M68056n56419O97533O13022m66444
659D95123o08124k06183O90931m09589j56574n90994l34676P89351p1140r2111
649d93986k04240P30581N41563k82194j94493M95482k76100l49282O1849K71808
639C00988j52106q9867l78358q0003l583J11460l60664J155Q2706N29325k74434
$$ y = [-296372, -295980, 116588, -155369, 162031, 509589, 497156, 184826, 691698, 426346, -320623, 591223, 23095, 139182, 847915, 458472, 155752, -655199, 389733, 333412, 1258335, 91147, -462281, -611671, -579931, -862385, -996529, -311352, -439906, 301425, -370620, -215775, -436219, -289993, -47023, -656726, -260625, 207431, -348988, 348545, 961567, 495123, -113001, -319184, 371747, -37842, -194416, -785410, -1120086, -330735, -401875, -493986, -698226, 32355, 573918, 291724, 97231, 592713, 316613, -32669, 29180, 300988, 148882, 59015, -319343, -399346, -402929, -291469, -652133, -650978, -568272, -38947, -313381]
$$ [...]
##END NTUPLES=NMR SPECTRUM
##END=
