##TITLE=1H_TG-2365-2
 CDCl3
 8 sc, 
 20.1.2023
##JCAMPDX= 6.0         $$ Bruker NMR JCAMP-DX V2.0
##DATA TYPE= NMR SPECTRUM
##DATA CLASS= NTUPLES
##ORIGIN= UXNMR, Bruker Analytische Messtechnik GmbH
##OWNER= root
$$ XWIN-NMR		Version 3.5
$$ Fri Jan 20 14:27:25 2023 Russian Standard Time (UT+4h)  she@DPX200
##.OBSERVE FREQUENCY= 200.13135
##.OBSERVE NUCLEUS= ^1H
##.ACQUISITION MODE= SIMULTANEOUS
##.ACQUISITION SCHEME= undefined
##.AVERAGES= 8
##.DIGITISER RES= 18
##SPECTROMETER/DATA SYSTEM= spect
##.PULSE SEQUENCE= zg30
##.SOLVENT NAME= CDCl3
##.SHIFT REFERENCE= (INTERNAL, CDCl3, 0, 15.9)
##AUDIT TRAIL= $$ (NUMBER, WHEN, WHO, WHERE, WHAT)
$$ ##TITLE= Audit trail, XWIN-NMR		Version 3.5
$$ ##JCAMPDX= 5.01
$$ ##ORIGIN= Bruker BioSpin GmbH
$$ ##OWNER= she
$$ F:/spectra/data/she/nmr/H-F/1/pdata/1/auditp.txt
$$ ##AUDIT TRAIL=  $$ (NUMBER, WHEN, WHO, WHERE, WHAT)
(   1,<2023-01-20 14:26:13.84 +0400>,<she>,<DPX200>,
      <created by zg, POWCHK disabled, PULCHK disabled
       configuration hash MD5:
       00 E9 B6 7A A2 85 ED C7 34 08 36 98 17 FE 4E 26
       data hash MD5: 16K
       B4 98 08 FF F8 C3 F7 A3 BA 52 AF 9A 36 52 01 96>)
(   2,<2023-01-20 14:26:16.62 +0400>,<she>,<DPX200>,
      <Start of raw data processing
       efp BC_mod = 2 LB = 0.24 FT_mod = 6 PKNL = 1 PHC0 = -19268.35 PHC1 = 7.600791 SI = 16K 
       data hash MD5: 16K
       50 23 D1 F5 05 90 1C 04 DA 54 6D BA 94 2C BE 4D>)
(   3,<2023-01-20 14:26:55.25 +0400>,<she>,<DPX200>,
      <abs ABSG = 5 
       data hash MD5: 16K
       3C 36 18 F4 65 B5 B5 E1 5A 7F F2 CB 31 CC 3D 6D>)
$$ ##END=
$$ 
$$ hash MD5
$$ A7 06 73 6A 85 B2 48 28 03 12 85 6F A2 74 F5 A6
##$RELAX= 
##$RELAX= 
##$RELAX= 
##$RELAX= 
##$RELAX= 
##$RELAX= 
$$ Bruker specific parameters
$$ --------------------------
##$DU= <F:/spectra>
##$EXPNO= 1
##$NAME= <H-F>
##$PROCNO= 1
##$TYPE= <nmr>
##$USER= <she>
##$AMP= (0..31)
100 100 100 100 100 100 100 100 100 100 100 100 100 100 100 100 100 100 
100 100 100 100 100 100 100 100 100 100 100 100 100 100 
##$AQSEQ= 0
##$AQ_mod= 1
##$AUNM= <au_zg>
##$AUTOPOS= <>
##$BF1= 200.13
##$BF2= 200.13
##$BF3= 200.13
##$BF4= 200.13
##$BF5= 200.13
##$BF6= 200.13
##$BF7= 200.13
##$BF8= 200.13
##$BYTORDA= 1
##$CFDGTYP= 0
##$CFRGTYP= 5
##$CHEMSTR= <none>
##$CNST= (0..31)
1 1 145 1 1 1 1 1 1 1 1 1 1 1 1 1 1 1 1 1 1 1 1 1 1 1 1 1 1 1 1 1 
##$CPDPRG= <>
##$CPDPRG1= <>
##$CPDPRG2= <>
##$CPDPRG3= <>
##$CPDPRG4= <mlev>
##$CPDPRG5= <mlev>
##$CPDPRG6= <mlev>
##$CPDPRG7= <mlev>
##$CPDPRG8= <mlev>
##$CPDPRGB= <>
##$CPDPRGT= <>
##$D= (0..31)
0 1.2 0 0 0 0 0 0 0 0.06 0 0.03 0 0 0 0 0.0002 0 0 0 0 0 0 0 0 0 0 0 0 
0 0 0 
##$DATE= 1674210373
##$DBL= (0..7)
120 120 120 120 120 120 120 120 
##$DBP= (0..7)
150 150 150 150 150 150 150 150 
##$DBP07= 0
##$DBPNAM0= <>
##$DBPNAM1= <>
##$DBPNAM2= <>
##$DBPNAM3= <>
##$DBPNAM4= <>
##$DBPNAM5= <>
##$DBPNAM6= <>
##$DBPNAM7= <>
##$DBPOAL= (0..7)
0.5 0.5 0.5 0.5 0.5 0.5 0.5 0.5 
##$DBPOFFS= (0..7)
0 0 0 0 0 0 0 0 
##$DE= 6
##$DECBNUC= <off>
##$DECIM= 32
##$DECNUC= <off>
$$ [...]
##$SUBNAM3= <"">
##$SUBNAM4= <"">
##$SUBNAM5= <"">
##$SUBNAM6= <"">
##$SUBNAM7= <"">
##$SUBNAM8= <"">
##$SUBNAM9= <"">
##$SW= 18.05172834244
##$SWIBOX= (0..15)
0 0 2 0 0 0 0 0 0 0 0 0 0 0 0 0 
##$SW_h= 3612.71676300578
##$TD= 16384
##$TD0= 1
##$TE= 0
##$TE2= 300
##$TE3= 300
##$TEG= 300
##$TL= (0..7)
0 120 120 120 120 120 120 120 
##$TP= (0..7)
150 150 150 150 150 150 150 150 
##$TP07= 0
##$TPNAME0= <>
##$TPNAME1= <>
##$TPNAME2= <>
##$TPNAME3= <>
##$TPNAME4= <>
##$TPNAME5= <>
##$TPNAME6= <>
##$TPNAME7= <>
##$TPOAL= (0..7)
0.5 0.5 0.5 0.5 0.5 0.5 0.5 0.5 
##$TPOFFS= (0..7)
0 0 0 0 0 0 0 0 
##$TUNHIN= 0
##$TUNHOUT= 0
##$TUNXOUT= 0
##$USERA1= <user>
##$USERA2= <user>
##$USERA3= <user>
##$USERA4= <user>
##$USERA5= <user>
##$V9= 5
##$VALIST= <valist>
##$VCLIST= <CCCCCCCCCCCCCCC>
##$VD= 0
##$VDLIST= <DDDDDDDDDDDDDDD>
##$VPLIST= <PPPPPPPPPPPPPPP>
##$VTLIST= <TTTTTTTTTTTTTTT>
##$WBST= 1024
##$WBSW= 4
##$XGAIN= (0..3)
0 0 0 0 
##$XL= 0
##$YL= 0
##$YMAX_a= 943682
##$YMIN_a= -652568
##$ZGOPTNS= <>
##$ZL1= 120
##$ZL2= 120
##$ZL3= 120
##$ZL4= 120
##$ABSF1= 15.90004
##$ABSF2= -2.151814
##$ABSG= 5
##$ABSL= 3
##$ALPHA= 0
##$AQORDER= 0
##$ASSFAC= 0
##$ASSFACI= 0
##$ASSFACX= 0
##$ASSWID= 0
##$AUNMP= <proc_1d>
##$AZFE= 0.1
##$AZFW= 0.1
##$BCFW= 0
##$BC_mod= 2
##$BYTORDP= 0
##$COROFFS= 0
##$CY= -3
##$DATMOD= 1
##$DC= 0
##$DFILT= <>
##$DTYPP= 0
##$F1P= 0
##$F2P= 0
##$FCOR= 1
##$FTSIZE= 16384
##$FT_mod= 6
##$GAMMA= 0
##$GB= 0
##$INTBC= 1
##$INTSCL= 3.70164e-10
##$ISEN= 128
##$LB= 0.24
##$LEV0= 0
##$LPBIN= 0
##$MAXI= 10000
##$MC2= 0
##$MEAN= 0
##$ME_mod= 0
##$MI= 1.114404
##$NCOEF= 0
##$NC_proc= -6
##$NLEV= 6
##$NOISF1= 3.799351
##$NOISF2= 2.8
##$NSP= 0
##$NTH_PI= 0
##$NZP= 0
##$OFFSET= 15.90004
##$PC= 1
##$PHC0= -19268.35
##$PHC1= 7.600791
##$PH_mod= 1
##$PKNL= yes
##$PPARMOD= 0
##$PSCAL= 0
##$PSIGN= 0
##$REVERSE= no
##$SF= 200.129974282643
##$SI= 16384
##$SIGF1= 3
##$SIGF2= 2
##$SINO= 5.538805
##$SIOLD= 16384
##$SREGLST= <1H.CDCl3>
##$SSB= 0
##$STSI= 16384
##$STSR= 0
##$SW_p= 3612.71676300578
##$SYMM= 0
##$S_DEV= 0
##$TDeff= 16384
##$TDoff= 0
##$TI= <>
##$TILT= no
##$TM1= 0
##$TM2= 0
##$TOPLEV= 0
##$USERP1= <user>
##$USERP2= <user>
##$USERP3= <user>
##$USERP4= <user>
##$USERP5= <user>
##$WDW= 1
##$XDIM= 16384
##$YMAX_p= 325668181
##$YMIN_p= -1314887
$$ End of Bruker specific parameters
$$ ---------------------------------
##NTUPLES= NMR SPECTRUM
##VAR_NAME=  FREQUENCY,     SPECTRUM/REAL,   SPECTRUM/IMAG
##SYMBOL=    X,             R,               I
##VAR_TYPE=  INDEPENDENT,   DEPENDENT,       DEPENDENT
##VAR_FORM=  AFFN,          ASDF,            ASDF
##VAR_DIM=   16384,         16384,           16384
##UNITS=     HZ,            ARBITRARY UNITS, ARBITRARY UNITS
##FACTOR=    0.220516191357247, 1,           1
##FIRST=     3182.07453082079, 0,            0
##LAST=      -430.642232184994, 0,           0
##MIN=       -430.642232184994, -1314887,    0
##MAX=       3182.07453082079, 325668181,    0
$$ Real data points
##PAGE= N=1
##DATA TABLE= (X++(R..R)), XYDATA
$$ [...]
6155A2890613P6659Q4364O1034M8957q694k5572k8105j970o6929m5122n7974l5353
$$ 12890613 12967272 13051636 13112670 13161627 13152933 13127361 13099256 13097286 13030357 12985235 12927261 12891908
6143A2891908L128M438n2664r5661q7448o1829n3032j08217j07235o1875p0634
$$ 12891908 12895036 12899474 12846810 12751149 12663701 12601872 12548840 12440623 12333388 12271513 12200879
6132A2200879q2958k7415l7564k6063J5147K0283r683J957N0172Q3554R4045R9452
$$ 12200879 12117921 12090506 12052942 12026879 12042026 12062309 12052626 12054583 12104755 12188309 12282354 12381806
6120A2381806J07516J10956R9671J55727K26179K19087K00302K16617K38386K61185
$$ 12381806 12489322 12600278 12699949 12855676 13081855 13300942 13501244 13717861 13956247 14217432
6110A4217432K30561K51925K69296K77114K76977K64079K27994K07450J82610
$$ 14217432 14447993 14699918 14969214 15246328 15523305 15787384 16015378 16222828 16405438
6101A6405438J42553J07721Q6991M8068R568n0961k7100k1236j3294o978j5353
$$ 16405438 16547991 16655712 16742703 16790771 16800339 16749378 16722278 16701042 16687748 16680770 16665417
6090A6665417O47j8661l6063l5165m4497j32066n1413j13758p7648j11849j02252
$$ 16665417 16666064 16647403 16611340 16576175 16531678 16399612 16348199 16234441 16156793 16044944 15942692
6079A5942692j15352j29908j29692j06333j24506j21993j23592j27097q5141j27691
$$ 15942692 15827340 15697432 15567740 15461407 15336901 15214908 15091316 14964219 14879078 14751387
6069A4751387j30957j27596p4771r7601k2327q0959m9592j5159q449j3961j5442
$$ 14751387 14620430 14492834 14418063 14320462 14298135 14217176 14167584 14152425 14143976 14130015 14114573
6058A4114573J9319K1794O9729J4611m950L7272j133M1654Q365J812k534m731
$$ 14114573 14133892 14155686 14225415 14240026 14235076 14272348 14271215 14312869 14321234 14323046 14320512 14315781
6046A4315781J43l5562j9375p0171o5655o6764K038r346j2398n180J7256N1137
$$ 14315781 14315924 14280362 14260987 14190816 14125161 14058397 14060435 14051089 14038691 14033511 14050767 14101904
6034A4101904J3623Q578R0365O9826K9781O0289Q4783L8039M0436N7586N3175
$$ 14101904 14115527 14124105 14214470 14284296 14314077 14374366 14459149 14497188 14537624 14595210 14648385
6023A4648385Q0324J9725L2793J3491O514L4583j3800m6209q5448m0296o5200
$$ 14648385 14728709 14748434 14781227 14794718 14801232 14835815 14822015 14775806 14690358 14650062 14584862
6012A4584862n9627q1486q8810o1408q7658m5780J6647l8983l3133n487k7709
$$ 14584862 14525235 14443749 14354939 14293531 14205873 14160093 14176740 14137757 14104624 14099137 14071428
6001A4071428j3724j4992k4745o435O764K8030J8911N2288L4674L7854Q0912M9487
$$ 14071428 14057704 14042712 14017967 14011532 14018296 14046326 14065237 14117525 14152199 14190053 14270965 14320452
5989A4320452K9150K991J8283l4139q9770j21720j10312j33265p9574o6348p9297
$$ 14320452 14349602 14352593 14370876 14336737 14246967 14125247 14014935 13881670 13802096 13735748 13656451
5978A3656451q0539n0458o6539j4502n5505n4487K3k2172n6708l4209j2885j361
$$ 13656451 13575912 13525454 13458915 13444413 13388908 13334421 13334444 13312272 13255564 13221355 13208470 13207109
5966A3207109l401q412j3096j5089J9330O855N6511J0944j0482p7343l4347p7138
$$ 13207109 13203708 13195296 13182200 13167111 13186441 13193296 13249807 13260751 13250269 13172926 13138579 13061441
5954A3061441p2040j09559n5965o2106q8960l675l3452m6085n7122n38n0634l2490
$$ 13061441 12989401 12879842 12823877 12761771 12672811 12669136 12635684 12589599 12532477 12531939 12481305 12448815
5942A2448815j4911k1706o128N1322M743j293M9254J015k2618Q0455O8974Q8895
$$ 12448815 12433904 12412198 12406070 12457392 12462135 12460842 12510096 12511111 12488493 12568948 12637922 12726817
5930A2726817N1361P4393O8955R2206J21449J34366J43910J56642J92695J90019
$$ 12726817 12778178 12852571 12921526 13013732 13135181 13269547 13413457 13570099 13762794 13952813
5920A3952813L25232L73686M36924N66901O13965O31820N03982L29695J88115
$$ 13952813 14278045 14651731 15088655 15655556 16269521 16901341 17405323 17735018 17923133
5911A7923133q1694l38901l86473l84602k67770j57415j21153m8229p7530q675
$$ 17923133 17841439 17502538 17116065 16731463 16463693 16306278 16185125 16136896 16059366 16050691
5901A6050691N6583p913N5113P3469Q3981J38456J98465K28467K25348L75042
$$ 16050691 16107274 16099361 16154474 16227943 16311924 16450380 16648845 16877312 17102660 17477702
5891A7477702M55580M71984O21766P48510Q87938J165384J492068J742191J819216
$$ 17477702 17933282 18405266 19027032 19775542 20663480 21828864 23320932 25063123 26882339
5882B6882339J432809Q70664L33562m61786j277381j827767j860690j579904j286070
$$ 26882339 28315148 29185812 29519374 29057588 27780207 25952440 24091750 22511846 21225776
5873B1225776r90964p15236n74031m64094l67058k53544j73259p2344L0380J00719
$$ 21225776 20234812 19519576 18945545 18481451 18114393 17860849 17687590 17615246 17645626 17746345
5863A7746345J72586K39450K66196L67031M37854N64642O08961P73987Q99020
$$ 17746345 17918931 18158381 18424577 18791608 19229462 19794104 20403065 21177052 22076072
5854B2076072J073679J394327J660084J744493J383612P41928J78726n56789j415291
$$ 22076072 23149751 24544078 26204162 27948655 29332267 30074195 30252921 29696132 28280841
5845B8280841k067888k174156j873131j457623j137428q96321o82800n49345l90993
$$ 28280841 26212953 24038797 22165666 20708043 19570615 18674294 17991494 17442149 17051156
5836A7051156l19792k46971j70993r6313j31478q3049r8962L105J2181j19K8123
$$ 17051156 16731364 16484393 16313400 16217087 16085609 16002560 15903598 15906703 15918884 15918765 15946888
5825A5946888N9359R2019J16296J74508K27009L50835M19184L04120R3053j05100
$$ 15946888 16006247 16098266 16214562 16389070 16616079 16966914 17386098 17690218 17783271 17678171
5815A7678171l09516n58364p82816q98261q11704o42430n10182m08874l83145
$$ 17678171 17368655 16810291 16027475 15129214 14317510 13675080 13164898 12756024 12372879
5806A2372879l00124k79483k46506k27353k02707j97330j91121k04027j56479
$$ 12372879 12072755 11793272 11546766 11319413 11116706 10919376 10728255 10524228 10367749
5797A0367749j50214j77278j76413j57221j35181j36039j49657j44297q7119j05846
$$ 10367749 10217535 10040257 9863844 9706623 9571442 9435403 9285746 9141449 9054330 8948484
5787H948484j05221q5089j03844j23461j35426j00787q4581r1068p5466r6225
$$ 8948484 8843263 8758174 8654330 8530869 8395443 8294656 8210075 8119007 8043541 7947316
5777G947316r9970j04627p7955m7862m9545o5736q5493m7516n5105m9609n5426
$$ 7947316 7847346 7742719 7664764 7616902 7567357 7501621 7416128 7368612 7313507 7263898 7208472
5766G208472o7518p5425r8956l6747n2500p3858o1814o0056n1953l8957l7413
$$ 7208472 7140954 7065529 6966573 6929826 6877326 6803468 6741654 6681598 6629645 6590688 6553275
5755F553275o3432o3971o8845p783m805n2332k8729l5111l0642j2290m0993l7126
$$ 6553275 6489843 6425872 6357027 6349244 6344439 6292107 6263378 6228267 6197625 6185335 6144342 6107216
5743F107216l2807j9917k5787r602r587m1203m2677J8075K4819o0488J83l2099
$$ 6107216 6074409 6054492 6028705 6019103 6009516 5968313 5925636 5943711 5968530 5908042 5908225 5876126
5731E876126n5693l7420L319m5523p2835O802l9939l7212j5727l0201j7872l9681
$$ 5876126 5820433 5783013 5786332 5740809 5667974 5674776 5634837 5597625 5581898 5551697 5533825 5494144
5719E494144j6216k5363j9789l9627M3379j1156k6321m7832k8973j8604k4829
$$ 5494144 5477928 5452565 5432776 5393149 5436528 5425372 5399051 5351219 5322246 5303642 5278813
5708E278813k8747l6091m6043k5434r857k3769j3903j9620j4759K7553n392n7506
$$ 5278813 5250066 5213975 5167932 5142498 5132641 5108872 5094969 5075349 5060590 5088143 5082751 5025245
5696E025245r650K877L4179j4406j3277j7558N487K6907j2290J3029L1532M193
$$ 5025245 5015595 5018472 5052651 5038245 5024968 5007410 5012897 5039804 5027514 5040543 5072075 5076268
5684E076268R693N3577K4800R763J4393J0291M5266P306M5376M569J3823N2031
$$ 5076268 5085961 5139538 5164338 5174101 5188494 5198785 5244051 5251357 5296733 5301302 5315125 5367156
5672E367156N5334J1993J6982K3946L3727L3889J5087N6897O4719O2648l280K9785
$$ 5367156 5422490 5434483 5451465 5475411 5509138 5543027 5558114 5615011 5679730 5742378 5739098 5768883
5660E768883K5155K571L2460L5512P3608N8515N3751k0359J3192O9117P3732J18603
$$ 5768883 5794038 5796609 5829069 5864581 5938189 5996704 6050455 6030096 6043288 6112405 6186137 6304740
5648F304740O8285N0156N7421O8897Q3511Q2655Q3478Q0312J11953Q6908M7957
$$ 6304740 6373025 6423181 6480602 6549499 6633010 6715665 6799143 6879455 6991408 7078316 7126273
5637G126273J07466J26686Q6159Q6360N9209Q9582N3302O3079J6233L0430O1391
$$ 7126273 7233739 7360425 7446584 7532944 7592153 7681735 7735037 7798116 7814349 7844779 7906170
5626G906170L5043P983K7722K771N4254L4766K8789N5399M0045L8224N4825O2560
$$ 7906170 7941213 7949196 7976918 7979689 8033943 8068709 8097498 8152897 8192942 8231166 8285991 8348551
5614H348551Q5015P3738O1271J04530Q7577R5242M2045Q3843Q5942N6538R5413
$$ 8348551 8433566 8507304 8568575 8673105 8760682 8855924 8897969 8981812 9067754 9124292 9219705
5603I219705R1136R4477N8659L4114K0564L0023j1205r491j1112p7213l951l9614
$$ 9219705 9310841 9405318 9463977 9498091 9518655 9548678 9537473 9527982 9516870 9439657 9435706 9396092
5591I396092n8843k2238n3088n0993k0029j1290l1988p3571N2329M753J5446j3102
$$ 9396092 9337249 9315011 9261923 9210930 9190901 9179611 9147623 9074052 9126381 9131134 9146580 9133478
5579I133478l3290R74J9131k213N6774L9205M6644J9229j6123K7449r577J241
$$ 9133478 9100188 9101162 9120293 9118080 9174854 9214059 9260703 9279932 9263809 9291258 9281681 9282922
5567I282922j4249r132m3458p9371m9795n9206o2979j01432n8241q4054q8062
$$ 9282922 9268673 9259541 9216083 9136712 9086917 9027711 8964732 8863300 8805059 8721005 8632943
5556H632943p3739n0938k0967n5131m9312n1470q3276o3101n2521p0725j7602
$$ 8632943 8559204 8508266 8487299 8432168 8382856 8331386 8248110 8185009 8132488 8061763 8044161
5545H044161l4381m861l0653l0572n1869P45k2717k8600l8073k0144o6429l5141
$$ 8044161 8009780 8004919 7974266 7943694 7891825 7892570 7869853 7841253 7803180 7783036 7716607 7681466
5533G681466n8693m7991m0976m3890l4151k6488j9451l1899j8078o5049m7164
$$ 7681466 7622773 7574782 7533806 7489916 7455765 7429277 7409826 7377927 7359849 7294800 7247636
5522G247636n2470j9026k8305n6370J593L660J3029J1225m529j4282p241n9l2502
$$ 7247636 7195166 7176140 7147835 7091465 7093058 7096718 7109747 7120972 7116443 7102161 7094920 7094861 7062359
5509G062359N8844K2817l2765p917j8722Q159k3605l8102k1764L4196j6652q028
$$ 7062359 7121203 7144020 7111255 7103338 7084616 7092775 7069170 7031068 7009304 7043500 7026848 7018820
5497G018820L2255K6401N1189K239L3223L0047J9186J5713P2130j4828K2706R164
$$ 7018820 7051075 7077476 7128665 7130904 7164127 7194174 7213360 7229073 7301203 7286375 7309081 7318245
5485G318245q015j4345j591M2933j7122l886k685m978M9135L2451L16M3078K3950
$$ 7318245 7310230 7295885 7294294 7337227 7320105 7316219 7313534 7308556 7357691 7390142 7390458 7433536 7457486
5472G457486L3368L9883J8963K2157M8765K9136Q4562M7165M4237L8158j5115
$$ 7457486 7490854 7530737 7549700 7571857 7620622 7649758 7734320 7781485 7825722 7863880 7848765
5461G848765J6268K78M0101L8827K0905J5807M6320J7130L3381J8453K349P847
$$ 7848765 7865033 7865311 7905412 7944239 7965144 7980951 8027271 8044401 8077782 8096235 8098584 8106431
5449H106431L97j931P957M7209K9497M7238L8210L346N8408Q3724N8813L8406
$$ 8106431 8106828 8104897 8112854 8160063 8189560 8236798 8275008 8278354 8336762 8420486 8479299 8517705
5437H517705Q8751Q2433N7115O8072N1758Q7346P6261M0028O2597M9926J4570
$$ 8517705 8606456 8688889 8746004 8814076 8865834 8953180 9029441 9069469 9132066 9181992 9196562
5426I196562M5816O4487K4947J5009J5429J3510J8435m218N4112r976K5590J2257
$$ 9196562 9242378 9306865 9331812 9346821 9362250 9375760 9394195 9389977 9444089 9434113 9459703 9471960
5414I471960l2241J428l8648r283m739j0723l967J6563K3972P565j1448K2117
$$ 9471960 9439719 9441147 9402499 9393216 9388477 9377754 9373787 9390350 9414322 9421887 9410439 9432556
5402I432556O086K5919K0116M4875P7873N0681K8726Q9911Q1518N3855M1435M7862
$$ 9432556 9438642 9464561 9484677 9529552 9607425 9658106 9686832 9776743 9858261 9912116 9953551 10001413
5390A0001413R9196N8776J15363N0198O2395P4292R5813L9773N3087L6032M9614
$$ 10001413 10100609 10159385 10274748 10324946 10387341 10461633 10557446 10597219 10650306 10686338 10735952
5379A0735952K1218J4759N4355J7621K7526J7047L5137k5485J8611M824K4063
$$ 10735952 10757170 10771929 10826284 10843905 10871431 10888478 10923615 10898130 10916741 10921565 10945628
5368A0945628O6439M5158P957J7587P4025M1651O3952J01402M3738Q6773R3794
$$ 10945628 11012067 11057225 11065182 11082769 11156794 11198445 11262397 11363799 11407537 11494310 11588104
5357A1588104Q8119P7129O0922M8789O9419Q2125L8389L5048L3958M7906L3795
$$ 11588104 11676223 11753352 11814274 11863063 11932482 12014607 12052996 12088044 12122002 12169908 12203703
5346A2203703N3778J6063L4684J377O94M2242K7890K6638N7866O9712M1954P4862
$$ 12203703 12257481 12273544 12308228 12309605 12310299 12352541 12380431 12407069 12464935 12534647 12576601 12651463
5334A2651463O2085N0074J24878R1306J29053J34005J18532J01087J42167J41952
$$ 12651463 12713548 12763622 12888500 12979806 13108859 13242864 13361396 13462483 13604650 13746602
5324A3746602J35040J54443Q9908R1646R4291M4117O4809j770n0175J1451q4390
$$ 13746602 13881642 14036085 14125993 14217639 14311930 14356047 14420856 14419086 14368911 14380362 14295972
5313A4295972o0884n2208o6667j03796q2805p0424q9066j15469j01691l6543q7725
$$ 14295972 14235088 14182880 14116213 14012417 13929612 13859188 13770122 13654653 13552962 13516419 13428694
5302A3428694p0551k3099o1923l8693q921o0587o740K5815j8919k1832P778J4756
$$ 13428694 13358143 13335044 13273121 13234428 13225507 13164920 13158180 13183995 13165076 13143244 13151022 13165778
5290A3165778J9818m1809L303M8276J7350K7110K4279K9503o707k9983k5326p4651
$$ 13165778 13185596 13143787 13147090 13195366 13212716 13239826 13264105 13293608 13286901 13256918 13231592 13156941
5278A3156941r3220q9535j50272o7199o4475q0797j12306n8948p2275q2147p9190
$$ 13156941 13063721 12974186 12823914 12756715 12692240 12611443 12499137 12440189 12367914 12285767 12206577
5267A2206577n2629p1357k7217k1409n62j0084M2019P423J9240J12416J26681
$$ 12206577 12153948 12082591 12055374 12033965 12033403 12023319 12065338 12072761 12092001 12204417 12331098
5256A2331098J72020J38003J77657J35125J49535J44336J07736O8297J7739N5937
$$ 12331098 12503118 12641121 12818778 12953903 13103438 13247774 13355510 13423807 13441546 13497483
5246A3497483Q0754N4773L4825L9891k4708p7948j10962j29214r1227n7993m1728
$$ 13497483 13578237 13633010 13667835 13707726 13683018 13605070 13494108 13364894 13273667 13215674 13173946
5235A3173946J1662L5537N6600N9871P8508J19837J12533J26631J27250J37621
$$ 13173946 13185608 13221145 13277745 13337616 13416124 13535961 13648494 13775125 13902375 14039996
5225A4039996J61403K00922J71866J28587J20733J42026J13143J17546J56771
$$ 14039996 14201399 14402321 14574187 14702774 14823507 14965533 15078676 15196222 15352993
5216A5352993J74006J29961Q1963O4642N2067J5700J3433J0775o553O1642P9620
$$ 15352993 15526999 15656960 15738923 15803565 15855632 15871332 15884765 15895540 15888987 15950629 16030249
5205A6030249J07483J55245J61839K04227K09970K15679K24031J82038K09247
$$ 16030249 16137732 16292977 16454816 16659043 16869013 17084692 17308723 17490761 17700008
5196A7700008J72802O5556R1576k241o0317n0396j5874l5710j332K294l9897N7336
$$ 17700008 17872810 17938366 18029942 18027701 17967384 17916988 17901114 17865404 17864072 17866366 17826469 17883805
5184A7883805L5392M8649N2146O0540J11858J27166J79930J56868K06090K97325
$$ 17883805 17919197 17967846 18019992 18080532 18192390 18319556 18499486 18656354 18862444 19159769
5174A9159769L21724L66235L54196L96176M23313M30117M01042L13156K67161
$$ 19159769 19481493 19847728 20201924 20598100 21021413 21451530 21852572 22165728 22432889
5165B2432889K28896J50379N8918P3325O9743Q8758L4891l3113j07794j85485
$$ 22432889 22661785 22812164 22871082 22944407 23014150 23102908 23137799 23104686 22996892 22811407
5155B2811407l52142m35278m79171n03135m63836l96233l74343k82339j94633
$$ 22811407 22459265 22023987 21544816 21041681 20577845 20181612 19807269 19524930 19330297
5146A9330297j75798p1556J0273J3566O1519J09444J51225J62773J40927J01500
$$ 19330297 19154499 19082943 19093216 19106782 19168301 19277745 19428970 19591743 19732670 19834170
5136A9834170J44604J84713Q5019P6221P3925L9852j5570o6825j83911l49269
$$ 19834170 19978774 20163487 20248506 20324727 20398652 20438504 20422934 20356109 20172198 19822929
5126A9822929m01519m24148m23406m45348l74880l19347l11916k46300k10331
$$ 19822929 19421410 18997262 18573856 18128508 17753628 17434281 17122365 16876065 16665734
5117A6665734j48020j41172r1707p2406q5649n9022k1550j7014N415P550P830
$$ 16665734 16517714 16376542 16284835 16212429 16126780 16067758 16046208 16029194 16034609 16042159 16049989
5106A6049989K8502L7283M9699P8137J02103J20891P5353J80551K74011K78386
$$ 16049989 16078491 16115774 16165473 16243610 16345713 16466604 16541957 16722508 16996519 17274905
5096A7274905K88209L16891L73839L07478L06334K05721N4395k5865j11503j69562
$$ 17274905 17563114 17880005 18253844 18561322 18867656 19073377 19127772 19101907 18990404 18820842
5086A8820842k15345k23016j93906j44725j43820j43227j12330n6541j0949J1079
$$ 18820842 18605497 18382481 18188575 18043850 17900030 17756803 17644473 17587932 17576983 17588062
5076A7588062M1268P2181Q5482Q7143J43713K13465K44419K88468L18058K66982
$$ 17588062 17629330 17701511 17786993 17874136 18017849 18231314 18475733 18764201 19082259 19349241
5066A9349241K56412J54845O4824o2568j55690j15042k09024j78672k14094j45080
$$ 19349241 19605653 19760498 19825322 19762754 19607064 19492022 19282998 19104326 18890232 18745152
5056A8745152j61782j45696j62245j29459j13325j31920j42574j55076j95221
$$ 18745152 18583370 18437674 18275429 18145970 18032645 17900725 17758151 17603075 17407854
5047A7407854j96650k30376k18463j83814j49652q9798q5694o0603j2788Q588
$$ 17407854 17211204 16980828 16762365 16578551 16428899 16339101 16253407 16192804 16180016 16188604
5037A6188604m196j5405k0956l4871l4951q319J2615M2078r363j3731k4461l2445
$$ 16188604 16184408 16169003 16148047 16113176 16078225 16069906 16082521 16124599 16115236 16101505 16077044 16044599
5025A6044599j42644j74038k15867k13535k40800k39756j32442p5676q2865n3764
$$ 16044599 15901955 15727917 15512050 15298515 15057715 14817959 14685517 14609841 14526976 14473212
5015A4473212O233L6615M4663P8251R4940P7491J19808J18468J05372Q6131J03318
$$ 14473212 14479445 14516060 14560723 14638974 14733914 14811405 14931213 15049681 15155053 15241184 15344502
5004A5344502J46083J90006K09453K68450L28139L81370M30475M67925N63715
$$ 15344502 15490585 15680591 15890044 16158494 16486633 16868003 17298478 17766403 18330118
4995A8330118O29433O08111O02461N58331M21787K76383Q4849j94008m12846n10823
$$ 18330118 18959551 19567662 20170123 20728454 21150241 21426624 21511473 21317465 20904619 20393796
4985B0393796n51159n68803n65423n10337m73793l43171k76886k26939j50083
$$ 20393796 19842637 19273834 18708411 18198074 17724281 17381110 17104224 16877285 16727202
4976A6727202r1564q6691p3499l2993j5856j8036J1944P9925K6017k6293N3143
$$ 16727202 16635638 16548947 16475448 16442455 16426599 16408563 16420507 16500432 16526449 16500156 16553299
4965A6553299P3159O5210R5171J25904J21759J31369J15779J24027J28284J72749
$$ 16553299 16626458 16691668 16786839 16912743 17034502 17165871 17281650 17405677 17533961 17706710
4955A7706710J71787J60166J77007K16883K56588K56134K11714K50692K52768
$$ 17706710 17878497 18038663 18215670 18432553 18689141 18945275 19156989 19407681 19660449
4946A9660449K92699L28322L00383K44349L28274L24694K98828L00176L01375
$$ 19660449 19953148 20281470 20581853 20826202 21154476 21479170 21777998 22078174 22379549
4937B2379549K84611K66375K56851K86355K73251K69107K96242K87976L28893
$$ 22379549 22664160 22930535 23187386 23473741 23746992 24016099 24312341 24600317 24929210
4928B4929210L53973L40783L55505L71056L76948L90809L83346M52846M23921
$$ 24929210 25283183 25623966 25979471 26350527 26727475 27118284 27501630 27954476 28378397
4919B8378397M45796M29545M92960N25568N34091N20669N75228O48232O56316
$$ 28378397 28824193 29253738 29746698 30272266 30806357 31327026 31902254 32550486 33206802
4910C3206802P20171P10572P34901Q39085Q65265R22545R90339J055133J098787
$$ 33206802 33926973 34637545 35372446 36211531 37076796 37999341 38989680 40044813 41143600
4901D1143600J186455J304021J404824J525844J659029J805428J955656K087597
$$ 41143600 42330055 43634076 45038900 46564744 48223773 50029201 51984857 54072454
4893E4072454K280410K435840K512049K429591K186623J713479J189569M75685
$$ 54072454 56352864 58788704 61300753 63730344 65916967 67630446 68820015 69295700
4885F9295700k68905q27507j133000j171307r69889o89717m21951j65784O3633
$$ 69295700 69026795 68199288 67066288 65894981 64925092 64235375 63813424 63647640 63711273
4876F3711273L22909N49790P58868R53989J093503J158298J089259R21449O37876
$$ 63711273 64034182 64583972 65342840 66296829 67390332 68548630 69637889 70559338 71197214
4867G1197214K27310k23879p80039j442214j974502k173518k216076k058955j858342
$$ 71197214 71424524 71200645 70420606 68978392 67003890 64830372 62614296 60555341 58696999
4858E8696999j639791j396915j173615r63969p74262o27131n57094n11525n10915
$$ 58696999 57057208 55660293 54486678 53522709 52748447 52121316 51564222 51052697 50541782
4849E0541782n13346m80231n29879n72928n19545m37291l64015k31380j38696
$$ 50541782 50028436 49548205 49018326 48445398 47925853 47488562 47124547 46893167 46754471
4840D6754471M602J08624L18602M45374N51642P49391R35201J103550J294318
$$ 46754471 46759073 46867697 47186299 47631673 48183315 48932706 49867907 50971457 52265775
4831E2265775J539331J626862J816642J880791J825731J581832J314665R08160
$$ 52265775 53805106 55431968 57248610 59129401 60955132 62536964 63851629 64759789
4823F4759789M46928k72420j299315k318374l110080l251820k997704k603786
$$ 64759789 65206717 64934297 63634982 61316608 58206528 54954708 51957004 49353218
4815D9353218k147673j751379j470721j122851q50394n88364l35039o9690J77717
$$ 49353218 47205545 45454166 43983445 42860594 42010200 41421836 41086797 41017107 41194824
4806D1194824L16324M85846P06539J017583J281459J591871J772773J815482J763365
$$ 41194824 41511148 41996994 42703533 43721116 45002575 46594446 48367219 50182701 51946066
4797E1946066J803463J789472J592474J173764L70123q26718k218344l024475
$$ 51946066 53749529 55539001 57131475 58305239 58675362 57848644 55630300 52605825
4789E2605825l145260k898118k484447k119002j803218j609883j505976j451584
$$ 52605825 49460565 46562447 44078000 41958998 40155780 38545897 37039921 35588337
4781C5588337j437899j268839j080904r23468p74157o52338n60500n06961m28528
$$ 35588337 34150438 32881599 31800695 30877227 30103070 29450732 28890232 28383271 27954743
4772B7954743l66954l21453k41535k22912j88497j32209j11744p3533K6694M6405
$$ 27954743 27587789 27266336 27024801 26801889 26613392 26481183 26369439 26295906 26322600 26369005
4762B6369005N3379Q7126R3505J97390K23988K45604L44820L93687M52999M56452
$$ 26369005 26422384 26509510 26603015 26800405 27024393 27269997 27614817 28008504 28461503 28917955
4752B8917955N00042N52068O08216O07760O74793P31174P53258P78021Q69607
$$ 28917955 29417997 29970065 30578281 31186041 31860834 32592008 33345266 34123287 34992894
4743C4992894R17484R61124J032473J099928J194284J243805J266319J255216
$$ 34992894 35910378 36871502 37903975 39003903 40198187 41441992 42708311 43963527
4735D3963527J326391J346115J449453J673075J913975K233646K507049K900997
$$ 43963527 45289918 46636033 48085486 49758561 51672536 53906182 56413231 59314228
4727E9314228L337569L957827M589902N236978N860269O242662O304914O196814
$$ 59314228 62651797 66609624 71199526 76436504 82296773 88539435 94844349 101041163
4719A01041163N935223N330485M321472L256594K416964K102990J871129J108523
$$ 101041163 106976386 112306871 116628343 119884937 122301901 124404891 126276020 127384543
4711A27384543r02065m669874r423834j2746491j2439195j0340777q284861o722573
$$ 127384543 126482478 121812604 112388770 99642279 87203084 76862307 68577446 61854873
4703F1854873n562097m533880l639404k941184k396219j953576j629594j373251
$$ 61854873 56292776 51758896 48119492 45178308 42782089 40828513 39198919 37825668
4695C7825668j215336j101054j055804j119896j097352r60844q03870o58318n77973
$$ 37825668 36610332 35509278 34453474 33333578 32236226 31275382 30471512 29813194 29235221
4686B9235221n63215m69503n52679n88774o22946o18332n83912n30214m37151
$$ 29235221 28672006 28202503 27649824 27061050 26438104 25819772 25235860 24705646 24268495
4677B4268495m01410l26818k94634k71250k66579k25169k25278k25119j83727
$$ 24268495 23867085 23540267 23245633 22974383 22707804 22482635 22257357 22032238 21848511
4668B1848511j98122j99628j94654k02177k03668j92220k37379k58072k18373
$$ 21848511 21650389 21450761 21256107 21053930 20850262 20658042 20420663 20162591 19944218
4659A9944218j78703j93359j73711j33223j40791r9959q9597r1256q1787n5544
$$ 19944218 19765515 19572156 19398445 19265222 19124431 19024472 18934875 18843619 18761832 18706288
4649A8706288m2211l1438k2254k3220l1403o3125l2262p2326o9107m5853o9744
$$ 18706288 18664077 18632639 18610385 18587165 18555762 18492637 18460375 18388049 18318942 18273089 18203345
4638A8203345q2499p0089j09456j02665q1620j46097r3717j60887j44983j12541
$$ 18203345 18120846 18050757 17941301 17838636 17757016 17610919 17517202 17356315 17211332 17098791
4628A7098791j48310j45635j23347j38691j13817p6903j02158r9117j06404q5695
$$ 17098791 16950481 16804846 16681499 16542808 16428991 16352088 16249930 16150813 16044409 15958714
4618A5958714o4565r3162n2386m789r2691n9781l9755p7301m6200l9621o9896
$$ 15958714 15894149 15800987 15748601 15743812 15651121 15591340 15551585 15474284 15428084 15388463 15318567
4607A5318567o3767l3541q5909n0314n5101j17058q2372j04466r8593m0310n8090
$$ 15318567 15254800 15221259 15135350 15085036 15029935 14912877 14830505 14726039 14627446 14587136 14529046
4596A4529046p9468k0702m7051l3060n5761j8448m0003n0231r4925q6520j0650
$$ 14529046 14449578 14428876 14381825 14348765 14293004 14274556 14234553 14184322 14089397 14002877 13992227
4585A3992227m5052k7245k9224m5908m7399k6563l0331m4876j4366j9778p5291
$$ 13992227 13947175 13919930 13890706 13844798 13797399 13770836 13740505 13695629 13681263 13661485 13586194
4574A3586194q1986n7669p4291q3455o1819j04507j33843j38692j34987j24831
$$ 13586194 13504208 13446539 13372248 13288793 13226974 13122467 12988624 12849932 12714945 12590114
4564A2590114q4130j62943j42998j47751q8733j25986j04156p7337o3894l7194
$$ 12590114 12505984 12343041 12200043 12052292 11963559 11837573 11733417 11656080 11592186 11554992
4554A1554992p8881p2022p0499l0527m0500p3106p179l2876m4338l4348p1319
$$ 11554992 11476111 11404089 11333590 11303063 11262563 11189457 11182278 11149402 11105064 11070716 10999397
4543A0999397n5863l5802o9362N364K4638l2763N0721J6574L5953N2707L0914
$$ 10999397 10943534 10907732 10838370 10843734 10868372 10835609 10886330 10902904 10938857 10991564 11022478
4532A1022478O7767P8264O1084O8271K8834m289o3628j26690j26109r7848j35588
$$ 11022478 11090245 11168509 11229593 11297864 11326698 11322409 11258781 11132091 11005982 10908134 10772546
4521A0772546j54057j01881p6020j10172n566j1217q116n1550J8243k9187p434
$$ 10772546 10618489 10516608 10440588 10330416 10324850 10313633 10305517 10253967 10272210 10243023 10235589
4510A0235589L0617n6L9276r877K4372M6650M1005L364K631K214R967l2466k1805
$$ 10235589 10266206 10266150 10305426 10295549 10319921 10366571 10407576 10410940 10413571 10415785 10425752 10393286 10371481
4497A0371481K9456K013m3836j2926o378J8960k5804L1616J0510L4052M6886P8647
$$ 10371481 10400937 10402950 10359114 10346188 10339810 10358770 10332966 10364582 10375092 10409144 10456030 10534677
4485A0534677J24108J34337J08184M5241R5973J14904R6043J41455J39474J09888
$$ 10534677 10658785 10793122 10901306 10946547 11042520 11157424 11253467 11394922 11534396 11644284
4475A1644284Q7922J31508J21117J50854J64851J29184J62334J43822J07664J48053
$$ 11644284 11732206 11863714 11984831 12135685 12300536 12429720 12592054 12735876 12843540 12991593
4465A2991593J09991R1160J80867J32443J04938J07112J62704J77415J83904K16926
$$ 12991593 13101584 13192744 13373611 13506054 13610992 13718104 13880808 14058223 14242127 14459053
4455A4459053K20049K58049L31693L63060L94715L62036L67972L93356L47357
$$ 14459053 14679102 14937151 15268844 15631904 16026619 16388655 16756627 17149983 17497340
4446A7497340L53442M09826M30299M70414M98790M96968N33983N75913O11159
$$ 17497340 17850782 18260608 18690907 19161321 19660111 20157079 20691062 21266975 21878134
4437B1878134O50058O83303P36433Q00121Q94182R41113J016281J154512J225722
$$ 21878134 22528192 23211495 23947928 24748049 25642231 26583344 27599625 28754137 29979859
4428B9979859J351583J512776J706966J950097K152850K472223K727100L016218
$$ 29979859 31331442 32844218 34551184 36501281 38654131 41126354 43853454 46869672
4420D6869672L415128L870964M421131M974677N510740O009312O537959O805800
$$ 46869672 50284800 54155764 58576895 63551572 69062312 75071624 81609583 88415383
4412H8415383O731713N818454L707466N07399k801417n350269p297645q538080
$$ 88415383 95147096 100965550 104673016 105180415 102378998 97028729 89731084 81193004
4404H1193004q830773q244861p246008o131153n065771m230859l539980k973568
$$ 81193004 72362231 64117370 56871362 50740209 45674438 41443579 37903599 34930031
4396C4930031k517270k166662j874141j675528j484044j374036j270567j066793
$$ 34930031 32412761 30246099 28371958 26696430 25212386 23838350 22567783 21500990
4388B1500990j010536q88156q03746p68515o64391n84779n67493n14818m67731
$$ 21500990 20490454 19602298 18798552 18030037 17365646 16780867 16213374 15698556 15230825
4379A5230825m12159l87833l57533l17885l12393l14885k91949k48205k50605
$$ 15230825 14818666 14430833 14073300 13755415 13443022 13128137 12836188 12587983 12337378
4370A2337378k36876k10741k08978j47339j57981j56296j44645j09377j64772
$$ 12337378 12100502 11889761 11680783 11533444 11375463 11219167 11074522 10965145 10800373
4361A0800373j70362j83100j20734j86513j79991j84659j15972j09948j75012
$$ 10800373 10630011 10446911 10326177 10139664 9959673 9775014 9659042 9549094 9374082
4352I374082j13575q1919p3517o9470n9353m7951m7621j08536o8008o0723m9429
$$ 9374082 9260507 9178588 9105071 9035601 8976248 8928297 8880676 8772140 8704132 8643409 8593980
4341H593980o1621o4966p0973l8138n4334q6184o5557j5202n6734j442l1116o6778
$$ 8593980 8532359 8467393 8396420 8358282 8303948 8217764 8152207 8137005 8080271 8078829 8047713 7980935
4329G980935n7355p8148m2182k0347j7569m2916p8058n8354k8770n9123j9872
$$ 7980935 7923580 7845432 7803250 7782903 7765334 7722418 7644360 7586006 7557236 7498113 7478241
4318G478241p707m844k8545l7798p378k2516m2120p4809J6122q2489m7023n343
$$ 7478241 7470534 7465690 7437145 7399347 7391969 7369453 7327333 7252524 7268646 7186157 7139134 7133791
4306G133791l6385m5230M802m8386k1727k6045n6074o157J3273j4608K466k0509
$$ 7133791 7097406 7052176 7056978 7008592 6986865 6960820 6904746 6898589 6911862 6897254 6899720 6879211
4294F879211j1880L471M5511J5162N619r48J089k363l1687n05o087N905m9232
$$ 6879211 6867331 6870802 6916313 6931475 6937094 6936146 6937235 6934872 6903185 6902680 6896593 6902498 6853266
4281F853266O716L3725l2048k5786r809k3685L585J4441j164l5718j4559J1282
$$ 6853266 6859982 6893707 6861659 6835873 6826064 6802379 6805964 6820405 6819241 6783523 6768964 6780246
4269F780246M4471N481J1712n431r254J1007m068q426j8783n720K2626J5457J3132
$$ 6780246 6824717 6830198 6841910 6836479 6827225 6838232 6834164 6825738 6806955 6801235 6823861 6839318 6852450
4256F852450k2757m683L1198K0794N617K2763L0262L5876p029J6798J4022K8691
$$ 6852450 6829693 6825010 6856208 6877002 6882619 6905382 6935644 6971520 6964491 6981289 6995311 7024002
4244G024002K8331N374K1126J1511N2482J7191j1707M2417L3715j6236l6517N5082
$$ 7024002 7052333 7057707 7078833 7090344 7142826 7160017 7148310 7190727 7224442 7208206 7171689 7226771
4232G226771M0598L7511J8869O050O1825L9420K4356L8352O2084P977M786J4433
$$ 7226771 7267369 7304880 7323749 7329799 7391624 7431044 7455400 7493752 7555836 7563813 7568599 7583032
4220G583032J1312J5645K6485P3886K1449J0774L4541K1926K4262N1955N7590
$$ 7583032 7594344 7609989 7636474 7710360 7731809 7742583 7777124 7799050 7823312 7875267 7932857
4209G932857L2828Q560J7987L6416P7133P6241J02671M0549Q9307P6897Q1619
$$ 7932857 7965685 7974245 7992232 8028648 8105781 8182022 8284693 8325242 8414549 8491446 8573065
4198H573065L7664M3308J26597O1423R3756P8935J00212J09306L3538N1352J09016
$$ 8573065 8610729 8654037 8780634 8842057 8935813 9014748 9114960 9224266 9257804 9309156 9418172
4187I418172J10182O8899O8143J32674R9365O9127R9492J05692J08480J48756
$$ 9418172 9528354 9597253 9665396 9798070 9897435 9966562 10066054 10171746 10280226 10428982
4177A0428982Q6630J24901J12440J04983R5570J11253J59542J39405J44659J21202
$$ 10428982 10515612 10640513 10752953 10857936 10953506 11064759 11224301 11363706 11508365 11629567
4167A1629567J12937J37339J34783J39398J49848J57876J36053J88129J73200
$$ 11629567 11742504 11879843 12014626 12154024 12303872 12461748 12597801 12785930 12959130
4158A2959130J51055J66907K13003J78741J49032J72537J95484J93915J94736
$$ 12959130 13110185 13277092 13490095 13668836 13817868 13990405 14185889 14379804 14574540
4149A4574540K04224J65363J87146K30427K12141J99659J98188J98331K43106
$$ 14574540 14778764 14944127 15131273 15361700 15573841 15773500 15971688 16170019 16413125
4140A6413125K34279J97073K64899K31288K08025K63441K57300L17675K55299
$$ 16413125 16647404 16844477 17109376 17340664 17548689 17812130 18069430 18387105 18642404
4131A8642404K85872L02640K71136L19390L15701L19215L55607L29815L55882
$$ 18642404 18928276 19230916 19502052 19821442 20137143 20456358 20811965 21141780 21497662
4122B1497662L73859L88878M00334M22949M22676M44481M88134M83951M73571
$$ 21497662 21871521 22260399 22660733 23083682 23506358 23950839 24438973 24922924 25396495
4113B5396495M80813M87996N18370N40273N48662N24441N41320N49582N11902
$$ 25396495 25877308 26365304 26883674 27423947 27972609 28497050 29038370 29587952 30099854
4104C0099854N13714N24856N09552M82575M70426M61600M31864M30148M29258
$$ 30099854 30613568 31138424 31647976 32130551 32600977 33062577 33494441 33924589 34353847
4095C4353847L64630L59845L90849L50918L14704K92448K58737K26919J93630
$$ 34353847 34718477 35078322 35469171 35820089 36134793 36427241 36685978 36912897 37106527
4086C7106527J36427J19741R9674K8984P3880m805p2700l7872o5875j08716j33066
$$ 37106527 37242954 37362695 37462369 37491353 37565233 37560428 37487728 37449856 37383981 37275265 37142199
4075C7142199j89007k15739k65874k79888k89183l76171l71811l14943l61054
$$ 37142199 36953192 36737453 36471579 36191691 35902508 35526337 35154526 34839583 34478529
4066C4478529m51355m46025m25699m14255m39912m88240m58631n30888m77287
$$ 34478529 34027174 33581149 33155450 32741195 32301283 31813043 31354412 30823524 30346237
4057C0346237m57317n05819n43055m74507m82592n12780m61981m28290m77338
$$ 30346237 29888920 29383101 28840046 28365539 27882947 27370167 26908186 26479896 26002558
4048B6002558m26957m51607m55419l97560m05352m07728l79550l49413l53598
$$ 26002558 25575601 25123994 24668575 24271015 23865663 23457935 23078385 22728972 22375374
4039B2375374l47160l80491l29278l08888k85254l10000k47186k48828k29739
$$ 22375374 22028214 21647723 21318445 21009557 20724303 20414303 20167117 19918289 19688550
4030A9688550k15548j92011k05396j85036j70963j63820j57979j21909r3709j04223
$$ 19688550 19473002 19280991 19075595 18890559 18719596 18555776 18397797 18275888 18182179 18077956
4020A8077956q6242o3539l5499p2217l1396j9507l957p241j7516J301O1442M7439
$$ 18077956 17991714 17928175 17892676 17820459 17789063 17769556 17765599 17758358 17740842 17742143 17803585 17851024
4008A7851024O7559P5840R3627J07532P4083Q1510M6795M1094O7419O2095Q8923
$$ 17851024 17918583 17994423 18088050 18195582 18269665 18351175 18397970 18439064 18506483 18568578 18657501
3997A8657501R0173J24140J44249J46141J52123J72081K32300J90191K16780J88456
$$ 18657501 18747674 18871814 19016063 19162204 19314327 19486408 19718708 19908899 20125679 20314135
3987B0314135K25779K75970L05484K87178L04868L03659L27545L05684L00925
$$ 20314135 20539914 20815884 21121368 21408546 21713414 22017073 22344618 22650302 22951227
3978B2951227K37041J99768J89265J76419J74436N7772l035k7861M438l8706o3218
$$ 22951227 23188268 23388036 23577301 23753720 23928156 23985928 23982893 23955032 23959470 23920764 23857546
3967B3857546p0857k090J5927o406N9456M9529O4771J09950J64236J49575J67029
$$ 23857546 23786689 23784599 23800526 23794120 23853576 23903105 23967876 24077826 24242062 24391637 24558666
3956B4558666J72904K39788K00891K32777K86192K70370K84578L21032K92789
$$ 24558666 24731570 24971358 25172249 25405026 25691218 25961588 26246166 26567198 26859987
3947B6859987L23764L74932L33094L63598M24786L72656L97857M48572M57976
$$ 26859987 27183751 27558683 27891777 28255375 28680161 29052817 29450674 29899246 30357222
3938C0357222M99561M75528N13114N59212N31573N60665O64038O44702P33431
$$ 30357222 30856783 31332311 31845425 32404637 32936210 33496875 34160913 34805615 35539046
3929C5539046Q01567P42179P32860P35533O44983N60809N63796N74826O67466
$$ 35539046 36340613 37082792 37815652 38551185 39196168 39756977 40320773 40895599 41563065
3920D1563065O78630P30576Q32056Q71255R01009R77653J031627J032767J108723
$$ 41563065 42241695 42972271 43804327 44675582 45576591 46554244 47585871 48618638 49727361
3911D9727361J117006J171608J271224J288887J301842J352617J416166J496969
$$ 49727361 50844367 52015975 53287199 54576086 55877928 57230545 58646711 60143680
3903F0143680J509446J580061J590639J662153J704767J795194J818229J816950
$$ 60143680 61653126 63233187 64823826 66485979 68190746 69985940 71804169 73621119
3895G3621119J955208K008357K030379K076744K064176K147273K204392K257203
$$ 73621119 75576327 77584684 79615063 81691807 83755983 85903256 88107648 90364851
3887I0364851K304607K354853K351367K414306K399432K435901K548590K517225
$$ 90364851 92669458 95024311 97375678 99789984 102189416 104625317 107173907 109691132
3879A09691132K500334K513489K504105K503059K488686K478325K478037K469780
$$ 109691132 112191466 114704955 117209060 119712119 122200805 124679130 127157167 129626947
3871A29626947K443557K462253K315612K286464K242789K167249K082684J969446
$$ 129626947 132070504 134532757 136848369 139134833 141377622 143544871 145627555 147597001
3863A47597001J926847J813963J711451J592849J456501J392591J279516J129245
$$ 147597001 149523848 151337811 153049262 154642111 156098612 157491203 158770719 159899964
3855A59899964J031609Q97490P50133N80793M44575K53302O9289p6177k27545
$$ 159899964 160931573 161829063 162579196 163159989 163604564 163857866 163927155 163850978 163623433
3846A63623433m14192n71156p22263q91434r49254j078122j222673j322042j428975
$$ 163623433 163209241 162638085 161915822 161024388 160075134 158997012 157774339 156452297 155023322
3837A55023322j606893j724165j795964j885691j965457k105676k165303k240381
$$ 155023322 153416429 151692264 149896300 148010609 146045152 143939476 141774173 139533792
3829A39533792k217894k265112k266208k305621k320929k299307k258633k280239
$$ 139533792 137315898 135050786 132784578 130478957 128158028 125858721 123600088 121319849
3821A21319849k272974k294126k184270k167011k157213k086045k032885k010228
$$ 121319849 119046875 116752749 114568479 112401468 110244255 108158210 106125325 104115097
3813A04115097j935169j858257j792880j736334j685154j590977j523528j454862
$$ 104115097 102179928 100321671 98528791 96792457 95107303 93516326 91992798 90537936
3805I0537936j373869j303316j251594j167588j078866j016105r73337q63772
$$ 90537936 89164067 87860751 86609157 85441569 84362703 83346598 82373261 81509489
3797H1509489p86771p47227o39367n93844n56518m46906l64996l42193k12061
$$ 81509489 80722718 79975491 79336124 78742280 78185762 77738856 77373860 77031667 76819606
3788G6819606j47156j20366j2953P7913J11362J62076K76564L43669L98736M63643
$$ 76819606 76672450 76552084 76539131 76617044 76728406 76890482 77167046 77510715 77909451 78373094
3778G8373094N25711O43532P05613P61275Q67245R39475J033819J168673J282238
$$ 78373094 78898805 79542337 80247950 81009225 81876470 82815945 83849764 85018437 86300675
3769H6300675J377688J516520J675903J840791J993991K133840K239612K341325
$$ 86300675 87678363 89194883 90870786 92711577 94705568 96839408 99079020 101420345
3761A01420345K312426K240694K060779J732519J292977P47420J52535m08626
$$ 101420345 103732771 105973465 108034244 109766763 111059740 111807160 111959695 111551069
3753A11551069q45616j172434j425414j558017j559655j598015j651310j647636
$$ 111551069 110705453 109533019 108107605 106549588 104989933 103391918 101740608 100092972
3745A00092972j679283j858874k046444k285032k545170k786618l071935l233451
$$ 100092972 98413689 96554815 94508371 92223339 89678169 86891551 83819616 80586165
3737H0586165l327875l262919l188755l052091k805689k596432k340093k117989
$$ 80586165 77258290 73995371 70806616 67754525 64948836 62352404 60012311 57894322
3729E7894322j938582j742417j618181j495585j379996j231009j137278j046375
$$ 57894322 55955740 54213323 52595142 51099557 49719561 48488552 47351274 46304899
3721D6304899r47517q89286q51472p60417p10186o38621n67054n34079n63286
$$ 46304899 45357382 44468096 43616624 42856207 42146021 41507400 40940346 40406267 39842981
3712C9842981n03813m52686m16989m21410l71547l43158l35701l14192l22783
$$ 39842981 39339168 38886482 38469493 38048083 37676536 37333378 36997677 36683485 36360702
3703C6360702l27487k73572k72569k60576k07642k39019k46388k56860k41507
$$ 36360702 36033215 35759643 35487074 35226498 35018856 34779837 34533449 34276589 34035082
3694C4035082j86011k61884k78428k71051k78436k82615k72035k27576k46709
$$ 34035082 33849071 33587187 33308759 33037708 32759272 32476657 32204622 31977046 31730337
3685C1730337k28445k89107k49424k30372k55447k25523k39968k13608j95878
$$ 31730337 31501892 31212785 30963361 30732989 30477542 30252019 30012051 29798443 29602565
3676B9602565k33635j90865j71480j40199j79029j50722j25348j21166j30217
$$ 29602565 29368930 29178065 29006585 28866386 28687357 28536635 28411287 28290121 28159904
3667B8159904j25683n5642q0272q4688m6180k3179l4187l5798k0630l7308N6289
$$ 28159904 28034221 27978579 27898307 27813619 27767439 27744260 27710073 27674275 27653645 27616337 27672626
3656B7672626K9690J2629J6145P3703N9977N2557N7006P0063J13193O0805J00273
$$ 27672626 27702316 27714945 27731090 27804793 27864770 27917327 27974333 28044396 28157589 28218394 28318667
3645B8318667R6608J15481Q6540Q7592J16249J18188J59735J48831J42156J82660
$$ 28318667 28415275 28530756 28617296 28704888 28821137 28939325 29099060 29247891 29390047 29572707
3635B9572707J93231J91223J68504J74112K09877K43329K88295K40226K22229
$$ 29572707 29765938 29957161 30125665 30299777 30509654 30752983 31041278 31281504 31503733
3626C1503733K62874K73726L10421K57951L08447L22123K84053L36458L11600
$$ 31503733 31766607 32040333 32350754 32608705 32917152 33239275 33523328 33859786 34171386
3617C4171386L16382L35403L33707L08842L51340L12908L64094L17408L49528
$$ 34171386 34487768 34823171 35156878 35465720 35817060 36129968 36494062 36811470 37160998
3608C7160998M22491L74697L89026M31811M85248M49813M38933N05160M79506
$$ 37160998 37583489 37958186 38347212 38779023 39264271 39714084 40153017 40658177 41137683
3599D1137683N20560N26028N58933N56537N40825N63029N47457O41193N91021
$$ 41137683 41658243 42184271 42743204 43299741 43840566 44403595 44951052 45592245 46183266
3590D6183266O05159O05699O44795O58322O76323P08788P00489P26957P32352
$$ 46183266 46788425 47394124 48038919 48697241 49373564 50082352 50782841 51509798 52242150
3581E2242150P26058P60926P79704P92317P58555Q31300Q67999Q17202Q33453
$$ 52242150 52968208 53729134 54508838 55301155 56059710 56891010 57759009 58576211 59409664
3572E9409664Q88223R43403Q97225R50094R83702R43240J007968J026216J060814
$$ 59409664 60297887 61241290 62138515 63088609 64072311 65015551 66023519 67049735 68110549
3563F8110549J091630J092351J112293J123151J135041J196726J199086J204829
$$ 68110549 69202179 70294530 71406823 72529974 73665015 74861741 76060827 77265656
3555G7265656J274506J310045J324708J326749J376355J432181J460925J499381
$$ 77265656 78540162 79850207 81174915 82501664 83878019 85310200 86771125 88270506
3547H8270506J537849J596582J641357J668681J700480J725625J806208J920429
$$ 88270506 89808355 91404937 93046294 94714975 96415455 98141080 99947288 101867717
3539A01867717J944234J982512K074449K098774K194397K215083K309051K363461
$$ 101867717 103811951 105794463 107868912 109967686 112162083 114377166 116686217 119049678
3531A19049678K428517K516059K557658K618435K702258K761074K854430K886372
$$ 119049678 121478195 123994254 126551912 129170347 131872605 134633679 137488109 140374481
3523A40374481K911868L011030L008815L053629L082268L043091L026997L005154
$$ 140374481 143286349 146297379 149306194 152359823 155442091 158485182 161512179 164517333
3515A64517333K922391K895924K797056K693137K677201K584114K498544K391494
$$ 164517333 167439724 170335648 173132704 175825841 178503042 181087156 183585700 185977194
3507A85977194K244178K160993K000906J950291J834369J677101J554012J421400
$$ 185977194 188221372 190382365 192383271 194333562 196167931 197845032 199399044 200820444
3499B00820444J327809J225491J091740J056504R51630R16967R00671Q26991Q78568
$$ 200820444 202148253 203373744 204465484 205521988 206473618 207390585 208291256 209118247 209996815
3490B09996815R06594R60154J015341J081535J230024J334892J463042J564942
$$ 209996815 210903409 211863563 212878904 213960439 215190463 216525355 217988397 219553339
3482B19553339J786975J994622K144883K401629K680269K909724L173235L380108
$$ 219553339 221340314 223334936 225479819 227881448 230561717 233471441 236644676 240024784
3474B40024784L521495L713088L755808L750304L679105L736497L650266L655332
$$ 240024784 243546279 247259367 251015175 254765479 258444584 262181081 265831347 269486679
3466B69486679L717178L843760L964252M056635M186878M208333M083606L915113
$$ 269486679 273203857 277047617 281011869 285068504 289255382 293463715 297547321 301462434
3458C01462434L639242L243361K865192K433207K031102J645106J387364J147791
$$ 301462434 305101676 308345037 311210229 313643436 315674538 317319644 318707008 319854799
3450C19854799J055811R27016Q88723Q27034P21402O39670M34284K55355O4087
$$ 319854799 320910610 321837626 322726349 323553383 324274785 324914455 325348739 325604094 325668181
3441C25668181k54444n24802o96979q78085j006046j052085j178189j179285j129308
$$ 325668181 325413737 324888935 324191956 323313871 322307825 321255740 320077551 318898266 317768958
3432C17768958j175242j152889j131222j144891j198119j200595j230484j274966
$$ 317768958 316593716 315440827 314309605 313164714 311966595 310766000 309535516 308260550
3424C08260550j401707j420992j477901j581391j703235j772445j853462j894101
$$ 308260550 306858843 305437851 303959950 302378559 300675324 298902879 297049417 295155316
3416B95155316k016658k101035k203231k260877k335509k407385k504746k549589
$$ 295155316 293138658 291037623 288834392 286573515 284238006 281830621 279325875 276776286
3408B76776286k614907k678627k743738k782710k795230k882988k869220k872328
$$ 276776286 274161379 271482752 268739014 265956304 263161074 260278086 257408866 254536538
3400B54536538k908957k881222k838156k778766k734779k694693k596894k500433
$$ 254536538 251627581 248746359 245908203 243129437 240394658 237699965 235103071 232602638
3392B32602638k341501k214266k099045j944936j802269j687549j511463j399525
$$ 232602638 230261137 228046871 225947826 224002890 222200621 220513072 219001609 217602084
3384B17602084j254650j153190j033315r25627q43047o99711n86256n20276m41116
$$ 217602084 216347434 215194244 214160929 213235302 212392255 211692544 211106288 210586012 210144896
3375B10144896l88775l32078l20682k81745k74674k99106m15711m71509o27273
$$ 210144896 209756121 209424043 209103361 208821616 208546942 208247836 207832125 207360616 206733343
3366B06733343q11851r76441j111046j322559j521781j668019j785832j915165
$$ 206733343 205921492 204945051 203834005 202511446 200989665 199321646 197535814 195620649
3358A95620649k042479k129331k183979k236274k332385k364223k378484k458099
$$ 195620649 193578170 191448839 189264860 187028586 184696201 182331978 179953494 177495395
3350A77495395k480615k499252k479403k430074k338610k208879k075293j912685
$$ 177495395 175014780 172515528 170036125 167606051 165267441 163058562 160983269 159070584
3342A59070584j776005j669810j619066j621486j654225j794569j976093k200352
$$ 159070584 157294579 155624769 154005703 152384217 150729992 148935423 146959330 144758978
3334A44758978k410512k681032k849799k909646k950038k988011l016134k897083
$$ 144758978 142348466 139667434 136817635 133907989 130957951 127969940 124953806 122056723
3326A22056723k857537k840163k897189l002462l152384l289599l438438l629131
$$ 122056723 119199186 116359023 113461834 110459372 107306988 104017389 100578951 96949820
3318I6949820l775852l810672l815740l722444l539597l352612l109035k926928
$$ 96949820 93173968 89363296 85547556 81825112 78285515 74932903 71823868 68896940
3310F8896940k700290k446696k248811k046079j902372j718436j601036j476690
$$ 68896940 66196650 63749954 61501143 59455064 57552692 55834256 54233220 52756530
3302E2756530j351836j249820j186173j114348j035499r30231q82198p88839p82128
$$ 52756530 51404694 50154874 48968701 47854353 46818854 45888623 45006425 44217586 43435458
3293D3435458p09081o22771n15595m59363m07761k92212k37353j65907l9421L5654
$$ 43435458 42726377 42103606 41588011 41128648 40720887 40428675 40191322 40025415 39985994 40021648
3283D0021648J22748K91038M63178O62948J011966J430526J478604J148908N76364
$$ 40021648 40144396 40435434 40898612 41561560 42573526 44004052 45482656 46631564 47207928
3274D7207928j31318r31780j695957k160126k218025j899394j542378j197441
$$ 47207928 47076610 46144830 44448873 42288747 40070722 38171328 36628950 35431509
3266C5431509q28468o02422m77387l00503j59459j04679q2103M228j460K6587
$$ 35431509 34603041 34000619 33523232 33222729 33063270 32958591 32876488 32880716 32879256 32905843
3256C2905843K5192J10457K96738M20603N98195P84765J064594J380551J815923
$$ 32905843 32931035 33041492 33338230 33758833 34357028 35141793 36206387 37586938 39402861
3247C9402861K366082L122185L467082K874417J718988L95828j299397k850076
$$ 39402861 41768943 44891128 48358210 51232627 52951615 53347443 52048046 49197970
3239D9197970l873314m194709l641361k865094k137856j590157j221957j018106
$$ 49197970 45324656 41129947 37488586 34623492 32485636 30895479 29673522 28655416
3231B8655416q29120p66151p15968o57609n34112m58060l51811k34084j63647
$$ 28655416 27826296 27060145 26344177 25686568 25152456 24694396 24342585 24108501 23944854
3222B3944854l6115k011R1268J99847L21976N05370P25325R36998J283126J514697
$$ 23944854 23908739 23906728 23997996 24197843 24519819 25025189 25750514 26687512 27970638 29485335
3212B9485335J397906Q20173K11764n47704j365463j919903k117031j951922j601664
$$ 29485335 30883241 31703414 31915178 31367474 30002011 28082108 25965077 24013155 22411491
3203B2411491j246183r83900p36692o06566m94282l90165l52026l42493k91938
$$ 22411491 21165308 20181408 19444716 18838150 18343868 17953703 17601677 17259184 16967246
3194A6967246k17358k66114k47936k09350k14228k38812j39780r7047j46141j45805
$$ 16967246 16749888 16483774 16235838 16026488 15812260 15573448 15433668 15336621 15190480 15044675
3184A5044675p3594p2155j02501l9736j5213n7145l6302m5439m6172n2727k4867
$$ 15044675 14971081 14898926 14796425 14756689 14741476 14684331 14648029 14602590 14556418 14503691 14478824
3173A4478824j7011m0278P013K3124L310N078O1074N750K4187K5874K5576K1533
$$ 14478824 14461813 14421535 14428548 14451672 14454982 14460060 14521134 14526884 14551071 14576945 14602521 14624054
3161A4624054L3224M8553k153J1001J9881Q4008M1116J8405Q5061K3108N0370
$$ 14624054 14657278 14705831 14703678 14714679 14734560 14818568 14859684 14878089 14963150 14986258 15036628
3150A5036628J28592Q1248J04047R2205P4246R0112R0375Q1762J06555J26302
$$ 15036628 15165220 15246468 15350515 15442720 15516966 15607078 15697453 15779215 15885770 16012072
3140A6012072L3187J11095J32056J16281J68695J25262J33380J37849J39151J33869
$$ 16012072 16045259 16156354 16288410 16404691 16573386 16698648 16832028 16969877 17109028 17242897
3130A7242897J86881K08127K05615K00601K13155K70414K61958K23847K18936
$$ 17242897 17429778 17637905 17843520 18044121 18257276 18527690 18789648 19013495 19232431
3121A9232431K90358K69530K59644K91071L06853L51647L23178L52238L64258
$$ 19232431 19522789 19792319 20051963 20343034 20649887 21001534 21324712 21676950 22041208
3112B2041208M16101M73257M76060N14081N44971O26525O36445O96825P44259
$$ 22041208 22457309 22930566 23406626 23920707 24465678 25092203 25728648 26425473 27169732
3103B7169732P84215Q42400Q71808Q74134Q96297R34886Q96881P64736N89048
$$ 27169732 27953947 28796347 29668155 30542289 31438586 32373472 33270353 34035089 34624137
3094C4624137M65385P4906k42046n44870q99097j161596j438083j529657j533741
$$ 34624137 35089522 35164428 34922382 34377512 33478415 32316819 30878736 29349079 27815338
3085B7815338j455163j418469j289980j212648j063019r81638r10684q00902o95279
$$ 27815338 26360175 24941706 23651726 22439078 21376059 20394421 19483737 18682835 17987556
3076A7987556o76272n55552n20085n17167m83101m05153l67562l42640l13053
$$ 17987556 17311284 16755732 16235647 15718480 15235379 14830226 14462664 14120024 13806971
3067A3806971k95083k79916k51297k62505j77455k28362k05340j80348j54294
$$ 13806971 13511888 13231972 12980675 12718170 12540715 12312353 12107013 11926665 11772371
3058A1772371j61970j65502j08557j41265j17939j32419j32662j76612j83353
$$ 11772371 11610401 11444899 11336342 11195077 11077138 10944719 10812057 10635445 10452092
3049A0452092j57239k01980k18330j66990j96731k10612j76002j34469j49505
$$ 10452092 10294853 10092873 9874543 9707553 9510822 9300210 9124208 8989739 8840234
3040H840234j31150j23810q8867q6243q4624j01987q5735r4840o768p4101j09721
$$ 8840234 8709084 8585274 8496407 8410164 8325540 8223553 8137818 8042978 8036210 7962109 7852388
3029G852388m7498l6030j00777j13332j26530q5928n0443p4912q6322q2068r8740
$$ 7852388 7804890 7768860 7668083 7554751 7428221 7342293 7291850 7216938 7130616 7048548 6949808
3018F949808r4331q0626j02620j19043j15922j23630q2872p3461p1642p3758o5218
$$ 6949808 6855477 6774851 6672231 6553188 6437266 6313636 6230764 6157303 6085661 6011903 5946685
3007E946685p9775p5184m6636o684p2267l7970L029o0767n8952l6814j6633m4054
$$ 5946685 5866910 5791726 5745090 5738406 5666139 5628169 5631198 5570431 5511479 5474665 5458032 5413978
2995E413978l7763q9766m1493p2776p2119l2875l1045o2974j2691j8939n9818
$$ 5413978 5376215 5286449 5244956 5172180 5100061 5067186 5036141 4973167 4960476 4941537 4881719
2984D881719l2080k2685l8695j08386l3213k1996m5867p0233q8858j1699J1211
$$ 4881719 4849639 4826954 4788259 4679873 4646660 4624664 4578797 4508564 4419706 4408007 4419218
2973D419218n3446j5736n7354k9593m7573l3578m2688K5535j689o5565m0035r073
$$ 4419218 4365772 4350036 4292682 4263089 4215516 4181938 4139250 4164785 4163096 4097531 4057496 4048423
2961D048423N928l8225o1184k6730k570j3176m336j6269l5774j7932j0227O47
$$ 4048423 4054351 4016126 3954942 3928212 3925642 3912466 3908130 3891861 3856087 3838155 3827928 3828575
2949C828575J4759k4955n9512p1717l6796l1835j1228m1248m6115m4570k201J996
$$ 3828575 3843334 3818379 3758867 3687150 3650354 3618519 3607291 3566043 3519928 3475358 3473157 3475153
2937C475153P06k7236j8270J9354l8025k7674Q051K8614l5462m4146J2744k3406
$$ 3475153 3475859 3448623 3430353 3449707 3411682 3384008 3392059 3420673 3385211 3341065 3353809 3330403
2925C330403m250l1638M5J9545K2858j2018m1846j2328O682j9381k9184Q988p796
$$ 3330403 3326153 3294515 3294560 3314105 3336963 3324945 3283099 3270771 3277453 3258072 3228888 3237876 3230080
2912C230080o1441j9907L0625N835K0823k464m4488P620n036l0811k3664p994
$$ 3230080 3168639 3148732 3179357 3185192 3206015 3203551 3159063 3166683 3161647 3130836 3107172 3099178
2900C099178m5620Q702M2341j3827k5445q723K0598j1208j5676K5167j7438m403
$$ 3099178 3053558 3062260 3104601 3090774 3065329 3056606 3077204 3065996 3050320 3075487 3058049 3053646
2888C053646J860j5464J7832J359k641K0299J0697K5514N988L2995M1858N8890
$$ 3053646 3055506 3040042 3057874 3059233 3056592 3076891 3087588 3113102 3119090 3152085 3193943 3252833
2876C252833j3090J1437J0844r992j5676j1250j0813J2531N826J5550L49j1845
$$ 3252833 3239743 3251180 3262024 3252032 3236356 3225106 3214293 3226824 3232650 3248200 3248549 3236704
2864C236704J6232J6158K1574M018K4604M7210K9166N1465M0436k6655J1465J2242
$$ 3236704 3252936 3269094 3290668 3294686 3319290 3366500 3395666 3447131 3487567 3460912 3472377 3484619
2852C484619M1285M0591J4625N7732L5834L8957O7871K6221K9407J0225M9278
$$ 3484619 3525904 3566495 3581120 3638852 3674686 3713643 3781514 3807735 3837142 3847367 3896645
2841C896645L0153J9960M8766k931M4070O2070J3168M3430P8791Q9023P3259R5663
$$ 3896645 3926798 3946758 3995524 3992593 4036663 4098733 4111901 4155331 4234122 4323145 4396404 4492067
2829D492067Q1023P7092L5736M4955J7747m120J7927p062Q255j9575j3388L8012
$$ 4492067 4573090 4650182 4685918 4730873 4748620 4744500 4762427 4755365 4763620 4744045 4730657 4768669
2817D768669L1516p95K0905p371L7357L4334O954M8444L4406M1575N5629N2851
$$ 4768669 4800185 4799390 4820295 4812924 4850281 4884615 4891569 4940013 4974419 5015994 5071623 5124474
2805E124474P5520P6746Q9542O7269Q1986J20556R8997R5308J08564Q8865N5274
$$ 5124474 5199994 5276740 5366282 5433551 5515537 5636093 5735090 5830398 5938962 6027827 6083101
2794F083101Q8567K2469N2586K1827N5306N6900Q1265J12730J17902P8439J16482
$$ 6083101 6171668 6194137 6246723 6268550 6323856 6380756 6462021 6574751 6692653 6771092 6887574
2783F887574Q5350J14708O7045R3626O2476L9643Q4227O0191J5454N8414Q7233
$$ 6887574 6972924 7087632 7154677 7248303 7310779 7350422 7434649 7494840 7510294 7568708 7655941
2772G655941K2366J4088O6175R6067J11976J14161J02874J29049R7572J80138
$$ 7655941 7678307 7692395 7758570 7854637 7966613 8080774 8183648 8312697 8410269 8590407
2762H590407J89617K05341J88632K07284K20076K42176K90600K83250J90718J14899
$$ 8590407 8780024 8985365 9173997 9381281 9601357 9843533 10134133 10417383 10608101 10723000
2752A0723000M8738q365q7350j84695k34363k90476k32258k16317j76970j73723
$$ 10723000 10771738 10763373 10676023 10491328 10256965 9966489 9734231 9517914 9340944 9167221
2742I167221j39485n9062n1810O506r961K8535M4831O7382Q8089M8031P2373N5525
$$ 9167221 9027736 8968674 8916864 8923370 8913409 8941944 8986775 9054157 9142246 9190277 9262650 9318175
2730I318175N5280J01927J7101J6331k0061n4056j06011q9963j41380k25526k26066
$$ 9318175 9373455 9475382 9492483 9508814 9488753 9434697 9328686 9238723 9097343 8871817 8645751
2719H645751k36477k54389k68922k22163j94119k26234j95000j61969j69349j29708
$$ 8645751 8409274 8154885 7885963 7663800 7469681 7243447 7048447 6886478 6717129 6587421
2709F587421j27273q9344o7400j33432r4238m4238j37776j39127r7379j36201
$$ 6587421 6460148 6370804 6303404 6169972 6075734 6031496 5893720 5754593 5657214 5521013
2699E521013j36799j38360j22691j71913j14002j51262j48853j29230j73186j03486
$$ 5521013 5384214 5245854 5123163 4951250 4837248 4685986 4537133 4407903 4234717 4131231
2689D131231q9382j03568j17161q6889p9488r7222r5222p1823n7462j22986o0617
$$ 4131231 4041849 3938281 3821120 3734231 3654743 3557521 3462299 3390476 3333014 3210028 3149411
2678C149411m369m2814o8264o7282l4907p9661l2676o8200p0913p9972m1597m6687
$$ 3149411 3145042 3102228 3033964 2966682 2931775 2852114 2819438 2751238 2680325 2600353 2558756 2512069
2666B512069p6687n2994l8461k9760n8927o1680l0830m7716k1024k7758m8326
$$ 2512069 2435382 2382388 2343927 2314167 2255240 2193560 2162730 2115014 2093990 2066232 2017906
2655B017906k5455n1484m9316n6087k4692n8718j9228l9006l4306m8543j3217
$$ 2017906 1992451 1940967 1891651 1835564 1810872 1752154 1732926 1693920 1659614 1611071 1597854
2644A597854j7469m9525l8333k3836r880j4495k2353r887l9242l0523p849l7179
$$ 1597854 1580385 1530860 1492527 1468691 1458811 1444316 1421963 1412076 1372834 1342311 1334462 1297283
2632A297283m0119k4604l420k0940j2940k0974o305m9355n3624N123n1059k9965
$$ 1297283 1257164 1232560 1229140 1208200 1195260 1174286 1167981 1118626 1065002 1070125 1019066 989101
2620I89101n0406l0288r556j2920L6216l4861k4478l7240k5042j8343O136M854
$$ 989101 938695 908407 898851 885931 922147 887286 862808 825568 800526 782183 788319 793173
2608G93173k8256n8184n0436J2478K2977J721L428j7757l1997j397n41k9568l7112
$$ 793173 764917 706733 656297 668775 691752 693473 696901 679144 647147 645750 645209 615641 578529
2595E78529j2821n0637r66j2750M8m2721l4852M590K7361j2994R157m8335j5608
$$ 578529 565708 515071 514105 501355 501403 458682 423830 428420 455781 442787 451944 403609 388001
2582C88001q75j6298J7292k4756j4554m0879J7618l0356J8238M161j418k2658
$$ 388001 387126 370828 388120 363364 348810 307931 325549 295193 313431 317592 316174 293516
2570B93516n262k9057l4109j6403O087l5586j0375l3710K8209J3151Q348R46j0880
$$ 293516 288254 259197 225088 208685 214772 179186 168811 135101 163310 176461 184809 185755 174875
2557A74875K167l2435K1975j7494j4810K3691j5684L1576P152n1796j1080j0191
$$ 174875 177042 144607 166582 149088 134278 157969 142285 173861 181013 129217 118137 107946
2545A07946K536k6147L019L6491j2091l5603r187M5014L515k0437p1394j2263
$$ 107946 110482 84335 87354 123845 111754 76151 66964 111978 115493 95056 23662 11399
2533A1399M535j846J8234j211m078j476P849N087j9746L5945k9944k5826J0490
$$ 11399 15934 14088 32322 31111 27033 25557 33406 38493 18747 54692 24748 -1078 9412
2520I412k9955k2841L8183Q067P018k99r819j000O503J440N430k2141j3831L4703
$$ 9412 -20543 -43384 -5201 2866 9884 9585 -234 -1234 5269 6709 12139 -10002 -23833 10870
2506A0870M503k4753j1968j5659j1707L0516j1724O693k1683J9030J2413K3480
$$ 10870 15373 -9380 -21348 -37007 -48714 -18198 -29922 -23229 -44912 -25882 -13469 10011
2494A0011l9574j8580l4573M018K8814p392J0539j2169J5754N0694K845o076m4412
$$ 10011 -29563 -48143 -82716 -78698 -49884 -57276 -46737 -58906 -43152 7542 10387 4311 -40101
2481d0101K8771J0177j1952m0455K2012M476l684K7016R530k8644j9230j7946
$$ -40101 -11330 -1153 -13105 -53560 -31548 -27072 -30756 -3740 5790 -22854 -42084 -60030
2469f0030J8521O022l543J1458K568J8239J6757k7335k0366j2624N517j6505J3736
$$ -60030 -41509 -35487 -39030 -27572 -25004 -6765 9992 -17343 -37709 -50333 -44816 -61321 -47585
2456d7585j155M265l678J4685J3251k1199l5870J4568j7406M8640L2090l7255
$$ -47585 -48740 -44475 -48153 -33468 -20217 -41416 -77286 -62718 -80124 -31484 606 -36649
2444c6649r783j7957K3952q759L922j460L3012p201j9550O487K2641k5664n89
$$ -36649 -46432 -64389 -40437 -49196 -45274 -46734 -13722 -20923 -40473 -33986 -11345 -37009 -37598
2431c7598l7255Q191p041l508m794K1533j4973k6638J5833k4497j7760j024Q79
$$ -37598 -74853 -66662 -73703 -77211 -82005 -60472 -75445 -102083 -86250 -110747 -128507 -129531 -128652
2418a28652k899O894m346k4712J4389J9561k732L773j518J7569q68j6309o948
$$ -128652 -131551 -124657 -129003 -153715 -139326 -119765 -122497 -118724 -120242 -102673 -103541 -119850 -126798
2405a26798J7412l579k4427k1966m7407m696K8236L1202l0568K3304J7591l2566
$$ -126798 -109386 -112965 -137392 -159358 -206765 -211461 -183225 -152023 -182591 -159287 -141696 -174262
2393a74262L502J4779k4417j2135m6037K4759r761k613L0792j802K4807J8998
$$ -174262 -170760 -155981 -180398 -192533 -238570 -213811 -223572 -226185 -195393 -197195 -172388 -153390
2381a53390o8083m5608J5401K8453J3767k0323j049o240J761J9507j360r876J7481
$$ -153390 -221473 -267081 -251680 -223227 -209460 -229783 -230832 -237072 -235311 -215804 -217164 -227040 -209559
2368b09559j0674l356l4042K5267o363j4785L809l4049k3048o773k7026K1361
$$ -209559 -220233 -223589 -257631 -232364 -238727 -253512 -249703 -283752 -306800 -313573 -340599 -319238
2356c19238m142M855K8928P549j480l7098K1452L2529j1372l4322k8800K1755
$$ -319238 -323380 -318525 -289597 -282048 -283528 -320626 -299174 -266645 -278017 -312339 -341139 -319384
2344c19384L5149m0594J4940K3116k3661L3213q851k362j6811m1358p97r850J2950
$$ -319384 -284235 -324829 -309889 -286773 -310434 -277221 -286072 -288434 -305245 -346603 -347400 -357250 -344300
2331c44300L4L2495J6156k1272k1159k5079j0200M0448k5693J1707K1547k238
$$ -344300 -344266 -311771 -295615 -316887 -338046 -363125 -373325 -332877 -358570 -346863 -325316 -327554
2319c27554j4649l4721O266K3205j0784r547L2680l0141k1289K599J0743o92j3333
$$ -327554 -342203 -376924 -370658 -347453 -358237 -367784 -335104 -365245 -386534 -383935 -373192 -373884 -387217
2306c87217K5217k333Q14O527k4811o737J0335k8638O34J3347J5367J705r81J1993
$$ -387217 -362000 -364333 -363519 -356992 -381803 -388540 -378205 -406843 -406209 -392862 -377495 -375790 -376771 -364778
2292c64778j482j8421O501J7743j6248O40J3006Q100l4042K4190N823p52j8851
$$ -364778 -366260 -384681 -378180 -360437 -376685 -376045 -363039 -354939 -388981 -364791 -358968 -359720 -378571
2279c78571J9501J5191k5494n653j6128j612J5935J803k7148j7058J19K6010J7967
$$ -378571 -359070 -343879 -369373 -375026 -391154 -392766 -376831 -375028 -402176 -419234 -419115 -393105 -375138
2266c75138n956K3371k2204j2804K0669p503K5118L8168k9894l1243j4626K305
$$ -375138 -381094 -357723 -379927 -392731 -372062 -379565 -354447 -316279 -346173 -377416 -392042 -389737
2254c89737J0156K0746j1584n8473M267M8486k4836Q444K7120K7559J9043l9732
$$ -389737 -379581 -358835 -370419 -428892 -424625 -376139 -400975 -392531 -365411 -337852 -318809 -358541
2242c58541l3066J0996J8489O508N596o743k143J3307q993l1424M2524K5049k5976
$$ -358541 -391607 -380611 -362122 -355614 -350018 -356761 -358904 -345597 -354590 -386014 -343490 -318441 -344417
2229c44417m5837l4242O5553J2848J3929j3785K7554m935q760Q092Q512j1250
$$ -344417 -390254 -424496 -358943 -346095 -332166 -345951 -318397 -323332 -332092 -324000 -315488 -326738
2217c26738k0390J764l4108q167Q760K1464Q378k4956l031r748J1533J1956k5252
$$ -326738 -347128 -345364 -379472 -387639 -378879 -357415 -349037 -373993 -377024 -386772 -375239 -363283 -388535
2204c88535K1516K121k2818q740K829K213R242J0296k3864j5239K5622j0279J3212
$$ -388535 -367019 -364898 -387716 -396456 -393627 -391414 -382172 -371876 -395740 -410979 -385357 -395636 -382424
2191c82424k903N950n457j359l9671L937J6427J8891J6342j8074l094K167j4407
$$ -382424 -385327 -379377 -384834 -386193 -425864 -421927 -405500 -386609 -370267 -388341 -391435 -389268 -403675
2178d03675K4485k0652K0575j6846J1973K5381l5613k5998J1978N7036m269K982
$$ -403675 -379190 -399842 -379267 -396113 -384140 -358759 -394372 -420370 -408392 -351356 -355625 -352643
2166c52643q619R376k9813N65K8569J4610l3424M596J2046K4371k0236l0079L1859
$$ -352643 -361262 -351886 -381699 -381134 -352565 -337955 -371379 -366783 -354737 -330366 -350602 -380681 -348822
2153c48822j2583n736p334L8004m557K3858q440l7441j0370J0542K6571j0249
$$ -348822 -361405 -367141 -374475 -336471 -341028 -317170 -325610 -363051 -373421 -362879 -336308 -346557
2141c46557r896Q467j8527k1333L7116J7443M96k6209J6451p75o1718M301L8238
$$ -346557 -356453 -347986 -366513 -387846 -350730 -333287 -332791 -359000 -342549 -343324 -405042 -400741 -362503
2128c62503n932L466K0841m833n787l3212K8498J5214o454J0596j2357J3706P29
$$ -362503 -368435 -364969 -344128 -348961 -354748 -387960 -359462 -344248 -350702 -340106 -352463 -338757 -338028
2115c38028O496J5393J1700n870k4601j9712j362j476j1591J1325k79K5851j7803
$$ -338028 -331532 -316139 -304439 -310309 -334910 -354622 -355984 -357460 -369051 -357726 -358005 -332154 -349957
2102c49957j5326k3904M0058J0983J5112J3807P156j2621j1163k1591k798L5806
$$ -349957 -365283 -389187 -349129 -338146 -323034 -309227 -302071 -314692 -325855 -347446 -350244 -314438
2090c14438k9437R798j8423k0198J6034j2930K6604L2208k9736J2626k445J9957
$$ -314438 -343875 -334077 -352500 -372698 -356664 -369594 -342990 -310782 -340518 -327892 -330337 -310380
2078c10380r209J0258l168M115K9876p182k874k1718J1040k018k0801J1299n883
$$ -310380 -319589 -309331 -312499 -308384 -278508 -285690 -288564 -310282 -299242 -301260 -322061 -310762 -316645
2065c16645N4381j0641k5887R025K9763j0197J8717j1155j2389k573J5079P623
$$ -316645 -262264 -272905 -298792 -289767 -260004 -270201 -251484 -262639 -275028 -277601 -262522 -254899
2053b54899j4013K8305J4533K9520k1633l4191l1743K052J5217K4447J9932J6957
$$ -254899 -268912 -240607 -226074 -196554 -218187 -252378 -284121 -282069 -266852 -242405 -222473 -205516
2041b05516J6344N532k745j0551k4327J6590L4337J6364O439k850o636k7131K203
$$ -205516 -189172 -183640 -186385 -196936 -221263 -204673 -170336 -153972 -147533 -150383 -157019 -184150 -181947
2028a81947P49K5140K865j0661L0487J8306j0405K2738p606J2422K2439K835l850
$$ -181947 -181198 -156058 -153193 -163854 -133367 -115061 -125466 -102728 -110334 -97912 -75473 -72638 -76488
2015g6488O26J9102M119L6414J841J4191P557J1797J7836k3383M9613J2660k7890
$$ -76488 -75862 -56760 -52641 -16227 -14386 -195 7362 19159 36995 13612 63225 75885 47995
2002D7995M551J6122J7155l344P961K3544L7530J3497p835M8113N6991K1284p334
$$ 47995 52546 68668 85823 82479 90440 113984 151514 165011 157176 205289 262280 283564 276230
1989B76230M2044L2990J864M4783K2078K9635N5897M5107J8960L8152P2876O8212
$$ 276230 318274 351264 353128 397911 419989 449624 505521 550628 569588 607740 680616 748828
1977G48828N5441P0536N4203O4482J06825O6269P5260J01574J24228J23992R6114
$$ 748828 804269 874805 929008 993490 1100315 1166584 1241844 1343418 1467646 1591638 1687752
1966A687752J38415J88719J88792K66071K60736L41893L80374N28487P23162P98366
$$ 1687752 1826167 2014886 2203678 2469749 2730485 3072378 3452752 3981239 4704401 5502767
1956E502767P37763M06921K97327M7323m79590r22322r92067q80599o48352n20954
$$ 5502767 6240530 6647451 6944778 6992101 6512511 5590189 4598122 3717523 3069171 2548217
1946B548217l77891l14237k38020j62083j48760j60221j04691o4637p9370r5779
$$ 2548217 2170326 1856089 1618069 1455986 1307226 1147005 1042314 977677 898307 802528
1936H02528q7899j04293r7932n9070o6257l9688k6373m3384o8735k6540n143k4755
$$ 802528 714629 610336 512404 453334 387077 347389 321016 277632 208897 182357 177214 152459
1924A52459l2197k6433l8071j756K726j0320j5694k7979L3087J943k0443J5259
$$ 152459 120262 93829 55758 54002 56728 46408 30714 2735 35822 37765 17322 32581
1912C2581k8175k6330L140j785j2900j9484j9161K458l7867J7514j1814j3819
$$ 32581 4406 -21924 -18784 -20569 -33469 -52953 -72114 -69656 -107523 -90009 -101823 -115642
1900a15642k564J2379k3146P997j8812j1045J4240l1377K697o823J5406k0051
$$ -115642 -118206 -105827 -128973 -120976 -139788 -150833 -136593 -167970 -165273 -172096 -156690 -176741
1888a76741k1477R675J8998P590k9118q042r284N617J6701R322K7Q466j6491m0470
$$ -176741 -198218 -188543 -169545 -161955 -191073 -199115 -208399 -202782 -186081 -176759 -176732 -168266 -184757 -225227
1874b25227k0379q135L4214j5271J8376l4853R230J8290j0658j0970m9592j9109
$$ -225227 -245606 -253741 -219527 -234798 -216422 -251275 -242045 -223755 -234413 -245383 -294975 -314084
1862c14084J8980L9054M0390j7736j9678M548k9073l5346J1123K4857K4180m937
$$ -314084 -295104 -256050 -215660 -233396 -253074 -248526 -277599 -312945 -301822 -276965 -252785 -257722
1850b57722J8341m1530l253J1360j2329r473K0301j2158n758K2656k4268K1090
$$ -257722 -239381 -280911 -284164 -272804 -285133 -294606 -274305 -286463 -292221 -269565 -293833 -272743
1838b72743k9827k642o866M8951N800j8428k3093k1460M6117K2463K337J4120
$$ -272743 -302570 -305212 -312078 -263127 -257327 -275755 -298848 -320308 -274191 -251728 -249391 -235271
1826b35271k2217o8798Q485M3051j3445J5621k6538J1488O085J2485k8308j1093
$$ -235271 -257488 -326286 -317801 -274750 -288195 -272574 -299112 -287624 -281539 -269054 -297362 -308455
1814c08455K6218m584k5250K6046K1837k538l5445k711M2169q189K962J4889J4504
$$ -308455 -282237 -286821 -312071 -286025 -264188 -266726 -302171 -304882 -262713 -270902 -267940 -253051 -238547
1801b38547k6021n06L1636J4284j5239j6295j6027l7716O362O409R156J8490k6029
$$ -238547 -264568 -265074 -233438 -219154 -234393 -250688 -266715 -304431 -298069 -291660 -282504 -264014 -290043
1788b90043k8472K3601L3294j6899O265J7701k2439k3862P958k495j7347J0724
$$ -290043 -318515 -294914 -261620 -278519 -272254 -254553 -276992 -300854 -292896 -295391 -312738 -302014
1776c02014L142K2801M652J5337P772j4563J2755J477K8601j7622J513j5283j8258
$$ -302014 -298872 -276071 -271419 -256082 -248310 -262873 -250118 -248641 -220040 -237662 -236149 -251432 -269690
1763b69690k5566K4158k874Q658R352j8802J7879j9182L64J3194j0620J5598K232
$$ -269690 -295256 -271098 -273972 -265314 -255962 -274764 -256885 -276067 -275703 -262509 -273129 -257531 -255299
1750b55299k7306N285J2912j2886r667p036n980k1110m07L2321L158O104j5190
$$ -255299 -282605 -277320 -264408 -277294 -286961 -293997 -299977 -321087 -321494 -289173 -286015 -279911 -295101
1737b95101J6564j4742l98j1529K5678K1980J3078l8311k3502K1137J0538r737
$$ -295101 -278537 -293279 -293677 -305206 -279528 -257548 -244470 -282781 -306283 -285146 -274608 -284345
1725b84345l443K772M5027P835l2810K8435r063j4506k9513J0032j7638j4420
$$ -284345 -287788 -285016 -239989 -232154 -264964 -236529 -245592 -260098 -289611 -279579 -297217 -311637
1713c11637J0401L7878L508k7140l490j0436L8324N138J2757L428j4905K8764
$$ -311637 -301236 -263358 -259850 -286990 -290480 -300916 -262592 -257454 -244697 -241269 -256174 -227410
1701b27410m2983P24R187J843J965J1496j1983J4918M349j7471J8400K3316M903
$$ -227410 -270393 -269669 -260482 -258639 -256674 -245178 -257161 -242243 -237894 -255365 -236965 -213649 -208746
1688b08746n718j3663L6757P32m4322M190r306L464O545l2392J0338J6027j0503
$$ -208746 -214464 -228127 -191370 -190638 -234960 -230770 -240076 -236612 -230067 -262459 -252121 -236094 -246597
1675b46597k8827J0856j8840K0259K1834k81j0532k8831J8562K2302n531k6794
$$ -246597 -275424 -264568 -283408 -263149 -241315 -241596 -252128 -280959 -262397 -240095 -245626 -272420
1663b72420l566K2514J4197m135l414l7533j718M1128L8986j1621n4512J6997
$$ -272420 -275986 -253472 -239275 -243410 -246824 -284357 -286075 -244947 -205961 -217582 -272094 -255097
1651b55097L0698k5052J4760K0674m1136o137M9966k2483k5905j1162K2719m821
$$ -255097 -224399 -249451 -234691 -214017 -255153 -261290 -211324 -233807 -259712 -270874 -248155 -252976
1639b52976O076J1592n747n85K452j2378j63J0328K1813q380k9617k0112K7041
$$ -252976 -246900 -235308 -241055 -241640 -239188 -251566 -251729 -241401 -219588 -227968 -257585 -277697 -250656
1626b50656l437k0438L6722l4551n8595L7056O6990J55o990n152L063n110P2J8935
$$ -250656 -254093 -274531 -237809 -272360 -330955 -293899 -226909 -226754 -233744 -238896 -235833 -240943 -240871 -221936
1612b21936k693k3782m2013J1315J0516J4494O87J8846J4985k332k7686j2728
$$ -221936 -224629 -248411 -290424 -279109 -268593 -254099 -253412 -234566 -219581 -221913 -249599 -262327
1600b62327p085L4224J4445q188k0306q116K1682R229K4137l4132M237l9443J3923
$$ -262327 -269412 -235188 -220743 -228931 -249237 -257353 -235671 -226442 -202305 -236437 -232200 -271643 -257720
1587b57720K6775j7991l2541Q100M6841J5109q782j7173p596K8943j4566m0529
$$ -257720 -230945 -248936 -281477 -273377 -226536 -211427 -220209 -237382 -244978 -216035 -230601 -271130
1575b71130R727K5971l1655J0113M248l619K7328o468Q519J0369j0533j6962J8715
$$ -271130 -261403 -235432 -267087 -256974 -252726 -256345 -229017 -235485 -226966 -216597 -227130 -244092 -225377
1562b25377R880j0515m9666p481L9664K1517k0518o486M0124L385r749J9269n076
$$ -225377 -215497 -226012 -275678 -283159 -243495 -221978 -242496 -248982 -208858 -205473 -215222 -195953 -201029
1549b01029j7753J0494q907J0191k0530J0753j7681k6110J3616m3053l360L5267
$$ -201029 -218782 -208288 -217195 -207004 -227534 -216781 -234462 -260572 -246956 -290009 -293369 -258102
1537b58102J8543O587L2899K2582N318j6189j201m2644j1045r583m08Q933j5846
$$ -258102 -239559 -232972 -200073 -177491 -172173 -188362 -189563 -232207 -243252 -252835 -253243 -244310 -260156
1524b60156K9352K3280j8710k0555M3381J701r775K1492j2085J6652l519j6162
$$ -260156 -230804 -207524 -226234 -246789 -203408 -201707 -211482 -189990 -202075 -185423 -188942 -205104
1512b05104j5165p022K0908L0159j6519J9023k9103r993K5909n658k3662l4563
$$ -205104 -220269 -227291 -206383 -176224 -192743 -173720 -202823 -212816 -186907 -192565 -216227 -250790
1500b50790J7806K4101j3562o78J8038n772m259J7947j3537j8605P323N682j048
$$ -250790 -232984 -208883 -222445 -223123 -205085 -210857 -215116 -197169 -210706 -229311 -221988 -216306 -217354
1487b17354j3030J0691L8245J9423l4418p953j5690Q660Q067k0603j2655L2764
$$ -217354 -230384 -219693 -181448 -162025 -196443 -204396 -220086 -211426 -203359 -223962 -236617 -203853
1475b03853O736J2545J8697P669j3805l5293Q027j7630j3421J2708J2196j220
$$ -203853 -197117 -184572 -165875 -158206 -172011 -207304 -199277 -216907 -230328 -217620 -205424 -206644
1463b06644m228k515j1478J6606j5546j391J2799l657k507K2174K2486j923k6904
$$ -206644 -210872 -213387 -224865 -208259 -223805 -225196 -212397 -216054 -218561 -196387 -173901 -175824 -202728
1450b02728J8163J5308m9203k1462L6986j089J0925k3838J648k356L390J5718
$$ -202728 -184565 -169257 -218460 -239922 -202936 -204025 -193100 -216938 -215290 -217646 -214256 -198538
1438a98538M505m879P48M526k0072j3312L0951L1244J2303P682j7013j5872J0029
$$ -198538 -194033 -198912 -198164 -193638 -213710 -227022 -196071 -164827 -152524 -144842 -161855 -177727 -167698
1425a67698J5020m2257n206M741m446K7333K2662j8139k0956k6994J1122L8446
$$ -167698 -152678 -194935 -200141 -195400 -199846 -172513 -149851 -167990 -188946 -215940 -204818 -166372
1413a66372r815j9591J5845K1144o208N403j4077P08K1507p0417J4468R00j145
$$ -166372 -176187 -195778 -179933 -158789 -164997 -159594 -173671 -172963 -151456 -221873 -207405 -206505 -207650
1400b07650J0766J4762l472R934J7174p040K3941l1098j080r624Q143L3350q11
$$ -207650 -196884 -182122 -185594 -175660 -158486 -165526 -141585 -172683 -173763 -183387 -175244 -141894 -142705
1387a42705j7647j4540J4526K1270l4268l1534J0228J5016Q970k3216j0681K7952
$$ -142705 -160352 -174892 -160366 -139096 -173364 -204898 -194670 -179654 -170684 -193900 -204581 -176629
1375a76629J121j3043j0815R187P620J6975o773R027j1293j0040O205j4086n831
$$ -176629 -175508 -188551 -199366 -190179 -182559 -165584 -172357 -163330 -174623 -184663 -178458 -192544 -198375
1362a98375J560K553l0322K9302K115L4802j5626n382R864J913k8293L0637L741
$$ -198375 -196815 -194262 -224584 -195282 -193167 -158365 -173991 -179373 -169509 -167596 -195889 -165252 -161511
1349a61511K868L1084j1458m6510L4243K5756m3911r397J2331r648m700N24m830
$$ -161511 -158643 -127559 -139017 -185527 -151284 -125528 -169439 -178836 -166505 -176153 -180853 -180329 -185159
1336a85159J0631l7251L2846J4080j427n598L1756l207o591j4474j261L7078j3631
$$ -185159 -174528 -211779 -178933 -164853 -166280 -171878 -140122 -143329 -149920 -164394 -165655 -128577 -142208
1323a42208q069J0873j4586j762j2842l3696K2521L4615n427j3127j8384J8726
$$ -142208 -150277 -139404 -153990 -155752 -168594 -202290 -179769 -145154 -150581 -163708 -182092 -163366
1311a63366q349j9861K4414j0444J1094j07r114K6350k945k0297K8883M813j0597
$$ -163366 -171715 -191576 -167162 -177606 -166512 -166619 -175733 -149383 -152328 -172625 -143742 -138929 -149526
1298a49526J81J1397M6988m5327j642Q426J9682l7785j3513J7137J2046r529j7536
$$ -149526 -149345 -137948 -90960 -136287 -137929 -129503 -109821 -147606 -161119 -143982 -131936 -141465 -159001
1285a59001K737L836K4347j7393J3766l2140L3808o907m1097n998j56M0663K422
$$ -159001 -156264 -152428 -128081 -145474 -131708 -163848 -130040 -136947 -178044 -184042 -184198 -143535 -141113
1272a41113O423L689n110n9819K6555l986K5534J7981k5633N4942K6431j6650
$$ -141113 -134690 -131001 -136111 -195930 -169375 -173361 -147827 -129846 -155479 -100537 -74106 -90756
1260i0756j8017j8176p217L7740k7821m0753O540J8504J0407N93m9255O697n741
$$ -90756 -108773 -126949 -134166 -96426 -124247 -165000 -158460 -139956 -129549 -128956 -178211 -171514 -177255
1247a77255N597k955p04p14K448O351L5990m8010p855M2014n238j0916K7814J3812
$$ -177255 -171658 -174613 -175317 -176031 -173583 -167232 -131242 -179252 -187107 -145093 -150331 -161247 -133433 -119621
1233a19621k6591R772j4403j9847j5562O2J4826N3986K415j0355J038J1272k6219
$$ -119621 -146212 -136440 -150843 -170690 -186252 -186190 -171364 -117378 -114963 -125318 -124280 -113008 -139227
1220a39227m003j488J0368K9113l1822O284J8510k2410L680L8123j0597n939N022
$$ -139227 -143230 -144718 -134350 -105237 -137059 -130775 -112265 -134675 -130995 -92872 -103469 -109408 -104386
1207a04386n018k8617j6025P961L494J6705j5163Q599J2608J6424R20l9746k408
$$ -104386 -109404 -138021 -154046 -146085 -142591 -125886 -141049 -132450 -119842 -103418 -102498 -142244 -144652
1194a44652L6815j2080k6644J363J7648J3493J6940r639m2292J2868l605j1469
$$ -144652 -107837 -119917 -146561 -145198 -127550 -114057 -97117 -106756 -149048 -136180 -139785 -151254
1182a51254J4211J60j8994Q11J2922J2026J6125k7160K6600K5145j2059k612R74
$$ -151254 -137043 -136883 -155877 -155066 -142144 -130118 -113993 -141153 -114553 -89408 -101467 -104079 -103105
1169a03105o130j8217m052J0016j1101k5338M3563j1010J9937K2165J878l077
$$ -103105 -109235 -127452 -131504 -121488 -132589 -157927 -114364 -125374 -105437 -83272 -81394 -84471
1157h4471m185K0017l91m4270n5035L4767L1652L835l734L2398l0726M558j2610
$$ -84471 -88656 -68639 -69030 -113300 -168335 -133568 -101916 -98081 -101815 -69417 -100143 -95585 -108195
1144a08195l1652J35K4657N205k0045j6237O012q93L7049j1064M851M92J4259
$$ -108195 -139847 -139712 -115055 -109850 -129895 -146132 -140120 -141013 -103964 -115028 -110177 -109685 -95426
1131i5426J7485J352k6775m270J4483l0389M5144Q275o17k9418m8640J3495Q137
$$ -95426 -77941 -76589 -103364 -107634 -93151 -123540 -78396 -70121 -70738 -100156 -148796 -135301 -127164
1118a27164n07L7387K202m5958K2793J5856P934j40K077K6813r8093L3751M4235
$$ -127164 -127671 -90284 -88082 -134040 -111247 -95391 -87457 -87597 -85520 -58707 -156800 -123049 -78814
1105g8814j2352J6964M0501l0365m6787k9244J9102Q444J3060j0746p760K4219
$$ -78814 -91166 -74202 -33701 -64066 -110853 -140097 -120995 -112551 -99491 -110237 -117997 -93778
1093i3778k7917o891J2100J6962r024O309K7138l4773j6595N896L4375M5186O684
$$ -93778 -121695 -128586 -116486 -99524 -108548 -102239 -75101 -109874 -126469 -120573 -86198 -41012 -34328
1080c4328j3253l7744j1890K3698k166k7236j1010N1623J634k7683m9973K0009
$$ -34328 -47581 -85325 -97215 -73517 -75683 -102919 -113929 -62306 -60672 -88355 -138328 -118319
1068a18319P898J0077K3922r78K9987l2817K325K4433J793n841j1281j7672Q36
$$ -118319 -110421 -100344 -76422 -77400 -47413 -80230 -77905 -53472 -51679 -57520 -68801 -86473 -85637
1055h5637M4445M653m7188K6158l2268m545n838R781K3646k3481O364k8197J3899
$$ -85637 -41192 -36539 -83727 -57569 -89837 -94382 -100220 -90439 -66793 -90274 -83910 -112107 -98208
1042i8208M637R989K8692K875l1844k2192N4141o207k7184K8805n299n415l914
$$ -98208 -93571 -83582 -54890 -52015 -83859 -106051 -51910 -58117 -85301 -56496 -61795 -67210 -71124
1029g1124J9957L547m3570K8250r049l198K4450J1937k7069k1538N515K9092j5436
$$ -71124 -51167 -47620 -91190 -62940 -71989 -75187 -50737 -38800 -65869 -87407 -81892 -52800 -68236
1016f8236k139k0218r26K9683K1247N624k1344q317k0526K6330J082k1369o760
$$ -68236 -70375 -90593 -91519 -61836 -40589 -34965 -56309 -64626 -85152 -58822 -57740 -79109 -85869
1003h5869R134J8220o802m8122P9K5261N014l151q417K0880j6659L0754O246p069
$$ -85869 -76735 -58515 -65317 -113439 -113360 -88099 -83085 -86236 -94653 -73773 -90432 -59678 -53432 -60501
989f0501k376j4069l45p234R798K9669p433m589K3780k4829K8510J219n609j3999
$$ -60501 -62877 -76946 -77291 -84525 -74727 -45058 -52491 -57080 -33300 -58129 -29619 -28400 -34009 -48008
975d8008j3990K650j4344J0744o616k0731J0673p98j2010O388J0338n860K3774
$$ -48008 -61998 -59348 -73692 -62948 -69564 -90295 -79622 -80420 -92430 -86042 -75704 -81564 -57790
962e7790J346L106j8757l0393J2503N4644J2865n2963j3687K3898J2718J2989
$$ -57790 -56444 -53338 -72095 -102488 -89985 -35341 -22476 -75439 -89126 -65228 -52510 -39521
950c9521r864R153k9000j0879R952J2000o410l921K3701l908J8263l5510J544
$$ -39521 -49385 -40232 -69232 -80111 -70159 -58159 -64569 -68490 -44789 -48697 -30434 -65944 -64400
937f4400J2065L2096l3665J1952Q455j0899l8455O912O156J9331k3361K933K2177
$$ -64400 -52335 -20239 -53904 -41952 -33497 -44396 -82851 -75939 -69783 -50452 -73813 -70880 -48703
924d8703R835l424j9534p483j0187R077k06J1577J1848n465k8072K5624M0657
$$ -48703 -38868 -42292 -61826 -69309 -79496 -70419 -70625 -59048 -47200 -52665 -80737 -55113 -14456
911a4456L646n9387J389M4099m444p066O530n0663M5098O821k1246p627k3144
$$ -14456 -10810 -70197 -68808 -24709 -29153 -36219 -29689 -80352 -35254 -28433 -49679 -57306 -80450
898h0450P564J9097R733O197l8346m779N811J2256M2419j2250J0753k3877K1961
$$ -80450 -72886 -53789 -44056 -37859 -76205 -80984 -75173 -62917 -20498 -32748 -21995 -45872 -23911
885b3911R828l2290q715j270K6420K7905l0251J2854k7125j1407J6323j6098K272
$$ -23911 -14083 -46373 -55088 -56358 -29938 -2033 -32284 -19430 -46555 -57962 -41639 -57737 -55465
872e5465M2282L7798n3859j6515q480j95l336K2206M0915o863P056P92n4129m412
$$ -55465 -13183 24615 -29244 -45759 -54239 -54434 -57770 -35564 5351 -1512 5544 6336 -47793 -52205
858e2205O885J2196l6024J6328O2707j2802n1586L6016o335m6778q053L3892j3312
$$ -52205 -45320 -33124 -69148 -52820 9887 -2915 -54501 -18485 -24820 -71598 -79651 -45759 -59071
845e9071J9149J7787L966j5968k8261J9191J9073k7484k7163p48L7647J3753k121
$$ -59071 -39922 -22135 -18169 -34137 -62398 -43207 -24134 -51618 -78781 -79529 -41882 -28129 -30250
832c0250K8374j1065m4245J0210L1410R935R241l2412j6531K7232m523j8127r792
$$ -30250 -1876 -12941 -57186 -46976 -15566 -5631 3610 -28802 -45333 -18101 -22624 -40751 -50543
819e0543J9611N81k8751J9610j5747L3414J703j5205K0836L0407l0015j4550k1345
$$ -50543 -30932 -30351 -59102 -39492 -55239 -21825 -20122 -35327 -14491 15916 -14099 -28649 -49994
806d9994L030K5642M451l92Q696Q207k120J712l4534K6259J6238l0330k3879J2000
$$ -49994 -46964 -21322 -16871 -17263 -8567 -360 -2480 -768 -35302 -9043 7195 -23135 -47014 -35014
792c5014J9583K0930l246l8284N936k2103K5124K0665p384L57j8629L288K3578
$$ -35014 -15431 5499 2253 -36031 -30095 -52198 -27074 -6409 -13793 -13436 -32065 -28777 -5199
779e199j4963j8681M191m863n742L1j2610N519L957K0955k1981k6662K9433M0147
$$ -5199 -20162 -38843 -34652 -39515 -45257 -45226 -57836 -52317 -48360 -27405 -49386 -76048 -46615 -6468
765f468N309k2235l557k895J5840J6163l5190L192K0079M2333j9447k4536K1513
$$ -6468 -1159 -23394 -26951 -29846 -14006 2157 -33033 -29841 -9762 32571 13124 -11412 10101
752A0101r473j2799k5148k7507J9638O333J2804K3865m1436L2797K5243O022j0668
$$ 10101 628 -12171 -37319 -64826 -45188 -38855 -26051 -2186 -43622 -10825 14418 20440 9772
739I772k7530K77K795M616n938q528K892o626J6442Q471J9818l349k3592k3077
$$ 9772 -17758 -17481 -14686 -10070 -16008 -24536 -21644 -28270 -11828 -3357 16461 13112 -10480 -33557
725c3557j0031L7450J1583K2941k4885j370k0690P826L776j1869j7915L370J4915
$$ -33557 -43588 -6138 5445 28386 3501 2131 -18559 -10733 -6957 -18826 -36741 -33371 -18456
712a8456P786J145R908L2155K761j4619J9236k954k4390L943j7189j5863J0427
$$ -18456 -10670 -9525 383 32538 35299 20680 39916 36962 12572 16515 -674 -16537 -6110
699f110Q161p432j0889O532K320q557J7401k4673j7316M5941m498o631J8821n804
$$ -6110 2051 -5381 -16270 -9738 -7418 -15975 1426 -23247 -40563 5378 880 -5751 13070 7266
685G266L3959R612j9178o844p361r274J110K8312k275m0507J3974J1098k258j548
$$ 7266 41225 50837 31659 24815 17454 8180 9290 37602 35327 -5180 8794 19892 17634 16086
671A6086j3162j9310L4010o819J917Q673pn429r908o981J6923l8272j40N473J6993
$$ 16086 2924 -16386 17624 10805 12722 21395 21388 15959 6051 -930 15993 -22279 -22419 -16946 47
656D7R07k1109l5442J8753L9083k562J3126k0723L7742k1675K473J6202m3250
$$ 47 954 -20155 -55597 -36844 2239 -323 12803 -7920 29822 8147 10620 26822 -16428
643a6428o573K4675J6213j0922o815L687J0830p236j6886K371L1652O616k3558
$$ -16428 -23001 1674 17887 6965 150 3837 14667 7431 -9455 -7084 24568 31184 7626
630G626k2496L0359M903J1483L462k1965K6352Q818k0676k9182j0558q577J3774
$$ 7626 -14870 15489 20392 31875 35337 13372 39724 48542 27866 -1316 -11874 -20451 -6677
617f677J4581R563j6813k9032K0141K1760K5299r576J7207l7432n980J5359N889
$$ -6677 7904 17467 654 -28378 -8237 13523 38822 29246 46453 9021 3041 18400 24289
604B4289k592j0078j5078L4502j5070j8845K9654l301j4977k7486K9067L5654
$$ 24289 21697 11619 -3459 31043 15973 -2872 26782 23481 8504 -18982 10085 45739
592D5739M754l861j9512j7196J1794l3169r401M6276M048R674k4853k5509Q759
$$ 45739 50493 46632 27120 9924 21718 -11451 -20852 25424 29472 39146 14293 -11216 -2457
579b457k6375J6335J3372o916J6986L4114j1540k1106J1192J0826k5653K9537
$$ -2457 -28832 -12497 875 -6041 10945 45059 33519 12413 23605 34431 8778 38315
567C8315K0421n396k4236J2190o010j3832m627J1162o748m935L613L9782l5598
$$ 38315 58736 53340 29104 41294 35284 21452 16825 27987 21239 16304 19917 59699 24101
554B4101N175K8898o32k2552o503M205j0784J3244R362l788j5287j0997J3986
$$ 24101 29276 58174 57542 34990 28487 32692 21908 35152 44514 40726 25439 14442 28428
541B8428P072J2186L6254k8930K677J6462k3348J3247m335j0059K347K8754K527
$$ 28428 35500 47686 83940 55010 57687 74149 50801 64048 59713 49654 52001 80755 83282
528H3282k0384k1530L0024l1066K4052K324J6068Q591l4101J0929L027K104q8
$$ 83282 62898 41368 71392 40326 64378 66702 82770 91361 57260 68189 71216 73320 73232
515G3232l2572k9217q629j3001k2529J4654M6451j7079J2493M160J2488p615r703
$$ 73232 40660 11443 2814 -10187 -32716 -18062 28389 11310 23803 27963 40451 32836 23133
502B3133N209J5536j9952J1373O134j4020j72K781q113P107k103N213p924L6281
$$ 23133 28342 43878 23926 35299 41433 27413 27241 30022 21909 29016 26913 32126 24202 60483
488F0483K344l3978j06k1016l633Q504O50K5068j6331O746J4246K0407k6474l300
$$ 60483 62827 28849 28743 7727 4094 12598 13248 38316 21985 28731 42977 63384 36910 33610
474C3610O3904k091o4092k6924J3968l197J4879K8017r744O503K6054m3583m582
$$ 33610 97514 95423 31331 4407 18375 15178 30057 58074 48330 54833 80887 37304 32722
461C2722J3283P519k1491J8052L3430j7567p006N170J7568L37k2246j283R692
$$ 32722 46005 53524 32033 50085 83515 65948 58942 64112 81680 82017 59771 58488 68180
448F8180l0727k2601J9359J897M3180J428k7108m998q345k1169k0851K6888J9545
$$ 68180 37453 14852 34211 36108 79288 80716 53608 48610 40265 19096 -1755 25133 44678
435D4678K882K3617J4917o4796N9011L2623O77k6145l1929j2006K3986R374k5192
$$ 44678 47560 71177 86094 21298 80309 112932 113609 87464 55535 43529 67515 76889 51697
422E1697l1507J5135J0386L882k0372L6713l236K1268M343m4696o156k514J1885
$$ 51697 20190 35325 45711 49593 29221 65934 62698 83966 88309 43613 37457 34943 46828
409D6828J0458j3078K5909K0063j3041J2999k6225k9663K6018m509q771K1561
$$ 46828 57286 44208 70117 90180 77139 90138 63913 34250 60268 55759 46988 68549
397F8549m5614k4936K8639K7188j2272M2274J9936n1230k7222J939J4202K2685
$$ 68549 22935 -2001 26638 53826 41554 83828 103764 52534 25312 27251 41453 64138
385F4138o903K3215k3235k2697J8566J3823K0267q660K0337j0180l0848K863L989
$$ 64138 57235 80450 57215 34518 53084 66907 87174 78514 98851 88671 57823 60686 64675
372F4675k3084J8943K9946j4020l140Q648K5772l9523J5422k0669L575j3886J4061
$$ 64675 41591 60534 90480 76460 73320 81968 107740 68217 83639 62970 66545 52659 66720
359F6720j6380K12k698K9251m435k2124k4414l942K3134j462L4352L345l0659
$$ 66720 50340 50552 47854 77105 72670 50546 26132 22190 45324 43862 78214 81559 50900
346E0900J3449k1225l874J415j4748L9408l105k0698M8780o275l8860L1655j263
$$ 50900 64349 43124 39250 40665 25917 65325 62220 41522 90302 84027 45167 76822 75559
333G5559j0465k3842j246K2389p901J8736J5729k6977L06K4284K011L1324N103
$$ 75559 65094 41252 40006 62395 54494 73230 88959 61982 62288 86572 88583 119907 125010
320A25010o4312j4283r880j8142M7901J2948M296P475M154j7725q609J1522r666
$$ 125010 60698 46415 36535 18393 66294 79242 83538 91013 95167 77442 68833 80355 70689
307G0689L320J8526j0217r446J3641j8028K7746Q126j7014r829N972K6384r038
$$ 70689 74009 92535 82318 72872 86513 68485 96231 104357 87343 77514 83486 109870 100832
294A00832j7684j5313J0213j0044q241O2673n158l5921L6473k2476j0799k7982
$$ 100832 83148 67835 78048 68004 59763 122436 117278 81357 117830 95354 84555 56573
282E6573l4777N446J514J2448R37L0488m586M6119M66j9637k864j0141O321l2343
$$ 56573 21796 27242 28756 41204 42141 72629 68043 114162 114628 94991 92127 81986 88307 55964
268E5964j3009K2885k6536K0685K9860r774K6894Q896k367j012k960J0184j9842
$$ 55964 42955 65840 39304 59989 89849 80075 106969 115865 113498 112486 109526 119710 99868
255I9868j2123K7226O116n1267j4066K4576M277n776K2014k4846R411l6J0944
$$ 99868 87745 114971 121087 69820 55754 80330 84607 78831 100845 75999 85410 85374 96318
242I6318r910k084J171N89j5115J0962k2166k8521K2756K0352l474N79r964R695
$$ 96318 86408 84324 85495 86084 70969 81931 59765 31244 54000 74352 70878 71457 61493 71188
228G1188j6113K0551J1643j2286J1354k3387K4444J5548m6966L180O527q313k414
$$ 71188 55075 75626 87269 74983 86337 62950 87394 102942 55976 59156 65683 57370 54956
215E4956J1862J7645O051k3177l2980K3312j6689P468O760o353J4450L0431k8468
$$ 54956 66818 84463 90514 67337 34357 57669 40980 48448 55208 48855 63305 93736 65268
202F5268j5506J2324L1348k0926k3659K0906L6171k7213k8940o032q482M583N699
$$ 65268 49762 62086 93434 72508 48849 69755 105926 78713 49773 43741 35259 39842 45541
189D5541J0669K6552j715n135k2709K2276O490m6085m053L3593O238N977K7942
$$ 45541 56210 82762 81047 75912 53203 75479 81969 35884 31831 65424 71662 77639 105581
176A05581Q200m0926k3745j5453J9174J2727J9137r260k4357L7299Q51j6819j4826
$$ 105581 113781 72855 49110 33657 52831 65558 84695 75435 51078 88377 89228 72409 57583
163E7583J4875j0370p244j6904K5874J0426l9707O506J5483L129l336n089J9369
$$ 57583 72458 62088 54844 37940 63814 74240 34533 41039 56522 59651 56315 51226 70595
$$ [...]
##END NTUPLES=NMR SPECTRUM
##END=
