##TITLE=1H_TG-2365-1
 CDCl3
 8 sc, 
 19.1.2023
##JCAMPDX= 6.0         $$ Bruker NMR JCAMP-DX V2.0
##DATA TYPE= NMR SPECTRUM
##DATA CLASS= NTUPLES
##ORIGIN= UXNMR, Bruker Analytische Messtechnik GmbH
##OWNER= root
$$ XWIN-NMR		Version 3.5
$$ Thu Jan 19 14:18:46 2023 Russian Standard Time (UT+4h)  she@DPX200
##.OBSERVE FREQUENCY= 200.13135
##.OBSERVE NUCLEUS= ^1H
##.ACQUISITION MODE= SIMULTANEOUS
##.ACQUISITION SCHEME= undefined
##.AVERAGES= 8
##.DIGITISER RES= 18
##SPECTROMETER/DATA SYSTEM= spect
##.PULSE SEQUENCE= zg30
##.SOLVENT NAME= CDCl3
##.SHIFT REFERENCE= (INTERNAL, CDCl3, 0, 15.8394)
##AUDIT TRAIL= $$ (NUMBER, WHEN, WHO, WHERE, WHAT)
$$ ##TITLE= Audit trail, XWIN-NMR		Version 3.5
$$ ##JCAMPDX= 5.01
$$ ##ORIGIN= Bruker BioSpin GmbH
$$ ##OWNER= she
$$ F:/spectra/data/she/nmr/H-F/1/pdata/1/auditp.txt
$$ ##AUDIT TRAIL=  $$ (NUMBER, WHEN, WHO, WHERE, WHAT)
(   1,<2023-01-19 14:17:32.42 +0400>,<she>,<DPX200>,
      <created by zg, POWCHK disabled, PULCHK disabled
       configuration hash MD5:
       00 E9 B6 7A A2 85 ED C7 34 08 36 98 17 FE 4E 26
       data hash MD5: 16K
       54 81 16 0C 26 3E 72 8F 41 71 30 14 AA 92 F7 8F>)
(   2,<2023-01-19 14:17:35.18 +0400>,<she>,<DPX200>,
      <Start of raw data processing
       efp BC_mod = 2 LB = 0.24 FT_mod = 6 PKNL = 1 PHC0 = -19147.66 PHC1 = 57.60079 SI = 16K 
       data hash MD5: 16K
       98 1B B3 8C 2F 47 4E 7E B8 1D 4F E4 2B 08 65 73>)
(   3,<2023-01-19 14:17:56.68 +0400>,<she>,<DPX200>,
      <pk PHC0 = -121.4985 PHC1 = -47.8 
       data hash MD5: 16K
       C9 C4 3B 8A 61 8B C9 9C 35 F5 67 23 FA C3 BB 40>)
(   4,<2023-01-19 14:17:59.87 +0400>,<she>,<DPX200>,
      <abs ABSG = 5 
       data hash MD5: 16K
       F9 D9 98 C9 82 58 02 B4 F4 00 B5 0F 44 4A 98 23>)
$$ ##END=
$$ 
$$ hash MD5
$$ 9A 14 BD 96 62 B4 4B 62 B6 90 4B 74 C4 02 BE 21
##$RELAX= 
##$RELAX= 
##$RELAX= 
##$RELAX= 
##$RELAX= 
##$RELAX= 
$$ Bruker specific parameters
$$ --------------------------
##$DU= <F:/spectra>
##$EXPNO= 1
##$NAME= <H-F>
##$PROCNO= 1
##$TYPE= <nmr>
##$USER= <she>
##$AMP= (0..31)
100 100 100 100 100 100 100 100 100 100 100 100 100 100 100 100 100 100 
100 100 100 100 100 100 100 100 100 100 100 100 100 100 
##$AQSEQ= 0
##$AQ_mod= 1
##$AUNM= <au_zg>
##$AUTOPOS= <>
##$BF1= 200.13
##$BF2= 200.13
##$BF3= 200.13
##$BF4= 200.13
##$BF5= 200.13
##$BF6= 200.13
##$BF7= 200.13
##$BF8= 200.13
##$BYTORDA= 1
##$CFDGTYP= 0
##$CFRGTYP= 5
##$CHEMSTR= <none>
##$CNST= (0..31)
1 1 145 1 1 1 1 1 1 1 1 1 1 1 1 1 1 1 1 1 1 1 1 1 1 1 1 1 1 1 1 1 
##$CPDPRG= <>
##$CPDPRG1= <>
##$CPDPRG2= <>
##$CPDPRG3= <>
##$CPDPRG4= <mlev>
##$CPDPRG5= <mlev>
##$CPDPRG6= <mlev>
##$CPDPRG7= <mlev>
##$CPDPRG8= <mlev>
##$CPDPRGB= <>
##$CPDPRGT= <>
##$D= (0..31)
0 1.2 0 0 0 0 0 0 0 0.06 0 0.03 0 0 0 0 0.0002 0 0 0 0 0 0 0 0 0 0 0 0 
0 0 0 
##$DATE= 1674123451
##$DBL= (0..7)
120 120 120 120 120 120 120 120 
##$DBP= (0..7)
150 150 150 150 150 150 150 150 
##$DBP07= 0
##$DBPNAM0= <>
##$DBPNAM1= <>
##$DBPNAM2= <>
##$DBPNAM3= <>
##$DBPNAM4= <>
$$ [...]
##$SUBNAM3= <"">
##$SUBNAM4= <"">
##$SUBNAM5= <"">
##$SUBNAM6= <"">
##$SUBNAM7= <"">
##$SUBNAM8= <"">
##$SUBNAM9= <"">
##$SW= 18.05172834244
##$SWIBOX= (0..15)
0 0 2 0 0 0 0 0 0 0 0 0 0 0 0 0 
##$SW_h= 3612.71676300578
##$TD= 16384
##$TD0= 1
##$TE= 0
##$TE2= 300
##$TE3= 300
##$TEG= 300
##$TL= (0..7)
0 120 120 120 120 120 120 120 
##$TP= (0..7)
150 150 150 150 150 150 150 150 
##$TP07= 0
##$TPNAME0= <>
##$TPNAME1= <>
##$TPNAME2= <>
##$TPNAME3= <>
##$TPNAME4= <>
##$TPNAME5= <>
##$TPNAME6= <>
##$TPNAME7= <>
##$TPOAL= (0..7)
0.5 0.5 0.5 0.5 0.5 0.5 0.5 0.5 
##$TPOFFS= (0..7)
0 0 0 0 0 0 0 0 
##$TUNHIN= 0
##$TUNHOUT= 0
##$TUNXOUT= 0
##$USERA1= <user>
##$USERA2= <user>
##$USERA3= <user>
##$USERA4= <user>
##$USERA5= <user>
##$V9= 5
##$VALIST= <valist>
##$VCLIST= <CCCCCCCCCCCCCCC>
##$VD= 0
##$VDLIST= <DDDDDDDDDDDDDDD>
##$VPLIST= <PPPPPPPPPPPPPPP>
##$VTLIST= <TTTTTTTTTTTTTTT>
##$WBST= 1024
##$WBSW= 4
##$XGAIN= (0..3)
0 0 0 0 
##$XL= 0
##$YL= 0
##$YMAX_a= 502948
##$YMIN_a= -344297
##$ZGOPTNS= <>
##$ZL1= 120
##$ZL2= 120
##$ZL3= 120
##$ZL4= 120
##$ABSF1= 15.77113
##$ABSF2= -2.28072
##$ABSG= 5
##$ABSL= 3
##$ALPHA= 0
##$AQORDER= 0
##$ASSFAC= 0
##$ASSFACI= 0
##$ASSFACX= 0
##$ASSWID= 0
##$AUNMP= <proc_1d>
##$AZFE= 0.1
##$AZFW= 0.1
##$BCFW= 0
##$BC_mod= 2
##$BYTORDP= 0
##$COROFFS= 0
##$CY= -3
##$DATMOD= 1
##$DC= 0
##$DFILT= <>
##$DTYPP= 0
##$F1P= 0
##$F2P= 0
##$FCOR= 1
##$FTSIZE= 16384
##$FT_mod= 6
##$GAMMA= 0
##$GB= 0
##$INTBC= 1
##$INTSCL= 3.70164e-10
##$ISEN= 128
##$LB= 0.24
##$LEV0= 0
##$LPBIN= 0
##$MAXI= 10000
##$MC2= 0
##$MEAN= 0
##$ME_mod= 0
##$MI= 1.114404
##$NCOEF= 0
##$NC_proc= -8
##$NLEV= 6
##$NOISF1= 3.799351
##$NOISF2= 2.8
##$NSP= 0
##$NTH_PI= 0
##$NZP= 0
##$OFFSET= 15.83944
##$PC= 1
##$PHC0= -19269.16
##$PHC1= 9.800789
##$PH_mod= 1
##$PKNL= yes
##$PPARMOD= 0
##$PSCAL= 0
##$PSIGN= 0
##$REVERSE= no
##$SF= 200.129986410358
##$SI= 16384
##$SIGF1= 3
##$SIGF2= 2
##$SINO= 5.538805
##$SIOLD= 16384
##$SREGLST= <1H.CDCl3>
##$SSB= 0
##$STSI= 16384
##$STSR= 0
##$SW_p= 3612.71676300578
##$SYMM= 0
##$S_DEV= 0
##$TDeff= 16384
##$TDoff= 0
##$TI= <>
##$TILT= no
##$TM1= 0
##$TM2= 0
##$TOPLEV= 0
##$USERP1= <user>
##$USERP2= <user>
##$USERP3= <user>
##$USERP4= <user>
##$USERP5= <user>
##$WDW= 1
##$XDIM= 16384
##$YMAX_p= 560066057
##$YMIN_p= -888175
$$ End of Bruker specific parameters
$$ ---------------------------------
##NTUPLES= NMR SPECTRUM
##VAR_NAME=  FREQUENCY,     SPECTRUM/REAL,   SPECTRUM/IMAG
##SYMBOL=    X,             R,               I
##VAR_TYPE=  INDEPENDENT,   DEPENDENT,       DEPENDENT
##VAR_FORM=  AFFN,          ASDF,            ASDF
##VAR_DIM=   16384,         16384,           16384
##UNITS=     HZ,            ARBITRARY UNITS, ARBITRARY UNITS
##FACTOR=    0.220516191357247, 1,           1
##FIRST=     3169.94698114546, 0,            0
##LAST=      -442.769781860323, 0,           0
##MIN=       -442.769781860323, -888175,     0
##MAX=       3169.94698114546, 560066057,    0
$$ Real data points
##PAGE= N=1
##DATA TABLE= (X++(R..R)), XYDATA
$$ [...]
8305 -59908 -126326 -97640 -185736 -249512 -255644 -176886 -50165 -25985 -150865 -140092 -12877
8294 -12877 -49724 -15322 -15941 63708 158473 225315 251608 193536 48283 73868 -39527 -57475
8282 -57475 54242 -76708 -87881 -62172 23711 80972 132939 257873 201434 119561 59630
8271 59630 10078 -22762 121635 3016 -29314 8707 18839 31952 32728 118352 -36185 -76351
8259 -76351 -33304 -100221 -87061 42496 70854 73196 127288 67009 58297 -41719 55768 5318
8247 5318 50515 248158 277852 343566 326094 256276 204301 247313 135240 144252 363808 286313
8235 286313 339241 442910 526739 556231 544654 538708 679498 916544 1162369 1279085 1134897
8224 1134897 1203018 1260945 1117231 838105 752609 676187 600748 547577 364748 205282 290767
8213 290767 307045 238086 217435 268068 418706 371993 373551 370201 338101 65343 139066 87061
8201 87061 -45877 161731 114629 87055 -45642 98044 -291808 -421252 -888175 -550799
8191 -550799 588618 601931 703903 538216 613139 513034 219241 334912 449453 364650
8181 364650 441138 491365 348592 165929 350144 426760 311001 120646 210288 284247 232899
8170 232899 146977 305791 478300 462695 365298 362507 468615 442500 457260 430533 301576
8159 301576 487087 485450 362955 477705 395603 383951 424201 278761 275578 368996 308982
8148 308982 271702 404075 523096 366307 369304 275364 340157 333305 467490 521726 391985
8137 391985 365549 467083 521364 483895 371443 441628 476682 390536 482750 472491 553939
8126 553939 518174 486440 651457 730448 616230 499054 459168 612829 655515 541341 551846
8115 551846 457075 517244 631755 658768 675180 457008 503033 504633 441094 604822 617724
8104 617724 731221 554369 423629 565377 616880 796508 744696 695028 764362 627883
8094 627883 623110 589052 566513 702208 710373 786050 920147 849881 793243 729358 740348 669960
8082 669960 686547 751246 754599 866251 870749 735836 574230 667388 739170 788395 735459
8071 735459 813005 884457 814396 769632 858837 908187 793148 727169 717745 775690 755794 747737
8059 747737 692657 733172 852217 861020 823177 850889 664168 795680 807466 828368 935999
8048 935999 876175 862843 869634 761352 858062 902046 1005114 1013055 994410 970384 923884 945374
8036 945374 958560 1024888 935203 827962 820010 814241 876980 971281 950354 862230 806193 777893
8024 777893 716764 867388 938071 999538 1047110 1085575 1079862 924655 912968 977575 932282
8013 932282 1016903 1069100 985939 890261 940580 958614 761430 733460 780250 808231 906979
8002 906979 898621 929957 774662 635605 729045 728922 663701 677637 756280 709163 745882 782580
7990 782580 702785 879870 858039 1018336 1058891 974154 804614 790802 812130 908747 839545
7979 839545 667863 736856 702460 581647 519802 708973 852789 699653 695207 710835 711953
7968 711953 806139 983354 922480 794410 691550 830175 878547 789953 778437 801747 791886
7957 791886 692552 664466 755098 813953 681702 686382 711736 825870 817480 731953 645716 663729
7945 663729 615923 638716 644841 614099 563657 634941 546315 420641 349225 493687 566803
7934 566803 608603 598510 454734 386408 498658 564648 496542 418279 494720 421180 457424
7923 457424 566639 554870 507815 488941 611282 450519 448925 578648 533918 584744 469819
7912 469819 426814 541879 591595 657695 686511 547326 466324 485054 506449 604750 641959
7901 641959 668094 702909 670072 642208 661174 514614 406205 484179 606603 489486 390409
7890 390409 375057 484926 499482 549689 589842 660809 495393 530338 356611 338990 444821
7879 444821 435009 476693 310083 217026 248785 237723 137044 247229 281467 252479 311397
7868 311397 280911 267563 321099 415381 421636 417659 307158 335774 499143 549088 491776 459491
7856 459491 547181 514967 378121 418723 467826 533358 555518 597228 543993 475828 601979
7845 601979 548530 559348 515461 528292 473745 573858 663459 711248 874816 795497 665960
7834 665960 591959 387966 314510 291456 319925 427958 608400 447307 488074 462855 445708
7823 445708 392766 460376 444856 418642 222756 291824 218908 1146214 1309321 307565 482978
7812 482978 265845 203434 287556 371608 297177 210385 145985 85750 184866 144377 196181
7801 196181 258031 156689 80895 110561 -36730 -11219 127154 89550 140647 199315 237367
7790 237367 217122 194306 154907 167288 128916 99232 55324 39215 19912 36 35850 64012
7778 64012 82301 378649 367488 197785 97727 218903 108129 48521 273971 304702 227756
7767 227756 134748 83134 162103 128835 177281 217726 183323 139249 98858 175906 185995 163507
7755 163507 162826 264702 305421 309884 313830 150296 92369 136338 124714 114174 126285 182529
7743 182529 261623 337079 243629 148398 132037 166708 95835 56914 162931 131932 33790
7732 33790 126288 151359 210679 45007 89753 94556 108560 180383 235473 160887 240792 358977
7720 358977 171173 289346 177274 155771 275043 251374 272825 259730 197251 313629 273984
7709 273984 376596 219544 166388 290722 215223 309156 277901 205568 168277 262278 250778
7698 250778 196491 395403 491528 384183 284882 402467 240723 136223 300585 293747 260621
7687 260621 287507 361206 369139 339124 323091 359728 313121 299559 340661 238225 294684 310388
7675 310388 344468 398514 285721 189855 207969 265723 189425 204426 207126 189680 201742 172686
7663 172686 340876 308669 370261 256563 20738 46156 45997 -31224 -124513 66264 84315
7652 84315 143769 141938 166997 285095 260683 57621 -55735 -54537 -5909 131718 50139
7641 50139 135832 225213 173836 137252 63031 99954 15277 -31978 133128 63193 -55335
7630 -55335 -208226 -90980 -370 64406 155820 100431 26340 -96844 -104106 -31127 32469
7619 32469 16643 47449 -38696 -916 48552 15593 8883 41630 -37409 130368 13898 -36838
7607 -36838 67220 -15407 73482 57697 34657 -1881 -1469 84633 -18969 68259 4581 20677
7595 20677 48977 -25992 26431 109216 151982 130623 112459 131317 102742 59753 72108 46032
7583 46032 -70366 -99284 -134573 -173248 -36022 158022 186925 227760 219015 80877 94947
7572 94947 -13301 -173335 -229010 -106627 -48175 30561 -41998 -29826 -10349 5437 106231
7561 106231 20035 -93450 39267 76567 -11331 81006 72500 -138977 -92501 110012 151293
7550 151293 59646 -88259 3102 82785 204235 137468 -5827 -37842 -27265 -66146 40968
7539 40968 548 19413 142949 250608 213080 20657 44633 -5876 24909 8484 24288
7528 24288 79028 -67243 -113689 68151 -40761 -129163 -213027 -143903 -145839 -77627 2660
7517 2660 36126 -1620 -16141 21967 31754 1886 -23633 56441 -23794 -39710 3741 114291
7505 114291 113440 56882 104168 -57115 -76558 -23418 -7907 135815 163646 -28772 24678
7494 24678 8826 -45263 -30633 22136 -32137 -17519 91805 119676 87490 15983 61994 -3963
7482 -3963 -9575 12416 106032 44967 -60326 -28704 63683 57153 -60745 177152 194679 49247
7470 49247 158880 10876 76339 95818 66305 64060 174020 253378 182497 139676 143417 131368
7458 131368 67030 122045 212935 257123 148946 61863 53262 74618 25842 229794 182332
7447 182332 122908 209326 300033 328291 235119 281342 315500 363037 393680 330389 297037 328352
7435 328352 385422 149626 105648 263438 242229 235970 280933 357652 273536 171947 14522
7424 14522 75175 337308 296029 152024 207890 312090 226197 250506 250453 179569 352338 341390
7412 341390 362658 258178 200302 169072 314981 173587 251012 323926 386545 500236 190192
7401 190192 58257 248542 269879 312840 330097 327130 274062 213549 380907 282286 290649
7390 290649 391063 346321 380269 288867 326111 324509 253202 205570 251631 347869 315534 349478
7378 349478 207824 186866 347858 342113 379486 485909 299191 214889 337395 440781 344101
7367 344101 310592 330586 479238 432592 413476 505908 420875 416522 403644 319513 299165 424826
7355 424826 570091 541191 373512 326241 479547 456805 450571 326132 376970 577238 576151
7344 576151 679369 626003 460310 438844 569467 459905 491621 614864 608685 543075 490352
7333 490352 515932 462118 464102 356015 554455 551231 515840 447214 416705 528018 550125
7322 550125 648054 493639 581622 526761 470284 528925 479587 459483 584240 587208 665628
7311 665628 613036 611957 779936 753731 689023 558630 619999 623420 765699 801123 784148
7300 784148 740690 705051 607574 673233 821071 950146 854092 875811 978376 1062806 1058227
7289 1058227 990300 1013212 947207 1011060 934156 952947 951366 1092989 1167149 1183383 1267668
7278 1267668 1258113 1195720 1240394 1432475 1451808 1420281 1587398 1635104 1677761 1679853 1733670
7267 1733670 1818118 1831416 1772867 1882501 1958620 2065752 2091819 2261178 2296220 2344004 2438230
7256 2438230 2595730 2681891 2728258 2878608 2952644 3096395 3052441 3062060 3254557 3385270 3324716
7245 3324716 3377309 3573758 3741956 4006031 4164490 4258135 4389033 4417878 4507505 4582209
7235 4582209 4749977 4831053 5140654 5247476 5320248 5333618 5388014 5560407 5668945 5744799
7225 5744799 5956860 6130509 6261806 6373172 6311179 6489353 6721171 6848912 6816138 6806560
7215 6806560 7017270 7039871 7171831 7296245 7398360 7415426 7510260 7667882 7604850 7664544
7205 7664544 7753979 7753725 7973455 8053750 7857640 7944837 8069654 8015420 7958544 8002168 8150232
7194 8150232 8061576 7922013 7868855 7976920 7896087 7838837 7931988 7926221 7736719 7650450 7569562
7183 7569562 7550583 7549798 7521349 7500673 7377756 7253292 7210229 7066829 6848085 6786033 6652898
7172 6652898 6641239 6468560 6501158 6449861 6233755 6063792 5928689 5723580 5582716 5588950
7162 5588950 5574797 5385576 5336309 5279473 5148860 5036129 4970325 4738764 4685787 4648196 4607548
7151 4607548 4461250 4356792 4286706 4147254 4128604 4078662 3927495 3983224 3941383 3790020
7141 3790020 3717079 3628425 3549645 3539627 3665233 3593184 3407906 3530282 3533410 3350030 3254866
7130 3254866 3259373 3287596 3290252 3201613 3296733 3311076 3118248 3190696 3139038 3187972 3170498 3124005
7118 3124005 3275472 3357448 3406057 3345044 3451264 3574122 3468712 3583102 3652626 3673551
7108 3673551 3741414 3758798 3686177 3750395 3708776 3744672 3829814 3848136 3819761 3914347 3942642
7097 3942642 3953636 3983680 3896324 3840848 3894021 4031362 4116196 4169688 4124036 4232054 4214449
7086 4214449 4165213 4236288 4336987 4208972 4237558 4359712 4493917 4542828 4519780 4597373 4555466
7075 4555466 4677264 4666046 4684579 4841312 4849643 4749255 4748806 4611342 4514502 4424779 4362808
7064 4362808 4332440 4390705 4448884 4416144 4378691 4028479 4074697 4286658 4197700 4099134 4102691
7053 4102691 4180115 4057991 4132476 3915090 3805376 4003166 3939056 3939153 3910500 3890649 3817547
7042 3817547 3782248 3763175 3702038 3725791 3625655 3581383 3562917 3519845 3526972 3431591 3352437
7031 3352437 3393721 3243695 3132800 3017274 2965500 2859310 2776798 2626330 2656167 2653085 2671317
7020 2671317 2593213 2534528 2623332 2569007 2560293 2620925 2508450 2472775 2399907 2393916 2369467 2170980
7008 2170980 2097293 2159800 2233149 2201349 2172824 2089255 2102530 2033733 1963016 1858112 1996918
6997 1996918 1943637 1846490 1797134 1891030 1852046 1787977 1668899 1624297 1702241 1863639 1836517
6986 1836517 1725845 1745995 1829206 1695496 1783533 1735877 1628166 1627100 1673599 1695757 1627962
6975 1627962 1607586 1623003 1745650 1814587 1800847 1626654 1555271 1506317 1429174 1362895 1563930
6964 1563930 1733650 1733718 1667412 1587260 1673715 1688723 1601569 1627289 1611625 1453097 1392719 1461120
6952 1461120 1527673 1523546 1526787 1630827 1533486 1585070 1710557 1710467 1691997 1676792 1656384 1577813
6940 1577813 1515560 1484929 1659310 1650729 1581920 1662305 1588548 1641739 1673171 1738606 1727749
6929 1727749 1716112 1513376 1396966 1586252 1505338 1462386 1731295 1713227 1748700 1766412 1764997
6918 1764997 1739654 1638314 1695090 1535740 1559953 1749068 1731604 1801113 1805761 1734100 1731136
6907 1731136 1754908 1800947 1872004 1810153 1710757 1823350 1757615 1735612 1755406 1827932 1883000
6896 1883000 1873963 1952938 1956972 1861015 1861398 1871455 1801986 1769234 1823702 1974182 1962375 2058005
6884 2058005 2016790 1937452 2159849 2263387 2213968 2169124 2300658 2282866 2341616 2391348 2462071
6873 2462071 2538269 2406101 2412782 2462528 2510117 2549297 2543950 2478933 2512049 2589856 2720255
6862 2720255 2726051 2706486 2879186 2880595 2882479 3070249 3260401 3442065 3601915 3876420 4004006
6851 4004006 4039706 3967882 3750365 3660105 3532056 3447942 3246020 3044213 3012509 2874195
6841 2874195 2996698 3006017 2934842 3068396 2970470 2957536 2871549 3053936 3017816 2892233 2933573
6830 2933573 2899603 3138568 3177885 3181698 3172343 3240107 3193588 3165230 3339621 3281883 3344266
6819 3344266 3476052 3630003 3517394 3591160 3602103 3633420 3660114 3640580 3833415 3885521 4043474
6808 4043474 4031499 4144845 4194496 4173131 4156661 4166059 4254106 4388528 4502656 4506856 4629965
6797 4629965 4696817 4819057 4768428 4737687 4917986 5207703 5284076 5411271 5555052 5671557
6787 5671557 5760819 5957535 6110790 6417027 6541685 6613820 6889868 7010763 7073691 6985388
6777 6985388 7085223 7153291 7078430 6971528 7115879 7171763 7106698 7057110 7257442 7014572 7048436
6766 7048436 7126838 7134582 7197527 7059234 6995723 7103182 7200298 7252053 7202364 7215001 7521827
6755 7521827 7714029 7643999 7716963 8033984 8216079 8317249 8380874 8473281 8617195 8617228 8627307
6744 8627307 8654235 8708012 8718794 8842335 8907154 8819960 8809797 8851005 8961829 9093598 9102000
6733 9102000 9350260 9388148 9394795 9619116 9891994 10160227 10057760 10114998 10366832 10573062
6723 10573062 10626133 10735351 10805081 10951354 11145667 11294227 11408771 11646064 11831979 11810821
6713 11810821 11702756 11813225 11794916 11847650 11872285 11888135 11978528 11975726 11975654 11964647 12061927 12109337
6701 12109337 12271027 12582083 12859284 12936122 13257566 13718777 14033290 14382849 14715944 15117804
6691 15117804 15566488 16067502 16522073 16913937 17202490 17750191 18301377 18672505 19081014
6682 19081014 19555629 20153393 20734976 21271066 21805308 22253582 22861093 23418958 23882264
6673 23882264 24163223 24398597 24666558 24738505 24824706 24901647 25117636 25221316 25334261 25305844
6663 25305844 25292543 25188134 25008983 25005143 24914777 24808451 24935195 25238209 25536938 26095772
6653 26095772 26498715 26946822 27438327 27852295 27930696 27975945 27983836 27932590 27483979 27070266
6643 27070266 26694158 26278595 25687408 25214553 24930764 24713695 24531053 24422218 24490298 24549977
6633 24549977 24775186 24894349 25152735 25539264 26062933 26616582 27190242 27795163 28351158
6624 28351158 28788999 29048393 29018479 28705773 28297129 27886816 27406304 26719396 25938298 25332472
6614 25332472 24629131 24109177 23785173 23590402 23440010 23414392 23499478 23700531 23853247 24111934
6604 24111934 24506073 24943807 25150964 25446077 25675414 26024787 26286320 26385443 26287174 25876219
6594 25876219 25431300 24798406 23992206 23431892 22823840 21968057 21262762 20693128 20015238
6585 20015238 19459375 19038250 18833554 18717893 18490440 18333655 18535704 18661625 18767514
6576 18767514 19015313 19175033 19254149 19355838 19372589 19468530 19477131 19385440 19204252 18933884
6566 18933884 18679412 18315264 17906142 17506751 17182750 16674553 16204323 15916988 15571484
6557 15571484 15123791 14853478 14479116 14197532 13934613 13786050 13664191 13532099 13298349
6548 13298349 13204021 13145141 13013142 12888939 12972449 12866769 12763663 12807171 12822263 12745848
6538 12745848 12727571 12703271 12763745 12900644 12860880 12735886 12774077 12738242 12895126 13092284
6528 13092284 13139488 13245173 13346622 13334241 13339492 13395456 13472119 13436500 13523496 13571283 13660553
6517 13660553 13811143 13753247 13825088 13909141 14059666 14083897 14084402 13971791 14133556 14239133 14209998
6506 14209998 14268781 14236208 14203903 14311250 14349750 14407481 14419889 14526265 14408924 14360481 14489939
6495 14489939 14629420 14572761 14534866 14500261 14550882 14542260 14388922 14170668 14121435 14104516 14015914
6484 14015914 14131971 14089466 13874519 13682071 13404019 13249822 13441993 13423219 13384210 13399302
6474 13399302 13378520 13236407 13186631 13179628 13124652 12991199 12864923 12864236 12846860 12883462 12857681
6463 12857681 12671470 12572627 12484683 12535937 12382923 12374188 12400433 12198414 11990843 11998213 12053919
6452 12053919 11933577 11936552 11943837 12000317 12043594 11925621 11892195 11923630 11862121 11905183 11924754
6441 11924754 12010575 12060441 11992205 12075605 12059617 12229713 12417553 12457828 12482749 12609382 12580641
6430 12580641 12635016 12734562 12790399 12975791 13131557 13221731 13194937 13210193 13491510 13703925
6420 13703925 13830984 14061538 14192578 14352233 14622402 14816906 15111102 15270457 15602127
6411 15602127 16024645 16342455 16716803 16966578 17393931 17752399 18119825 18481418 18836364
6402 18836364 19263620 19773993 20345951 21014572 21567052 22146937 22723138 23206720 23675610
6393 23675610 24080824 24548556 25037585 25268340 25467740 25641158 25769306 25724176 25933540 26071840
6383 26071840 26095829 26424628 26610159 26744010 26850257 26986790 27277038 27463486 27676839 27894962
6373 27894962 28098392 28182535 28198103 28247892 28246558 28016078 27897521 27751556 27428972 27149872
6363 27149872 27082477 26797298 26342677 26242012 26100373 25963636 25791302 25676732 25630335 25562779
6353 25562779 25569079 25579143 25616272 25753884 25851874 26039955 26064848 26240117 26467574 26686607
6343 26686607 26890242 26985193 27352650 27503406 27689469 28085947 28435289 28753597 29017097 29306782
6333 29306782 29722425 29961461 30051832 30363877 30601013 30882883 31023107 31069752 31227378 31233194
6323 31233194 31145148 31015954 30949021 30893658 30835510 30781749 30800903 30605118 30528331 30791581 30735920
6312 30735920 30863408 30944156 31143682 31318885 31345584 31440532 31508222 31548551 31533218 31624159 31556136
6301 31556136 31366078 31078649 30999485 30998754 30875548 30869072 30819100 30791530 30747649 30626090 30761064
6290 30761064 30551763 30478135 30547274 30396756 30340509 30352626 30449703 30396990 30317004 30283648 30215126
6279 30215126 30145537 30009129 29918922 29788059 29710286 29609628 29490001 29264105 29136676 28964254
6269 28964254 28776469 28555885 28146245 27743530 27506002 27272848 26860204 26565972 26178487
6260 26178487 25795760 25488325 25312528 25041951 24817615 24458585 24369850 24277120 24102240 23971521
6250 23971521 23772743 23584845 23626464 23633687 23609454 23525462 23391507 23615303 23726052 23675720
6240 23675720 23471478 23568478 23666951 23788632 23844620 23707235 23692297 23805286 23990159 24110949
6230 24110949 24157552 24068934 24122727 24136234 24179128 24117942 24039386 23918170 23936767 23881795 23830225
6219 23830225 23766160 23820002 23786675 23703390 23696102 23592990 23607345 23768751 23831422 23747681 23784477
6208 23784477 23865175 24045302 24142437 24019653 24014553 24021379 24095100 24252242 24227577 24141661 24197288
6197 24197288 24340149 24268432 24320052 24424694 24723635 24810840 24826004 24863314 24859043 24887166 25026783
6186 25026783 25023732 25133009 25208336 25227094 25367025 25410883 25586319 25767630 25861037 26045337
6176 26045337 26094482 26187097 26406584 26799917 27096400 27244832 27304957 27603816 27888453 28168266
6166 28168266 28593835 28891072 29118704 29532247 30034090 30300931 30919881 31363152 31846523
6157 31846523 32404993 32899645 33543227 34004265 34495131 35127872 35890955 36406432 37069809
6148 37069809 37738850 38217266 38958712 39471335 39998223 40443068 40769918 41221574 41493938
6139 41493938 41660536 41808717 41931107 42155503 42310244 42515368 42722385 42819254 42834284 42987254
6129 42987254 43143061 43234434 43410310 43373162 43196649 43194601 43241879 43286540 43183280 43167475 43062371
6118 43062371 42837324 42808042 42750800 42505666 42203975 42024712 41875044 41515961 41318531 41355007
6108 41355007 41196802 41013208 40787878 40587245 40501571 40444965 40223066 40248832 40402358 40424880
6098 40424880 40420691 40344532 40396132 40371793 40351862 40369566 40275229 40375172 40334793 40166513 39927141
6087 39927141 39650529 39539992 39243896 39035589 38854714 38489579 38351199 38203671 38193094 38143316
6077 38143316 38175380 38395178 38454627 38524456 38593156 38813776 39052548 39231015 39328565 39445194
6067 39445194 39536256 39558228 39533896 39448185 39420323 39220815 38860179 38479563 38248822 37951226
6057 37951226 37636401 37377404 37041285 36797231 36458700 36296536 36075697 35868414 35841687 35680510
6047 35680510 35626950 35715397 35647332 35617852 35608597 35571352 35675441 35723320 35760556 35780449 35738738
6036 35738738 35740299 35745970 35689844 35575223 35593883 35442085 35353551 35246194 35060045 34981950 34996439
6025 34996439 34814452 34741366 34596165 34534250 34467099 34303670 34295820 34199764 34074806 34032377 34151967
6014 34151967 34050486 34078355 33975402 33899976 33937548 33864571 33664888 33660729 33571881 33511843 33337682
6003 33337682 33183418 33101881 33040737 33006740 32758481 32772064 32574405 32414448 32399776 32270375
5993 32270375 32100560 32068684 32071727 32124329 32286345 32173538 32304186 32551348 32613288 32753635
5983 32753635 32898881 33295793 33788840 34338978 35134656 36066282 37202135 38236555 39413174
5974 39413174 40711344 42074302 42913924 42640428 41966450 41366378 40846717 40050434 38843772
5965 38843772 37518429 36172246 35206150 34535531 34125539 33824589 33760779 33752862 33822098 34078373
5955 34078373 34395821 35094421 35681727 36616585 37535691 38596838 39957390 41578815 43837772
5946 43837772 46420094 49412413 52783671 56454116 60322908 64405777 67810426 67946028
5938 67946028 65817693 63768969 62003940 59644851 56204108 52097647 48067640 44651256
5930 44651256 42098879 40464006 39075231 38141771 37391578 36926433 36783618 36947632 37119873
5921 37119873 37337082 37723549 38251696 39094749 40238583 41739411 43808682 46290860 49053765
5912 49053765 52499845 56101703 60092124 64141236 67692829 68562362 66382440 64108819
5904 64108819 62234819 59879632 56210979 51953404 47748604 43927637 41087689 38828163
5896 38828163 37093284 35809373 34676500 33861763 33157457 32710933 32343553 32084127 31939479
5887 31939479 31918075 31763184 31828767 32245092 32600117 33174761 33899301 34769081 35800474 36921402
5877 36921402 37999671 39081284 39339401 38536836 37518869 36629268 35597443 34232483 32677221
5868 32677221 30894870 29377204 28158013 27033895 26319628 25536022 25096499 24547928 24044994
5859 24044994 23662242 23136625 22885196 22620264 22303753 22045839 21782796 21428979 21293308
5850 21293308 21125448 20901077 20697535 20308544 19957910 19684126 19527931 19314612 19160668
5841 19160668 18914732 18705988 18655964 18587912 18468082 18313427 18121046 17931396 17823171 17760514
5831 17760514 17680537 17529244 17564587 17510485 17362424 17295427 17208838 17127116 17082803 16964515 16858710
5820 16858710 16630823 16470840 16427570 16196226 16030828 16082356 15942244 15739385 15661045 15775422
5810 15775422 15637356 15582490 15590153 15596947 15487028 15446501 15338335 15183606 15108567 15003920 14912240
5799 14912240 14702389 14649400 14551286 14481935 14403144 14307544 14104939 13964911 13861687 13850129
5789 13850129 13734280 13599587 13449248 13434657 13309260 13050005 12896283 12855892 12953046 12933774
5779 12933774 12664698 12757577 12758237 12630540 12713421 12727958 12821145 12769424 12665195 12542239 12571522
5768 12571522 12598644 12432292 12360402 12372037 12223905 12171479 12193069 12214349 12186196 12061972 12080656
5757 12080656 12071372 12086331 12100172 12096507 12058431 12067525 12016952 11950175 11962113 11876963 11840835 11829280
5745 11829280 11707558 11594870 11588149 11475949 11554655 11449493 11269572 11059753 10921316 10896366
5735 10896366 10885968 10916828 10907239 10740806 10721594 10839277 10819578 10773575 10720559 10842291 10688342
5724 10688342 10780423 10906199 10755157 10769838 10793098 10687190 10603530 10661426 10671186 10795313 10669787
5713 10669787 10534423 10696422 10815601 10806794 10808652 10722712 10713406 10852565 10828762 10764696 10794257
5702 10794257 10971432 11012650 11059969 11059581 11281170 11316337 11315361 11375513 11425284 11379721 11414076 11506567
5690 11506567 11466420 11568797 11637361 11768451 11930022 11951848 11971537 11953190 11784450 11904460
5680 11904460 11923407 12111335 12218510 12327513 12267990 12349445 12513890 12479617 12492679 12444623
5670 12444623 12540975 12502862 12689703 12681150 12707855 12719326 12663030 12733846 12755086 12866020 12902962
5659 12902962 13039652 13133419 13127178 13156945 13229611 13234093 13364284 13428188 13410474 13484038 13657801
5648 13657801 13742785 13751371 13796872 13894969 13900584 14051755 14078399 14268455 14542220 14519819 14470758
5637 14470758 14579032 14743041 14797501 14919643 15062850 15189098 15345117 15452025 15304354 15421437
5627 15421437 15621625 15690607 15773896 15839166 15939856 16146483 16212657 16322425 16423462 16423108 16466961
5616 16466961 16667878 16644688 16592862 16777847 16914307 17021839 17182924 17178478 17207220 17350593
5606 17350593 17604058 17574123 17625305 17742186 17973204 18129414 18259248 18395377 18451618 18578593
5596 18578593 18710311 18865650 18817566 18816891 18996947 19090947 19068144 19190066 19309941 19383542 19449019
5585 19449019 19458093 19388210 19404135 19449693 19609507 19741288 19889933 19831653 19916641 20094234 20090851
5574 20090851 20327945 20539475 20837598 20746320 20782207 20951962 21071825 21442294 21521665 21609778
5564 21609778 21824003 22036754 22217266 22450540 22490015 22697904 22830775 22953093 23030252 23247075
5554 23247075 23435693 23573179 23761051 24098544 24513622 24707215 24806226 25023372 25164575 25422312
5544 25422312 25717813 25923550 26253544 26609555 26826598 27294081 27800312 28266859 28633312
5535 28633312 28974866 29395730 29533310 29986353 30575423 31035070 31318422 31697999 32167869
5526 32167869 32573037 32889834 33365930 33757939 34105603 34397099 34620464 34941833 35135583
5517 35135583 35304022 35353124 35493869 35585042 35568959 35601855 35614913 35771282 35901283 35855423
5507 35855423 35930028 36166565 36353229 36486259 36720855 36874519 37190924 37596080 37868619 38313344
5497 38313344 38768758 39280498 39776327 40400061 41057706 41736137 42252070 42947460 43618259
5488 43618259 44358890 44847928 45274523 45848624 46292972 46581318 46916925 47165481 47354957
5479 47354957 47479921 47574628 47568439 47421195 47335044 46984117 46682921 46235104 46045281 45851061
5469 45851061 45578803 45448349 45318886 45254148 45058109 44943081 44998583 44936492 44989594 44954334
5459 44954334 45087721 45172001 45318094 45476248 45551563 45654267 45835077 45844646 45960094 46216808
5449 46216808 46262067 46324941 46557442 46549554 46497513 46513852 46284676 46150771 45786367 45565336
5439 45565336 45277766 44964340 44704667 44340522 44043454 43644766 43375927 43076066 42929858
5430 42929858 42770113 42467630 42501805 42439153 42332690 42451197 42432776 42305167 42195809 42045581
5420 42045581 42083339 42081778 41949422 41854103 41811739 41498464 41273732 40932983 40573783 40374965
5410 40374965 40000174 39572830 39211059 38845442 38535947 38423214 38193569 37977117 37868096
5401 37868096 37503393 37270286 37071872 36996077 36831561 36637607 36464535 36395304 36509218 36405801
5391 36405801 36436343 36421410 36377538 36587327 36521626 36654506 36729723 36876517 37034466 37018056
5381 37018056 37238387 37333706 37331315 37333710 37409879 37696663 37960110 38267647 38445330 38682470
5371 38682470 39037227 39074618 39056709 38814594 38665678 38623078 38563147 38186776 37956416 37712199
5361 37712199 37231686 36765201 36452390 36101616 35698856 35286147 35241570 35082980 34775536 34756189
5351 34756189 34590365 34482158 34521201 34644325 34772100 34958408 35134923 35116412 35419302 35765788
5341 35765788 36063832 36311987 36399514 36461348 36472368 36364957 36330832 36135363 35933398 35717110
5331 35717110 35503700 35089982 34564368 33997865 33603827 33135022 32581796 32444482 32137740
5322 32137740 31910113 31730012 31466174 31323312 31279609 31430702 31378094 31372204 31648516 31627273
5312 31627273 31965044 32282340 32495737 32679967 33078378 33328353 33487468 33904640 34234692
5303 34234692 34235318 34451689 34925804 34929352 35038588 35275761 35606132 35742868 35976511 36233831
5293 36233831 36269679 36277916 36455439 36691347 36958961 37204859 37277565 37541197 37632842 37842334
5283 37842334 38301749 38668990 39068620 39497027 40064685 40766610 41641721 42504716 43340207
5274 43340207 44128925 44758600 45345981 45609760 45783742 46019076 46128317 46060417 45847497 45629911
5264 45629911 45477695 45408085 45193654 44963934 44883094 44784460 45026185 45230198 45407180 45618061
5254 45618061 45990011 46631301 47230314 48107131 49074254 50125355 51154199 52479117 54064680
5245 54064680 55568874 56998939 58284371 59561463 60778757 61850791 62785003 63557750
5237 63557750 64322945 65098961 65839995 66550059 66553825 66248953 65610770 64789862 63692983 62436632
5227 62436632 60992873 59411919 57844456 56510387 55385572 54469874 53820465 53493708 53377084
5218 53377084 53281047 53497666 53893411 54447107 55213494 56161411 56766183 57256799 57761779 58198968
5208 58198968 58606310 58999513 59142720 58886720 58258371 57278030 56222449 54917485 53470765
5199 53470765 52033070 50500104 48942216 47643123 46519557 45559143 44898603 44452539 44066026
5190 44066026 43680519 43402444 43092942 42904613 42825086 42877647 42749654 42489085 42508218 42522986
5180 42522986 42476153 42556731 42681825 42873132 43197169 43614531 44088570 44717891 45675661 46581350
5170 46581350 47647352 49048437 50353708 51555691 52524009 53243218 53777598 53744494 53428347
5161 53428347 53183209 52652930 51926161 50924474 49787853 48716000 47564399 46539182 45649318
5152 45649318 44731630 43864821 43117884 42814128 42799661 42905509 43376242 43863246 44470943 45395509
5142 45395509 46425633 47395060 48138552 48670556 48883391 49067092 49118051 49002016 48849849
5133 48849849 48548593 48017671 47522700 46795371 45973205 45287267 44513937 43910951 42943004
5124 42943004 41840237 40733478 39605007 38569722 37654326 36628324 35415827 34448071
5116 34448071 33714023 33157777 32704567 32296623 32087393 31949704 31860587 31797266 31831611 32074760
5106 32074760 32273257 32649931 32743599 33049061 33328762 33506634 33420547 33145863 32751144 32401719
5096 32401719 32043235 31607655 31019622 30544825 29993926 29745491 29542904 29191041 28939213
5087 28939213 28724960 28606838 28537969 28711683 28982122 29090445 29047052 29135157 29325010 29636550
5077 29636550 29995286 30309698 30721846 31182329 31752734 32336374 32870990 33643602 34514975
5068 34514975 35644432 36855322 38298224 39907623 41728956 43774617 46319873 49124426
5060 49124426 52422889 56281767 60660456 65937643 71931491 78480371 85523749 92745687
5052 92745687 99547634 105122304 108273840 108298277 106085863 102510220 97804605 91806183
5044 91806183 84926395 77599065 70497887 63987485 58113774 53038891 48988241 45388464
5036 45388464 42554431 40032297 38023410 36366139 34754270 33635089 32533918 31777164
5028 31777164 31151580 30366529 29785325 29220514 28613732 27966012 27450406 26849714 26066028
5019 26066028 25487376 24966037 24466979 23977382 23494318 23275389 23120853 22894534 22749042
5010 22749042 22615543 22587844 22585141 22496446 22313485 22301325 22346004 22263848 22211279 22239775 22099397
4999 22099397 22120008 22071018 22051981 22080537 22013210 22091775 22089362 22227030 22237790 22257794 22402637
4988 22402637 22652439 22929315 23104801 23121327 23446515 23540682 23812420 24059789 24292805 24529616
4978 24529616 24743574 25082069 25507418 25923232 26254664 26754963 27166053 27564058 28015093
4969 28015093 28489983 29161702 29709207 30222584 30829441 31382470 32063243 32859887 33658419
4960 33658419 34378210 35327467 36148982 37381611 38530422 39739240 41150868 42724223 44443484
4951 44443484 46438969 48506878 50993797 53831489 56890897 60387262 64309338 68465532
4943 68465532 72960949 77414606 81338521 84400443 86324599 87185134 87466610 87222199 86367905
4934 86367905 84911098 83345452 81964386 80617834 79807693 79672648 80045140 80954796 82084252
4925 82084252 83626080 85554377 87783945 90197249 92559033 94553593 95823157 95523448
4917 95523448 94217494 92369695 89764457 86600236 82949710 79428449 76131467 73137790
4909 73137790 70622804 68717069 67180939 66144460 65425588 64798918 64365028 64038332 63722766
4900 63722766 63215425 62753015 62100720 61679367 61441181 61223839 61225161 61636216 62273710 62941470
4890 62941470 63936473 65328018 66772406 68552454 70706991 73365111 76431067 80009391
4882 80009391 84320796 89323632 95182262 101896703 109671789 117963906 126389015 134649371
4874 134649371 142057807 147189538 149414181 149589857 148223846 145625418 142873537 140545853
4866 140545853 138802312 137552109 136132714 133323009 129042305 123682255 117430926 110040191
4858 110040191 102137180 94481911 87363279 81140591 75882625 71452410 67628976 64398703
4850 64398703 61632341 59201624 57226784 55462814 53939963 52511219 51354227 50347600
4842 50347600 49373411 48460206 47728170 47186979 46567454 46152060 45656520 45186163 44764824
4833 44764824 44303060 44105120 43814080 43692306 43610924 43573835 43638034 43737501 43579796 43672669
4823 43672669 43807433 44097653 44552789 44932918 45345728 45707244 46109926 46813415 47470999
4814 47470999 48148659 48791555 49540552 50344904 51267382 52097151 53126176 54251462 55414941
4805 55414941 56559297 57733260 59041389 60271099 61392904 62520457 63649950 64784106
4797 64784106 65917587 66942163 68238744 69762162 71546081 73450002 75585300 78186803
4789 78186803 81142322 84626651 88588466 93327242 98794007 105190344 112618163 121067852
4781 121067852 130346773 140648404 151706270 162907485 173796422 183032726 190239661
4774 190239661 197573135 206470030 217733807 230208090 244550786 261767804 282672359
4767 282672359 302110890 315030912 325470723 336892504 336206346 315204717 290928942
4760 290928942 268343416 242542457 212666663 184623024 160596414 141986161 128013848
4753 128013848 116923231 108117895 100988648 95186608 90218421 86117186 82589012 79250353
4745 79250353 76542308 74105355 71744552 69644459 67804885 65881840 63895500 62016516
4737 62016516 60241484 58668875 56932905 55172542 53526784 52234816 50970434 49494929
4729 49494929 48416809 47383808 46412703 45525525 44799828 44001103 43392788 42838179 42098665
4720 42098665 41498373 40848228 40451037 39909560 39307873 38698482 38202905 37658920 37130056
4711 37130056 36429765 35996439 35476156 34875284 34395128 33817569 33319723 32857477 32277078
4702 32277078 31752241 31221574 30812527 30201960 29832584 29500935 29035387 28460903 28067905
4693 28067905 27688923 27262110 26839507 26461205 26222136 25894813 25668710 25438188 25252143
4684 25252143 25134294 24919348 24721621 24514624 24357414 23998530 23791312 23555934 23515340 23268194
4674 23268194 23252623 23170555 22991385 22959689 22783014 22817162 22668424 22394390 22354028 22446507
4664 22446507 22349075 22183586 22100111 21921001 21628442 21404880 21351973 21158177 21024346 20878051
4654 20878051 20655391 20470674 20359991 20237550 20118613 19987805 19850724 19661349 19427688
4645 19427688 19307513 19248764 19161536 19058999 19005243 18870025 18737466 18595056 18483542 18497498
4635 18497498 18547366 18553062 18430134 18264942 18257916 18279803 18262443 18215636 18114458 18057733 17916129
4624 17916129 17884123 17896647 17800254 17750680 17830714 17889939 17886425 17796506 17580188 17650090 17609751
4613 17609751 17582048 17657523 17626388 17714571 17646871 17581930 17634314 17677832 17824601 17963159 17989611
4602 17989611 17934456 18095089 18003038 18068386 18119446 18186773 18288058 18458502 18684527 18936492
4592 18936492 19042023 19148129 19481640 19862348 20199728 20450212 20618076 20848314 20941950 20975968
4582 20975968 21067342 21065212 21163074 21097085 21195587 21330739 21585233 21929564 22126647 22403089
4572 22403089 22849262 23314680 23693409 24009868 24494755 24810020 25078802 25418272 25702679
4563 25702679 26276471 26612451 26989166 27244807 27696750 28176078 28558194 29025115 29448135
4554 29448135 30089983 30600009 31165347 31685187 32353424 33196229 34023948 34865608 35828427
4545 35828427 36867378 37871082 38842617 40151664 41286664 42409471 43658455 44865352
4537 44865352 46129958 47472426 48755033 49891585 51181402 52633613 53912367 55272101
4529 55272101 56777761 58487220 60505159 62184052 64312433 66761832 69500153 72650173
4521 72650173 75907415 79753398 83935111 88424498 93401581 99056309 105507272 112667138
4513 112667138 120779768 129857875 140507378 152814788 167382953 184391799 204163824
4506 204163824 226691970 251617289 279825086 311018662 343262951 374261487 399829737
4499 399829737 411257683 406459014 392937176 377241693 361315410 342631313 318944913
4492 318944913 290707297 259963965 228869215 200231163 176058335 156309497 140037856
4485 140037856 126407521 114899969 105361265 97304068 90345973 84135829 78945245 74511014
4477 74511014 70513995 67081995 63876349 61046218 58248966 55824978 53747513 51722392
4469 51722392 49633435 47826694 46064474 44316999 42721982 41139085 39868539 38602132
4461 38602132 37514541 36459524 35616987 34673372 33803021 33059376 32270055 31587902 30974270
4452 30974270 30478696 29872917 29438171 28990052 28286770 27783031 27270794 26663640 26031614
4443 26031614 25325404 24655935 23843217 23029538 22369344 21744904 21218621 20866252 20361665
4434 20361665 19923388 19392476 19039038 18579548 18244965 17824183 17531795 17328635 17137821
4425 17137821 16878366 16544395 16441577 16265687 16214221 16033201 15868360 15630654 15544357 15410657
4415 15410657 15164509 15106684 15014773 14723190 14379201 14089712 13985048 13922467 13625690 13433532
4405 13433532 13403829 13340710 13340840 13417091 13256226 13198973 13032222 13041655 13139770 13056076 12926684
4394 12926684 12819420 12678004 12525174 12296616 12220429 12247565 12070457 11881302 11972374 11824021
4384 11824021 11712035 11504929 11480582 11540847 11509790 11323815 11230172 11296399 11178999 10947473
4374 10947473 10934267 10909526 10849765 10756067 10588906 10543178 10393259 10272367 10133466 10267964
4364 10267964 10126453 10201859 10177984 9939661 9800966 9856427 10001440 10018994 10001965 9864586
4354 9864586 9856147 10024488 9864706 9601618 9478829 9565209 9540258 9448074 9339756 9387935 9357271
4343 9357271 9304165 9445613 9274525 9343387 9426549 9266874 9008363 8965844 9006957 8928727 8958969
4332 8958969 8836617 8922679 8954176 8945431 8812663 8806688 8841243 8896494 8894659 8959032 8931932 9026393
4320 9026393 9011483 9005063 9059603 9130503 9133880 9193422 9345249 9236630 9375572 9522925 9383398
4309 9383398 9311458 9350742 9386915 9487331 9500729 9615165 9529429 9279648 9345137 9403852 9566574
4298 9566574 9731767 9696663 9711374 9676812 9703117 9694707 9716912 9840081 9933036 9793466 9770118
4287 9770118 9860603 9996717 10200932 10262032 10235759 10286462 10192174 10164161 10285276 10410320 10472397
4276 10472397 10554190 10446354 10521786 10862829 11014089 11200344 11241758 11325016 11405237 11506224
4266 11506224 11600806 11600567 11809808 12073308 12008413 12021000 12239016 12573108 12654025 12833316 13076844
4255 13076844 13254415 13575570 13791232 14078219 14150244 14364921 14747967 15041533 15343315 15632981
4245 15632981 15731705 15897418 16377230 16577241 16798696 17043123 17372549 17871971 18140731 18532728
4235 18532728 18835968 19192123 19641100 19950061 20310879 20636462 21146545 21677884 22102509
4226 22102509 22611922 23089442 23469689 23925578 24408350 24843561 25474765 26048340 26450347
4217 26450347 26862361 27421148 28004198 28554994 29145900 29681063 30138488 30803592 31363289
4208 31363289 32067001 32646664 33450984 34382299 35096265 35894983 36869473 37783183 38801048
4199 38801048 39767871 40787352 41836195 42954369 44003482 45084228 46050432 47073817
4191 47073817 48156789 49274110 50502367 51708797 52955383 54121584 55329615 56651438
4183 56651438 58137286 59605510 61001747 62585090 64125741 65622313 67199533 68732741
4175 68732741 70449263 72208080 73894018 75663303 77316163 78993214 80717137 82433939
4167 82433939 84177742 85695033 87213601 88737442 90212112 91672297 93115818 94448275
4159 94448275 95696098 96637646 97701756 98694002 99584364 100210562 100879572 101407097 101972966
4150 101972966 102326824 102643224 102752669 102766003 102551699 102353603 102102943 101504499 101038015
4141 101038015 100413377 99695901 99002132 98040912 97039305 96075454 94857948 93684848 92449334
4132 92449334 91226509 89935650 88269638 86843539 85478811 84013970 82492197 80909168
4124 80909168 79256741 77723513 76383088 74808219 73289830 71714632 70196060 68772977
4116 68772977 67345777 65902428 64413449 62956323 61780527 60600520 59264560 57820562
4108 57820562 56559238 55477162 54482671 53404708 52315220 51404373 50561335 49623892 48856486
4099 48856486 47964198 47115153 46401610 45550994 44983509 44430520 43814169 43310600 42756969
4090 42756969 42298921 41895297 41520083 41119512 40840186 40655753 40543198 40405385 40284916
4081 40284916 40200469 39969248 39930402 40063765 40184865 40389378 40604414 40730667 40947141 41221362
4071 41221362 41621591 42031615 42568523 42978326 43635536 44199739 44839908 45578307 46364578
4062 46364578 47214478 47776027 48475228 49032422 49805954 50564383 51298480 52204250 53084872
4053 53084872 53979797 54929090 55960098 57191272 58443861 59834317 61111699 62454171
4045 62454171 63943047 65398768 66880575 68324790 69912570 71500576 73177867 74683773
4037 74683773 76263256 77681379 79090230 80353671 81654854 82599280 83515603 84533479
4029 84533479 85391564 86173613 86906065 87524349 88020068 88574353 89067655 89671099 90173332
4020 90173332 90422747 90608646 90870924 91074468 91286991 91510351 91575570 91605498 91795722 91919095
4010 91919095 92046501 92104324 92109642 92298070 92373036 92384656 92776518 92972215 93319039 93828366
4000 93828366 94453376 94909224 95685474 96670048 97612227 98984501 100882319 103459738 106396919
3991 106396919 110067087 114424239 118980940 123865081 129226267 133022013 131460267 128850785
3983 128850785 127547145 126280520 124041153 119977471 115855394 112113447 109405684 107698031
3975 107698031 106812537 106530584 106546865 106988976 107657444 108678991 109993620 111282444 112711969
3966 112711969 114385116 116362429 118610335 120860094 123213167 125992400 128563033 131337072
3958 131337072 134274392 137435535 140666297 144094576 147703415 151434292 155323022 159358021
3950 159358021 163491962 167763537 172198117 176732416 181345926 186088710 190940039 195850267
3942 195850267 200990722 206144260 211302901 216437679 221640632 226874449 232127826 237419408
3934 237419408 242717505 247886917 252957578 257981849 262931580 267745783 272519978 277050463
3926 277050463 281431218 285426422 289033584 292550684 295912705 299001514 301812292 304148221
3918 304148221 306195836 308178573 309667983 310877802 311700638 312126013 312038518 311671359 310834153
3909 310834153 309748494 308244748 306369238 304204376 301691884 298876048 295736642 292475236
3901 292475236 289033970 285086209 281022541 276760161 272283905 267693727 262727255 257860821
3893 257860821 252934907 247930771 242892354 237932341 232859812 227912808 223130527 218411750
3885 218411750 213584859 209034992 204769586 200466460 196353150 192310220 188375181 184804152
3877 184804152 181441473 178190562 175064233 172331664 169673853 167139002 165029533 162903594
3869 162903594 160983577 159373015 157899758 156756605 155574000 154691917 153975222 153324484
3861 153324484 152905750 152551681 152381219 152283642 152306362 152232765 151768361 151036309 150673123 150109380
3851 150109380 149592265 149073188 148623110 148419767 148234342 148161244 148051032 148125351 148170322 148348688
3841 148348688 148713992 149090111 149665768 150233328 151014624 151799308 152876364 154219675 155714408
3832 155714408 157499674 159196713 161048038 163388098 166061610 168923451 171973333 175242338
3824 175242338 178900225 182981289 187167757 191841702 196884575 202206942 208163156 214427337
3816 214427337 220839610 227602870 234375785 241269481 247760700 253354076 258125341 261972961
3808 261972961 264617865 266073617 266373903 265759575 264480656 262517137 260153992 257412363
3800 257412363 254525484 251389026 247905650 244035407 239798330 234731967 229059270 222573251
3792 222573251 215754562 208318205 200326205 192399995 184407113 176503985 169005726 161967767
3784 161967767 155367811 149136513 143477316 138279492 133512371 129159308 124854174 120993658
3776 120993658 117728479 114585902 111774622 108996891 106516538 104102631 101857732 99881853
3768 99881853 98114513 96401352 94798868 93433207 92192651 91044489 89749589 88678797
3760 88678797 87806060 86951079 86089485 85347048 84534401 83869207 83288283 82945344 82531460
3751 82531460 81884159 81396916 80817886 80341016 79806507 78952708 78385540 77809453 77213422
3742 77213422 76681597 75959901 75194042 74540131 73880181 73300323 72609725 71941810 71304121
3733 71304121 70577231 69782854 69184620 68581313 67924248 67539401 67043207 66586143 66055484
3724 66055484 65700762 65352267 65099466 64941406 64664638 64628514 64423994 64266311 64292619 64378882
3714 64378882 64333209 64406510 64712242 64817231 64856915 65147148 65541834 65919684 66258375 66593251
3704 66593251 66746380 67100084 67582018 68022968 68585858 68938963 69340219 69825002 70388399
3695 70388399 70831358 71217270 71946255 72588753 73209355 73879274 74534369 75307855 76166258
3686 76166258 76938258 77712608 78525309 79417208 80417037 81421760 82478400 83452062 84632988
3677 84632988 85716467 86758655 88034251 89155166 90245527 91513543 92823329 94037371
3669 94037371 95362001 96934131 98274109 99525565 100987926 102400307 103960948 105529753
3661 105529753 107122313 108755003 110306988 111996602 113776512 115807102 117754966 119646266
3653 119646266 121821786 124073555 126320333 128923658 131507432 134242444 137093998 140038563
3645 140038563 143187130 146397331 149720064 153163835 156583884 160221516 164074052 167667674
3637 167667674 171415507 175147479 178947488 182504166 186144065 189730026 193113296 196229473
3629 196229473 199009000 201821295 204540231 207057527 209196366 211353603 213145764 214906121
3621 214906121 216450981 217838881 218878655 219863648 220868800 221488912 222162623 222625757 223125723
3612 223125723 223448861 223928792 224303653 224787827 225298417 225787136 226608913 227736471 228744014
3603 228744014 229948104 231369627 233023859 234945575 237019983 239410281 241996392 244885921
3595 244885921 247952936 251356470 254973437 258755006 263159420 267864150 272532513 277631709
3587 277631709 283240089 288916895 295043326 301459030 308050338 315022062 322244266 329958608
3579 329958608 337700062 345560946 353530256 361544499 369821075 378150862 386462058 394662094
3571 394662094 402756465 410585757 418357697 426006786 433363238 440485263 447373817 453849828
3563 453849828 459852678 465576185 470912715 475934912 480510900 484656879 488385812 491723161
3555 491723161 494535574 496888975 498742827 500387360 501508529 502225004 502752400 502907470
3547 502907470 502987192 503008549 502749095 502451215 501954219 501496661 501190373 501002631 501007465 501122408
3537 501122408 501517305 502310982 503350162 504774192 506350669 508269541 510469138 512584146
3529 512584146 514772903 517040525 519350746 521589613 523947918 526635131 529513041 532355210
3521 532355210 535393231 538713750 542230460 545541717 548634696 551529874 554142323 556481550
3513 556481550 558298868 559416388 559954235 560066057 559756318 559239501 558706536 558152252 557245942
3504 557245942 556389113 555585876 554594361 553621794 552557145 551283432 549702248 548154346 546514646
3495 546514646 544843527 543198453 541459719 539821610 538394128 537222433 536232381 535578717
3487 535578717 535050511 534579868 534459045 534398297 534388319 534467125 534553421 534627714 534622421 534558460 534420195
3476 534420195 534022791 533408266 532740971 531770087 530499539 528923524 527239651 525180525 522755834
3467 522755834 520055030 516983986 513396052 509465213 505215365 500550003 495491290 490015329
3459 490015329 484064750 477852655 471370683 464701960 457844679 450960912 443979151 436919699
3451 436919699 429983742 423007231 416245359 409795731 403562070 397833519 392420715 387249514
3443 387249514 382439451 378070725 374106981 370527303 367573839 365072665 362936113 361257164
3435 361257164 360220593 359525658 359284995 359351348 360037299 361083082 362479186 363961126 365889055
3426 365889055 367718504 369884669 371874367 373578271 375210189 376612480 377786370 378778897
3418 378778897 379290818 379599286 380016188 380539086 380741445 380906179 381295370 381726576 382149558
3409 382149558 382743593 383273747 384104805 384800032 385361165 386133294 386778183 387310081 387570166
3400 387570166 387632224 387373295 386546837 384886990 382305502 378918665 374935640 369895359 364318720
3391 364318720 357956873 351259670 344159102 336798717 329192498 321417455 313472799 304827352
3383 304827352 295758436 286380829 276382957 266029929 254975947 243482115 232014210
3376 232014210 220547683 209548439 198831131 188578057 178962932 169866739 161588662
3369 161588662 153987335 147158855 140845662 135169004 129922711 125072432 120881145 116950607
3361 116950607 113215378 109809105 106622377 103843952 101148670 98947741 96845780 95021571
3353 95021571 93207364 91508136 90323797 89251483 88212460 87394402 86800539 86532457 86538637
3344 86538637 86844066 87699159 89210849 91058438 93483518 96150797 99338864 102819419
3336 102819419 106266116 107542510 105362094 102264669 99788012 97354732 93851493 89298602
3328 89298602 84449194 80088788 76726137 74216363 72321431 70907761 70125946 69810347
3320 69810347 69651723 69713530 69920255 70111462 70423778 71176435 72439351 73966398 76161663
3311 76161663 79053707 82908908 87625848 93427879 100573398 108202025 116343888 124830816
3303 124830816 129866331 127347054 122411620 118408605 114515530 108677869 100509760 91692457
3295 91692457 83269770 76080030 70550391 66437431 63261234 60506443 58052855 56000758
3287 56000758 54488881 53346766 52395627 51457944 50762831 50336453 50333574 50800172 51740787
3278 51740787 53100408 54817333 57075012 59955110 63049143 66304852 69890125 72304994
3270 72304994 71305998 68452620 65972890 63731231 60985448 56908039 52426631 47859073
3262 47859073 43715469 40612520 38185813 36253069 34650300 33353445 32128225 30993014
3254 30993014 29962049 29109552 28417391 27829390 27264900 26679691 26203755 25709841 25187212
3245 25187212 24873701 24441826 24049577 23868740 23576457 23140625 22765047 22658422 22285106
3236 22285106 21952728 21737003 21654615 21697292 21445817 21271249 21070454 21017627 20868938 20634118
3226 20634118 20476821 20354060 20422672 20384334 20286827 20364720 20224192 20150460 20232308 20017334
3216 20017334 19922329 19912508 19924435 19847258 19907311 19823625 19758650 19732635 19671231 19765896 19975736
3205 19975736 20058293 19982782 19977783 19978265 20147874 20166651 20294371 20400927 20481213 20544909 20509684
3194 20509684 20719718 20753797 20772571 20758656 20807968 20880856 21082193 21228105 21399836 21787799
3184 21787799 22052597 22151357 22329066 22576699 22742676 22811888 23237192 23539865 23881945 24162620
3174 24162620 24344726 24674202 25003299 25506972 25985619 26522429 27164397 27840521 28682162
3165 28682162 29457569 30292102 31194097 31989247 32907938 33741280 34461154 35336325 35829270
3156 35829270 36159161 36515446 36777638 36922452 37128403 37197715 37086609 37017730 36786363 36498515
3146 36498515 36065268 35478386 34453656 33244085 32038744 30875623 29665941 28305598
3138 28305598 27001210 25701776 24530936 23415123 22476415 21601254 20724768 20003203 19413851
3129 19413851 18898899 18582708 18150072 17614812 17377036 17173064 17101980 17134837 17119160 17051798
3119 17051798 17127896 17171926 17301480 17464669 17469036 17244057 16912996 16750251 16586929 16215425
3109 16215425 15716066 15277443 14789786 14355804 13872970 13486554 13119742 12646181 12319547
3100 12319547 11897466 11627576 11323416 11057987 10834415 10741129 10616432 10522912 10457661 10302811
3090 10302811 10158612 10157246 10118432 10229277 10339388 10348768 10300652 10308783 10245617 9992178 9715786
3079 9715786 9354562 9307545 9058317 8671911 8383742 8072601 7957541 7651524 7432142 7260785
3069 7260785 6940647 6696241 6633734 6465913 6480744 6366321 6175986 5997837 5965016 5830543
3059 5830543 5766225 5717728 5818652 5687804 5494542 5580476 5593693 5510297 5295410 5304828 5294265
3048 5294265 5238685 5073208 5086605 5027103 4967482 4889207 4863156 4773882 4797398 4672060 4529757
3037 4529757 4546196 4496799 4359716 4388094 4378049 4282362 4293132 4251221 4130413 4141663 3999693
3026 3999693 4033826 4026123 4034507 4097350 4060947 3973844 3908378 3842491 3881405 3890549 3934172 3910599
3014 3910599 3849342 3858967 3920925 3938050 3845256 3729313 3780504 3845208 3809333 3743859 3525684
3003 3525684 3433546 3448106 3405132 3368979 3259133 3258002 3207976 3106161 3129049 3028816 3043484
2992 3043484 3074393 3165966 3111606 3191757 3214618 3123310 3121059 3071228 3018694 2975526 2959733 3004098
2980 3004098 3025217 3076807 2992842 3076052 3110635 3064634 3176903 3023442 2985348 3045703 3043154
2969 3043154 3011567 2965587 2963316 3001307 2925727 2867356 2894149 2919019 3024998 2997504 2892061
2958 2892061 2738723 2660169 2709582 2712656 2604537 2637530 2609989 2588037 2650857 2642558 2566634
2947 2566634 2780819 2807655 2605390 2666457 2747542 2666754 2602032 2704721 2735714 2890655 2902403
2936 2902403 2901163 2907628 2896736 2768127 2981854 2935251 2749066 2873585 2807100 2903845 2858183
2925 2858183 2764868 2620583 2708287 2792935 2806545 2905817 2831389 2831344 2802485 2593199 2710821
2914 2710821 2862545 2841180 2862699 2846252 2977870 3159142 3087108 3124174 3218403 3274885 3254998
2903 3254998 3237596 3304038 3450055 3470337 3486155 3485321 3491010 3552529 3565381 3588117 3560415 3542076
2891 3542076 3534247 3691023 3792695 3831240 3894785 4041917 4113997 4165136 4138141 4272416 4290790
2880 4290790 4278759 4222347 4182112 4250136 4175979 4173938 4266449 4194075 4262601 4444351 4399614
2869 4399614 4404429 4402230 4392737 4497464 4637833 4690204 4754237 4897824 5086908 5110393 5290873
2858 5290873 5469732 5555158 5784583 6066851 6057847 6259684 6548463 6749986 6826397 7133926
2848 7133926 7306345 7439585 7431579 7475963 7827378 8118219 8461768 8745485 9093463 9079865
2838 9079865 9269696 9549596 9756348 9959555 10147237 9979934 10008675 10146575 10106693 10168126
2828 10168126 10191984 10224644 10425530 10460029 10483447 10645814 10761925 10920841 10982914 11124784
2818 11124784 11418271 11812111 12350653 12772333 13144170 13797790 14485256 15081754 15626534
2809 15626534 15903282 15875949 15609650 15275685 14773383 14202661 13455289 12860612 12138543 11377654
2799 11377654 10850977 10335668 9898366 9478030 9173959 8908697 8735439 8546799 8406665
2790 8406665 8317694 8265601 8198386 8235690 8245160 8266575 8413944 8401075 8427748 8451944 8599847
2779 8599847 8696482 8444450 8348803 8194821 7878959 7708175 7208875 6970768 6696069 6215148
2769 6215148 5866109 5629617 5354453 5126617 4860060 4586143 4377200 4347608 4296405 4168288
2759 4168288 3939095 3832443 3775696 3532210 3361015 3335991 3209362 2876403 2829191 2810123
2749 2810123 2734407 2553177 2589891 2517052 2449721 2376286 2409206 2310991 2134437 2175061 2118244
2738 2118244 2106906 2141498 2091995 2123089 1883218 1803103 1749628 1741733 1716843 1693604 1660363
2727 1660363 1655625 1577853 1459771 1413145 1559341 1429304 1445812 1458022 1325422 1319025 1285669
2716 1285669 1322026 1333194 1301501 1239701 1190550 1215859 1179290 1198615 1105216 1114261 1182209 1061180
2704 1061180 1086032 990016 1087349 1072483 1007868 985146 944372 972912 982172 968541 965817 888430
2692 888430 837890 821475 855829 852207 771483 758889 786593 902392 813864 646198 673388
2681 673388 935235 938404 671565 811048 719740 600227 596598 610213 609006 521895 671338
2670 671338 659417 702869 704113 597177 604255 563235 522671 511704 529784 563869 641361 563419
2658 563419 429513 431176 515018 428307 358167 312286 320103 376754 404312 293319 367417 371182
2646 371182 378193 451900 459956 419059 482474 540508 491769 433631 284767 270374 303704 221660
2634 221660 252228 415364 325597 225549 346560 397551 435724 457771 460649 348821 374163
2623 374163 384000 322906 315657 399084 184602 180360 210655 132565 170418 120396 117836 227295
2611 227295 211091 219606 312127 309930 323171 290422 83435 -45263 20436 257385 310475
2600 310475 298159 370867 256636 293351 112397 114200 138428 89392 196651 187509 227369
2589 227369 241126 275831 205980 233826 194786 210530 214275 187322 207532 148979 91338 112002
2577 112002 282537 61471 28603 -45884 27322 180987 74817 -15431 24488 62733 11290
2566 11290 24373 123702 157244 146598 105943 49692 -138474 141820 315676 201979 101551
2555 101551 16399 225361 114477 168297 275420 246644 187075 114485 170548 257037 230676
2544 230676 201710 220572 41873 39029 95990 209056 122518 81833 196088 257039 223252
2533 223252 99200 101656 166848 304745 267848 98569 229469 160266 74181 -49398 74212
2522 74212 98751 29896 69248 144133 255088 271551 194405 133665 51535 22771 200545
2511 200545 143202 18537 -32593 -3360 -59666 -16090 -11291 -25213 107873 29519 22165 78563
2499 78563 263831 295408 320188 262212 127984 160647 144864 201216 170686 86539 81407 134538
2487 134538 132594 121859 142040 141092 -42882 -70545 -49340 51531 168543 31425 58566
2476 58566 1545 -117138 -126147 -22001 11757 104897 38723 29876 -17219 17343 -13026 -103340
2464 -103340 -96884 13617 24741 31583 107830 52656 135554 -54662 87393 33081 107786
2453 107786 49948 81484 32006 22294 -37287 -17234 -33753 -76509 91194 90292 -23931 -220768
2441 -220768 -252876 -17255 9445 -67463 -95544 -47121 -137117 -122408 -110611 -139318 -84025
2430 -84025 -49319 -95313 -1214 -147188 -52994 -45449 -174295 -137092 -153738 -50225 11097
2419 11097 -189354 -184897 -39224 -69473 -3721 13160 -31886 -165206 -127972 -87700 -144900
2408 -144900 -49534 -25628 -17880 -21442 22285 17377 10408 29808 -107683 -42082 -62620 48738
2396 48738 -59323 -96138 -108352 8041 -187787 -184061 -38211 -186360 -247004 -230361 -131489
2385 -131489 -91823 -68273 -71805 -48698 -12655 24416 -27495 -92983 -97380 -206943 -119043 18133
2373 18133 -44390 71214 84672 -94509 -133719 -37183 -81387 -116596 -215747 -158864 -59331
2362 -59331 -79084 -32006 -139331 6132 -38790 -7469 -41632 -122211 -80677 -60513 41476
2351 41476 -148740 -111328 -94 -92470 -30286 -159801 -208146 -97441 -51108 -160953 5157
2340 5157 1558 -108505 75016 113781 -70777 -191122 -152881 130956 85991 -27163 -81181
2329 -81181 -74254 -71603 -48141 62755 33247 -70594 -89181 -85760 7828 305 -121235 -91597
2317 -91597 -67997 -108066 -95947 -86325 -118141 -68449 -67138 170341 226517 198173 29029 -151121
2305 -151121 -44468 31905 -54463 -91901 -106287 -115245 -131636 -40439 6558 -62818 -74304 -14503
2293 -14503 -6506 -104403 -52337 20642 41331 37636 37457 3219 -30525 59517 125473 166169 145656
2280 145656 127145 194358 239020 97609 62748 91917 68218 121889 65843 53959 65797
2269 65797 38411 47132 -124751 -33632 -19534 -81636 -165122 -120661 -123697 -94128 -78211 -116023
2257 -116023 -29429 62093 29632 -80386 -146505 -204726 -38633 -59020 -35140 -9200 -30834
2246 -30834 -47930 -124729 -150097 16455 58568 26604 80775 15493 -95068 -36820 -50530
2235 -50530 -9757 -20135 -106381 -114767 -80151 -118204 -3481 67709 13022 -43452 -72362 48113
2223 48113 7896 -34383 -116402 -167316 -119903 -17784 -148459 -147497 -98980 -77050 -130482 -50149
2211 -50149 -27074 -54317 -129157 -52200 -89256 -49939 -69754 88642 -106653 -184762 -274011
2200 -274011 -330689 -134681 -121057 -139529 -88127 -79415 -32471 -64619 -142751 -50047 -13223 -142413
2188 -142413 -157355 -25686 5356 -51152 -101988 -46710 -133102 -24914 -83369 -125486 -103923
2177 -103923 -190357 -133107 -161866 -261605 -196739 -151923 15375 -34607 -105055 -124583 -7180
2166 -7180 35394 99563 132819 50597 -79860 -83070 2038 87182 149806 132368 106433 87431
2154 87431 58584 100164 81398 183676 206815 194366 22915 122688 -5414 -13512 131453
2143 131453 62324 43973 66611 62854 87454 115313 5515 -48506 76814 5946 -4916
2132 -4916 114028 162638 130107 113151 1824 79177 41715 -38476 -41082 18937 16070 -14784
2120 -14784 37556 184674 327493 279209 288161 163916 154324 316841 299151 116357 171946
2109 171946 189080 98801 -12333 142091 334775 228550 235317 171371 208483 269489 343474
2098 343474 514433 411252 324963 356038 422336 231811 205922 211295 328870 454113 424070
2087 424070 418985 464083 376461 520858 723999 610155 636150 731401 728519 717016 795041
2076 795041 919378 962320 990279 1025334 1042243 1158628 1056798 878575 976740 1065010 1007732
2065 1007732 1137945 1293489 1215287 1271216 1357663 1506942 1479532 1455700 1516382 1742418 1831358
2054 1831358 1940341 1981916 2218425 2181304 2160214 2305874 2425388 2542621 2702648 2786950
2044 2786950 2960518 2953148 3074134 3264280 3410236 3664268 3767932 3805646 4014490 4187475
2034 4187475 4398233 4757982 5109869 5308584 5456189 5785772 6278423 6716245 7249757 7905316
2024 7905316 8343020 9172563 9874720 10525407 11204319 12143290 13336001 14945968 16916998
2015 16916998 19120795 21687508 24901744 28534255 32168523 36102245 39817922 39695830
2007 39695830 36841643 34682940 33050494 30773124 27043327 23118537 19383525 16257755
1999 16257755 13953598 12184603 10861060 9808522 8941956 8269489 7669356 7043580 6391404
1990 6391404 5984421 5542173 5042384 4771642 4468802 4121840 3790037 3789240 3516131 3318795
1980 3318795 3178545 3169928 2885175 2669159 2586102 2411074 2337418 2264848 2224254 1981787 1801930
1969 1801930 1700651 1610818 1679151 1642805 1556732 1497022 1410116 1449765 1564001 1485023 1322321
1958 1322321 1185764 1132518 1212054 1286100 1224794 1008032 1007775 1065106 1090031 1015656 797656
1947 797656 867082 884533 940330 896139 846400 793469 735374 598050 480700 555581 695395
1936 695395 651249 504816 494768 396979 394427 437653 500996 469957 590248 548412 477659
1925 477659 444165 410384 470488 467203 404432 415128 309048 302680 316486 252792 234318 279455
1913 279455 247394 173911 196554 223968 184241 237923 132117 156754 225065 182401 248900
1902 248900 394791 320653 199663 110337 105965 192896 154080 226257 143893 123182 208175
1891 208175 26717 -13586 -20812 79308 247823 158563 75268 79784 27396 10536 47707
1880 47707 10757 -71393 -72136 65607 10906 -107000 -96295 26561 5356 -58530 -148332 -80221
1868 -80221 -70524 -94837 6550 -6641 8076 -26391 -18161 -45278 -112378 -38430 -8672 112940
1856 112940 41639 28160 15176 -45094 -53974 -82083 -17384 -8232 -63914 -180657 -114935 -104880
1844 -104880 -58497 -142142 -89482 -49119 -197627 -210591 -77540 -70175 -154308 -159856 -22178
1833 -22178 -41127 -242438 -154375 -89708 -10673 1864 -68689 -77730 -63299 -17385 -18992 -39330
1821 -39330 -10262 -97562 -56630 -64249 -12900 -64344 -124308 -66433 -175693 -112644 72435 -13975
1809 -13975 -135984 -109535 -58100 64532 23555 59871 -143466 -166854 -67137 -30901 -6636
1798 -6636 4406 103843 131146 34750 -43262 35796 8816 -32484 -71976 60496 -36676 -104109
1786 -104109 -43368 -195672 -208013 84464 -141243 -269796 -193090 -134302 -173723 -210656 -372470
1775 -372470 -319371 -141486 -161105 -145607 -254770 -177546 -226116 -185917 -284022 -137435 -114763
1764 -114763 -80951 -16534 -80073 -146858 -38390 -208183 -154058 16095 -119755 -167923 -192225
1753 -192225 -120903 -143440 -153983 -125618 -178342 -215232 -248799 -199569 -60696 -30960 -92033
1742 -92033 -137622 25644 107421 111704 -40421 27461 -46890 -97329 -30377 38697 61105 77616
1730 77616 140677 89723 -22245 22175 -70753 -245668 -186590 -71702 -31644 -163095 -222356
1719 -222356 -138116 -250839 -149123 -93673 -63305 -56662 -126645 -51946 46332 -186428 -360279
1708 -360279 -231397 -154808 -89782 -200434 -148096 -111660 -96079 -114353 -198261 -260746 -132583
1697 -132583 -81681 -119385 -126084 -104296 -163504 -247163 -248240 -38918 -72960 -31848 -47048 -71908
1685 -71908 -47680 -83814 -154792 -110406 -150758 -245510 -259170 -193710 -140396 -165388 -181522 -279402
1673 -279402 -160524 -137398 12086 -83627 -144224 -115838 -96837 -51925 -166702 -84733 -45282
1662 -45282 -136578 -200700 -74989 -156949 -157393 -79199 -153284 -146338 -95340 -38383 -71461 -133820
1650 -133820 -214394 -211011 -222932 -161646 -133796 -256337 -294676 -147727 -169530 -28361 81028
1639 81028 -26103 -167929 -168536 -42412 -25220 -38040 -235781 -172645 -21976 9084 -5499
1628 -5499 -88801 -132640 -109043 -114321 -146770 -134889 -80052 11245 -15879 -57723 -2011 -34170
1616 -34170 -126104 -169577 -102486 -68352 -249192 -193389 -165817 -248894 -235764 -242457 -68758 -83549
1604 -83549 -62157 -103667 -36206 -71642 -216870 -231669 -217682 -57392 -229732 -299192 -262729
1593 -262729 -262531 -205664 -60149 59192 -46109 -166840 -186203 -129359 -73393 -56589 -29294
1582 -29294 -52462 -47040 -5459 -1245 -141972 -214508 -171118 -167377 -273456 -220716 -156501 17791
1570 17791 -151393 -230071 -272131 -181918 -91642 -117912 -12930 63219 -44833 -173476 -122203
1559 -122203 -99192 -110168 -70118 -142730 -258129 -230252 -295597 -269447 -197406 -157429 -71904
1548 -71904 -131665 -177232 -155445 -160831 -118292 -124994 -103858 -58469 2817 63751 -113505 -250864
1536 -250864 -168922 -191658 -95576 -68963 -220162 -162141 -146259 -143439 -203122 -373721 -387355
1525 -387355 -346027 -128940 -100550 11915 -36444 -86059 -108340 125433 60841 -26501 8379
1514 8379 -73244 -182611 -96676 -111388 -158060 -142855 -254155 -118157 -133371 -216601 -135619
1503 -135619 -250682 -226149 -192206 -121827 -112093 46777 102997 -25125 -77819 -160648 -197487
1492 -197487 -161706 -157743 -120670 -31417 -89681 -196902 -140504 -97256 -22469 -102258 -45739 -108801
1480 -108801 -134002 -60354 -137057 -61677 -69125 -38692 -157206 -165549 -174371 -54186 -122789 -167955
1468 -167955 -146629 -2817 -104602 -188186 -33100 13689 -170526 -45640 -87720 -234819
1458 -234819 -158788 -173582 -217161 -214077 -229707 -132072 -260182 -135314 9687 -66254 -88675
1447 -88675 -109631 -99530 -76667 -207996 -108039 -42399 -72939 5479 -158827 -169120 -237762
1436 -237762 -221082 -213098 -160311 -124535 -26654 -27106 -116458 -108336 -107421 -223273 -128434 -94623 -100985
1423 -100985 -41766 -62619 101826 101179 61255 -25961 -62180 -109327 -154527 -149740 -103801 59978
1411 59978 58144 -53762 -44512 -164191 -126790 -93836 -77532 -53179 -32799 718 -199734 -252594
1399 -252594 -130915 -59343 -81210 -174333 -18420 -50805 -151687 -35534 -119903 -150521 -110420
1388 -110420 -147388 -104223 44902 -38663 2541 78464 86159 -129226 -104121 -71019 -7687
1377 -7687 22131 -56227 -60000 -129158 -94411 -60743 -81951 -101655 -88762 13838 -18821 -7321
1365 -7321 -126475 -206743 -25698 -64274 -193255 -177727 -93890 -196860 -223004 -181104 -62447
1354 -62447 -20637 -7562 9156 -149125 -109489 -44144 -138429 -64608 -58735 60416 116566 -32474
1342 -32474 -101173 -53027 -42280 -136643 -20208 -74745 -115172 -64810 -222578 -121183 -102522
1331 -102522 -66990 -93730 -41493 -88229 -69264 -76070 -225220 -203715 -87374 -54971 -156143
1320 -156143 -104244 -178735 -222245 -140813 -278947 -256859 -16590 -98783 -130535 -209538 -76621
1309 -76621 -5407 -105416 -164153 -128420 -323942 -238164 -188895 -76217 15963 -31506 -15244
1298 -15244 -79394 -45004 -86186 -78928 -7524 -17161 -92798 -65193 -139260 -180731 -109308 -175545
1286 -175545 -174180 66525 117620 10986 -76250 -12156 -16820 -85067 -130088 -56074 22428 -3877
1274 -3877 -142349 -17676 -48428 -150557 -125512 -32200 -258427 -132505 -23405 -190314 -159234
1263 -159234 -213840 -193700 -264179 -174373 -145299 -124521 -143151 -130353 -86339 -97410 -114919 -93198
1251 -93198 -75580 -119288 -53384 -53475 -140355 28270 -66896 -104066 -35045 -23607 -3084 3677
1239 3677 -26231 -26481 92323 59490 -142978 -141376 -133577 -83984 -148412 -107976 -33418 -53549
1227 -53549 25879 -89722 -145910 -163317 -256020 -184974 -183880 -235131 -191365 -48531 -68045 -116588
1215 -116588 54593 179145 114378 -107551 -100614 -97487 -13624 19837 4666 17689 61111
1204 61111 476 8941 18721 94798 -51331 -120730 -54118 -41514 -99809 -152151 -152752 -104580
1192 -104580 -117095 -94560 -198181 -227965 -72483 -110202 -107593 -108027 50653 -58159 -220632
1181 -220632 -118124 -51429 9072 -2159 -8768 34003 -89913 -123407 -93100 -30502 55765
1170 55765 -10610 -101377 -124046 -91023 -122455 17921 -57561 -130780 -42834 -77204 -80356 -46372
1158 -46372 -2156 66448 41308 -33028 -5631 -77042 26609 -10013 69499 94952 -35191
1147 -35191 -134601 -103354 67425 7381 -22949 83455 9228 -44506 -76327 -123269 -113075
1136 -113075 -52655 -68254 -118025 -54525 95368 80786 28887 37692 -3022 -11185 15811 4868
1124 4868 -75634 -42042 -64630 -159780 -198903 -77388 53755 66502 -78634 -96894 -50527
1113 -50527 -12685 -28511 5464 -54206 -117098 -66360 -60045 44845 162815 72922 49374 -20662
1101 -20662 25365 60140 -25916 37715 -96157 -83710 52010 -21823 -56071 227722 186349
1090 186349 29268 55629 57488 -6458 -119298 -199144 -105846 61887 52946 70657 -42079
1079 -42079 -108078 -111717 -69208 31287 -19780 9992 -62296 -102282 23248 29642 153125 54692
1067 54692 39265 136407 95606 -2495 188588 88524 -70169 406 47117 27307 -96513
1056 -96513 -5541 -151022 -47236 -91733 -130905 13814 66213 15550 -81840 40109 81454
1045 81454 96626 48587 11153 51033 27552 -91231 -88714 -118350 -100668 16967 -57469 5505
1033 5505 -79454 -87557 -38735 125874 97439 147345 108990 29666 37015 170119 81084 -87638
1021 -87638 -107777 -81425 -93336 25834 75761 -52082 46325 -19047 -80845 -57810 -81549
1010 -81549 -148359 -25863 -7042 -94101 -2738 189414 166825 115691 54696 -66815 -198971
999 -198971 -97533 37388 43212 24499 -21358 -9008 6382 -61601 -23482 91965 -27340
988 -27340 26619 22561 21469 -14511 -54210 -237582 -115336 15853 -49527 65470 24629 -199
976 -199 -74465 32058 -16778 22439 21832 -115620 -14240 47505 203889 128586 -47083 -63828
964 -63828 -53515 -39208 -21913 -70235 -45360 71528 -18943 -22869 49809 103641 80541 -19862
952 -19862 -166095 -52169 -53075 15553 14746 65430 -78620 -111771 -73302 -135104 -193606 -26929
940 -26929 24747 95226 72405 37444 82482 -57433 -101490 -142225 -100086 -126204 -142227 -37502
928 -37502 13529 78926 144574 197834 96734 40812 -22388 -140694 -40741 60313 -46414
917 -46414 -7142 -53967 5534 111618 112430 -67734 -89834 -15967 60843 -26801 -216541 -149873
905 -149873 -43425 -116640 -204905 -94539 -35493 -64957 -127240 -85954 31221 126114 88474
894 88474 39448 -135514 -146424 -111953 -111083 -94841 -55013 -171496 52180 180621 138783 122133
882 122133 33274 -77852 10370 30139 -138681 -35558 24344 -48295 -6917 -46272 18339
871 18339 347 27112 -19078 -97143 -145788 90305 103133 -27775 94598 248316 99887
860 99887 74446 107660 148711 212455 120727 215810 168466 186631 121567 -37651 58674 -66540
848 -66540 -110590 -119698 -123525 -53612 75909 -6238 -90599 -127620 -49892 -17299 51751 191371
836 191371 306909 18604 15446 118095 127880 52636 47231 174326 184904 112231 122888 91926
824 91926 89466 27211 -49154 76500 83691 84580 139434 164609 -31432 29773 86322 65268
812 65268 -55957 114334 57479 109149 -39346 88020 74687 -51043 3758 7885 10445
801 10445 -22405 120820 57708 43658 92465 190211 170931 84861 34038 -64018 -17066 -57705
789 -57705 37846 22314 -78895 1905 -3307 15444 -23777 105681 170212 75705 105725 137010
777 137010 121422 105220 163315 144992 283305 214952 290950 72052 -7993 -65269 -150812
766 -150812 -140668 34442 239179 247188 231640 119797 79221 75718 -7244 -43563 115044
755 115044 223042 188284 66173 -10846 -13700 -30670 94301 264768 267881 122566 144067
744 144067 113940 6385 -9790 -46449 95 21625 25430 21316 118548 72910 77812 220411
732 220411 246729 179093 118453 231343 116962 12322 -127009 -36509 -26060 -112659 -115223
721 -115223 -22409 63714 588 36287 59843 41648 -24969 12618 -9133 -34426 -27090 -53562
709 -53562 56618 135464 86661 -9307 17299 -62566 28704 137476 84615 83889 49874 72670
697 72670 81505 70448 769 95903 96888 70942 98365 199890 194502 224142 59719 40450
685 40450 -29815 -68610 17240 94544 160867 203759 101961 53212 -48278 27743 1916 133283
673 133283 28383 122685 93608 62373 40703 97648 77110 68832 44003 127404 174646 145008
661 145008 172414 151679 63851 81227 115197 150327 3882 -9987 136801 331439 336922
650 336922 132366 99313 48518 33839 19689 4644 -14583 86603 143606 197379 152761
639 152761 159180 76669 20252 -63227 135136 67371 228386 262958 202568 142248 30676
628 30676 138463 119768 205869 223508 117768 109420 55265 91941 124567 31901 -52946 105742
616 105742 191711 109756 -123585 -171022 -146645 -35316 69951 191589 151938 159126 17586
605 17586 36616 74936 -54077 55159 84818 -44529 48578 -23249 101217 223401 170527
594 170527 71652 105488 196476 94516 3374 49368 -10647 -187136 -125090 43719 98876
583 98876 -23369 33435 71439 35529 87676 -817 57378 200052 227253 174022 73277
572 73277 91244 115523 194121 265074 170467 66350 123769 196142 197198 98273 89557 154583
560 154583 109142 54927 97200 -17933 31584 226811 167447 8268 -67477 127755 141109
549 141109 -91044 -16389 135338 230582 204499 182665 135869 286107 244067 85858 21864
538 21864 5661 -122264 -104236 60566 81393 64982 107816 27007 -496 81434 138176 244075
526 244075 217123 168348 155269 163617 96650 142040 255442 256736 131588 101374 158276 140589
514 140589 40381 135602 129845 24863 50121 151481 164504 174278 263909 75707 -13872
503 -13872 28218 124452 44630 125926 116104 19209 83296 115418 132664 102460 147067 138554
491 138554 115118 128385 149870 196352 243563 201834 12022 67648 259345 212457 164859
480 164859 64790 32687 -13021 21646 137098 144208 160272 16797 62736 211842 62870
469 62870 27915 31681 110301 320811 212169 116730 138260 175402 24354 -38206 92323
458 92323 249708 111394 49443 -7883 -17334 177497 136430 45185 103677 30580 70937 164362
446 164362 183244 158132 13686 -38856 50984 209200 256390 203412 162383 222111 32629
435 32629 -149847 -170294 -20951 32798 -13759 -15339 41219 95060 127682 112202 70270 67169
423 67169 95587 78175 146596 137930 222430 173933 336466 247443 89431 193790 246350 119390
411 119390 179065 162134 75564 180314 43156 155602 188010 183210 146162 202862 124851
400 124851 -2735 79781 81543 93590 249664 261704 199150 57137 33598 54339 50756 88197
388 88197 96339 181231 237321 83803 178161 212381 222402 298847 152573 -76624 -21552 3382
376 3382 32160 83207 99299 132226 38080 84618 -73754 -7452 66123 8698 140741 124543
364 124543 11564 -7524 128612 325447 247058 223192 137492 135119 134757 245302 299209 168036
352 168036 207632 182531 276332 232408 90415 53863 119265 154701 68568 39219 1392 98626
340 98626 60904 184949 218012 210289 251722 321129 288941 345078 370007 243509 258563 214951
328 214951 335737 289800 212409 213588 142355 196069 104987 9836 149656 289230 275416
317 275416 94793 79086 -24716 35623 -28717 112549 198033 131070 144387 133616 109951
306 109951 115624 152979 90279 226125 63096 212107 191036 95726 52011 -6663 99808
295 99808 105851 69540 100149 80413 33097 60369 138960 108660 65142 6581 77710 205842
283 205842 285586 139643 -62858 103984 61878 129439 159642 216142 173366 114020 127129
272 127129 191327 126903 78396 154631 162396 258499 149279 132829 192396 99695 54989 103653
260 103653 58483 -52551 101249 187068 242794 42501 -6409 13147 37182 63205 23519
249 23519 178933 241095 194111 66455 57213 177327 201098 181123 201649 204267 244524 153892
237 153892 167039 243373 176859 170389 66158 49003 -16258 -33115 86052 193128 205255
226 205255 97309 115330 223280 4515 8261 86280 231759 123957 104145 138667 44927
215 44927 110245 104947 230491 99311 188054 255798 275113 253833 199872 322009 365290 396107
203 396107 362236 266507 267786 271091 251876 196651 142400 111264 160749 323420 383987 222698
191 222698 57237 151444 209563 204040 227099 94084 108760 67615 131287 198505 135362 49181
179 49181 91432 60993 54928 129594 170599 99114 -21168 -74296 77509 105509 182350 260978
167 260978 201039 228290 235350 285501 276889 159169 130096 202933 216810 135730 120049 170267
155 170267 248657 174290 155009 178330 173028 346544 362424 239616 116200 111404 104017 89418
143 89418 140056 168432 139112 194222 137328 172483 194848 132523 58765 210003 233523 38323
131 38323 -36980 67513 166471 245683 247634 93633 55630 112227 225928 134493 141901 157545
119 157545 96945 -5892 -6814 66067 136950 238141 237082 274181 238037 180942 65288 95156
107 95156 116992 91694 149202 134179 150569 152227 166791 109182 223995 136514 128125 158275
95 158275 164118 186382 271142 214291 169380 185618 254553 134229 156503 257128 323298 277932
83 277932 131551 133978 203086 296300 169454 132955 55381 87460 101081 142327 107562 158289
71 158289 183787 187535 183441 205643 77382 167594 96192 50706 147789 251447 162912 149110
59 149110 160958 128606 147541 182675 161903 122911 213553 196434 212686 161691 160899 189217
47 189217 288380 261715 236932 287409 304831 219306 236968 100332 34979 199784 199475 168589
35 168589 88029 100444 122450 118419 203824 206140 132056 136567 107262 23204 94847 191205 154695
22 154695 173237 201193 232240 112705 88433 123844 190310 253952 238922 194886 336385 314402
10 314402 246136 123386 90740 69728 39386 111688 142106 224790 283563 286914
0 286914
$$ Imaginary data points
##PAGE= N=2
##DATA TABLE= (X++(I..I)), XYDATA
16383 -7324202 -7183810 -6994906 -6882957 -6854651 -6743228 -6647834 -6586434 -6424080 -6241362 -6171672
16373 -6171672 -6130803 -6044527 -6004304 -5845937 -5787072 -5711661 -5583147 -5458727 -5402853 -5272867
16363 -5272867 -5187747 -5071333 -4868659 -4866136 -4791476 -4730339 -4655740 -4459773 -4342328 -4217382
16353 -4217382 -4097777 -4057728 -4025098 -3918927 -3838508 -3706159 -3603078 -3476040 -3442896 -3282649
16343 -3282649 -3242160 -3253951 -3087384 -2924679 -2815084 -2742977 -2607997 -2599461 -2533508 -2546134 -2390878
16332 -2390878 -2271887 -2190498 -2061843 -2002469 -1862122 -1840468 -1775701 -1708356 -1592012 -1384575
16322 -1384575 -1231656 -1213570 -1181855 -1034966 -963778 -873348 -802475 -784620 -720016 -573510 -589504
16311 -589504 -511896 -429849 -380512 -236277 -90659 -93252 -33945 104301 181601 267939 371708
16300 371708 483860 561983 580769 649889 785355 852911 883098 959542 1058260 1089920 1114323
16289 1114323 1214461 1286417 1430622 1536708 1586701 1595487 1698232 1755319 1806332 1912193
16279 1912193 1977435 2052802 2212016 2343515 2331159 2405843 2423028 2427334 2511359 2583366 2716581
16268 2716581 2645069 2769253 2927376 3022408 3030432 3131715 3232649 3242940 3268687 3381603
16258 3381603 3464986 3481994 3443330 3574075 3645568 3701788 3850200 3941817 3804303 3821457 3923420
16247 3923420 4023984 4149859 4142918 4233308 4369800 4469777 4478942 4556695 4655816 4543730 4444507
16236 4444507 4451281 4607447 4713375 4794379 4943634 4883484 5002366 4941547 4998798 5028656 5109131
16225 5109131 5161039 5134919 5121335 5182667 5266594 5428932 5549201 5538050 5478888 5439237 5386218
16214 5386218 5363668 5510849 5423832 5434936 5543397 5697259 5861938 5895674 5853542 5876395
16204 5876395 5887322 5946982 6029304 6140619 6256341 6229288 6223729 6229479 6229063 6215365 6152897 6196373
16192 6196373 6391508 6355555 6446774 6480753 6648376 6822112 6870388 6650416 6565489 6629586
16182 6629586 6663528 6749782 6670403 6747351 6876092 6669401 6759179 6776346 6747666 6776236 6847758
16171 6847758 6844107 6958151 6996963 6990322 6975620 7038469 7144287 7228751 7225993 7162110 7181612
16160 7181612 7042336 7169760 7234578 7322649 7347095 7217122 7312652 7405277 7390153 7365831 7325577
16149 7325577 7305952 7362691 7447532 7415376 7400300 7388167 7456331 7483829 7504740 7516604 7525050
16138 7525050 7562457 7560644 7534712 7467948 7664049 7738780 7659424 7739412 7674933 7678854 7689147
16127 7689147 7626776 7703704 7736770 7599958 7673394 7754953 7634218 7705284 7802071 7846339 7909493
16116 7909493 7858639 7875071 7936061 7807220 7749832 7825667 7876994 7996982 7886557 8052454
16106 8052454 8048987 8040555 8004547 8192018 8115807 8008042 8043780 8219498 8233502 8141424 8042457
16095 8042457 7816392 7952199 8208856 8128255 8185011 8159216 8174397 8202883 8233653 8199114 8022871
16084 8022871 8181212 8197060 8239283 8133645 8154149 8163493 8163751 8130272 8072734 8129589 8138806 8047235
16072 8047235 8095320 8198288 8142746 8205703 8153251 8203095 8181251 8187490 8250682 8250116 8418188
16061 8418188 8324247 8202885 8248744 8358856 8331957 8293277 8301614 8433049 8274840 8189026 8133200
16050 8133200 8254668 8112305 8264536 8403414 8318346 8369243 8315806 8459251 8305246 8262633
16040 8262633 8285339 8249813 8180616 8272793 8297788 8321936 8161160 8269752 8276804 8119767 8123712
16029 8123712 8208610 8315143 8243669 8359716 8253271 8277788 8276642 8274547 8301987 8274151 8115977
16018 8115977 8144505 8349717 8370721 8364335 8346018 8384657 8489888 8467621 8485577 8384923 8375792
16007 8375792 8484713 8425906 8390504 8258873 8177482 8199748 8234357 8299973 8299075 8400170 8333294
15996 8333294 8227976 8233125 8322607 8318385 8285192 8315542 8285705 8346071 8320731 8405942 8375383
15985 8375383 8380692 8377089 8286482 8376370 8460525 8463227 8467560 8346365 8256777 8167909 8344964 8325393
15973 8325393 8408600 8388861 8239624 8252483 8170400 8242863 8393042 8449547 8383036 8445728 8361030
15962 8361030 8370671 8327859 8375785 8367427 8450597 8409296 8379930 8365253 8319104 8415181 8315628 8282011
15950 8282011 8461546 8446708 8298832 8284091 8343102 8432558 8334626 8288324 8431659 8434449 8460788
15939 8460788 8422509 8339358 8362595 8357132 8220845 8181888 8251008 8225490 8286274 8256419 8305713
15928 8305713 8426193 8348139 8337251 8365781 8319163 8315754 8279125 8368019 8437522 8531272 8475828
15917 8475828 8389130 8326594 8295083 8333433 8246531 8335449 8430299 8377942 8337826 8421354 8504501
15906 8504501 8405731 8312059 8331428 8357510 8180684 8263538 8321884 8325664 8409228 8520117 8465377
15895 8465377 8361529 8424435 8571505 8589785 8472593 8454565 8452160 8465893 8503534 8412126 8331967
15884 8331967 8250993 8227372 8421283 8392729 8391235 8326416 8522628 8545872 8393325 8451897 8436787
15873 8436787 8454737 8441767 8539357 8620810 8567894 8443992 8440715 8511784 8332513 8278755 8360401
15862 8360401 8320909 8379633 8369505 8508131 8415338 8438849 8472520 8514958 8568970 8373921 8303594
15851 8303594 8451518 8480922 8493074 8517602 8498128 8517633 8544728 8641410 8607344 8516303 8356270
15840 8356270 8442787 8484380 8534972 8424405 8485378 8521639 8460453 8413157 8394202 8520918 8521462
15829 8521462 8410575 8439834 8419956 8462355 8576134 8432721 8464948 8470299 8344845 8378810 8615494
15818 8615494 8685832 8511791 8501695 8435282 8496600 8564545 8579329 8469537 8432312 8536977 8482416
15807 8482416 8495376 8577277 8436888 8349602 8362568 8429306 8474818 8299521 8342181 8428376 8506076
15796 8506076 8414965 8474547 8465482 8322538 8393662 8452184 8438101 8527041 8501588 8521098 8497143
15785 8497143 8513585 8444367 8335060 8358847 8496361 8442023 8448218 8486201 8505586 8547816 8416166
15774 8416166 8311975 8281858 8336301 8504603 8557725 8488389 8560486 8533225 8526518 8533673 8504611
15763 8504611 8510325 8666411 8508067 8474290 8578430 8512032 8597888 8398603 8315983 8534721
15753 8534721 8434258 8315952 8353697 8432729 8504462 8520854 8549527 8495747 8488054 8612608 8532632
15742 8532632 8545808 8560852 8537778 8511812 8415680 8463895 8463846 8437428 8423945 8393907 8397896 8488314
15730 8488314 8378947 8410009 8366142 8408342 8449322 8434437 8464587 8564390 8495032 8402277 8632931
15719 8632931 8545921 8555198 8702102 8646264 8554168 8601425 8572679 8618539 8444739 8323610 8471949
15708 8471949 8626307 8558663 8442453 8496299 8585415 8614813 8609594 8584188 8605982 8561573 8495081
15697 8495081 8505225 8553051 8605050 8485263 8487966 8647944 8721283 8748861 8774784 8776235 8552054
15686 8552054 8563680 8486808 8511461 8527955 8496142 8535262 8372260 8311570 8455567 8581583 8631602
15675 8631602 8547770 8513432 8401327 8632398 8697198 8696731 8466625 8378194 8448661 8488906 8616753
15664 8616753 8556418 8552589 8644695 8748779 8717300 8496060 8384761 8491629 8562408 8562145 8543439
15653 8543439 8681298 8748757 8695092 8663997 8714251 8606123 8729039 8531781 8492304 8581609
15643 8581609 8723100 8716598 8618304 8567135 8495788 8482752 8472274 8544754 8608522 8577971 8619046
15632 8619046 8659384 8823299 8677458 8630302 8637442 8656488 8588047 8427050 8519857 8695967 8701446
15621 8701446 8743896 8651035 8568564 8540207 8662073 8542224 8539168 8604638 8715417 8655879 8692941
15610 8692941 8658917 8502681 8548943 8659791 8514944 8418514 8511071 8515782 8596540 8591700 8601679
15599 8601679 8544689 8643415 8667051 8618145 8716169 8788291 8653200 8804708 8741694 8677869 8679158
15588 8679158 8579073 8588182 8651667 8686439 8629101 8585872 8564669 8651358 8656405 8762556 8840688
15577 8840688 8680292 8614581 8622588 8536373 8558495 8547319 8607007 8742910 8686142 8715231 8659069
15566 8659069 8616268 8664515 8702737 8673262 8631677 8649915 8631183 8731329 8848163 8589787 8606258
15555 8606258 8548553 8487022 8506718 8670100 8515805 8553027 8587196 8597896 8590099 8608926 8618223
15544 8618223 8633654 8523027 8594557 8635495 8575330 8633832 8574838 8634782 8728286 8742945 8720035
15533 8720035 8650956 8654260 8711682 8586527 8528902 8635458 8908774 8769586 8675277 8737144 8720728
15522 8720728 8695263 8770920 8826438 8780026 8674517 8716974 8788679 8761101 8786962 8849991 8785152
15511 8785152 8693671 8796374 8684262 8850450 8915989 8726107 8677714 8731296 8817097 8759452
15501 8759452 8721705 8785443 8743824 8700226 8596514 8645573 8676944 8617213 8692993 8691892 8741270
15490 8741270 8763254 8672650 8847973 8772410 8750726 8805691 8654855 8641755 8621018 8651442 8703806
15479 8703806 8750907 8825978 8748533 8703311 8766476 8645406 8668750 8603900 8737776 8779450 8808864
15468 8808864 8793550 8816954 8681895 8660211 8598086 8458480 8669638 8780655 8801043 8668948
15458 8668948 8602088 8660028 8684266 8738140 8842307 8877728 8917535 8965705 8998940 9001850 8976981
15447 8976981 8817492 8728410 8878035 8871238 8748478 8628302 8665795 8630509 8767638 8761827 8690812
15436 8690812 8695453 8897645 8843030 8868962 8833888 8847363 8950733 8850228 8760406 8701861 8732541
15425 8732541 8790784 8825957 8818177 8801158 8779014 8807032 8833717 8793976 8907579 8940603 8831969
15414 8831969 8798154 8809313 8865674 8859575 8782556 8772276 8753811 8770829 8725951 8725943 8682436 8719882
15402 8719882 8797170 8789976 8849754 8807674 8779685 8855692 8914980 8668606 8717828 8745945 8778807
15391 8778807 8792938 8813474 8839370 8832724 8805258 8875585 8850278 8835438 8834075 8967279 8954549
15380 8954549 8881989 8967663 8892888 8855124 8850348 8727479 8613705 8772180 8841601 8757523 8942290
15369 8942290 8853895 8812466 8839497 8784585 8848938 8827273 8883221 8819663 8846800 9000107 8969124
15358 8969124 8763126 8828864 8778871 8774573 8855495 8893523 8895366 8874272 9089217 8985614 8899749
15347 8899749 8856014 8884121 8915693 9016545 8980574 8906569 8909156 8729717 8907452 8858556 8677155
15336 8677155 8564231 8661030 8788439 8748586 8820177 8807939 8885966 8779329 8759769 8734003 8620515
15325 8620515 8688762 8822817 8821985 8851780 8857714 8868524 8793812 8758581 8885861 8806370 8904412
15314 8904412 9017025 8971126 9014078 8948412 8980953 9038119 9066330 9056426 9010996 8855544 8984053
15303 8984053 8871459 8823099 8859965 8769482 8910834 9044262 8863235 8813617 8930106 8948755
15293 8948755 8906151 8952867 8980844 8899527 8935276 8842890 8922980 8991338 8876473 8858664 8894360
15282 8894360 8955009 8955540 8814163 8890359 8891042 8936679 8846003 8838540 8861432 8943139 8968565 8882950
15270 8882950 8842168 8792309 8772278 8893270 8779070 8819741 8943526 8888973 8763293 8906192
15260 8906192 8961982 8817402 8939564 9002181 8985323 8832248 8787379 8890333 8900729 8869088
15250 8869088 8941017 9003784 8904485 8993143 8936476 8943986 8837512 8848702 8851442 8928405 9002141
15239 9002141 8910453 8942643 8930660 9082154 9001581 8929097 9030276 9159436 9048393 9045902 8972062
15228 8972062 8898150 8996332 9084211 8971215 8838310 8875999 8839917 8857552 8855725 8858084 8935946
15217 8935946 9025539 8998187 8927505 8809963 8713718 8778488 8883173 8920238 8794838 8893101 8934516
15206 8934516 8887449 8813535 8888333 9032641 9015316 9178472 9106311 8975668 9034832 8932919
15196 8932919 8873935 8932580 8965694 9015697 8973176 8923918 8988917 8972443 9009579 8915461 8829871
15185 8829871 8845854 8876947 9004034 9100897 9029842 9001695 8900676 9003849 9107185 8997045
15175 8997045 8822327 8767335 8845621 8816947 8929133 8944912 8905786 8905800 8927691 8875361 9050337
15164 9050337 9144109 9126487 9084798 9093260 9008374 8977098 8940937 8994619 8979037 8945977 9013640
15153 9013640 8760297 8892113 8987948 8986687 8924933 8846014 8996821 9073922 9064614 8834104 8972453
15142 8972453 9047290 9023727 9234207 9055500 9042366 9215523 9269626 9295612 9132547 9067119
15132 9067119 8930487 9016043 9203256 9072730 8954764 9059568 8992177 9022478 9125553 9143115
15122 9143115 9064419 8949846 8944332 9122532 9053361 9006987 8983352 8986542 9074136 9070150 9124810
15111 9124810 8992672 9223027 9173512 9027143 8996014 8995082 8972430 8921846 8962282 9076851 9109586
15100 9109586 9267347 9156150 8910275 9075519 9172127 9061587 9153881 9103762 9105436 9068608
15090 9068608 9104146 8987798 8893596 9116540 9183294 9101798 9004291 9113286 9196137 9138209 9121282
15079 9121282 9117719 9071968 8994269 9024223 9059445 9101350 9066652 9126064 9046923 9110696 9143680
15068 9143680 9052407 9184473 9380598 9209945 9096185 9074548 8977138 9039188 9087244 9092617 9065585
15057 9065585 9080552 8997277 8987415 8960148 9085893 9166507 9175281 9052341 8916263 8951867 9029390
15046 9029390 9076030 9182668 9189757 9248774 9205097 9152534 9125793 9198557 9095680 9078988 9111413
15035 9111413 9153368 9262363 9195239 9121198 9218695 9167110 9173906 9127758 9025728 9082633 9051452
15024 9051452 8934804 9016124 9100760 9030313 9135487 9190009 9225346 9136233 9263868 9306665 9194078
15013 9194078 9118036 9074274 8948871 9063397 9107304 9107063 9197090 9219411 9235428 9060920 9028598
15002 9028598 9025928 9153737 9137256 9114768 9182949 9155215 9175709 9229152 9101740 9115632 9182134
14991 9182134 9147039 9215255 9100221 9095456 9195151 9184514 9127439 8944507 9012105 9081167 9115374
14980 9115374 9128233 9193684 9184362 9229742 9284434 9314238 9205034 9213617 9131887 9020499 9065414
14969 9065414 9070061 9044107 9008801 9132923 9094774 9156488 9438906 9324183 9200138 9149670 9205973
14958 9205973 9265541 9208491 9226611 9178678 9083210 8980618 9101802 9205569 9342930 9300589
14948 9300589 9259054 9214966 9107047 9118405 9242376 9343995 9357450 9302994 9266215 9289696 9212815
14937 9212815 9291530 9414965 9212578 9067549 9153141 9201022 9203932 9229102 9174136 9219526 9253042
14926 9253042 9240177 9215859 9198044 9218889 9135652 9054372 9244020 9204213 9246032 9179768 9112677
14915 9112677 9281122 9332817 9341740 9353599 9299712 9293710 9216840 9229402 9184783 9202217 9104005
14904 9104005 9105869 9071905 9042116 9118487 9092581 9178531 9324665 9268625 9366915 9356684 9243675
14893 9243675 9270944 9163845 9232160 9143316 9134915 9248437 9226376 9223393 9278499 9351874 9353435
14882 9353435 9320387 9265874 9179691 9075688 9034083 9111939 9081992 9180459 9295205 9252564 9180479
14871 9180479 9340146 9374737 9395632 9437609 9409678 9341197 9313070 9331527 9243281 9285064 9188107
14860 9188107 9348961 9382642 9367024 9331721 9288964 9317376 9110811 9256078 9297917 9398344
14850 9398344 9459506 9395409 9322497 9176855 9323741 9394170 9353422 9359112 9457235 9505707 9330382
14839 9330382 9224703 9232963 9345941 9340394 9272462 9254353 9303111 9220043 9164089 9152180 9166743
14828 9166743 9141613 9266627 9285192 9305317 9323657 9379682 9265216 9298032 9329759 9262960 9413009
14817 9413009 9402995 9232696 9386144 9364903 9300234 9451819 9330888 9238399 9140973 9140974 9296790
14806 9296790 9263610 9201154 9118379 9250443 9319949 9416178 9449409 9464001 9372876 9268901 9229034
14795 9229034 9354198 9423169 9409539 9333111 9187553 9210601 9154102 9121203 9109195 9146115 9207768
14784 9207768 9254701 9290317 9244509 9262402 9374393 9298223 9441168 9279313 9300195 9329554 9298722
14773 9298722 9419205 9510621 9519360 9482360 9424921 9444657 9413883 9372623 9419201 9319139 9408660
14762 9408660 9483580 9445992 9500034 9318120 9238944 9168168 9097278 9174735 9307288 9389609 9493834
14751 9493834 9406268 9401776 9245223 9238892 9338456 9390829 9424036 9486516 9181480 9235662 9327910
14740 9327910 9392166 9430321 9413088 9447929 9408729 9252212 9329793 9406539 9453230 9473219 9557796
14729 9557796 9342368 9318680 9495729 9506616 9438133 9457147 9469943 9444037 9430126 9417858 9431665
14718 9431665 9371273 9496702 9453843 9521766 9460485 9476312 9567068 9521065 9453907 9514342 9407881
14707 9407881 9493116 9598287 9752360 9591615 9573695 9521390 9634238 9564073 9591996 9521377
14697 9521377 9580294 9548525 9399755 9524331 9663943 9556949 9532015 9403970 9335407 9336234 9341307
14686 9341307 9373967 9468099 9543506 9578855 9596706 9462058 9356048 9384017 9482149 9516621 9439204
14675 9439204 9424971 9444747 9438080 9355274 9394321 9480184 9446955 9476571 9420691 9320515 9342756
14664 9342756 9342701 9567512 9656280 9589701 9537044 9515273 9442839 9264213 9423597 9512170 9481449
14653 9481449 9522915 9551336 9471371 9320872 9428742 9417377 9466652 9606450 9506693 9271293
14643 9271293 9243941 9440800 9505599 9480005 9359588 9406471 9438629 9416385 9399059 9419504 9465395
14632 9465395 9590686 9513579 9528845 9441591 9521927 9611764 9603180 9472806 9377968 9516403 9541048
14621 9541048 9491875 9482344 9490990 9502064 9330316 9349421 9379227 9405524 9374119 9462789 9501828
14610 9501828 9516139 9364707 9285608 9604648 9599073 9321054 9340864 9464360 9581512 9665852
$$ [...]
##END NTUPLES=NMR SPECTRUM
##END=
