##TITLE=1H_TG-2364-xy
 DMSO
 8 sc, 
 17.11.2022
##JCAMPDX= 6.0         $$ Bruker NMR JCAMP-DX V2.0
##DATA TYPE= NMR SPECTRUM
##DATA CLASS= NTUPLES
##ORIGIN= UXNMR, Bruker Analytische Messtechnik GmbH
##OWNER= root
$$ XWIN-NMR		Version 3.5
$$ Thu Nov 17 14:36:48 2022 Russian Standard Time (UT+4h)  she@DPX200
##.OBSERVE FREQUENCY= 200.1313499994
##.OBSERVE NUCLEUS= ^1H
##.ACQUISITION MODE= SIMULTANEOUS
##.ACQUISITION SCHEME= undefined
##.AVERAGES= 8
##.DIGITISER RES= 18
##SPECTROMETER/DATA SYSTEM= spect
##.PULSE SEQUENCE= zg30
##.SOLVENT NAME= DMSO
##.SHIFT REFERENCE= (INTERNAL, DMSO, 0, 15.7612)
##AUDIT TRAIL= $$ (NUMBER, WHEN, WHO, WHERE, WHAT)
$$ ##TITLE= Audit trail, XWIN-NMR		Version 3.5
$$ ##JCAMPDX= 5.01
$$ ##ORIGIN= Bruker BioSpin GmbH
$$ ##OWNER= she
$$ F:/spectra/data/she/nmr/H-F/1/pdata/1/auditp.txt
$$ ##AUDIT TRAIL=  $$ (NUMBER, WHEN, WHO, WHERE, WHAT)
(   1,<2022-11-17 14:35:39.98 +0400>,<she>,<DPX200>,
      <created by zg, POWCHK disabled, PULCHK disabled
       configuration hash MD5:
       00 E9 B6 7A A2 85 ED C7 34 08 36 98 17 FE 4E 26
       data hash MD5: 16K
       9B FD F5 D9 E8 05 AC 29 8B E9 72 45 8C 3A CB 76>)
(   2,<2022-11-17 14:35:42.12 +0400>,<she>,<DPX200>,
      <Start of raw data processing
       efp BC_mod = 2 LB = 0.24 FT_mod = 6 PKNL = 1 PHC0 = -18032.25 PHC1 = 15.0007 SI = 16K 
       data hash MD5: 16K
       60 C2 93 53 FD 38 33 7E 50 2B E4 58 00 36 B6 52>)
(   3,<2022-11-17 14:35:58.92 +0400>,<she>,<DPX200>,
      <pk PHC0 = -0.2033642 PHC1 = -1.800001 
       data hash MD5: 16K
       AD B2 58 84 37 DB B3 21 07 24 5A 14 BD 9B 95 04>)
(   4,<2022-11-17 14:36:02.01 +0400>,<she>,<DPX200>,
      <abs ABSG = 5 
       data hash MD5: 16K
       66 06 9D FC 23 40 A3 C4 F0 3C 5A 76 A6 B5 85 1C>)
$$ ##END=
$$ 
$$ hash MD5
$$ 69 41 48 63 B4 7E F8 0F 37 A6 99 19 FA 4E 53 44
##$RELAX= 
##$RELAX= 
##$RELAX= 
##$RELAX= 
##$RELAX= 
##$RELAX= 
$$ Bruker specific parameters
$$ --------------------------
##$DU= <F:/spectra>
##$EXPNO= 1
##$NAME= <H-F>
##$PROCNO= 1
##$TYPE= <nmr>
##$USER= <she>
##$AMP= (0..31)
100 100 100 100 100 100 100 100 100 100 100 100 100 100 100 100 100 100 
100 100 100 100 100 100 100 100 100 100 100 100 100 100 
##$AQSEQ= 0
##$AQ_mod= 1
##$AUNM= <au_zg>
##$AUTOPOS= <>
##$BF1= 200.13
##$BF2= 200.13
##$BF3= 200.13
##$BF4= 200.13
##$BF5= 200.13
##$BF6= 200.13
##$BF7= 200.13
##$BF8= 200.13
##$BYTORDA= 1
##$CFDGTYP= 0
##$CFRGTYP= 5
##$CHEMSTR= <none>
##$CNST= (0..31)
1 1 145 1 1 1 1 1 1 1 1 1 1 1 1 1 1 1 1 1 1 1 1 1 1 1 1 1 1 1 1 1 
##$CPDPRG= <>
##$CPDPRG1= <>
##$CPDPRG2= <>
##$CPDPRG3= <>
##$CPDPRG4= <mlev>
##$CPDPRG5= <mlev>
##$CPDPRG6= <mlev>
##$CPDPRG7= <mlev>
##$CPDPRG8= <mlev>
##$CPDPRGB= <>
##$CPDPRGT= <>
##$D= (0..31)
0 1.2 0 0 0 0 0 0 0 0.06 0 0.03 0 0 0 0 0.0002 0 0 0 0 0 0 0 0 0 0 0 0 
0 0 0 
##$DATE= 1668681339
##$DBL= (0..7)
120 120 120 120 120 120 120 120 
##$DBP= (0..7)
150 150 150 150 150 150 150 150 
##$DBP07= 0
##$DBPNAM0= <>
##$DBPNAM1= <>
##$DBPNAM2= <>
##$DBPNAM3= <>
##$DBPNAM4= <>
$$ [...]
##$SUBNAM3= <"">
##$SUBNAM4= <"">
##$SUBNAM5= <"">
##$SUBNAM6= <"">
##$SUBNAM7= <"">
##$SUBNAM8= <"">
##$SUBNAM9= <"">
##$SW= 18.0517283424941
##$SWIBOX= (0..15)
0 0 2 0 0 0 0 0 0 0 0 0 0 0 0 0 
##$SW_h= 3612.71676300578
##$TD= 16384
##$TD0= 1
##$TE= 0
##$TE2= 300
##$TE3= 300
##$TEG= 300
##$TL= (0..7)
0 120 120 120 120 120 120 120 
##$TP= (0..7)
150 150 150 150 150 150 150 150 
##$TP07= 0
##$TPNAME0= <>
##$TPNAME1= <>
##$TPNAME2= <>
##$TPNAME3= <>
##$TPNAME4= <>
##$TPNAME5= <>
##$TPNAME6= <>
##$TPNAME7= <>
##$TPOAL= (0..7)
0.5 0.5 0.5 0.5 0.5 0.5 0.5 0.5 
##$TPOFFS= (0..7)
0 0 0 0 0 0 0 0 
##$TUNHIN= 0
##$TUNHOUT= 0
##$TUNXOUT= 0
##$USERA1= <user>
##$USERA2= <user>
##$USERA3= <user>
##$USERA4= <user>
##$USERA5= <user>
##$V9= 5
##$VALIST= <valist>
##$VCLIST= <CCCCCCCCCCCCCCC>
##$VD= 0
##$VDLIST= <DDDDDDDDDDDDDDD>
##$VPLIST= <PPPPPPPPPPPPPPP>
##$VTLIST= <TTTTTTTTTTTTTTT>
##$WBST= 1024
##$WBSW= 4
##$XGAIN= (0..3)
0 0 0 0 
##$XL= 0
##$YL= 0
##$YMAX_a= 122450
##$YMIN_a= -115495
##$ZGOPTNS= <>
##$ZL1= 120
##$ZL2= 120
##$ZL3= 120
##$ZL4= 120
##$ABSF1= 15.73918
##$ABSF2= -2.31267
##$ABSG= 5
##$ABSL= 3
##$ALPHA= 0
##$AQORDER= 0
##$ASSFAC= 0
##$ASSFACI= 0
##$ASSFACX= 0
##$ASSWID= 0
##$AUNMP= <proc_1d>
##$AZFE= 0.1
##$AZFW= 0.1
##$BCFW= 0
##$BC_mod= 2
##$BYTORDP= 0
##$COROFFS= 0
##$CY= -3
##$DATMOD= 1
##$DC= 0
##$DFILT= <>
##$DTYPP= 0
##$F1P= 0
##$F2P= 0
##$FCOR= 1
##$FTSIZE= 16384
##$FT_mod= 6
##$GAMMA= 0
##$GB= 0
##$INTBC= 1
##$INTSCL= 3.70164e-10
##$ISEN= 128
##$LB= 0.24
##$LEV0= 0
##$LPBIN= 0
##$MAXI= 10000
##$MC2= 0
##$MEAN= 0
##$ME_mod= 0
##$MI= 1.114404
##$NCOEF= 0
##$NC_proc= -9
##$NLEV= 6
##$NOISF1= 3.799351
##$NOISF2= 2.8
##$NSP= 0
##$NTH_PI= 0
##$NZP= 0
##$OFFSET= 15.76121
##$PC= 1
##$PHC0= -18032.45
##$PHC1= 13.2007
##$PH_mod= 1
##$PKNL= yes
##$PPARMOD= 0
##$PSCAL= 0
##$PSIGN= 0
##$REVERSE= no
##$SF= 200.130002067028
##$SI= 16384
##$SIGF1= 3
##$SIGF2= 2
##$SINO= 5.538805
##$SIOLD= 16384
##$SREGLST= <1H.CDCl3>
##$SSB= 0
##$STSI= 16384
##$STSR= 0
##$SW_p= 3612.71676300578
##$SYMM= 0
##$S_DEV= 0
##$TDeff= 16384
##$TDoff= 0
##$TI= <>
##$TILT= no
##$TM1= 0
##$TM2= 0
##$TOPLEV= 0
##$USERP1= <user>
##$USERP2= <user>
##$USERP3= <user>
##$USERP4= <user>
##$USERP5= <user>
##$WDW= 1
##$XDIM= 16384
##$YMAX_p= 317752207
##$YMIN_p= -2109617
$$ End of Bruker specific parameters
$$ ---------------------------------
##NTUPLES= NMR SPECTRUM
##VAR_NAME=  FREQUENCY,     SPECTRUM/REAL,   SPECTRUM/IMAG
##SYMBOL=    X,             R,               I
##VAR_TYPE=  INDEPENDENT,   DEPENDENT,       DEPENDENT
##VAR_FORM=  AFFN,          ASDF,            ASDF
##VAR_DIM=   16384,         16384,           16384
##UNITS=     HZ,            ARBITRARY UNITS, ARBITRARY UNITS
##FACTOR=    0.220516191357247, 1,           1
##FIRST=     3154.29107825414, 0,            0
##LAST=      -458.425684751639, 0,           0
##MIN=       -458.425684751639, -2109617,    0
##MAX=       3154.29107825414, 317752207,    0
$$ Real data points
##PAGE= N=1
##DATA TABLE= (X++(R..R)), XYDATA
$$ [...]
10511h7868l9003L18748K88977o11732n66223r8510l25392L39101L55336O51562
$$ -87868 -126871 191877 480854 -130878 -697101 -795611 -1121003 -781902 -426566 224996
10501B24996M2831m7283o81961j03622Q76026m46514k05555p91345J3206m08505
$$ 224996 267827 220544 -461417 -565039 310987 -135527 -341082 -1132427 -1119221 -1527726
10491a527726j64474M65954M98306k54003K14525L22167J40093l36926N95681
$$ -1527726 -1692200 -1226246 -727940 -981943 -767418 -445251 -305158 -642084 -46403
10482d6403p615P21599p32513p66813N26235L9177k34860l30232P21464o8407
$$ -46403 -54018 667581 -64932 -831745 -305510 -266333 -501193 -831425 -109961 -178368
10472a78368k24340N83229N37774r89537J3605N2124K12183l41983j51640O89257
$$ -178368 -402708 180521 718295 -271242 -257637 -205513 6670 -335313 -486953 202304
10462B02304m35901o23694l7633J265912j22087M7214R20934o79262j043991L98457
$$ 202304 -233597 -857291 -894924 370988 248901 296115 1217049 537787 -506204 -107747
10452a07747j97955k68714Q6981M25160l11762j92288K3816K57893O54726p68448
$$ -107747 -305702 -574416 -487435 -62275 -374037 -566325 -542509 -284616 370110 -398338
10442c98338k36982J069996j50053j35196N87830n28639j85875l10545l60133
$$ -398338 -635320 434676 284623 149427 737257 208618 22743 -287802 -647935
10433f47935J46159J31304j07864r2405l73927M31443j2253j29378J88135r9243
$$ -647935 -501776 -370472 -478336 -570741 -944668 -513225 -525478 -654856 -466721 -565964
10423e65964J3854J80918R64040O84024j052602p48457N57375O76849q46460p33258
$$ -565964 -552110 -371192 592848 1276872 224270 -524187 33188 710037 -136423 -869681
10413h69681J53467R66991J36374n38692m10532J07642q1640N17760K58834l45854
$$ -869681 -716214 250777 387151 -151541 -562073 -454431 -536071 -18311 240523 -105331
10403a05331j59132j9566O64557l20771l41211J96773q1087k82431n5427j21313
$$ -105331 -264463 -284029 380528 59757 -281454 -84681 -165768 -448199 -503626 -624939
10393f24939O87585j4920p08585J55211J118533J01771J6940j030266l79625k18127
$$ -624939 62646 47726 -660859 -505648 612885 714656 731596 -298670 -678295 -896422
10383h96422j89308P95187O08188r33848M90856K48944p09640K0637o680k59115
$$ -896422 -1085730 -290543 317645 -616203 -125347 123597 -586043 -565406 -572086 -831201
10373h31201Q91763K48908m40326j96959m1832O9156R8729N81782K2906o00924
$$ -831201 60562 309470 -130856 -327815 -369647 -300491 -201762 380020 402926 -197998
10363a97998j113507O22637J26908L88838j6876L50173k5487q1065m53562J89480
$$ -197998 -1311505 -688868 -561960 -173122 -189998 160175 134688 53623 -399939 -210459
10353b10459P91847j62574k07618n2369n42782M6107j93043J32276n17110N55990
$$ -210459 581388 418814 211196 158827 -383955 -337848 -530891 -398615 -915725 -359735
10343c59735M84477n69123j83320J59990J35558Q58205k57861r49148k24427J021735
$$ -359735 124742 -444381 -627701 -467711 -332153 526052 268191 -680957 -905384 116351
10333A16351R83835p74186L9590k97634l51470M93316q64578n247L90021o78n86281
$$ 116351 1100186 326000 365590 67956 -283514 209802 -654776 -660023 -270002 -270680 -856961
10322h56961N40753O09938J54868M27446j78597r42556J86228r143N54931P0448
$$ -856961 -316208 293730 448598 876044 697447 -245109 -58881 -68024 486907 557355
10312E57355j054413M03776m18510K58574l44676J149471m95320m05814m85438
$$ 557355 -497058 -93282 -511792 -253218 -597894 551577 56257 -349557 -834995
10303h34995j016876O07096J090965n6112m13585P146n23094j29420O46983r24338
$$ -834995 -1851871 -1244775 -153810 -209922 -623507 -616361 -1139455 -1268875 -621892 -1546230
10293a546230P38724N38338Q20331l12576j53734J45078O4063R16085m56993l32199
$$ -1546230 -807506 -269168 551163 238587 84853 229931 293994 1210079 753086 420887
10283D20887l01915l0097l24861k21542K78891J61526m41308K68394L43500l73412
$$ 420887 118972 88875 -235986 -457528 -178637 -17111 -458419 -190025 153475 -219937
10273b19937J72837M63499p00100L67535R53923j227074j86297L68225n70114
$$ -219937 -47100 416399 -283701 83834 1037757 -189317 -375614 -7389 -577503
10264e77503j35103N96556Q97554K04282n99712q15400k03811J96197J10548k35098
$$ -577503 -712606 -116050 781504 985786 386074 -429326 -633137 -436940 -326392 -561490
10254e61490l05760K93047N08627K48008J99030N3909l54966j17981j96757k43474
$$ -561490 -867250 -574203 -65576 182432 381462 435371 80405 -37576 -234333 -477807
10244d77807J88468r2599n35695K65495P4454K06906K28638m55160J90374N27028
$$ -477807 -289339 -381938 -917633 -652138 -577684 -370778 -142140 -597300 -406926 120102
10234A20102k23963k2885l74258Q53J74294J71211J24182r0820k38499o19797
$$ 120102 -103861 -126746 -501004 -500151 -325857 -154646 -30464 -121284 -359783 -979580
10224i79580J002430n91381l56145O45317P05751K67822n52059j34342k67143
$$ -979580 22850 -568531 -924676 -279359 426392 694214 142155 7813 -259330
10215b59330l5492j81642J90001R03104p94356Q72623L2772n99617n55104K30874
$$ -259330 -294822 -476464 -286463 616641 -177715 694908 727680 128063 -427041 -196167
10205a96167M75392k22230Q7097q11233l46089R41360K52919Q5223m15775n67787
$$ -196167 279225 56995 144092 -667141 -1013230 -71870 181049 266272 -149503 -717290
10195g17290l42046J94571J038405O5395l68848j24574n17726K890L76217J09169
$$ -717290 -1059336 -864765 173640 239035 -129813 -254387 -772113 -769223 -393006 -283837
10185b83837l55440l29816L01944j77192L76731j04282p41264J90956R67835P17561
$$ -283837 -639277 -969093 -667149 -844341 -467610 -571892 -1313156 -1122200 -154365 563196
10175E63196K7385p81870m45781O68014M03812p78662l04571J337656L75854j493538
$$ 563196 590581 -191289 -637070 30944 434756 -343906 -648477 689179 1065033 -428505
10165d28505o06460N66332P11824l0969p4795K25852n86367q21357Q94626j94780
$$ -428505 -1034965 -468633 243191 212222 137427 363279 -223088 -1044445 -149819 -344599
10155c44599M77206J64617m04978l41222k53050R22388O60324n11063j6650j327965
$$ -344599 132607 297224 -107754 -448976 -702026 220362 880686 369623 352973 -974992
10145i74992j94251Q28850J21374j0935j47377j46252n68254J087429K77544J16390
$$ -974992 -1169243 -340393 -219019 -229954 -377331 -523583 -1091837 -4408 273136 389526
10135C89526j025526N50496p74904P25470O01937n71399O05474K1102L58751r74415
$$ 389526 -636000 -85504 -860408 -134938 466999 -104400 501074 522176 880927 -93488
10125i3488m30771N44259M8730j279203m14961R25110O76466M87073M09502m32899
$$ -93488 -524259 20000 68730 -1210473 -1625434 -700324 -23858 463215 872717 439818
10115D39818k57746o40640j47566N60894O37534j183491m5401J175088q37652
$$ 439818 182072 -458568 -606134 -45240 592294 -591197 -636598 538490 -299162
10106b99162m59223r2481M03483K81129o74118J9531Q02390l36726j77056L35152
$$ -299162 -758385 -850866 -447383 -166254 -840372 -820841 -18451 -355177 -532233 -197081
10096a97081k62634O64375J59214L45848O57504l92663m61572l03859n29613J072751
$$ -197081 -459715 204660 363874 709722 1367226 974563 512991 209132 -320481 752270
10086G52270N01234r96299R7813l36258k40088R6823R32865k58344l27573J44815
$$ 752270 1253504 257205 355018 18760 -221328 -124505 808360 550016 222443 367258
10076C67258n87282k08040K34490K02032K60203J21586l02056J94693P36689J18883
$$ 367258 -220024 -428064 -193574 8458 268661 390247 88191 282884 1019573 1138456
10066A138456n51236l32232L51606N07969m88714k14311n50814K89933k32973
$$ 1138456 587220 254988 606594 1114563 625849 411538 -139276 150657 -82316
10057h2316J29654Q83137J51330m66036r67085K74291m04680N45281l88174j90867
$$ -82316 47338 930475 1081805 615769 -351316 -77025 -481705 63576 -324598 -515465
10047e15465k03609n01110J250906j3985p50616j98971P68115o1551l27354m0115
$$ -515465 -719074 -1220184 30722 16737 -733879 -932850 -164735 -226286 -553640 -593755
10037e93755R51972k64227j23001L41891j27486J71569r973n86952K153O68228
$$ -593755 358217 93990 -29011 312880 185394 356963 346990 -239962 -237809 430419
10027D30419j29841K42371J6401n64310L82480k01122n08888L22475J35120m0961
$$ 430419 300578 542949 559350 -4960 377520 176398 -332490 -10015 125105 84144
10017H4144o69958p7697r01830K05781J538321L46325o87139K20751P35030J15585
$$ 84144 -585814 -663511 -1565341 -1359560 178761 525086 -162053 58698 793728 909313
10007I09313j82010p23659n77895J34913L88596l63896K92974J89360q7898j55659
$$ 909313 727303 3644 -574251 -439338 -50742 -414638 -121664 67696 -20202 -175861
9997a75861N75710L76833n20849m12800J09833J85959Q60688n42873o21528J028478
$$ -175861 399849 776682 255833 -156967 -47134 138825 999513 456640 -164888 863590
9987H63590p85002o50894J405394j99662j496434L6562J141539K94283r5062j048861
$$ 863590 78588 -572306 833088 633426 -863008 -826446 315093 609376 514314 -534547
9977e34547L24228J227998o20510L7295p20515j29512L57277k80515m74199j12168
$$ -534547 -210319 1017679 397169 434464 -286051 -415563 -58286 -338801 -813000 -925168
9967i25168K40363J181954j06633M41034m51852j097245l27325l41166k23941
$$ -925168 -684805 497149 390516 831550 379698 -717547 -1044872 -1386038 -1609979
9958a609979P58128J320764m25563n50740L69294o21833P9221L03241J38072o50630
$$ -1609979 -851851 468913 43350 -507390 -138096 -759929 -680708 -377467 -239395 -890025
9948h90025o89558j87768M18089Q92523R00045p48621l11306K13723k09549P39703
$$ -890025 -1579583 -1767351 -1349262 -456739 443306 -305315 -616621 -402898 -612447 127256
9938A27256m76657j093983M58085P55655n66831r06686P10747R63957J85556J90033
$$ 127256 -349401 -1443384 -985299 -229644 -796475 -1703161 -992414 -28457 157099 347132
9928C47132l50949n74652O37297J8n94720l08218K53495O92589m57384Q99383
$$ 347132 -3817 -578469 58828 58846 -535874 -844092 -590597 101992 -355392 543991
9918E43991l32581j15907k95389j90508n71402J32314M52582J38068j042780N94165
$$ 543991 211410 95503 -199886 -390394 -961796 -829482 -376900 -238832 -1281612 -687447
9908f87447O09909l84422p9158P15055J39602k45318m90983n04935O56623p1433
$$ -687447 -77538 -461960 -541118 173937 313539 68221 -422762 -927697 -271074 -342507
9898c42507p4973m37036M04547K72482l64318J17252J001034j36550m31696k64344
$$ -342507 -417480 -854516 -449969 -177487 -541805 -424553 576481 439931 8235 -256109
9888b56109O11624L19204r80702L10988N38558J70549J9868N47435k9434q45155
$$ -256109 355515 674719 -305983 5005 543563 714112 733980 1281415 1251981 406826
9878D06826M75921m57273j150454m14073N41054O76050k42684K89958P74635j0309
$$ 406826 882747 425474 -724980 -1139053 -597999 78051 -164633 125325 899960 889651
9868H89651j127603M46357o59269j89540l90124O29466k77365p34288J006250
$$ 889651 -237952 208405 -450864 -640404 -1030528 -401062 -678427 -1412715 -406465
9859d06465K34530N48414m64461k44596K3895L70356L68722P0894j105079n09193
$$ -406465 -171935 376479 -87982 -332578 -308683 61673 430395 501289 -603790 -1112983
9849a112983P98869K80639p5674K94187Q7506o1705m6700j08388q83137n39538
$$ -1112983 -314114 -33475 -109149 185038 272544 210839 164139 55751 -827386 -1366924
9839a366924Q86681m61081J69451N29555k12042J88197K1074O56702K7791j76962
$$ -1366924 -480243 -941324 -771873 -242318 -454360 -266163 -245089 411613 439404 262442
9829B62442l3703K30583o30728m71211o16787M87371N84367K73348n8299j12410
$$ 262442 228739 459322 -171406 -642617 -1259404 -772033 -187666 85682 27383 -85027
9819h5027L36514o68943j188705Q91924L68080K0213j4512k43711N00598P33585
$$ -85027 251487 -417456 -1606161 -714237 -346157 -325944 -340456 -584167 -83569 650016
9809F50016l17396M40595m20203l37610M47327J9831n35779n89551k28244r1463
$$ 650016 332620 773215 353012 15402 462729 482560 -53219 -642770 -871014 -962477
9799i62477P72875J72090J42053L03790p1766k40820L47972n58683p32818K06755
$$ -962477 -189602 -17512 124541 428331 356565 115745 463717 -94966 -827784 -621029
9789f21029Q36423K83343O69471p35400p18800n3866Q5906n682j915J5566R3289
$$ -621029 215394 498737 1168208 432808 -285992 -339858 -253952 -259634 -261549 -245983 -152694
9778a52694l46968O83N95585J28140n8489o5664p02761O52876L35595N44288J61864
$$ -152694 -499662 -498979 96606 224746 166257 100593 -602168 50708 386303 930591 1092455
9767A092455p40388m16289J62980j65645l07195j87209L45666K23629L00813m70951
$$ 1092455 352067 -64222 98758 -66887 -374082 -561291 -215625 8004 308817 -162134
9757a62134L45336M83723n96634j114857j47457Q10308l16874N74082J95224N79834
$$ -162134 183202 666925 70291 -1044566 -1192023 -381715 -698589 -124507 70717 650551
9747F50551p33069m41584K95975q92486M9749O68491L89609m09070L15321N89349
$$ 650551 -82518 -524102 -228127 -1120613 -1070864 -402373 -12764 -421834 -106513 482836
9737D82836N00824L01758m80214l36829p768M37875n66215k5903o22059o17702
$$ 482836 983660 1285418 805204 468375 460607 898482 332267 306364 -315695 -933397
9727i33397J386012L14564p39837M69312l12516M35462p67947m43659J095231
$$ -933397 452615 767179 27342 496654 184138 619600 -148347 -592006 503225
9718E03225j297691k06221J018671L3738Q43163k39862P6632l30329p26722l71697
$$ 503225 -794466 -1000687 17984 51722 894885 655023 731655 401326 -325396 -697093
9708f97093O8304K37179K80107k96911j7983P57400m31231k70856r83969P35949
$$ -697093 -628789 -391610 -111503 -408414 -426397 331003 -100228 -371084 -1355053 -619104
9698f19104O19853o19951P63962n27488M20793M82866l81636K42015J56701n77108
$$ -619104 749 -619202 144760 -382728 38065 520931 139295 381310 538011 -39097
9688c9097m88165K03887O10809K23429O4880l57186j78573L41844l20781O09795
$$ -39097 -527262 -323375 287434 510863 575743 218557 39984 381828 61047 670842
9678F70842m70853l21173M58646J55044n081n94J060072J74909o54777K16170
$$ 670842 199989 -121184 337462 492506 487425 486831 1546903 1721812 1067035 1283205
9668A283205j44120n92016J7062Q18658K1979o19262o92P18637p4966k52368l42168
$$ 1283205 1139085 547069 564131 1382789 1404768 785506 784814 1503451 1428485 1176117 833949
9657H33949l32645j90699O1560R16416O73711r6830K21840k36592k14827O86880
$$ 833949 501304 310605 372165 1288581 1962292 1865462 2087302 1850710 1635883 2322763
9647B322763o3666P20662J357081P69361M0091K32364P88125J222786K290134
$$ 2322763 2259097 2979759 4336840 5106201 5146292 5378656 6166781 7389567 9679701
9638I679701J835913J227291Q91787j508137k846516k773681j478754j69545k97529
$$ 9679701 11515614 12742905 13634692 12126555 9280039 6506358 5027604 4858059 4560530
9629D560530m52742k130648L48271k54959o48192J11729N70596j04054j070168
$$ 4560530 4107788 1977140 2325411 2070452 1422260 1533989 2104585 2000531 930363
9620I30363k16807l57058J90499l46147K62419N98173K24951m54926p08803j4847
$$ 930363 713556 356498 546997 200850 463269 1061442 1286393 831467 122664 107817
9610A07817O66689J82439k36707m06258J09171J24939M29882Q4302j6399r57825
$$ 107817 774506 956945 720238 313980 423151 548090 977972 1062274 1045875 88050
9600H8050j507N90520P1669o58363k02245M03837O993K32363L88253k05072m15073
$$ 88050 86543 677063 748732 90369 -111876 291961 298954 531317 919570 714498 299425
9589B99425k9719k95842P42237m81475p00635r3342P49739N22212n71406o81840
$$ 299425 269706 -26136 716101 234626 -466009 -559351 190388 712600 141194 -540646
9579e40646L25738m43864J75287l1141J3505J41567M00390K66334k99481J88192
$$ -540646 -214908 -658772 -483485 -514626 -501121 -359554 40836 307170 7689 195881
9569A95881l84711M2965P77241k3377J14356J7974j48828n94930o97210L37781
$$ 195881 -188830 -145865 631376 607999 722355 740329 591501 -3429 -700639 -362858
9559c62858L49156P40659J80j276870L57295N71156l01411J32084j88625J156070
$$ -362858 -13702 726957 727137 -549733 -192438 378718 77307 209391 20766 1176836
9549A176836m9382j94822j31459o00854m05106J3122O27796J020440r61434q400
$$ 1176836 1127454 932632 801173 200319 -204787 -191665 436131 1456571 495137 486737
9539D86737L26738j45624m27825l74392K93929M8091o72452n50450N85085J61030
$$ 486737 813475 667851 240026 -134366 159563 207654 -464798 -1015248 -430163 -269133
9529b69133r5846O77726Q4117L90539l7126l81252J76127k69276J1673k80516
$$ -269133 -364979 312747 396864 787403 750277 369025 545152 275876 287549 7033
9519G033L69750j21588N39826q16454j99306L05221O73941k58499p20447N86719
$$ 7033 376783 255195 795021 -21433 -220739 84482 758423 499924 -220523 366196
9509C66196n30695N78684j1286K01887O2022l84540n20650r834j65410k49855
$$ 366196 -164499 414185 402899 604786 666808 282268 -238382 -248216 -413626 -663481
9499f63481j57325j25857P31762M37269m88254K05176J03576K61561K18513p43699
$$ -663481 -820806 -946663 -214901 222368 -265886 -60710 42866 304427 522940 -220759
9489b20759K76651M31057O3150j157224k91265O82452J031018L67630l46330J51194
$$ -220759 55892 486949 550099 -607125 -898390 -215938 815080 1182710 836380 987574
9479I87574j161643j04033L09623j79189P56578n11049m7245n04604l50905J086214
$$ 987574 -174069 -278102 31521 -147668 608910 97861 50616 -453988 -804893 281321
9469B81321N21749k45897o97381o0303j7103K80945o16179l36991Q43422O40166
$$ 281321 803070 557173 -140208 -200511 -217614 63331 -552848 -889839 -46417 593749
9459E93749J09315p9264n04160O065L49538m51234L18665J32447L96597m72336
$$ 593749 703064 623800 119640 125705 475243 24009 342674 475121 871718 399382
9449C99382r59103P24124M76448j5430l18418l4764p9700J81318J12829q61604
$$ 399382 -559721 164403 640851 625421 307003 272239 192539 373857 486686 -374918
9439c74918J061875M32628k84937q16861j82612j30241p75160L97308k3390P00426
$$ -374918 686957 1119585 834648 17787 -164825 -295066 -1070226 -672918 -696308 4118
9429D118N44219J17691j23217K2595P87057m31640n98924K79832J16178P1180
$$ 4118 548337 666028 542811 565406 1352463 920823 321899 601731 717909 789089
9419G89089m37579n36036K30741K99432J38428K08213P4343m52390J66577K67303
$$ 789089 351510 -184526 46215 345647 484075 692288 766631 314241 480818 748121
9409G48121m59822j80109m9015l45255M284K10305O18282K69989l31933o16337
$$ 748121 288299 108190 59175 -286080 -281796 -71491 546791 816780 484847 -131490
9399a31490j50673k85438J02897M97944O30765j71065j0367o65911L4765M51236
$$ -131490 -282163 -567601 -464704 33240 664005 492940 482573 -183338 -148573 302663
9389C02663n14602k91885p2548J48558Q64478m20295l64547n4120k35315J003530
$$ 302663 -211939 -503824 -576372 -427814 436664 16369 -348178 -402298 -637613 365917
9379C65917r3686k88761j5054N20129J18372j26261K1201K13556p93520P71493
$$ 365917 272231 -16530 -31584 488545 606917 480656 501857 715413 -78107 693386
9369F93386L14058k64895O5683k31118P04561M25170q27514q63519o54636Q64410
$$ 693386 1007444 742549 808232 577114 1281675 1706845 879331 15812 -638824 225586
9359B25586k67702K97277M65723l3114n747O06735k44601p56742J4410K7665L22198
$$ 225586 -42116 255161 720884 687770 682023 1288758 1044157 287415 301825 329490 651688
9348F51688K02141K34878o27874p19446m37687R71469K78616r53656K16815Q5463
$$ 651688 853829 1088707 460833 -258613 -696300 275169 553785 -399871 -183056 -97593
9338i7593p92775J034638n3351j85871O05732Q36844r13884n09315M36562j823816
$$ -97593 -890368 144270 90919 -94952 510780 1347624 433740 -75575 360987 -1462829
9328a462829O50210Q41798j23025O72482K4773l31622m46153O34516P65076j196195
$$ -1462829 -812619 29179 -93846 578636 603409 271787 -174366 460150 1225226 29031
9318B9031j34198L99366m69107k2214L15437M29473J96712j74170j94977J79196
$$ 29031 -105167 294199 -174908 -197122 118315 547788 744500 570330 375353 554549
9308E54549k02993L61498J60385J62084j41605l74308O711J11561M54785k35503
$$ 554549 351556 713054 873439 1035523 893918 519610 526321 637882 1092667 857164
9298H57164O07632n68724j046785N62687L87861O4876j028964O34572M11501m52847
$$ 857164 1464796 896072 -150713 411974 799835 864711 -164253 470319 881820 428973
9288D28973J82732L39736l867j21821k86204J74179R1576j99581n43697N07070
$$ 428973 611705 951441 947574 825753 539549 713728 805304 605723 62026 569096
9278E69096L47783m17745l42406j24996P05687k5074N1324L09056L53917P8441
$$ 569096 916879 499134 156728 31732 737419 712345 763669 1072725 1426642 1505083
9268A505083o04992l15667L64573l53763m85828M64816K94483L13959L83259l72568
$$ 1505083 900091 584424 948997 595234 109406 574222 868705 1182664 1565923 1193355
9258A193355L95958K53023K67641m01068m41831P4033N85558Q9763n76777p69235
$$ 1193355 1589313 1842336 2109977 1708909 1267078 1341111 1926669 2016432 1439655 670420
9248F70420j65868l25929N26506P00703L76009j7638k66160o68186j7974k47926
$$ 670420 504552 178623 705129 1405832 1781841 1764203 1498043 829857 811883 563957
9238E63957M9095P62763r2422Q12030m36402j095274k26402L47635N48248L89983
$$ 563957 613052 1375815 1283393 2095423 1659021 563747 337345 684980 1233228 1623211
9228A623211l65342o03464L08775Q72517R7329k85286J43778j16929N15232Q02849
$$ 1623211 1257869 654405 963180 1835697 1933026 1647740 1791518 1674589 2189821 2992670
9218B992670o35826j30967m61847k49486L59266p28984k85697Q20582M39679N77987
$$ 2992670 2356844 2225877 1764030 1514544 1873810 1144826 859129 1679711 2119390 2697377
9208B697377p76400m11573l63512L73333J93914j36687L81815K33061l64262l74144
$$ 2697377 1920977 1509404 1145892 1519225 1713139 1576452 1958267 2191328 1827066 1452922
9198A452922J067462M30796k11416j93283p63943L28752K18778L11537J52770
$$ 1452922 2520384 2951180 2739764 2546481 1782538 2111290 2330068 2641605 2794375
9189B794375j40056J446068M75073k98603r44070r92177P11844O97058o1222m1900
$$ 2794375 2654319 4100387 4575460 4276857 3332787 2340610 3052454 3749512 3688290 3646390
9179C646390j51572N84553N72792m04036r84757K77508K14547l040N65067j53506
$$ 3646390 3494818 4079371 4652163 4248127 3263370 3540878 3755425 3752385 4317452 4163946
9169D163946L52497K19423l3209J83844K04831J595777Q77103n58170M40149K94892
$$ 4163946 4516443 4735866 4702657 4886501 5091332 6687109 7564212 7006042 7446191 7741083
9159G741083P66854N396J253240P62936J264539Q05800O77915J653711M04480
$$ 7741083 8507937 8513333 9766573 10529509 11794048 12599848 13277763 14931474 15335954
9150A5335954R23183l0687l48188J59592J202062Q312L35187j199209n04836j181238
$$ 15335954 16259137 16228450 15880262 16039854 17241916 17250228 17585415 16386206 15881370 14700132
9140A4700132j300832l90546k84494p51322p19439n35098k43077M45976j75922
$$ 14700132 13399300 13008754 12724260 11972938 11253499 10718401 10475324 10921300 10745378
9131A0745378o23512j31664J66545k20110J173085J219575j43690p28246J032118
$$ 10745378 10121866 9990202 10156747 9936637 11109722 12329297 12185607 11457361 12489479
9122A2489479J300681R44142O25132O70093R74147Q31990J326541P93831J071242
$$ 12489479 13790160 14734302 15359434 16029527 17003674 17835664 19162205 19956036 21027278
9113B1027278L04026Q71464J135218R20640l28409o02715j85380j496231j738246
$$ 21027278 21331304 22202768 23337986 24258626 23930217 23327502 23142122 21645891 19907645
9104A9907645j538369j060688k05230j169695j341987j159459P24323N77443n51622
$$ 19907645 18369276 17308588 17103358 15933663 14591676 13432217 14156540 14733983 14182361
9095A4182361L10590N40727l21203J39435R13240O63076O98923R71847Q08406
$$ 14182361 14492951 15033678 14712475 14851910 15765150 16428226 17127149 18098996 18907402
9086A8907402Q97928J697777Q18269J369116K221779R52500N01125N95489N30560
$$ 18907402 19805330 21503107 22321376 23690492 25912271 26864771 27365896 27961385 28491945
9077B8491945Q75213J421164L27840k167246j330551k059468j859967j007443
$$ 28491945 29367158 30788322 31116162 28948916 27618365 25558897 23698930 22691487
9069B2691487j007610j230757j263907j511564L9087n71107j9667j568958r86955
$$ 22691487 21683877 20453120 19189213 17677649 17716736 17145629 17125962 15557004 14570049
9060A4570049L55685J408287K93363L06646J315211J48467L25092J617697J255391
$$ 14570049 14925734 16334021 16627384 16934030 18249241 18397708 18722800 20340497 21595888
9051B1595888J315376J736586K112381J455912O96741J003580J565394J778119
$$ 21595888 22911264 24647850 26760231 28216143 28912884 29916464 31481858 33259977
9043C3259977J865223J238367K82434O29546m74051m97469k132628k406591l374123
$$ 33259977 35125200 36363567 36646001 37275547 36801496 36304027 34171399 31764808 28390685
9034B8390685l713791k917895k841827j541006j611778j598693p30600p87914
$$ 28390685 24676894 21758999 18917172 17376166 15764388 14165695 13435095 12647181
9026A2647181j5308j281569o02243k83421m40000l14839j231135k77830n95198
$$ 12647181 12631873 11350304 10748061 10464640 10024640 9709801 8478666 8200836 7605638
9017G605638n65529L32816n22592m5368K70415q8016L11026j163013k72963J139145
$$ 7605638 7040109 7372925 6850333 6804965 7075380 6987364 7298390 6135377 5862414 7001559
9007G001559o45275l32160J92067o60973j22664j08703L44380P43558n37883p52664
$$ 7001559 6356284 6024124 6216191 5555218 5432554 5323851 5668231 6411789 5873906 5121242
8997E121242j108225O8059L0937j49432k74952K87307k8382R46921k55564n44039
$$ 5121242 4013017 4081076 4112013 3962581 3687629 3974936 3946554 4893475 4637911 4093872
8987D093872N28520o24619p25293O87635p45875l53984r5427K01534O97062o40922
$$ 4093872 4622392 3997773 3272480 3960115 3214240 2860256 2764829 2966363 3663425 3022503
8977C022503K29825M51616P13572n34157m89509M59054R28986m32407l17895j23873
$$ 3022503 3252328 3703944 4417516 3883359 3393850 3852904 4781890 4349483 4031588 3907715
8967C907715n95931J88013j82491J47685Q18020L35357N15778q46831K5309K49624
$$ 3907715 3311784 3499797 3317306 3464991 4283011 4618368 5134146 4287315 4312624 4562248
8957D562248p4070k12867R09586k57971o18818K3011K65466j08521m99044Q728
$$ 4562248 4488178 4275311 5184897 4926926 4308108 4331119 4596585 4488064 3989020 3997748
8947C997748J74411L19134N68097j12002K35050N11560m89381j53511P9259O7259
$$ 3997748 4172159 4491293 5059390 4947388 5182438 5693998 5204617 5051106 5130365 5197624
8937E197624L16483J76637k92500l6245O4810J30655J47173L51811M94172j99662
$$ 5197624 5514107 5690744 5398244 5361999 5426809 5557464 5704637 6056448 6550620 6350958
8927F350958n032K04458K13583O63885L1379m01193o65869J244440L2708P08225
$$ 6350958 6345926 6550384 6763967 7427852 7459231 7058038 6392169 7636609 7669317 8377542
8917H377542m73082K6108Q42593O2771K76716n36105J95725J908482P34251P45233
$$ 8377542 7904460 7930568 8773161 8835932 9112648 8576543 8772268 10680750 11415001 12160234
8907A2160234J090509Q00397p9457O57904J387955J091119J456864J298430J076729
$$ 12160234 13250743 14051140 13971683 14629587 16017542 17108661 18565525 19863955 20940684
8898B0940684K754083J937481J920690Q71143P34938L40424l33336J19689j196440
$$ 20940684 23694767 25632248 27552938 28424081 29159019 29499443 29166107 29285796 28089356
8889B8089356k222204k288089n14598o40841l62707p85800O09483j043127j067713
$$ 28089356 25867152 23579063 23064465 22423624 22060917 21275117 21884600 20841473 19773760
8880A9773760L87321J90526k0417m3748N0908L95274J751945P56776O53642J438921
$$ 19773760 20161081 20351607 20331190 20287442 20338350 20733624 22485569 23242345 23895987 25334908
8870B5334908J553523J701536J733694K379740J780563K799210L968918L278620
$$ 25334908 26888431 28589967 30323661 32703401 34483964 37283174 41252092 44530712
8862D4530712L399144K969433Q26177P29823q60395k500076l584809k408227k320126
$$ 44530712 47929856 50899289 51725466 52455289 51594894 49094818 45510009 43101782 40781656
8853D0781656k260594k332233l270159j961534j415745k536850k118389j009168
$$ 40781656 38521062 36188829 32918670 30957136 29541391 27004541 24886152 23876984
8845B3876984j323583j176743l75224j848082m29634o90114J68602J083515Q59322
$$ 23876984 22553401 21376658 21001434 19153352 18723718 18033604 18202206 19285721 20145043
8836B0145043n97851P12656P90717J519338J114932J190248J634329O36029O60516
$$ 20145043 19547192 20259848 21050565 22569903 23684835 24875083 26509412 27145441 27805957
8827B7805957O78726J313046K216107J406025K80690m99337k076719k575776l249933
$$ 27805957 28484683 29797729 32013836 33419861 33700551 33201214 31124495 28548719 25298786
8818B5298786k789634k006205j162753j466543r91641k73285j303931o50244q31979
$$ 25298786 22509152 20502947 19340194 17873651 16882010 16608725 15304794 14654550 13822571
8809A3822571j596223j199275p90102O07156n21913j641248o90893N68695k91879
$$ 13822571 12226348 11027073 10236971 10844127 10322214 8680966 7990073 8558768 8266889
8800H266889l39591O11432j63589o17937k75175n34821j41457m16208j41751o5729
$$ 8266889 7927298 8538730 8375141 7757204 7482029 6947208 6805751 6389543 6247792 6182063
8790F182063L70154q78681L24986J10179J35086n41684N48146Q01712K15688m10744
$$ 6182063 6552217 5673536 5998522 6108701 6243787 5702103 6250249 7051961 7267649 6856905
8780F856905j23969o75464L91036j90484m04235L17152M59394n43465J05591O33190
$$ 6856905 6732936 6057472 6448508 6258024 5853789 6170941 6630335 6086870 6192461 6825651
8770F825651O8199L262N83570K414m63499j34059m11360k85033K42628M33460
$$ 6825651 6893850 6897112 7480682 7483096 7019597 6885538 6474178 6189145 6431773 6865233
8760F865233N37225n58085K44235j30295Q20606O48839J2951J061636M92909o5741
$$ 6865233 7402458 6844373 7088608 6958313 7778919 8427758 8440709 9502345 9995254 9929513
8750I929513J506460J172663R62871J522566J261316J547633K57592J395250J020679
$$ 9929513 11435973 12608636 13571507 15094073 16355389 17903022 18160614 19555864 20576543
8741B0576543J608817J642013J004490q83239k401748j706968q21297j68387j96582
$$ 20576543 22185360 23827373 24831863 23948624 21546876 19839908 19018611 18850224 18653642
8732A8653642j510475j137646j214039j656537k51738j47795m56885K44231j427399
$$ 18653642 17143167 16005521 14791482 13134945 12883207 12735412 12278527 12522758 11095359
8723A1095359R13927M54535l36827M21010J646907J022409Q40153O48912Q81613
$$ 11095359 12009286 12463821 12126994 12548004 14194911 15217320 16057473 16706385 17587998
8714A7587998k43224k61666R50372J921754K836027J435856J328618J032898L03418
$$ 17587998 17344774 17083108 18033480 19955234 22791261 24227117 25555735 26588633 26892051
8705B6892051N5939q30803j812668l191128k218974j789631j433655n46889l67050
$$ 26892051 26947990 26117187 24304519 21113391 18894417 17104786 15671131 15124242 14757192
8696A4757192q20329k15323j292967n19389n68480p63785J12995n58255q80332
$$ 14757192 13936863 13721540 12428573 11909184 11340704 10576919 10689914 10131659 9251327
8687I251327j49985k03543q0306P70391O77023L71543m863M85400K50167K07322
$$ 9251327 9101342 8897799 8817493 9587884 10264907 10636450 10631587 11116987 11367154 11574476
8677A1574476L37533O6826K95278J58376q2189r01580q23196l95071k62362j60101
$$ 11574476 11912009 11978835 12274113 12432489 12350300 11448720 10625524 10230453 9968091 9807990
8667I807990j321764o71410n23209M67810n61892m80098n74949k42471p99189
$$ 9807990 8486226 7814816 7291607 7759417 7197525 6717427 6142478 5900007 5100818
8658E100818k1821J94163k10746m33069q00546M10708J5227k61963J38662J13825
$$ 5100818 5078997 5273160 5062414 4629345 3828799 4239507 4254734 3992771 4131433 4245258
8648D245258l02386K01777o54785k62292P44687l31291J60341J9232o09581n57006
$$ 4245258 3942872 4144649 3489864 3227572 3972259 3640968 3801309 3820541 3210960 2653954
8638B653954O84972j13837p63101L22812O93807j19654q07461m28943O21982Q18378
$$ 2653954 3338926 3225089 2461988 2784800 3478607 3358953 2551492 2122549 2744531 3562909
8628C562909J77376q96292J26663L99463l05239K46152M04663K1237l98535j8040
$$ 3562909 3740285 2843993 2970656 3370119 3064880 3311032 3715695 3736932 3338397 3320357
8618C320357q0397N91247R4944n21208m12533j79998o51064k74097l8313J7318
$$ 3320357 3239960 3831207 3926151 3404943 2992410 2812412 2161348 1887251 1848938 1866256
8608A866256K82476K79914l24503m78571J37526L63636l83815P4099L84646J59709
$$ 1866256 2148732 2428646 2104143 1625572 1763098 2126734 1742919 1817018 2201664 2361373
8598B361373n39857j72203M27144N16148k78787n39515J84880K54109j11008Q96770
$$ 2361373 1821516 1649313 2076457 2592605 2313818 1774303 1959183 2213292 2102284 2999054
8588B999054N14182m80571l25572k09216j34387J77438J23161m83415K95234j81785
$$ 2999054 3513236 3032665 2707093 2497877 2363490 2540928 2664089 2180674 2475908 2294123
8578B294123M97712n03036k82243j11492L67494M41681K1541M2615m3588q20691
$$ 2294123 2791835 2288799 2006556 1895064 2262558 2704239 2725780 2768395 2724807 1904116
8568A904116P22083N17256j10273l9762n55229j43989k33583K94060n10113n36650
$$ 1904116 2626199 3143455 3033182 2993420 2438191 2294202 2060619 2354679 1844566 1307916
8558A307916J147700J47220k18332r35722N10176O14949k05699m53072L2996p2554
$$ 1307916 2455616 2602836 2384504 1448782 1958958 2573907 2368208 1915136 1948132 1875578
8548A875578j72773K53013K72514k54267m94099O0449N87850L41976J50290k61196
$$ 1875578 1702805 1955818 2228332 1974065 1479966 1540415 2128265 2470241 2620531 2359335
8538B359335L93151J66574o82301N90086o32503N28652k18683k40145q87802R89887
$$ 2359335 2752486 2919060 2236759 2826845 2194342 2722994 2504311 2264166 1376364 2366251
8528B366251m33812m88338Q92021J33843k9662J027056k53112j046016j75451
$$ 2366251 1932439 1444101 2336122 2469965 2440303 3467359 3214247 2168231 1992780
8519A992780m55082k3736J90753R75405O12758j17362p07878K09072r45028L86656
$$ 1992780 1537698 1513962 1704715 2680120 3292878 3175516 2467638 2676710 1731682 2118338
8509B118338Q00265K36105l68279n60022R3868o3315O48483j37731J236625j028484
$$ 2118338 2918603 3154708 2786429 2226407 2320275 2256960 2905443 2767712 4004337 2975853
8499B975853m0581J34507L99656P9674K31564k17526o24391N68131j45882L61769
$$ 2975853 2935272 3069779 3469435 3549109 3780673 3563147 2938756 3506887 3361005 3722774
8489C722774P26564J813q9167j68059l31244l8989j235k57127m13014j82315n39788
$$ 3722774 4449338 4451151 4361984 4193925 3862681 3823692 3822457 3565330 3152316 2970001 2430213
8478B430213Q99558L61943K41165M98110j55661o64889m50173m85352O31974M24341
$$ 2430213 3329771 3691714 3932879 4430989 4275328 3610439 3160266 2674914 3306888 3731229
8468C731229L99374l48886m77371o69215J19157K89764K45034L68752k64218j15633
$$ 3731229 4130603 3781717 3304346 2635131 2754288 3044052 3289086 3657838 3393620 3277987
8458C277987N49925m66693l00925L00009J59514L45176l00560L52222J96644N48695
$$ 3277987 3827912 3361219 3060294 3360303 3519817 3864993 3564433 3916655 4113299 4661994
8448D661994p47694l16810K57750p9048l40580l82444N22522J160407K05425n53322
$$ 4661994 3914300 3597490 3855240 3776192 3435612 3053168 3575690 4736097 4941522 4388200
8438D388200q076o48593N27286M14328K93610k38969k10483j54276l00880N75422
$$ 4388200 4380124 3731531 4258817 4673145 4966755 4727786 4517303 4363027 4062147 4637569
8428D637569K24133l4794k48925k5029l59142m56259O81667N4581n51621Q36009
$$ 4637569 4861702 4826908 4577983 4552954 4193812 3737553 4419220 4473801 3922180 4758189
8418D758189q10957N53971l58830n968O50744j43771l11024O73862O78121k59665
$$ 4758189 3947232 4501203 4142373 4136405 4787149 4643378 4332354 5006216 5684337 5424672
8408E424672L09559O9657J96241K49027o31339K10495J13420p09884Q25674n89825
$$ 5424672 5734231 5803888 6000129 6249156 5617817 5828312 5941732 5231848 6057522 5467697
8398E467697p0588L9360M48579k54603n38839M87171L11M25588J07634K94605
$$ 5467697 5397109 5436469 5885048 5630445 5091606 5578777 5579088 6004676 6112310 6406915
8388F406915M78212m08400j42488J225468N8882p28432K4103r40428L40443j526
$$ 6406915 6885127 6476727 6334239 7559707 7618589 6890157 6914260 5973832 6314275 6312749
8378F312749Q39222l70767O41915M0027o17361l64111l77010j38596O27284J47226
$$ 6312749 7151971 6781204 7423119 7463146 6845785 6481674 6104664 5966068 6593352 6740578
8368F740578L19188j043002K10854O38363N68593o21936k29284N13936m09114
$$ 6740578 7059766 6016764 6227618 6865981 7434574 6812638 6583354 7097290 6688176
8359F688176J20841J90631q7452n76451O38921J28749l71299k3680Q52153n66214
$$ 6688176 6809017 6999648 6912196 6335745 6974666 7103415 6732116 6708436 7560589 6994375
8349F994375l61992L88747J354995l79210p51936M1198O85417M0724r04712K52812
$$ 6994375 6632383 7021130 8376125 7996915 7244979 7286177 7971594 8012318 7107606 7360418
8339G360418K11805K8087J39863k82170K01734k03722R08620L7455P52191q71684
$$ 7360418 7572223 7600310 7740173 7458003 7659737 7456015 8364635 8402090 9154281 8282597
8329H282597K82873k60639J3704l8305J8789r3085q13572P31507J037661K449
$$ 8282597 8565470 8304831 8318535 8280230 8299019 8205934 7392362 8123869 9161530 9163979
8319I163979q10084Q98513l2122n65832L67010k23581j86359n7541N32098O7228
$$ 9163979 8353895 9252408 9220286 8654454 9021464 8797883 8611524 8553983 9086081 9153309
8309I153309p98403Q7533N92646J140795M00932q36887m9826j8805k97444J68143
$$ 9153309 8354906 8442439 9035085 10175880 10576812 9739925 9690099 9671294 9373850 9541993
8299I541993L31350n23085Q65653k81353L21398M17572j62311l68431N68913N90079
$$ 9541993 9873343 9350258 10215911 9934558 10255956 10673528 10511217 10142786 10711699 11301778
8289A1301778J29634N87293j22044M62984j72495K99382k152r16621M9037Q24434
$$ 11301778 11431412 12018705 11896661 12359645 12187150 12486532 12484380 11567759 11616796 12441230
8279A2441230n99423k70508M499J290179o72756j63718l37886Q59132o35168L5841
$$ 12441230 11841807 11571299 11575798 12865977 12193221 12029503 11691617 12550749 11915581 11951422
8269A1951422K75732j001269N90930O12362j12785M15969l43468k4777Q54378
$$ 11951422 12227154 11225885 11816815 12429177 12316392 12732361 12388893 12364116 13218494
8260A3218494K5293K58383M09582K65322m55292O11319J51712q87333J81888N49476
$$ 13218494 13243787 13502170 13911752 14177074 13721782 14333101 14484813 13597480 13779368 14328844
8250A4328844K38818k61802Q30201L24905o861M48710n41847p70080Q31593l02202
$$ 14328844 14567662 14305860 15136061 15460966 15454105 15902815 15360968 14590888 15422481 15120279
8240A5120279k13208P35784N26701M17320j5977N11783m25120Q25124o71886l66565
$$ 15120279 14907071 15642855 16169556 16586876 16570899 17082682 16657562 17482686 16810800 16444235
8230A6444235Q21368L6706r4737P34582P0662R71431O09794j139245R54380O1081
$$ 16444235 17265603 17302309 17207572 17942154 18012816 18984247 19594041 18454796 19409176 19470257
8220A9470257k98284P45708o14090k09840L76894J30897R30801K46540m56934
$$ 19470257 19171973 19917681 19303591 19093751 19470645 19601542 20532343 20778883 20321949
8211B0321949m85586N64844R89155k68189K57027J046066Q66357l60663N4966
$$ 20321949 19836363 20401207 21390362 21122173 21379200 22425266 23291623 22930960 22985926
8202B2985926K75491M8503N2577O28108m85281k85154J030769N28430m01428K282326
$$ 22985926 23261417 23309920 23362497 23990605 23505324 23220170 24250939 24779369 24377941 26660267
8192B6660267j013451j621811K95041l19214R13655Q45596P8503n01280P67402
$$ 26660267 25646816 24025005 24320046 24000832 24914487 25760083 25838586 25337306 26104708
8183B6104708l73418L50933M20198J551422Q84711J215237l4050m51010m9353
$$ 26104708 25731290 26082223 26502421 28053843 28938554 30153791 30119741 29668731 29619378
8174B9619378m83204P79104R19028j129714P65412J051810O61226O90508N11896
$$ 29619378 29136174 29915278 30834306 29704592 30470004 31521814 32183040 32873548 33385444
8165C3385444P06687m49891J23794P36432J32375Q74446J050594k93578J98642
$$ 33385444 34092131 33642240 33766034 34502466 34634841 35509287 36559881 36266303 36464945
8156C6464945J168627N04329O00287R58088P50862r0552K65373R55583k09576
$$ 36464945 37633572 38137901 38738188 39696276 40447138 40356586 40621959 41577542 41367966
8147D1367966P09474K86789J329118J017947K91392R09130j7192Q36953M59633
$$ 41367966 42077440 42364229 43693347 44711294 45002686 45911816 45894624 46731577 47191210
8138D7191210Q38010K143640Q9368J41809O92600R67296N34836J268241K72089
$$ 47191210 48029220 50172860 50262228 50404037 51096637 52063933 52598769 53867010 54139099
8129E4139099J325380K245528L43223J369484J513562L26867J107908J529186
$$ 54139099 55464479 57710007 58053230 59422714 60936276 61263143 62371051 63900237
8121F3900237J478243J789996Q18952P79303K133894J177824P77725J394105J714136
$$ 63900237 65378480 67168476 67987428 68766731 70900625 72078449 72856174 74250279 75964415
8112G5964415J834373J793274K660999J969262J725766J950312J218766K760918
$$ 75964415 77798788 79592062 82253061 84222323 85948089 87898401 89117167 91878085
8104I1878085J600713K426196K916867J574564K043836J932235L042634K635577
$$ 91878085 93478798 95904994 98821861 100396425 102440261 104372496 107415130 110050707
8096A10050707K048906K613188L356079L454144K862750K280224K936018L989293
$$ 110050707 112099613 114712801 118068880 121523024 124385774 126665998 129602016 133591309
8088A33591309L242027L234910K603604L530168L789258K931114M209855M335170
$$ 133591309 136833336 140068246 142671850 146202018 149991276 152922390 157132245 161467415
8080A61467415L105248M115414L844322M174500L906993L362368M496782L325303
$$ 161467415 164572663 168688077 172532399 176706899 180613892 183976260 188473042 191798345
8072A91798345L096814L449858L845154M851796L455186L610785L785631L800996
$$ 191798345 194895159 198345017 202190171 207041967 210497153 214107938 217893569 221694565
8064B21694565K922597L985765L723507L662334L658146K817411M016889L146398
$$ 221694565 224617162 228602927 232326434 235988768 239646914 242464325 246481214 249627612
8056B49627612K706500K635896L287358K698821K280801K155764K794668J648598
$$ 249627612 252334112 254970008 258257366 260956187 263236988 265392752 268187420 269836018
8048B69836018J964251K366510K166537R06297J660270J337803R09683J178641
$$ 269836018 271800269 274166779 276333316 277239613 278899883 280237686 281147369 282326010
8040B82326010J114955Q63474P787J26366J75705R21261m2108q85344K29678k58528
$$ 282326010 283440965 284304439 284312226 284438592 284614297 285535558 285493450 284608106 284837784 284579256
8030B84579256j97283Q2998k43659j302794N59038p34638n67914j68643K45182
$$ 284579256 284381973 284464971 284221312 282918518 283477556 282742918 282175004 282006361 282251543
8021B82251543K82683j10956l51257p38390J72217m01707l55292O31125j56893
$$ 282251543 282534226 282423270 282072013 281333623 281505840 281104133 280748841 281379966 281223073
8012B81223073k01563K77785K66434K51353n8148j03612L50148L64983Q64656
$$ 281223073 281021510 281299295 281565729 281817082 281758934 281655322 282005470 282370453 283235109
8003B83235109M09488o1910J139758N30783L29603m35462J079454J593361M09477
$$ 283235109 283644597 283582687 284722445 285253228 285582831 285147369 286226823 287820184 288229661
7994B88229661j14372P53103K31501j4347N27559J199873O86298J60183M75900
$$ 288229661 288115289 288868392 289099893 289085546 289613105 290812978 291499276 291659459 292135359
7985B92135359Q96917N63029k6226n8245j51717j84707m57741M88730o24605p02234
$$ 292135359 293032276 293595305 293569079 293510834 293359117 293174410 292716669 293205399 292580794 291878560
7975B91878560j52414l50416p50973R2370N11083m79329q71165j078292R20858
$$ 291878560 291726146 291375730 290624757 290717127 291228210 290748881 289877716 288799424 289720282
7966B89720282j54979q53460n60091o69442n76980j80414o06259p0083L53873
$$ 289720282 289565303 288711843 288151752 287482310 286905330 286724916 286118657 286048574 286402447
7957B86402447p05552k05828o24929P6611l52902K27293q61111k1956Q60251l13790
$$ 286402447 285696895 285491067 284866138 284942749 284589847 284817140 283956029 283934073 284794324 284480534
7947B84480534l49885k66639J62861n28481k25266n60607m51891q27881J46321
$$ 284480534 284130649 283864010 284026871 283498390 283273124 282712517 282260626 281432745 281579066
7938B81579066m70301k97557N98309M63283l31217L50217l32056k17772j17777
$$ 281579066 281108765 280811208 281409517 281872800 281541583 281891800 281559744 281341972 281224195
7929B81224195P85401L14436q71491n11062m71226O75891J92961l22850J15937
$$ 281224195 282009596 282324032 281452541 280941479 280470253 281146144 281339105 281016255 281132192
7920B81132192r78613k3768n815m20912j69391l08284K95030j192818o69090M23077
$$ 281132192 280153579 280129811 280123996 279703084 279533693 279225409 279520439 278327621 277658531 278081608
7910B78081608j078316L9567m83096q72297n54224j498532l86332k34659j481938
$$ 278081608 277003292 277042859 276559763 275687466 275133242 273634710 273248378 273013719 271531781
7901B71531781p95153m72398j504351m55336j164358j143052o57637j423438j630730
$$ 271531781 270736628 270264230 268759879 268304543 267140185 265997133 265339496 263916058 262285328
7892B62285328p22668j663394q23875r48089j544690j035739j097683j033806
$$ 262285328 261562660 259899266 259075391 258127302 256582612 255546873 254449190 253415384
7884B53415384q78392n82511j386346o93519j244242k2742j157253m55492j63272
$$ 253415384 252536992 251954481 250568135 249874616 248630374 248607632 247450379 246994887 246831615
7875B46831615j435537m52347k74133q27543j497278N16840j35702q82406r23410
$$ 246831615 245396078 244943731 244669598 243842055 242344777 242861617 242725915 241843509 240920099
7866B40920099l63527L06866o96502o66963M7660p73930L82996k19741n92233
$$ 240920099 240556572 240863438 240166936 239499973 239547633 238773703 239156699 238936958 238344725
7857B38344725m0744P76245L96575j071601k56786q5239l9234K18103R14345m10766
$$ 238344725 238303981 239080226 239476801 238405200 238148414 238063175 238023941 238242044 239156389 238745623
7847B38745623M70860M53992M28306N11976r4285N27445M59567j63436R5535J548859
$$ 238745623 239216483 239670475 240098781 240610757 240516472 241043917 241503484 241340048 241435583 242984442
7837B42984442J231962r08871l50260O87240R88500R79839R2614R43912l84535
$$ 242984442 244216404 243307533 242957273 243644513 244633013 245612852 245705466 246649378 246264843
7828B46264843L42874M79600o64298O21730L63097M43725N79186K72702N52227
$$ 246264843 246607717 247087317 246423019 247044749 247407846 247851571 248430757 248703459 249255686
7819B49255686O43069J160221n03409j08850n02418N78275N7362L17586l49242
$$ 249255686 249898755 251058976 250555567 250446717 249944299 250522574 250579936 250897522 250548280
7810B50548280L901878J491163j255779k02429m95894N17594l39728l72001M77200
$$ 250548280 254450158 255941321 254685542 254483113 253987219 254504813 254165085 253793084 254270284
7801B54270284j79364K05239M17983R2261L6478k50934k25124k00843R4983M03995
$$ 254270284 254090920 254296159 254714142 254806403 254842881 254591947 254366823 254165980 254260963 254664958
7791B54664958o30885j345110M05543O19954J259020k90487l34394p68000Q33185
$$ 254664958 254034073 252688963 253094506 253714460 254973480 254682993 254348599 253580599 254413784
7782B54413784L55959O82419J44578L76758O69612N5217M05953J362138O31921
$$ 254413784 254769743 255452162 255596740 255973498 256643110 256698327 257104280 258466418 259098339
7773B59098339J258319J477705m1751J390708J218463Q71450N70994K024270K607767
$$ 259098339 260356658 261834363 261792612 263183320 264401783 265273233 265844227 267868497 270476264
7764B70476264J470147J618720J872896J475415J124852J719753J454498K121142
$$ 270476264 271946411 273565131 275438027 276913442 278038294 279758047 281212545 283333687
7756B83333687J402208J827832J871991J511295J425269J291273J489698K227645
$$ 283333687 284735895 286563727 288435718 289947013 291372282 292663555 294153253 296380898
7748B96380898J002693J660762J289413Q62656J676664J315030J659547J176273
$$ 296380898 297383591 299044353 300333766 301196422 302873086 304188116 305847663 307023936
7740C07023936O82841J058670J520106J097172r9375R13967J317842M50137R36507
$$ 307023936 307706777 308765447 310285553 311382725 311283350 312197317 313515159 313965296 314901803
7731C14901803R15847R17545j5333L96443j61229M50878L46253o98136k79680
$$ 314901803 315817650 316735195 316719862 317116305 316955076 317405954 317752207 317054071 316774391
7722C16774391n80005o31849j646477j050704r09817q93079j983785j690785k398163
$$ 316774391 316194386 315562537 313916060 312865356 311955539 311062460 309078675 307387890 304989727
7713C04989727k837112k761294l385411l381565l939146l176456l339228m237692
$$ 304989727 302152615 299391321 296005910 292624345 288685199 285508743 282169515 277931823
7705B77931823n668355m385233m118644m205796m482141m559666m326306m887047
$$ 277931823 272263468 267878235 263759591 259553795 255071654 250511988 246185682 241298635
7697B41298635m762067m957932m601823m151293m204155m992218m228385m026447
$$ 241298635 236536568 231578636 226976813 222825520 218621365 213629147 209400762 205374315
7689B05374315m140573m259618m477558l253332l065152k974433m924031m249409
$$ 205374315 201233742 196974124 192496566 189243234 186178082 183203649 178279618 174030209
7681A74030209l877889k365689l671734l507164l099809l270370k802039l289160
$$ 174030209 170152320 167786631 164114897 160607733 157507924 154237554 151435515 148146355
7673A48146355k015110l021493k374850k728692k259119k815756l220987k788276
$$ 148146355 146131245 143109752 140734902 138006210 135747091 132931335 129710348 126922072
7665A26922072k105102j925094k760114k198429j571574k478775l156491j577611
$$ 126922072 124816970 122891876 120131762 117933333 116361759 113882984 110726493 109148882
7657A09148882j423513j713441j857618j742502j587870j599892k708195j471560
$$ 109148882 107725369 106011928 104154310 102411808 100823938 99224046 96515851 95044291
7649I5044291j505548j488605k097009j303787p73044j131749k044792k420735
$$ 95044291 93538743 92050138 89953129 88649342 87876298 86744549 84699757 82279022
7641H2279022k141511j095700q15058j357386p80269j609261j345451j287517
$$ 82279022 80137511 79041811 78226753 76869367 76089098 74479837 73134386 71846869
7633G1846869j786810j957450o50115p21432j065654j842688q74257r21471r47312
$$ 71846869 70060059 68102609 67452494 66731062 65665408 63822720 62948463 62026992 61079680
7624F1079680j711873j017468j35216j312694r35696j458749j513295m34023l26672
$$ 61079680 59367807 58350339 58215123 56902429 55966733 54507984 52994689 52560666 52233994
7615E2233994m73681j372717o74921o54790l88317j800746m53362p39054m75014
$$ 52233994 51760313 50387596 49712675 49057885 48669568 46868822 46415460 45676406 45201392
7606D5201392j642539o71851L64006j171037j009560p37625p69948q78635m35883
$$ 45201392 43558853 42887002 43251008 42079971 41070411 40332786 39562838 38684203 38248320
7597C8248320m42785n73071o47631r2084q03325j319594n36118K57307p46588
$$ 38248320 37805535 37232464 36584833 36492749 35689424 34369830 33833712 34091019 33344431
7588C3344431R1915m43875l5404k28867j319251k92423M68220k86668j462873
$$ 33344431 33436346 32992471 32957067 32728200 31408949 31116526 31584746 31298078 29835205
7579B9835205p52137m03480p50449m13449o93489K17016k5412k14645j150124
$$ 29835205 29083068 28679588 27929139 27515690 26822201 27039217 27013805 26799160 25649036
7570B5649036k1283R58124p43718o81122o89118p55575Q30923l35203k96620j139523
$$ 25649036 25627753 26585877 25842159 25161037 24471919 23716344 24547267 24212064 23915444 22775921
7560B2775921K94136j52059j024168k50240k87377O8272J09229n8816j86615n77755
$$ 22775921 23070057 22917998 21893830 21643590 21356213 21424485 21533714 21474898 21288283 20710528
7550B0710528j58308j197157m02876M83156j7288M08240r27601k72122L87554
$$ 20710528 20552220 19355063 18952187 19435343 19418055 19826295 18898694 18626572 19014126
7541A9014126R1560j25530j257186J57270K84969r31534l94025j13441l58915
$$ 19014126 19105686 18980156 17722970 17880240 18165209 17233675 16839650 16726209 16367294
7532A6367294K04769k67509k05611k82238K59534j21758J68537j75140j334624
$$ 16367294 16572063 16304554 16098943 15816705 16076239 15954481 16123018 15947878 14613254
7523A4613254L9256Q0641l8000K0863l44862o98264m50052J027638L82910m61678
$$ 14613254 14652510 14733151 14695151 14716014 14371152 13672888 13222836 14250474 14633384 14171706
7513A4171706k95228K12964o04390j022365M77113K45178L19644q04880k37603
$$ 14171706 13876478 14089442 13485052 12462687 12939800 13184978 13504622 12699742 12462139
7504A2462139o39322J23474k09802M62990k18847M7849m1174o22589J088160P6927
$$ 12462139 11822817 11946291 11736489 12199479 11980632 12028481 11987307 11364718 12452878 12529805
7494A2529805m14422p9856n89178j21515J57685L79264k99464n81607p08255P33776
$$ 12529805 12115383 12035527 11446349 11324834 11482519 11861783 11562319 10980712 10272457 11006233
7484A1006233K4316K37974p67757p58915K0820n63810N56626O03916l16783L91460
$$ 11006233 11030549 11268523 10500766 9741851 9762671 9198861 9755487 10359403 10042620 10434080
7474A0434080l96693j92420j9982l51139L09554J81215j074634M34588M5021n68946
$$ 10434080 10037387 9844967 9824985 9473846 9783400 9964615 8889981 9324569 9369590 8800644
7464H800644K7573j68122p98338j35177M77634N91311O0094l55358j49192N7704
$$ 8800644 8828217 8660095 7861757 7726580 8204214 8795525 8855619 8500261 8351069 8408773
7454H408773J25983L01700j06553K37736p27808L5121L84387o0020N71182q31650
$$ 8408773 8534756 8836456 8729903 8967639 8239831 8274952 8659339 8599319 9170501 8338851
7444H338851j39429j91068J12063L7099P06170l8508K7893k14279p18144l44235
$$ 8338851 8199422 8008354 8120417 8157516 8863686 8825178 8853071 8638792 7920648 7576413
7434G576413J48643n72752q6456k24532l29074K88012K58207M39730o6073L85849
$$ 7576413 7725056 7152304 7065848 6841316 6512242 6800254 7058461 7498191 7432118 7817967
7424G817967L82872r76894j8210k53641P01307l96569K36751L88202m94560k95385
$$ 7817967 8200839 7223945 7205735 6952094 7653401 7256832 7493583 7881785 7387225 7091840
7414G091840k00659r0779q14024N70150N18419m26871n45139N8859j44162J057314
$$ 7091840 6891181 6800402 5986378 6556528 7074947 6648076 6102937 6161796 6017634 7074948
7404G074948L70223k60948J25517k91447J25757p23147j90532P9056L70407j023968
$$ 7074948 7445171 7184223 7309740 7018293 7144050 6420903 6230371 6309427 6679834 5655866
7394E655866J55909J3884J011161q41732j64620N10083j78533L66241j90376j84956
$$ 5655866 5811775 5825659 6836820 5995088 5830468 6340551 6162018 6528259 6337883 6152927
7384F152927o2198k73587J43233P01860N23023l09433J31982p57120L5817Q98343
$$ 6152927 6090729 5817142 5960375 6662235 7185258 6875825 7007807 6250687 6286504 7184847
7374G184847q88466j55179k99027J25523k04193K94747l67051k82982M10090Q93686
$$ 7184847 6296381 6141202 5842175 5967698 5763505 6058252 5691201 5408219 5818309 6711995
7364F711995L95030L02442K88159j231583m60763O83051N62189l96004O42856
$$ 6711995 7107025 7409467 7697626 6466043 6005280 6688331 7250520 6854516 7497372
7355G497372o65084j093708L18238P39205O56226L28470k83551l43234J235894
$$ 7497372 6832288 5738580 6056818 6796023 7452249 7780719 7497168 7153934 8389828
7346H389828K4071j17117N45090Q51777j45948j33071j6237P6637P66294J49241
$$ 8389828 8413899 8296782 8841872 9693649 9547701 9414630 9398393 9475030 10241324 10390565
7336A0390565L90816Q17702Q08547O33481M69283J007030J168897J581862K015790
$$ 10390565 10781381 11599083 12407630 13041111 13510394 14517424 15686321 17268183 19283973
7327A9283973J619005K246708K854927L430606M968381L809020K577541J207388
$$ 19283973 20902978 23149686 26004613 29435219 34403600 38212620 40790161 41997549
7319D1997549n11297k699469m268652m764204l014142l468988l231181k362804
$$ 41997549 41486252 38786783 34518131 29753927 26739785 23270797 20039616 17676812
7311A7676812p18936j924127j233196r01891o33763q23131j183897p66574m42928
$$ 17676812 16957876 15033749 13800553 12898662 12264899 11441768 10257871 9491297 9048369
7302I048369p07904j93915j506M800P61547p78851j831767k55477O50966J18389
$$ 9048369 8340465 8146550 8145044 8149844 8911391 8132540 6300773 6045296 6696262 6814651
7292F814651k55247l93649K7948m64331P89649K72637p2189n45311o87984N35038
$$ 6814651 6559404 6165755 6193703 5729372 6519021 6791658 6719469 6174158 5486174 6021212
7282F021212J00516o08451J91989j12405k79285K57708J41971l51704M31992p79708
$$ 6021212 6121728 5513277 5705266 5592861 5313576 5571284 5713255 5361551 5793543 5013835
7272E013835O12760M98221n46786o13894N66715l83981p7585J93211q87884o572
$$ 5013835 5626595 6124816 5578030 4964136 5530851 5146870 5069285 5262496 4374612 4368040
7262D368040M160J58763K8972P07172J40177j90803Q7608L4469p10796L17454
$$ 4368040 4372200 4530963 4559935 5267107 5407284 5216481 5304089 5338558 4627762 4945216
7252D945216N16738o3652l9005k01547j86950k74937J180011M97620p60541N21283
$$ 4945216 5461954 5398302 5359297 5157750 4970800 4695863 5875874 6373494 5612953 6134236
7242F134236J06436P0687q7045L28110J552508K18006j222480R09012J108506
$$ 6134236 6240672 6311359 6224314 6552424 8104932 8322938 7100458 8009470 9117976
7233I117976M26302J403709J178828p3243l90242J883021J660626J805954K964291
$$ 9117976 9544278 10947987 12126815 12053572 11663330 13546351 15206977 17012931 19977222
7224A9977222K212185J597365O1685q37015k451271j603260k693054j871816j796624
$$ 19977222 22189407 23786772 23848457 23011442 20560171 18956911 16263857 14392041 12595417
7215A2595417j833894o58697m63559j137839j067323o76106o03630l74663o48284
$$ 12595417 10761523 10102826 9639267 8501428 7434105 6757999 6154369 5779706 5131422
7206E131422N49267q90656r9253L3817j924k84901j05195j4063K08075r9743P4327
$$ 5131422 5680689 4790033 4690780 4724597 4722673 4437772 4332577 4318514 4526589 4426846 4501173
7195D501173j27354K8683L53576j222384k61500K26294k40815L52901N95151O74851
$$ 4501173 4373819 4402502 4756078 3533694 3272194 3498488 3257673 3610574 4205725 4880576
7185D880576r41622m74507j88064l9745K3371j2660L57839o3728j63728k80289
$$ 4880576 3938954 3464447 3276383 3236638 3260009 3247349 3605188 3541460 3377732 3097443
7175C097443j62791J305n50397J1964J17048N25210k07234j08394k01317p3991
$$ 3097443 2934652 2935957 2385560 2397524 2514572 3039782 2832548 2724154 2522837 2448846
7165B448846O952N09927m09633n38368n53380L92732M41402k12010O67636M26053
$$ 2448846 2455798 2965725 2556092 2017724 1464344 1857076 2298478 2086468 2754104 3180157
7155C180157j19368r23860L48326p3607j08351q2581J31293L13049m97712J15809
$$ 3180157 3060789 2136929 2485255 2411648 2303297 2220716 2352009 2665058 2167346 2283155
7145B283155k99924J36152k46638k49744J08461l02451j79259L85392j18231l00036
$$ 2283155 1983231 2119383 1872745 1623001 1731462 1429011 1249752 1635144 1516913 1216877
7135A216877m17751n9651J67509M58104M46258p765M60049j055258m81794N78598
$$ 1216877 799126 739475 906984 1365088 1811346 1803581 2263630 1208372 726578 1305176
7125A305176N76133r92469O58216N28656o46947j090416J66480L5971Q77685n62328
$$ 1305176 1881309 888840 1547056 2075712 1428765 338349 504829 540800 1418485 856157
7115H56157r4134J088189p22427o48551M22024n17194L92679Q50627m90089K07674
$$ 856157 762023 1850212 1127785 479234 901258 384064 776743 1627370 1137281 1344955
7105A344955J90862o79344k31047q0744L90376L63052j43991L71039m47235R66924
$$ 1344955 1535817 856473 625426 544682 935058 1298110 1154119 1525158 1077923 2044847
7095B044847o0877k44353j25891J36767q64356O67504Q2408m6473L43599p05458
$$ 2044847 1983970 1739617 1613726 1750493 886137 1553641 1636049 1589576 1933175 1227717
7085A227717L20172L78670o63867o39322N13755j33847L566q58245L03817O49431
$$ 1227717 1547889 1926559 1262692 623370 1137125 1003278 1006844 148599 452416 1101847
7075A101847j54640P19971Q90315j073987q06195j66158N69466k59044L14278
$$ 1101847 947207 1667178 2557493 1483506 677311 511153 1080619 821575 1135853
7066A135853L73135m5375n44015J06266l04168J29698K98714N8550M72147r45716
$$ 1135853 1508988 1463613 919598 1025864 721696 851394 1150108 1208658 1680805 735089
7056G35089l67762P45054n02177P2758j82416M42044K77400n50087l0541j86222
$$ 735089 367327 1112381 610204 682962 500546 942590 1219990 669903 639362 453140
7046D53140Q36882O98158n31886k19806N31854j003301K33317m91785O9452j1365
$$ 453140 1290022 1988180 1456294 1236488 1768342 765041 998358 506573 576025 564660
7036E64660O63968L56504j04336n98511K59561l01860k11923j231881P85549R45460
$$ 564660 1228628 1585132 1480796 882285 1141846 839986 628063 -603818 181731 1127191
7026A127191q7672j043657l49746L37219j250R3477l37059K10460L41827J196722
$$ 1127191 1039519 -4138 -353884 -16665 -17915 75562 -261497 -51037 290790 1487512
7016A487512m27543j85980K9267J098129n9709l00484n7835K73079k86522q26858
$$ 1487512 1059969 873989 903256 2001385 1941676 1641192 1583357 1856436 1569914 743056
7006G43056M58051J78572L37862p67180o30032J76041n26982j25328o61932J055589
$$ 743056 1201107 1379679 1717541 950361 320329 496370 -30612 -155940 -817872 237717
6996B37717P80407n28481N33341k5075L83546l89030j107482N77745N19642J74824
$$ 237717 1018124 489643 1022984 997909 1381455 992425 -115057 462688 982330 1157154
6986A157154J18724n14865l49253N22135l2246k1061N49048j15942j172216k85037
$$ 1157154 1275878 761013 411760 933895 901649 880588 1429636 1313694 141478 -143559
6976a43559O48475K1928n98386M14445j08736J62977K5455n3143J13703J98635
$$ -143559 504916 526844 -71542 342903 234167 397144 422599 369456 483159 681794
6966F81794j72804r81450M64819J29207K03453N76247j90103J99333L83940L99655
$$ 681794 508990 -472460 -7641 121566 325019 901266 711163 910496 1294436 1694091
6956A694091K53028q5915j81000j92092p51632j63040j17612j44685o21819M07668
$$ 1694091 1947119 1861204 1680204 1488112 736480 573440 455828 311143 -310676 96992
6946I6992J60686n2651L11618n87126M66559M04750r36754j47751M84174j84094
$$ 96992 257678 205027 516645 -70481 396078 800828 -135926 -283677 200497 16403
6936A6403O7938l21792L39141L13088J96650K84383K42726j25157m2184q17064
$$ 16403 84341 -237451 101690 414778 611428 895811 1138537 1013380 971196 154132
6926A54132l78101j71777L21680P39399N39392l00933N17825l33820p49891N01878
$$ 154132 -223969 -395746 -74066 665333 1204725 903792 1421617 1087797 337906 839784
6916H39784L41170k72865j34770K42991n33843j54131J65487l93418K33961n5495
$$ 839784 1180954 908089 773319 1016310 482467 328336 493823 100405 334366 278871
6906B78871p3265J69308j62639n4509m98027p3465P51395N22116k15836k62871
$$ 278871 205606 374914 212275 157766 -340261 -413726 337669 859785 643949 381078
6896C81078N80675M20436j61839m53224j30950l1043n60885R7609J80722M77689
$$ 381078 961753 1382189 1220350 767126 636176 605133 44248 141857 322579 800268
6886H00268L34992m47286k11665J72751j71470O6353M69827n08365L5818N83739
$$ 800268 1135260 687974 476309 649060 477590 543943 1013770 505405 541223 1124962
6876A124962J64461l03470Q8731m40583j7317K72276M07771j92100N5079J21060
$$ 1124962 1289423 985953 1074684 634101 616784 889060 1296831 1104731 1159810 1280870
6866A280870n73473J8531P7499K6289j23912l69055O0691L18081j71914p6995
$$ 1280870 707397 725928 803427 829716 705804 336749 397440 715521 543607 466612
6856D66612N0267k68649J38251N26796o29380m76944L22724L48706n98092J94603
$$ 466612 516879 248230 386481 913277 283897 -193047 129677 478383 -119709 74894
6846G4894L30559j36656J74254J0849M409j5733M71091m78248J28451J034836
$$ 74894 405453 268797 443051 453900 458309 442576 913667 435419 563870 1598706
6836A598706q07852n82127J01348L27142l3552p4192O29526j57282o12644K97716
$$ 1598706 790854 208727 310075 637217 603665 529473 1158999 1001717 389073 686789
6826F86789j98102P3866L9859M38230o53437K50154q9412J42499l86629n13219
$$ 686789 488687 562553 602412 1040642 387205 637359 547947 690446 303817 -209402
6816b09402j148583J059712J161210n60285n65986J22679J56119O7632J40981
$$ -209402 -1357985 -298273 862937 302652 -263334 -140655 15464 83096 224077
6807B24077k10838k15727N86607N46056q80490K00615K36147N72969J9587n52861
$$ 224077 13239 -202488 384119 930175 49685 250300 486447 1059416 1079003 526142
6797E26142j47181j55033L49749J06116Q0801K5849r19122Q57789J8082M7678
$$ 526142 378961 223928 573677 679793 760594 786443 -132679 725110 743192 790870
6787G90870k97340L88793k04046l12132K59100Q3K98626l52318M46729L23011
$$ 790870 493530 882323 678277 366145 625245 625328 923954 571636 1018365 1341376
6777A341376Q7782p81946N25031k30105l23387j9788R2464O62442o37801N86135
$$ 1341376 1429158 647212 1172243 942138 618751 598963 691427 1353869 716068 1302203
6767A302203q98422k62506l00084n2195N92151K83933Q59991M58040n18740j62196
$$ 1302203 403781 141275 -158809 -211004 381147 665080 1525071 1983111 1464371 1302175
6757A302175k07560L15323J15518n31322l02492R28863k49946p08654L93502N24378
$$ 1302175 1094615 1409938 1525456 994134 691642 1620505 1370559 661905 1055407 1579785
6747A579785L73049k97604n48675l6026l01989K95229M12825o59118P50364J74532
$$ 1579785 1952834 1655230 1106555 1070529 768540 1063769 1476594 817476 1567840 1742372
6737A742372j56868M06137l23635K70369m08067k77614Q88016Q7047K43869l82628
$$ 1742372 1585504 1991641 1668006 1938375 1530308 1252694 2140710 2227757 2471626 2088998
6727B088998O05215Q2297p6844M26177L5061P1030l38983q0597Q26396p9523k73943
$$ 2088998 2694213 2776510 2699666 3125843 3160904 3231934 2892951 2812354 3638750 3559227 3285284
6716C285284M92045K7162J91167O18315J78100n89203O87161P14673l82016l8302
$$ 3285284 3777329 3804491 3995658 4613973 4792073 4202870 4890031 5604704 5222688 5184386
6706E184386j52667j54954N17535Q00648K44897K30813j22649K57693j14274J89826
$$ 5184386 5031719 4876765 5394300 6194948 6439845 6670658 6548009 6805702 6691428 6881254
6696F881254O48018N67067L01317J70698Q94528p35782J16013N89119J052819
$$ 6881254 7529272 8096339 8397656 8568354 9462882 8727100 8843113 9432232 10485051
6687A0485051N31382j172486l33027Q12616N04726q3305l9202N92342m54805l94619
$$ 10485051 11016433 9843947 9510920 10323536 10828262 10744957 10705755 11298097 10843292 10448673
6677A0448673J144209J139544L43428M35413l8819Q68755P61216R2127M39000
$$ 10448673 11592882 12732426 13075854 13511267 13472448 14341203 15102419 15194546 15633546
6668A5633546j024604M03084N46569n56121N07975L30990K11761o56936K2903
$$ 15633546 14608942 15012026 15558595 15002474 15510449 15841439 16053200 15396264 15419167
6659A5419167M43023r47362j89023j8394l97205n84486O5879k77736M27534M55016
$$ 15419167 15862190 14914828 14725805 14707411 14310206 13725720 13791599 13513863 13941397 14396413
6649A4396413O14176l35192k83359J174748n41144p02782L6329n07645O97369
$$ 14396413 15010589 14675397 14392038 15566786 15025642 14322860 14359189 13851544 14548913
6640A4548913O6379j078286j80617n74207J70649m4460J74709j23071r38522l63407
$$ 14548913 14615292 13537006 13356389 12782182 12952831 12908371 13083080 12960009 12021487 11658080
6630A1658080j187739m26471J41954r3020L25839k77570n81421p74359J83896
$$ 11658080 10470341 10043870 10185824 10092804 10418643 10141073 9559652 8785293 8969189
6621H969189j20351O90359j81838q99524O2265l84038O80313k79210o6670j294819
$$ 8969189 8848838 9539197 9357359 8457835 8520100 8136062 8816375 8537165 8470495 7175676
6611G175676o13954P7357q68791K0994o36064n63126j49981N06229l03655l01811
$$ 7175676 6561722 6639079 5770288 5791282 5155218 4592092 4442111 4948340 4644685 4342874
6601D342874Q9120j14363K21698k21999m53459m55024K40274j61161J91596p2666
$$ 4342874 4431994 4317631 4539329 4317330 3863871 3408847 3649121 3487960 3679556 3606890
6591C606890p70861J07107k69487n13131M21859K08800o92437n37707N28215O32318
$$ 3606890 2836029 2943136 2673649 2160518 2582377 2791177 2098740 1561033 2089248 2721566
6581B721566k28061o84195r6633O08736o17266j68848P32315m44459M04733N27184
$$ 2721566 2493505 1809310 1712677 2321413 1704147 1535299 2267614 1823155 2227888 2755072
6571B755072m70894m55369Q27904l68913p68612j48478o470R93400J79976j263957
$$ 2755072 2284178 1828809 2656713 2287800 1519188 1370710 1364240 2357640 2537616 1273659
6561A273659L46358K89526L51803j060262j005223M23345L01147j85890j11238
$$ 1273659 1620017 1909543 2261346 1201084 195861 619206 920353 734463 623225
6552F23225K02829n37453P41496q29249j13125O25221o0192o4418M8818j074077
$$ 623225 826054 288601 1030097 200848 87723 712944 652752 588334 637152 -436925
6542d36925Q62214O63830l70559K35663n94892M57277m65379n88852J92445l29339
$$ -436925 425289 1089119 718560 954223 359331 816608 351229 -237623 -45178 -374517
6532c74517K21678J099457M95528J37286j006106k74982N36237L85808l49734
$$ -374517 -152839 946618 1442146 1579432 573326 298344 834581 1220389 870655
6523H70655o95704j28010p1419O86721K52575j65089P3783M3751L71703q87677
$$ 870655 174951 46941 -24478 662243 914818 749729 823512 867263 1238966 351289
6513C51289o67016J114405l74410K86663J018519q01202M7009J9408L25361L95784
$$ 351289 -315727 798678 424268 710931 1729450 928248 975257 994665 1320026 1715810
6503A715810r99593j98423J53929o6422n01894j5886M80214J65871k82907J73958
$$ 1715810 716217 517794 671723 605301 103407 87521 567735 733606 450699 624657
6493F24657m67375P5796k82468R167M19980j23242m20523J01117R62122p94260
$$ 624657 157282 233078 -49390 -40223 379757 256515 -164008 -62891 899231 104971
6483A04971O36124j80070N44766P02328K30932j277606m59569M92338Q595Q08685
$$ 104971 741095 561025 1105791 1808119 2039051 761445 301876 794214 802809 1611494
6473A611494M58563o36052o05188M9617J226418J70368K2325L22119j705952j90549
$$ 1611494 2070057 1434005 828817 878434 2104852 2275220 2297545 2619664 913712 723163
6463G23163n41067J204660q3287M46760k83510K08735O38355J76284l93941J29486
$$ 723163 182096 1386756 1303469 1750229 1466719 1675454 2313809 2490093 2096152 2225638
6453B225638q72615O73130R3831M38529l08064J4420j16514j25033M72584k42398
$$ 2225638 1353023 2026153 2119984 2558513 2250449 2264869 2148355 2023322 2495906 2253508
6443B253508J37759K99933O74947Q00067L43170k50556n24265m07808J218183
$$ 2253508 2391267 2691200 3366147 4166214 4509384 4258828 3734563 3326755 4544938
6434D544938l47894j60139J33348O22463O8828k94948Q64893J90989j73293J09200
$$ 4544938 4197044 4036905 4170253 4792716 4861544 4566596 5431489 5622478 5449185 5558385
6424E558385n24016N0253k33576R24187J59858p47244L85076q4593o42668M55259
$$ 5558385 5034369 5084622 4851046 5775233 5935091 5187847 5572923 5488330 4845662 5300921
6414E300921J62266k75905P46284J12507N0032M65427L03530K61425o83953O54096
$$ 5300921 5463187 5187282 5933566 6046073 6096105 6561532 6865062 7126487 6442534 7096630
6404G096630M33108J48055j95267M76519k36041J09260o43931k24851N629j9327
$$ 7096630 7529738 7677793 7482526 7959045 7723004 7832264 7188333 6963482 6969111 6949784
6394F949784M34073P75670J55866k094934l39993J156237L71820O31488J0369
$$ 6949784 7383857 8159527 8315393 6220459 5880466 7036703 7408523 8040011 8050380
6385H050380K03392k07792J11121J93648Q6151m71359j47594M81387J11726l00819
$$ 8050380 8253772 8045980 8157101 8350749 8436900 7965541 7817947 8299334 8411060 8110241
6375H110241N10257P47009l83282m26065M89347j69444K57814J7J71008j055179
$$ 8110241 8620498 9367507 8984225 8558160 9047507 8878063 9135877 9135894 9306902 8251723
6365H251723k65568J80458J57922n69978l73821M6601J62284j78209J04141P72859
$$ 8251723 7986155 8166613 8324535 7754557 7380736 7427337 7589621 7411412 7515553 8288412
6355H288412J85493N3854k68395l59452m55277P42227N13110L3964o14189j57811
$$ 8288412 8473905 8527759 8259364 7899912 7444635 8186862 8699972 8733936 8119747 7961936
6345G961936n31621M92073J30571k45223k96860J265180l35533n46869m29770
$$ 7961936 7430315 7922388 8052959 7807736 7510876 8776056 8440523 7893654 7463884
6336G463884n86926m4911p4507k44150N33911n73546j33525j29506K11554n56145
$$ 7463884 6876958 6832047 6757540 6513390 7047301 6473755 6340230 6210724 6422278 5866133
6326E866133j52296j0427m87746q1222l46279L41176o01847j66226j86880K23593
$$ 5866133 5713837 5703410 5215664 5134442 4788163 5129339 4527492 4361266 4174386 4397979
6316D397979M36687J20694Q3113K96174n94132m19480o9111l27392M77388L23193
$$ 4397979 4834666 4955360 5038473 5334647 4740515 4321035 4251924 3924532 4401920 4725113
6306D725113j769413p12761J139246j1487N27366n03860R9788m14031L62648k94818
$$ 4725113 2955700 2242939 3382185 3370698 3898064 3394204 3493992 3079961 3442609 3147791
6296C147791k23913l69044o05850K23766p86057j51431J43693O23608J1604l44263
$$ 3147791 2923878 2554834 1948984 2172750 1386693 1235262 1378955 2002563 2014167 1669904
6286A669904r21053j82896M06153K78191P33820j53151J11900l25933q95649N75305
$$ 1669904 748851 565955 972108 1250299 1984119 1830968 1942868 1616935 721286 1296591
6276A296591K93498K16674M8926q60418K49988N55104m44650J1853L88542k56888
$$ 1296591 1590089 1806763 1855689 995271 1245259 1800363 1355713 1367566 1756108 1499220
6266A499220Q9608J29884O83769m74728l55982L14289m66324m52945J70005Q05432
$$ 1499220 1588828 1718712 2402481 1927753 1571771 1886060 1419736 966791 1136796 1942228
6256A942228K33252l33669m67542K46249j93507k68281k84335J2519k69193p1370
$$ 1942228 2175480 1841811 1374269 1620518 1427011 1158730 874395 886914 617721 546351
6246E46351P11629L95958K20002k44249j4686m13941o1824J046915j209712K57225
$$ 546351 1257980 1653938 1873940 1629691 1615005 1201064 1139240 2186155 976443 1233668
6236A233668O19095N9695m7072k52386j49245j68983P2625J31425m05599K60312
$$ 1233668 1852763 1912458 1865386 1613000 1463755 1294772 1367397 1498822 1093223 1353535
6226A353535N05080m81136J040l90440n51569J092498J181506p55798k57146J4003
$$ 1353535 1858615 1377479 1378519 988079 436510 1529008 2710514 1954716 1697570 1711573
6216A711573O05464J70062m92749K01748n18105o39505K74200Q14048O85767J1423
$$ 1711573 2317037 2487099 1994350 2196098 1677993 1038488 1312688 2126736 2812503 2823926
6206B823926m5091J15693l35114L13583M247P16951j55503k28487L66936L5958
$$ 2823926 2778835 2894528 2559414 2872997 2877244 3594195 3438692 3210205 3577141 3613099
6196C613099R47725k59776J56545O24197j77364o0148L61441P15366N44393k61925
$$ 3613099 4560824 4301048 4457593 5081790 4904426 4844278 5205719 5921085 6465478 6203553
6186F203553n09168m07100k67572N29770k26641J180249P05801o45533k49289
$$ 6203553 5694385 5287285 5019713 5549483 5322842 6503091 7208892 6563359 6314070
6177F314070K72130K89151N17467O4726P1342L66455Q93213R3612o76931Q24497
$$ 6314070 6586200 6875351 7392818 7457544 7528886 7895341 8788554 8882166 8205235 9029732
6167I029732L42847L52670l62277r77369P54161M63584L04732O98590J1373j021402
$$ 9029732 9372579 9725249 9362972 8385603 9139764 9603348 9908080 10606670 10618043 9596641
6157I596641r2571J196262k06299N6601J16464R63053J41804l2690M84104O7257
$$ 9596641 9504070 10700332 10494033 10550634 10667098 11630151 11771955 11739265 12223369 12290626
6147A2290626o01388N0176k4930M08427O29042L72286J92679O03576K89958K40182
$$ 12290626 11689238 11739414 11714484 12122911 12751953 13124239 13316918 13920494 14210452 14450634
6137A4450634J010670J240779K13383J15712k79901Q12615J024828p247K96386
$$ 14450634 15461304 16702083 16915466 17031178 16751277 17563892 18588720 18581473 18877859
6128A8877859M2061k92664L17403K06115K95473J204851r15208J278092K51212
$$ 18877859 18919920 18627256 18944659 19150774 19446247 20651098 19735890 21013982 21265194
6119B1265194k9971Q20374r46062J646696J404310J55226O36139L72185R867R93542
$$ 21265194 21235223 22055597 21109535 22756231 24160541 24315767 24951906 25324091 25333958 26327500
6109B6327500P90533l04076Q27076j92676M97511Q86936l41712J32638M56604
$$ 26327500 27118033 26813957 27641033 27448357 27945868 28832804 28491092 28623730 29080334
6100B9080334Q9670q717l60180q35544J95955M67723p23966q24998L14610q5794
$$ 29080334 29170004 29161287 28801107 27965563 28161518 28629241 27905275 27080277 27394887 27309093
6090B7309093J62316r8523j433249J39111M67847j21910j66563m16751L95460
$$ 27309093 27471409 27372886 25939637 26078748 26546595 26424685 26258122 25841371 26236831
6081B6236831o46971o67733P39166j78681p8829n61813k56335P68617M47882k54647
$$ 26236831 25589860 24922127 25661293 25482612 25403783 24841970 24585635 25354252 25802134 25547487
6071B5547487n33283l34264L62871K51260p58140m73908K16230q74799q32811
$$ 25547487 25014204 24679940 25042811 25294071 24535931 24062023 24278253 23403454 22570643
6062B2570643n87154L0707q88887j114410k86652n54840j22961n03388k04944
$$ 22570643 21983489 22014196 21125309 20010899 19724247 19169407 19046446 18543058 18338114
6053A8338114J08246j074742j109037j62043j10l96914J248830l44442p6759Q460
$$ 18338114 18446360 17371618 16262581 16100538 16100428 15703514 16952344 16607902 16531143 16539603
6043A6539603M9130O91826K16866N00106m18384q45141o57490K12007o76857J879
$$ 16539603 16588733 17280559 17497425 17997531 17579147 16734006 16076516 16288523 15611666 15613545
6033A5613545p88012l82489k31078n73961j020553p7948l77493l11447m72601
$$ 15613545 14825533 14443044 14211966 13638005 12617452 12539504 12162011 11850564 11377963
6024A1377963j42911l58941l22717l9674n01318L54194K41686l79275K02157k49705
$$ 11377963 11235052 10876111 10553394 10513720 10012402 10366596 10608282 10229007 10431164 10181459
6014A0181459k67717l87144m47205k73770M13278o6807J9115j310438j79825M57808
$$ 10181459 9913742 9526598 9079393 8805623 9218901 9152094 9171209 7860771 7680946 8138754
6004H138754p19391n47745J33682M5218p18133l99531N52413K21120n98005J86975
$$ 8138754 7419363 6871618 7005300 7050518 6332385 5932854 6485267 6706387 6108382 6295357
5994F295357p75089r1623k71538k1383K28871k65832Q2950q63912O51905R29837
$$ 6295357 5520268 5428645 5157107 5135724 5364595 5098763 5181713 4317801 4969706 5899543
5984E899543m84070k08456K84445k5692o05971K52719o91112j64302L34770o07227
$$ 5899543 5415473 5207017 5491462 5465770 4859799 5112518 4421406 4257104 4591874 3984647
5974C984647r50185L62701j143247R48322M93628J1969j082026r61201L77085
$$ 3984647 3034462 3397163 2253916 3202238 3695866 3707835 2625809 1664608 2041693
5965B041693O94894L94098m2234J40659r67327K54824K02841p69731k85660n6151
$$ 2041693 2736587 3130685 3088451 3229110 2261783 2516607 2719448 1949717 1664057 1607906
5955A607906M4230P95093l72882l86540o72041p33830R17954Q49201k33465r55512
$$ 1607906 1652136 2447229 2074347 1687807 1015766 281936 1199890 2049091 1815626 860114
5945H60114m29807L02481M78259Q37868k84669K77852k32798q22306K13525J21938
$$ 860114 430307 732788 1211047 2048915 1764246 2042098 1809300 986994 1200519 1322457
5935A322457k93850L17030j93541j103476L62314j31153R3186K39885L63529m80501
$$ 1322457 1028607 1345637 1152096 48620 410934 279781 372967 612852 976381 495880
5925D95880q05169Q41553P6126N77076P4117k8107J65772p3547p06340k55207
$$ 495880 -309289 532264 608390 1185466 1259583 1231476 1397248 1323701 617361 362154
5915C62154M06885N58245J13350m62142J22515Q78580o80765j47718O1306O1617
$$ 362154 769039 1327284 1440634 978492 1101007 1979587 1298822 1151104 1212410 1274027
5905A274027j41590R65689k14859o88138P40037P983k17767j014492L02951K42381
$$ 1274027 1132437 2098126 1883267 1195129 1935166 1943149 1725382 710890 1013841 1256222
5895A256222L14865k86621J04011k06569P84344l80662l12079J17214k21583M9085
$$ 1256222 1571087 1284466 1388477 1181908 1966252 1585590 1273511 1390725 1169142 1218227
5885A218227P65728l88250k03905P52736m94278j42343j43779M62400J81556J64860
$$ 1218227 1983955 1595705 1391800 2144536 1650258 1507915 1364136 1826536 2008092 2172952
5875B172952j067300j8104Q18084p6039N29454O96025K23280P10838k37801q42733
$$ 2172952 1105652 1087548 1905632 1829593 2359047 3055072 3278352 3989190 3751389 2908656
5865B908656k62498n90614N93252L01414L18344o37461O5032q0953k28544M64488
$$ 2908656 2646158 2055544 2648796 2950210 3268554 2631093 2696125 2615172 2386628 2851116
5855B851116J013087O39422o01284L5654M24060O58689M92766k53039R25843o8447
$$ 2851116 3864203 4503625 3902341 3937995 4362055 5020744 5513510 5260471 6186314 6117867
5845F117867o53715R7464n3852M06463j35103K66914P21157m87156L07520N02983
$$ 6117867 5464152 5561616 5507764 5914227 5779124 6046038 6767195 6280039 6587559 7090542
5835G090542O15830n1826N91095K51787o81790J43101n64073K00683l6390Q71886
$$ 7090542 7706372 7654546 8245641 8497428 7815638 7958739 7394666 7595349 7558959 8430845
5825H430845k82287l97579m79565O99186k9228L3612o73611o7121N77900P02168
$$ 8430845 8148558 7750979 7271414 7970600 7941372 7974984 7301373 7234252 7812152 8514320
5815H514320j86539L82315m0137J69832q3175l12704K23344k53895J99223l0673
$$ 8514320 8327781 8710096 8669959 8839791 8756616 8443912 8667256 8413361 8612584 8581911
5805H581911j73021K03709p40981J93650Q21906n76268l1158n99219P42218J082051
$$ 8581911 8408890 8612599 7871618 8065268 8887174 8310906 8279748 7680529 8422747 9504798
5795I504798l13384m31191k14479l23987P83385K02426L00151j88210N28030o00278
$$ 9504798 9191414 8760223 8545744 8221757 9005142 9207568 9507719 9319509 9847539 9247261
5785I247261j61518N26402K99751o51919q13214l24961Q07061o67174o65425P676
$$ 9247261 9085743 9612145 9911896 9259977 8446763 8121802 8928863 8261689 7596264 7603940
5775G603940m67671N84393L41847J09044m73000l74809m52521J044985q52624
$$ 7603940 7136269 7720662 8062509 8171553 7698553 7323744 6871223 7916208 7063584
5766G063584p25496R60447P14984k4384j22638q29129m49233n94816J77193J113331
$$ 7063584 6338088 7298535 8013519 7989135 7866497 7037368 6588135 5993319 6170512 7283843
5756G283843k56542l58433O3523J7021J87127l90246j32734L41939K83717m96847
$$ 7283843 7027301 6668868 6732391 6749412 6936539 6546293 6413559 6755498 7039215 6542368
5746F542368q7676N39422j37587n72109k04961O9937m56594m23512L54547n63680
$$ 6542368 6454692 6994114 6856527 6284418 6079457 6149394 5692800 5269288 5623835 5060155
5736E060155R6292L92950l96399l67967j92520L85863k89549J06205r57467r53417
$$ 5060155 5156447 5549397 5152998 4785031 4592511 4978374 4688825 4795030 3837563 2884146
5726B884146n1749N88101K0454K47203q77676p74438j13785N068P02675n32598
$$ 2884146 2832397 3420498 3440952 3688155 2810479 2036041 1922256 1927324 2629999 2097401
5716B097401m43539j44813l56423L73517l15248Q36852N11634q519l55472p14930
$$ 2097401 1653862 1509049 1152626 1526143 1210895 2047747 2559381 2550862 2195390 1480460
5706A480460n40627j8893N7829M21867N24140m54779l2643o14189n81656L75732
$$ 1480460 939833 920940 978769 1400636 1924776 1469997 1437354 823165 241509 617241
5696F17241j49931P24557J23635l28037L7437k20245n68112m70536N45875N47857
$$ 617241 467310 1191867 1315502 987465 1024902 804657 236545 -233991 311884 859741
5686H59741N51002m53359k37377j50108Q18035j47554p15990m77040j0048k65150
$$ 859741 1410743 957384 720007 569899 1387934 1240380 524390 47350 37302 -227848
5676b27848N41564M68312J7318n2385r05673o38086Q47008J07530m51181J43039
$$ -227848 313716 782028 799346 746961 -158712 -796798 50210 157740 -293441 -150402
5666a50402j01305K04415j19140K82534j094690O89261R68823J6422l39605M94051
$$ -150402 -251707 -47292 -166432 116102 -978588 -289327 679496 695918 356313 850364
5656H50364j54203J06845o89373k61994O19331r1407J54616l16178L67898L82045
$$ 850364 696161 803006 113633 -148361 470970 379563 534179 218001 585899 967944
5646I67944l00457j09837j27885j99382m56627q5733K40159L31951j73217J13553
$$ 967944 667487 557650 429765 230383 -226244 -311977 -71818 260133 86916 200469
5636B00469L41345n10384n0179m93982P15382m86979r4260O53236k0343k0310
$$ 200469 541814 31430 -18749 -512731 202651 -284328 -378588 274648 254305 233995
5626B33995R5860m90942l86598J93451k76904K35457k23112O88361o23802M95368
$$ 233995 329855 -161087 -547685 -354234 -631138 -395681 -618793 69568 -554234 -58866
5616e8866J1025K18246k84680l15135J32312p4923Q4737M83598Q34749j509638
$$ -58866 -47841 170405 -114275 -429410 -297098 -372021 -287284 196314 1031063 -478575
5606d78575J85241p205M12397k29280J23947P07122k40024j228967L4120Q43977
$$ -478575 -293334 -300539 111858 -117422 6525 713647 473623 -755344 -721224 122753
5596A22753j06147j139767M39350P128j70322L8396L68354N44698l96954n8743
$$ 122753 16606 -1123161 -683811 -676683 -847005 -808609 -440255 104443 -292511 -351254
5586c51254K89247q36683N88958M48525k24345j07177k74938O6702N60368J61765
$$ -351254 -62007 -898690 -309732 138793 -85552 -192729 -467667 -400965 159403 321168
5576C21168m54202k9787L42544l24533n19234m51346Q45561L2590M418N82160
$$ 321168 -133034 -162821 179723 -144810 -664044 -1115390 -269829 -237239 -232821 349339
5566C49339K08805j000936r9442P39109O71794n79211l71017O98426o02143j16533
$$ 349339 558144 -442792 -542234 196875 868669 289458 -81559 616867 14724 -101809
5556a01809o60772M16860O97329l87299n050l68553L06240N97369n71622K3681
$$ -101809 -762581 -345721 351608 -35691 -40741 -409294 -103054 494315 -77307 -53626
5546e3626m11385K48180r4083K35715l08075o43234N95283l72884p9912L36396
$$ -53626 -465011 -216831 -310914 -75199 -383274 -1026508 -431225 -804109 -884021 -547625
5536e47625p66202J97588R48427l48324l9413N16741k18780m64246p79699P61223
$$ -547625 -1313827 -1116239 -167812 -516136 -555549 -38808 -257588 -721834 -1501533 -740310
5526g40310O85591L1407p37367l77884q8287O93342o3946R123k15777M20201M39460
$$ -740310 -54719 -23312 -760679 -1138563 -1226850 -533508 -597454 -588331 -804108 -383907 55553
5515E5553n62468p8365l67643Q5771K09549K53430N78470p1059l7726j199958
$$ 55553 -506915 -585280 -952923 -867152 -657603 -404173 174297 103238 65512 -1134446
5505a134446N22563j9136l31489P88003m01189q97529M55208M70545P00736m79941
$$ -1134446 -611883 -631019 -962508 -174505 -575694 -1473223 -1018015 -547470 153266 -326675
5495c26675J2930m37066p11246Q5566O23095r291L19624M8792n9544J75915J81672
$$ -326675 -313745 -750811 -1462057 -1376491 -753396 -762687 -443063 -394271 -453815 -277900 -96228
5484i6228K7296m26836J45601k26415O63915k32774o568r17266n19529P47094
$$ -96228 -68932 -495768 -350167 -576582 87333 -145441 -152009 -1069275 -1588804 -841710
5474h41710P8674J382193l13497q08814L85868m16772P040k9247O4130r88145
$$ -841710 -763036 619157 305660 -503154 -117286 -534058 -527018 -556265 -492135 -1480280
5464a480280L82114J90822R73529K95188k96332P4509N1524K73544K23700l46934
$$ -1480280 -1098166 -907344 66185 361373 65041 139550 191074 464618 688318 341384
5454C41384N0178k29013n88773J05831K26153Q6723o1662L16853L124K04957l3855
$$ 341384 391562 162549 -426224 -320393 -94240 -7517 -69179 247674 250798 455755 421900
5443D21900o69453M16162j10484m32691j44709K37715k73241n07277L18723K16015
$$ 421900 -247553 168609 58125 -374566 -519275 -281560 -554801 -1062078 -743355 -527340
5433e27340K06899k45001K56354J19946j3703m76060k3825N22618m63894J053839
$$ -527340 -320441 -565442 -309088 -189142 -202845 -678905 -702730 -180112 -644006 409833
5423D09833l26852j73475L55692n16884O9939p2650L3991L58668o2604j71161
$$ 409833 82981 -90494 265198 -251686 -181747 -254397 -220406 138262 75658 -95503
5413i5503K07424J2518l62390j010832P2756N63982K90846O07809l60234k94059
$$ -95503 111921 124439 -237951 -1248783 -1176027 -612045 -321199 286610 -73624 -367683
5403c67683p52765K8773k12817J066450k36775R4699Q43051O2109j44830o60454
$$ -367683 -1120448 -1091675 -1304492 -238042 -474817 -380118 462933 525042 380212 -280242
5393b80242n20446P42902o36525J26504M53044J86127N55509r2849m56309m14840
$$ -280242 -800688 -57786 -694311 -567807 -114763 71364 626873 534024 77715 -337125
5383c37125Q37326o58652j09859J46721q92216p65852N65871J89896P6716O17398
$$ -337125 500201 -158451 -268310 -121589 -1013805 -1779657 -1213786 -1023890 -947174 -329776
5373c29776N77886k34777n66869K20197O68025p63045K91673L38481K2148l40629
$$ -329776 248110 13333 -553536 -333339 334686 -428359 -136686 201795 223943 -116686
5363a16686K75696P14606n02o15428o14515L94572j56925k83206J09878l44770
$$ -116686 159010 873616 873114 257686 -356829 37743 -119182 -402388 -292510 -637280
5353f37280K93843N25412n80756j11723K8718l68340O95291p15836J03261N59910
$$ -637280 -343437 181975 -398781 -510504 -481786 -850126 -154835 -870671 -767410 -207500
5343b07500J60090k13546m46583K2688M09405N8958p898K26083o5397o92148l3158
$$ -207500 -47410 -260956 -707539 -684851 -275446 -216488 -224386 1697 -63700 -755848 -789006
5332g89006K55644J317051k78354j76797m26271m25101K49233K41334J97677m01616
$$ -789006 -533362 783689 505335 328538 -97733 -522834 -273601 -32267 165410 -236206
5322b36206l19266J087454M2415l84860J98964j84097K46619k87520k60978n25436
$$ -236206 -555472 531982 574397 189537 388501 204404 451023 163503 -97475 -622911
5312f22911L37446K11755k22536k55785L16234j66188L84768K21612M839K40532
$$ -622911 -285465 -73710 -296246 -552031 -235797 -401985 -17217 204395 209234 449766
5302D49766m45659L07096m94257q8442L68773n99751J98157J42259o34804M2990
$$ 449766 4107 311203 -183054 -271496 97277 -502474 -304317 -162058 -796862 -753872
5292g53872N38110k86166R96596K76651l35144J40441n75238k1679j09972j280615
$$ -753872 -215762 -501928 494668 771319 436175 576616 1378 -20301 -130273 -1410888
5282a410888K68042J665539J57156o91025K28926n0203o27450M34765L01849r91347
$$ -1410888 -1142846 522693 679849 -11176 217750 167547 -459903 -25138 276711 -714636
5272g14636M47843m82002J125725m34809K45431r2560j090353R44578n84636J9674
$$ -714636 -266793 -748795 376930 -57879 187552 94992 -995361 -50783 -635419 -615745
5262f15745l3982m24103M16043j25567L24652j30864J23539j74229K72659J34460
$$ -615745 -649727 -1073830 -657787 -783354 -458702 -589566 -466027 -640256 -367597 -233137
5252b33137k62355J202129L83177o68437K89605r5726j55949l00557j39669j8907
$$ -233137 -495492 706637 1089814 421377 710982 615256 459307 158750 19081 174
5242A74K15599O28713j6104q11793m86541j73512j28825L77351q25092o95378
$$ 174 215773 844486 828382 16589 -469952 -643464 -772289 -394938 -1220030 -1915408
5232a915408N19169K61580l2687P28668Q11616K80055j829254j29117K92307J73945
$$ -1915408 -1396239 -1134659 -1167346 -438678 372938 652993 -1176261 -1305378 -1013071 -839126
5222h39126q5189P2411J55943O45737q8502k64284m02758O91601L94630k3088
$$ -839126 -924315 -851904 -695961 -50224 -138726 -403010 -805768 -114167 280463 257375
5212B57375k76941l8780j183689j36486J034653l5039k62339K18601L50005M2786
$$ 257375 -19566 -58346 -1242035 -1378521 -343868 -378907 -641246 -422645 -72640 -29854
5202b9854J67966R35541q05646m17549Q42910m25106k45199o60736Q11898L22969
$$ -29854 138112 1073653 268007 -149542 693368 268262 23063 -637673 174225 497194
5192D97194q20308l39023Q57487r79106o89129Q20244J052510L90245m71009o98515
$$ 497194 -323114 -662137 195350 -783756 -1472885 -652641 399869 790114 319105 -379410
5182c79410L06027j81119j080394J27906M80896m26523P4350J38647L21130m71020
$$ -379410 -73383 -254502 -1334896 -1206990 -726094 -1152617 -1078267 -939620 -618490 -1089510
5172a089510M32685J20923l94360l33669O55968L62238L87864M2023o91373N41429
$$ -1089510 -656825 -535902 -930262 -1263931 -607963 -245725 142139 184162 -507211 34218
5162C4218l14898j93442k66136k12886K5921L12489O2930L12255j29656J07066
$$ 34218 -280680 -474122 -740258 -953144 -927223 -614734 -551804 -239549 -369205 -262139
5152b62139M77611J71444j048893n06823J013900N40798k8479n82032o35015N79712
$$ -262139 215472 386916 -661977 -1168800 -154900 385898 357419 -224613 -859628 -279916
5142b79916k21491m21228o78229P91181Q33324j153715K24944N76461J95374m1915
$$ -279916 -501407 -922635 -1600864 -809683 23641 -1130074 -905130 -328669 -133295 -175210
5132a75210l76931k00039N46138N70471j82255o91169K47182n3016N52915m33192
$$ -175210 -552141 -752180 -206042 364429 182174 -508995 -261813 -314829 238086 -195106
5122a95106o89469R07790j81702k01455M42335k76197m15675n74702j98915K72790
$$ -195106 -884575 23215 -158487 -359942 82393 -193804 -609479 -1184181 -1383096 -1110306
5112a110306Q76435O50891j12320m75146j043186j70461P78400K58137N35283
$$ -1110306 -233871 417020 304700 -170446 -1213632 -1384093 -605693 -347556 187727
5103A87727j22751n24807k38287k78818K88727q290K23922K1329p7544m12332
$$ 187727 64976 -459831 -698118 -976936 -688209 -696499 -472577 -451248 -528792 -941124
5093i41124n1587n9963K70522M58788Q278L92204P28004M32599M2606j563784
$$ -941124 -992711 -1052674 -782152 -323364 -315086 77118 805122 1237721 1280327 -283457
5083b83457j166806M67262Q85682m0327m36341n69231J52131M69504N58645L03
$$ -283457 -1450263 -983001 -97319 -137646 -573987 -1143218 -991087 -521583 37062 37365
5073C7365m56528m53929k47173M39378J7138j16188J14816J46306L69199J311
$$ 37365 -419163 -873092 -1120265 -680887 -663749 -779937 -665121 -518815 -149616 -148305
5063a48305q53193M45883l89004j89849K67521j83974P60799L6056k76283O00932
$$ -148305 -1001498 -555615 -944619 -1134468 -866947 -1050921 -290122 -254066 -530349 70583
5053G0583R595l53463o7904n15053N0927R6075K71419j62891r22096O20973J197396
$$ 70583 80178 -273285 -341189 -856242 -805315 -709240 -437821 -600712 -1522808 -901835 295561
5042B95561j77208K2360p85568M34125L20903l64636j53014R0557j89529P99763
$$ 295561 118353 140713 -644855 -210730 110173 -254463 -407477 -316920 -506449 293314
5032B93314R72901j225412J45821J33754m63489K2206Q19441p71390n05973P02581
$$ 293314 1266215 40803 186624 320378 -143111 -120905 698536 -72854 -578827 123754
5022A23754l21189J1511K55057l37912j90235n5253N68528O7475J85721j37659
$$ 123754 -197435 -185924 69133 -268779 -459014 -514267 54261 121736 307457 169798
5012A69798l57486m27614j0122j48670M77837K40342m37832M18606O3493o78150
$$ 169798 -187688 -615302 -625424 -774094 -296257 -55915 -493747 -75141 -11648 -689798
5002f89798J180358r5564m95360M80539k94605J98737M75252m50602q1360K26504
$$ -689798 490560 394996 -100364 380175 85570 284307 759559 308957 227597 454101
4992D54101l32793L3060m6612L80593j75358K5154p84977m61889J86054m77064
$$ 454101 121308 154368 107756 488349 312991 338145 -446832 -908721 -722667 -1199731
4982a199731J174485j98744k16219R72392Q50736l50094l86257K49822l78561
$$ -1199731 -25246 -223990 -440209 532183 1382919 1032825 646568 896390 517829
4973E17829l91529n69301K15682R32188K19325K08618m76471m19982K88391n00625
$$ 517829 126300 -443001 -227319 704869 924194 1132812 656341 236359 524750 24125
4963B4125O14088K29334n79667j08109R7819j30736n35607R0037L24634n28918
$$ 24125 638213 867547 287880 179771 277590 146854 -388753 -298716 25918 -503000
4953e03000K8455J92210J55881k66031O83189j15295J07240J27866q13985j43038
$$ -503000 -474545 -282335 -126454 -392485 290704 175409 282649 410515 -403470 -546508
4943e46508N82454M79335m01212m77152K38661k01721m23726J69732M52185j38978
$$ -546508 35946 515281 114069 -363083 -124422 -326143 -749869 -580137 -127952 -266930
4933b66930J38850o47821l44198L33431Q03423k14845J43090k21585J59481l45574
$$ -266930 -128080 -775901 -1120099 -786668 16755 -198090 -55000 -276585 -117104 -462678
4923d62678J2699R07208o26527L19682Q48094j25284j003856k28093k49566N80688
$$ -462678 -449979 457229 -169298 150384 998478 873194 -130662 -358755 -608321 -27633
4913b7633l07483K90552o49647L00377L79224j058489O32581J4738K88128L71781
$$ -27633 -335116 -44564 -694211 -393834 -14610 -1073099 -440518 -425780 -137652 234129
4903B34129l00530K05486l48645K54246M35243r67227J7935P77437J07127J77469
$$ 234129 -66401 139085 -209560 44686 479929 -487298 -469363 308074 415201 592670
4893E92670K30435N4409j68640k28304l29928J60579M86275p22531k89987k47737
$$ 592670 823105 877514 708874 480570 150642 311221 797496 74965 -215022 -462759
4883d62759O33215K44693n04707L40371K20277o67169O94356P3698j95486l05201
$$ -462759 170456 415149 -89558 250813 471090 -196079 498277 571975 376489 71288
4873G1288k61345R9221k83744m66564m89992L16445k11150R09543K69554j06205
$$ 71288 -190057 -90836 -374580 -841144 -1331136 -1014691 -1225841 -316298 -46744 -152949
$$ [...]
##END NTUPLES=NMR SPECTRUM
##END=
