##TITLE=1H_TG-2364-x1
 CDCl3
 40 sc, 
 17.11.2022
##JCAMPDX= 6.0         $$ Bruker NMR JCAMP-DX V2.0
##DATA TYPE= NMR SPECTRUM
##DATA CLASS= NTUPLES
##ORIGIN= UXNMR, Bruker Analytische Messtechnik GmbH
##OWNER= root
$$ XWIN-NMR		Version 3.5
$$ Thu Nov 17 14:29:49 2022 Russian Standard Time (UT+4h)  she@DPX200
##.OBSERVE FREQUENCY= 200.1313499994
##.OBSERVE NUCLEUS= ^1H
##.ACQUISITION MODE= SIMULTANEOUS
##.ACQUISITION SCHEME= undefined
##.AVERAGES= 32
##.DIGITISER RES= 18
##SPECTROMETER/DATA SYSTEM= spect
##.PULSE SEQUENCE= zg30
##.SOLVENT NAME= CDCl3
##.SHIFT REFERENCE= (INTERNAL, CDCl3, 0, 15.7392)
##AUDIT TRAIL= $$ (NUMBER, WHEN, WHO, WHERE, WHAT)
$$ ##TITLE= Audit trail, XWIN-NMR		Version 3.5
$$ ##JCAMPDX= 5.01
$$ ##ORIGIN= Bruker BioSpin GmbH
$$ ##OWNER= she
$$ F:/spectra/data/she/nmr/H-F/1/pdata/1/auditp.txt
$$ ##AUDIT TRAIL=  $$ (NUMBER, WHEN, WHO, WHERE, WHAT)
(   1,<2022-11-17 14:28:07.56 +0400>,<she>,<DPX200>,
      <continue with go, POWCHK disabled, PULCHK disabled
       configuration hash MD5:
       00 E9 B6 7A A2 85 ED C7 34 08 36 98 17 FE 4E 26
       data hash MD5: 16K
       33 07 93 E7 9D AC EE A9 67 4B 51 BE FB 75 3F 92>)
(   2,<2022-11-17 14:28:10.75 +0400>,<she>,<DPX200>,
      <Start of raw data processing
       efp BC_mod = 2 LB = 0.24 FT_mod = 6 PKNL = 1 PHC0 = -18035.95 PHC1 = 17.8007 SI = 16K 
       data hash MD5: 16K
       54 71 B1 C1 46 BD 8B 5A 66 9D 47 94 F6 D6 28 2A>)
(   3,<2022-11-17 14:28:30.93 +0400>,<she>,<DPX200>,
      <pk PHC0 = 3.696952 PHC1 = -2.8 
       data hash MD5: 16K
       C0 86 B9 D9 71 E7 35 78 BC 62 0D 9D C9 80 A0 D8>)
(   4,<2022-11-17 14:28:34.23 +0400>,<she>,<DPX200>,
      <abs ABSG = 5 
       data hash MD5: 16K
       0C F5 CD 53 8E AD FA DC 8F DD 77 28 DF CF 0D 56>)
$$ ##END=
$$ 
$$ hash MD5
$$ 4C CA 90 CA 41 16 15 A9 2E 44 35 68 C4 78 25 08
##$RELAX= 
##$RELAX= 
##$RELAX= 
##$RELAX= 
##$RELAX= 
##$RELAX= 
$$ Bruker specific parameters
$$ --------------------------
##$DU= <F:/spectra>
##$EXPNO= 1
##$NAME= <H-F>
##$PROCNO= 1
##$TYPE= <nmr>
##$USER= <she>
##$AMP= (0..31)
100 100 100 100 100 100 100 100 100 100 100 100 100 100 100 100 100 100 
100 100 100 100 100 100 100 100 100 100 100 100 100 100 
##$AQSEQ= 0
##$AQ_mod= 1
##$AUNM= <au_zg>
##$AUTOPOS= <>
##$BF1= 200.13
##$BF2= 200.13
##$BF3= 200.13
##$BF4= 200.13
##$BF5= 200.13
##$BF6= 200.13
##$BF7= 200.13
##$BF8= 200.13
##$BYTORDA= 1
##$CFDGTYP= 0
##$CFRGTYP= 5
##$CHEMSTR= <none>
##$CNST= (0..31)
1 1 145 1 1 1 1 1 1 1 1 1 1 1 1 1 1 1 1 1 1 1 1 1 1 1 1 1 1 1 1 1 
##$CPDPRG= <>
##$CPDPRG1= <>
##$CPDPRG2= <>
##$CPDPRG3= <>
##$CPDPRG4= <mlev>
##$CPDPRG5= <mlev>
##$CPDPRG6= <mlev>
##$CPDPRG7= <mlev>
##$CPDPRG8= <mlev>
##$CPDPRGB= <>
##$CPDPRGT= <>
##$D= (0..31)
0 1.2 0 0 0 0 0 0 0 0.06 0 0.03 0 0 0 0 0.0002 0 0 0 0 0 0 0 0 0 0 0 0 
0 0 0 
##$DATE= 1668680717
##$DBL= (0..7)
120 120 120 120 120 120 120 120 
##$DBP= (0..7)
150 150 150 150 150 150 150 150 
##$DBP07= 0
##$DBPNAM0= <>
##$DBPNAM1= <>
##$DBPNAM2= <>
##$DBPNAM3= <>
##$DBPNAM4= <>
$$ [...]
##$SUBNAM3= <"">
##$SUBNAM4= <"">
##$SUBNAM5= <"">
##$SUBNAM6= <"">
##$SUBNAM7= <"">
##$SUBNAM8= <"">
##$SUBNAM9= <"">
##$SW= 18.0517283424941
##$SWIBOX= (0..15)
0 0 2 0 0 0 0 0 0 0 0 0 0 0 0 0 
##$SW_h= 3612.71676300578
##$TD= 16384
##$TD0= 1
##$TE= 0
##$TE2= 300
##$TE3= 300
##$TEG= 300
##$TL= (0..7)
0 120 120 120 120 120 120 120 
##$TP= (0..7)
150 150 150 150 150 150 150 150 
##$TP07= 0
##$TPNAME0= <>
##$TPNAME1= <>
##$TPNAME2= <>
##$TPNAME3= <>
##$TPNAME4= <>
##$TPNAME5= <>
##$TPNAME6= <>
##$TPNAME7= <>
##$TPOAL= (0..7)
0.5 0.5 0.5 0.5 0.5 0.5 0.5 0.5 
##$TPOFFS= (0..7)
0 0 0 0 0 0 0 0 
##$TUNHIN= 0
##$TUNHOUT= 0
##$TUNXOUT= 0
##$USERA1= <user>
##$USERA2= <user>
##$USERA3= <user>
##$USERA4= <user>
##$USERA5= <user>
##$V9= 5
##$VALIST= <valist>
##$VCLIST= <CCCCCCCCCCCCCCC>
##$VD= 0
##$VDLIST= <DDDDDDDDDDDDDDD>
##$VPLIST= <PPPPPPPPPPPPPPP>
##$VTLIST= <TTTTTTTTTTTTTTT>
##$WBST= 1024
##$WBSW= 4
##$XGAIN= (0..3)
0 0 0 0 
##$XL= 0
##$YL= 0
##$YMAX_a= 152658
##$YMIN_a= -223782
##$ZGOPTNS= <>
##$ZL1= 120
##$ZL2= 120
##$ZL3= 120
##$ZL4= 120
##$ABSF1= 15.73918
##$ABSF2= -2.31267
##$ABSG= 5
##$ABSL= 3
##$ALPHA= 0
##$AQORDER= 0
##$ASSFAC= 0
##$ASSFACI= 0
##$ASSFACX= 0
##$ASSWID= 0
##$AUNMP= <proc_1d>
##$AZFE= 0.1
##$AZFW= 0.1
##$BCFW= 0
##$BC_mod= 2
##$BYTORDP= 0
##$COROFFS= 0
##$CY= -3
##$DATMOD= 1
##$DC= 0
##$DFILT= <>
##$DTYPP= 0
##$F1P= 0
##$F2P= 0
##$FCOR= 1
##$FTSIZE= 16384
##$FT_mod= 6
##$GAMMA= 0
##$GB= 0
##$INTBC= 1
##$INTSCL= 3.70164e-10
##$ISEN= 128
##$LB= 0.24
##$LEV0= 0
##$LPBIN= 0
##$MAXI= 10000
##$MC2= 0
##$MEAN= 0
##$ME_mod= 0
##$MI= 1.114404
##$NCOEF= 0
##$NC_proc= -7
##$NLEV= 6
##$NOISF1= 3.799351
##$NOISF2= 2.8
##$NSP= 0
##$NTH_PI= 0
##$NZP= 0
##$OFFSET= 15.73918
##$PC= 1
##$PHC0= -18032.25
##$PHC1= 15.0007
##$PH_mod= 1
##$PKNL= yes
##$PPARMOD= 0
##$PSCAL= 0
##$PSIGN= 0
##$REVERSE= no
##$SF= 200.130006476493
##$SI= 16384
##$SIGF1= 3
##$SIGF2= 2
##$SINO= 5.538805
##$SIOLD= 16384
##$SREGLST= <1H.CDCl3>
##$SSB= 0
##$STSI= 16384
##$STSR= 0
##$SW_p= 3612.71676300578
##$SYMM= 0
##$S_DEV= 0
##$TDeff= 16384
##$TDoff= 0
##$TI= <>
##$TILT= no
##$TM1= 0
##$TM2= 0
##$TOPLEV= 0
##$USERP1= <user>
##$USERP2= <user>
##$USERP3= <user>
##$USERP4= <user>
##$USERP5= <user>
##$WDW= 1
##$XDIM= 16384
##$YMAX_p= 488326091
##$YMIN_p= -1189957
$$ End of Bruker specific parameters
$$ ---------------------------------
##NTUPLES= NMR SPECTRUM
##VAR_NAME=  FREQUENCY,     SPECTRUM/REAL,   SPECTRUM/IMAG
##SYMBOL=    X,             R,               I
##VAR_TYPE=  INDEPENDENT,   DEPENDENT,       DEPENDENT
##VAR_FORM=  AFFN,          ASDF,            ASDF
##VAR_DIM=   16384,         16384,           16384
##UNITS=     HZ,            ARBITRARY UNITS, ARBITRARY UNITS
##FACTOR=    0.220516191357247, 1,           1
##FIRST=     3149.88211752535, 0,            0
##LAST=      -462.834645480426, 0,           0
##MIN=       -462.834645480426, -1189957,    0
##MAX=       3149.88211752535, 488326091,    0
$$ Real data points
##PAGE= N=1
##DATA TABLE= (X++(R..R)), XYDATA
$$ [...]
$$ plain form
5033 229965 448690 239629 182695 20874 194653 22821 327484 415432 350727 -82540
5023 -82540 -195996 4305 425008 803839 902732 1089610 941793 991835 499589 62210
5013 62210 297614 470451 645183 692177 515404 660261 350268 554240 365771 241354
5003 241354 386974 155521 156854 30488 -140002 169263 185405 -15643 -98050 -58700 54650
4992 54650 514127 127812 484614 349107 621804 907059 671392 600012 583597 226588
4982 226588 277919 343045 483238 72761 -161048 562107 499624 157961 117289 -92166
4972 -92166 18263 207792 123053 299667 935618 759996 887055 915097 872935 917870 610513
4961 610513 886900 579395 681407 374766 535118 411526 328668 532693 488769 594888
$$ packed form
5033B29965K18725k09061n6934j61821J73779j71832L04663Q7948o4705m33267
5023h2540j13456K00301M20703L78831R8893J86878j47817N0042m92246m37379
5013F2210K35404J72837J74732M6994j76773J44857l09993K03972j88469j24417
5003B41354J45620k31453J333j26366j70490L09265J6142k01048q2407L9350J13350
4992E4650M59477l86315L56802j35507K72697K85255k35667p1380j6415l57009
4982B26588N1331O5126J40193m10477k33809P23155o2483l41663m0672k09455
4972i2166J10429J89529q4739J76614O35951j75622J27059K8042m2162M4935l07357
4961F10513K76387l07505J02012l06641J60352j23592q2858K04025m3924J06119
$$ plain form
4951 594888 233856 191466 172617 -108915 -11979 242672 653901 773295 438074 204158
4941 204158 762246 629336 525049 604084 446269 90384 332870 -51497 -81170 -101091
4931 -101091 -27247 -16141 156051 340658 511269 891000 894199 699470 366647 484704
4921 484704 203523 -91132 87127 328362 359277 275089 165949 168614 195452 263462 192601
4910 192601 190890 500442 624137 530142 518075 494006 521275 559581 549304 706781 456174
4899 456174 373554 463916 301527 414330 547411 749301 590094 299236 425637 590616
4889 590616 865942 639071 584281 686481 568787 527551 597582 779483 861146 622083
4879 622083 3370 24421 523159 572175 399264 542531 646062 288403 245010 718689
$$ packed form
4951E94888l61032m2390j8849k81532R6936K54651M11229J19394l35221k33916
4941B04158N58088j32910j04287P9035j57815l55885K42486l84367k9673j9921
4931a01091P3844J1106J72192J84607J70611L79731L199j94729l32823J18057
4921D84704k81181k94655J78259K41235L0915q4188j09140K665K6838O8010p0861
4910A92601j711L09552J23695r3995j2067k4069K7269L8306j0277J57477k50607
4899D56174q2620R0362j62389J12803J33081K01890j59207k90858J26401J64979
4889E90616K75326k26871n4790J02200j17694m1236P0031J81901Q1663k39063
4879F22083o18713K1051M98738M9016j72911J43267J03531l57659m3393M73679
$$ plain form
4869 718689 -88999 114931 634035 655431 271306 118655 329979 580407 566957 390872
4859 390872 572602 632612 689806 604473 483679 381790 429026 867972 781834 731204 800758
4848 800758 373805 280891 184246 174938 233734 192854 184675 65474 383275 725870 831245
4837 831245 888458 654241 797332 743969 703673 224372 368313 393464 787200 901090
4827 901090 948054 908165 468260 382505 385228 283883 292011 603920 849916 1007450 615423
4816 615423 616969 600362 542679 520443 346283 352152 210612 137418 -41473 -308206 69642
4805 69642 250617 619582 1057876 664516 544636 891091 644027 933506 851678 691164
4795 691164 643846 436148 384137 651747 382306 586090 575482 450370 735525 535130
$$ packed form
4869G18689q07688K03930N19104K1396l84125j52651K11324K50428j3450j76085
4859C90872J81730O0010N7194q5333j20794j01889M7236M38946q6138n0630O9554
4848H00758m26953r2914r6645r308N8796m0880q179j19201L17801L42595J05375
4837H31245N7213k34217J43091n3363m0296m79301J43941K5151L93736J13890
4827I01090M6964l9889m39905q5755K723j01345Q128L11909K45996J57534l92027
4816F15423J546j6607n7683k2236j74160N869j41540p3194j78891k66733L77848
4805F9642J80975L68965M38294l93360j19880L46455k47064K89479q1828j60514
4795F91164m7318k07698n2011K67610k69441K03784j0608j25112K85155k00395
$$ plain form
4785 535130 593854 655857 551770 612251 884362 935849 1022749 986819 688359 341403 372794
4774 372794 630125 1216011 1167022 1077761 1218633 893756 641866 505221 575033 736372
4764 736372 729053 806472 1033735 480801 590491 742236 665343 844150 436903 534965 856098
4753 856098 911924 495825 371555 611001 607448 531170 594128 637155 923798 833531 557493
4742 557493 300952 578171 754967 1026291 1099816 824785 922568 913104 938486 891866 598901
4731 598901 793344 998232 1058152 1021736 889217 911621 790080 1101931 592893 835874
4721 835874 981857 1035918 1089422 446224 572218 1090527 923655 1007768 908917 564778
4711 564778 489270 762247 1121330 979772 1386363 1609943 797351 555633 882898 737141
$$ packed form
4785E35130N8724O2003j04087O0481K72111N1487Q6900l5930k98460l46956L1391
4774C72794K57331N85886m8989q9261J40872l24877k51890j36645O9812J61339
4764G36372p319P7419K27263n52934J09690J51745p6893J78807m07247R8062L21133
4753H56098N5826m16099j24270K39446l553p6278O2958M3027K86643r0267k76038
4742E57493k56541K77219J76796K71324P3525k75031R7783r464K5382m6620k92965
4731E98901J94443K04888N9920l6416j32519K2404j21541L11851n09038K42981
4721H35874J45983N4061N3504o43198J25994N18309j66872Q4113r8851l44139
4711E64778p5508K72977L59083j41558M06591K23580q12592k41718L27265j45757
$$ plain form
4701 737141 1023035 1224482 977388 755388 939835 1220249 1379360 1354689 1115223 769164
4691 769164 631186 923348 1394682 1130618 1091377 983920 864708 1207284 1234904 1220376
4681 1220376 1528030 1225729 1085240 1049729 978293 1423942 1041042 890132 890913 194246
4671 194246 535105 695323 490642 795300 762320 732946 878248 878927 1151967 1240902 1035141
4660 1035141 1123755 1143638 1133660 1149171 1865217 1875305 1193451 999063 1247551 1555711 1086660
4649 1086660 1078488 937040 846502 1677255 1692097 1593579 1379289 1590507 1341512 1211071
4639 1211071 1491936 1850754 1645000 1293516 1256686 1246618 1350489 1647234 1711217 1535640
4629 1535640 1586320 1310238 1580075 1384898 1484142 1290054 1644312 1785936 1714388 1519594
$$ packed form
4701G37141K85894K01447k47094k22000J84447K80414J59111k4671k39466l46059
4691G69164j37978K92162M71334k64064l9241j07457j19212L42576K7620j4528
4681A220376L07654l02301j40489l5511p1436M45649l82900j50910P81o96667
4671A94246L40859J60218k04681L04658l2980k9374J45302O79K73040Q8935k05761
4660A035141Q8614J9883r978J5511P16046J0088o81854j94388K48488L08160m69051
4649A086660q172j41448r0538Q30753J4842r8518k14290K11218k48995j30441
4639A211071K80865L58818k05754l51484l6830j0068J03871K96745O3983j75577
4629A535640N0680k76082K69837j95177R9244j94088L54258J41624p1548j94794
$$ plain form
4619 1519594 1597669 1557123 1383181 1611440 1521219 1312265 1411041 1538592 1511922 1627568
4609 1627568 1866144 1642513 1553460 1442860 1951533 1913748 1838691 1928927 2070696 2106504
4599 2106504 2189985 2143865 1971270 1813856 1699990 1865193 1823387 2021511 2115941 1740046
4589 1740046 2014850 2684495 2462224 2339951 1998805 2129480 2180663 1891247 1800949 2155424
4579 2155424 2180852 2396335 2531954 2268411 1691283 2042798 1883405 2042317 1877522 2057060
4569 2057060 1896594 2137228 2274851 2443260 2662285 2677665 2225826 2119521 2589865 2529478
4559 2529478 2606295 2723413 2211276 2146283 2392416 2695722 2625484 2598895 2955692 2793170
4549 2793170 2627128 2720505 2614013 2657796 2712092 2627547 2670277 2198100 2508759 2640305
$$ packed form
4619A519594P8075m0546j73942K28259r0221k08954R8776J27551k6670J15646
4609A627568K38576k23631q9053j10600N08673l7785p5057R0236J41769L5808
4599B106504Q3481m6120j72595j57414j13866J65203m1806J98124R4430l75895
4589A740046K74804O69645k22271j22273l41146J30675N1183k89416r0298L54475
4579B155424K5428K15483J35619k63543n77128L51515j59393J58912j64795J79538
4569B057060j60466K40634J37623J68409K19025J5380m51839j06305M70344o0387
4559B529478P6817J17118n12137o4993K46133L03306p0238k6589L56797j62522
4549B793170j66042R3377j06492M3783N4296q4545M2730m72177L10659J31546
$$ plain form
4539 2640305 2614570 2736381 2801956 2936161 2895303 2937801 2752170 2282038 2441556 2536130
4529 2536130 2669626 2993122 3175298 3220551 3397694 3190233 2826992 2866665 2890699 3133876
4519 3133876 3276762 3006861 3500622 3608477 3519514 3564654 3704336 3596746 3668957 3797104
4509 3797104 3838780 3931291 3827031 3760893 3654400 3401988 3383833 3220395 3406115 3852376
4499 3852376 3900761 3651139 3883298 4113290 3735685 3829636 4465725 4337639 4419439 4265980
4489 4265980 4227358 4152601 4543698 4327698 3918943 3796799 4212363 4464879 4678264 4807854
4479 4807854 4571453 4209153 4706856 5008684 5137477 4914512 5102573 5481460 5133458 5162676
4469 5162676 5070375 5160221 5048993 5116936 4903154 5031926 4992534 5327452 5434076 5672187
$$ packed form
4539B640305k5735J21811O5575J34205m0858M2498j85631m70132J59518R4574
4529B536130J33496L23496J82176M5253J77143k07461l63241L9673K4034K43177
4519C133876J42886k69901M93761J07855q8963M5140J39682j07590P2211J28147
4509C797104M1676R2511j04260o6138j06493k52412j8155j63438J85720M46261
4499C852376M8385k49622K32159K29992l77605R3951O36089j28086Q1800j53459
4489D265980l8622p4757L91097k16000m08755j22144M15564K52516K13385J29590
4479D807854k36401l62300M97703L01828J28793k22965J88061L78887l48002K9218
4469E162676r2301Q9846j11228O7943k13782J28772l9392L34918J06624K38111
$$ plain form
4459 5672187 5655539 5406973 5158135 5250662 5221895 5567235 5743081 6149525 6298558 6355440
4449 6355440 6390475 6221080 6460862 6836840 6911545 6717787 6553830 6637184 6859425 6766769
4439 6766769 6685539 7052193 7507404 7459349 7263581 7657547 7692641 7715194 7920164 8287150
4429 8287150 8267154 8155927 8121094 7880543 8122770 8299212 8959364 9081688 8868493 9244497
4419 9244497 8974923 9183092 9348004 9539160 9381825 9425372 9803554 9794645 9972507 9783008
4409 9783008 9571835 9628484 10292056 10684181 10968098 10601357 10999851 10443434 10184345 11324324
4399 11324324 11699053 11724844 11595598 12137423 12254851 12353106 12278564 12677174 12871349 13170254
4389 13170254 13419214 13426553 13399515 13983539 14247288 14030054 14570003 14333881 14656024 14987908
$$ packed form
4459E672187j6648k48566k48838R2527k8767L45340J75846M06444J49033N6882
4449F355440L5035j69395K39782L75978P4705j93758j63957Q3354K22241r2656
4439F766769q1230L66654M55211m8055j95768L93966L5094K2553K04970L66986
4429H287150j9996j11227l4833k40551K42227J76442O60152J22324k13195L76004
4419I244497k69574K08169J64912J91156j57335M3547L78182q909J77862j89499
4409I783008k11173N6649O63572L92125K83917l66741L98494n56417k59089J139979
4399A1324324L74729K5791j29246N41825J17428R8255p4542L98610J94175K98905
4389A3170254K48960P339k7038N84024K63749k17234N39949k36122L22143L31884
$$ plain form
4379 14987908 15499144 15627360 15675034 16012716 16398134 16530068 17150088 17266791 17724860 17473487
4369 17473487 17792333 18172502 18283594 19139861 19085229 19656458 20036836 20189642 20615567 21078735
4359 21078735 21524281 22253551 22700476 23052885 23199071 23746191 24424098 25250671 25747743
4350 25747743 26073839 26689369 27029585 27376375 27652475 28332092 28288069 28510938 28774292 29155339
4340 29155339 29684965 29934275 30496759 30699828 31530754 32070029 32722226 33199378 33823612
4331 33823612 34119745 34841313 35085728 35306512 35987976 36677281 36911503 37626849 37868120
4322 37868120 38075387 38508565 38977811 39342746 39554365 39702318 39603192 39902779 40289993 40629954
4312 40629954 40511481 40589571 40820356 40747536 40630484 40755430 40584922 40118513 40076206 39993206
$$ packed form
4379A4987908N11236J28216M7674L37682L85418J31934O20020J16703M58069k51373
4369A7473487L18846L80169J11092Q56267n4632N71229L80378J52806M25925M63168
4359B1078735M45546P29270M46925L52409J46186N47120O77907Q26573M97072
4350B5747743L26096O15530L40216L46790K76100O79617m4023K22869K63354L81047
4340B9155339N29626K49310N62484K03069Q30926N39275O52197M77152O24234
4331C3823612K96133P21568K44415K20784O81464O89305K34222P15346K41271
4322C7868120K07267M33178M69246L64935K11619J47953r9126K99587L87214L39961
4312D0629954j18473P8090K30785p2820j17052J24946j70508m66409m2307q3000
$$ plain form
4302 39993206 39750479 39636785 39554437 39529431 38791895 38298510 37688739 37383712 36879709 36349324
4292 36349324 35664747 35105095 34582936 34629995 34332549 33765376 32937209 32537527 32064564 31927973
4282 31927973 31501261 30710148 30346195 30143470 29576907 28694438 28292999 28171988 27432931
4273 27432931 27050002 27136911 26557516 26291493 25786656 24921175 25004647 24723545 23939681 23600213
4263 23600213 23378214 23201939 23155522 23093489 22516276 21958504 21834661 21584411 21407670 21297698
4253 21297698 20839236 20672833 21011996 21137491 20340808 20300387 20091138 19623976 19886690 19543868
4243 19543868 19429301 19526486 19462605 19244933 19142742 19096923 19318686 19036607 19536338 19552765
4233 19552765 19295481 19148213 19324827 19582628 19875354 20256175 19773311 19546489 19550143 19571516
$$ packed form
4302C9993206k42727j13694q2348k5006p37536m93385o09771l05027n04003n30385
4292C6349324o84577n59652n22159M7059k97446n67173q28167l99682m72963j36591
4282C1927973m26712p91113l63953k02725n66563q82469m01439j21011p39057
4273B7432931l82929Q6909n79395k66023n04837q65481Q3472k81102p83864l39468
4263B3600213k21999j76275m6417o2033n77213n57772j23843k50250j76741j09972
4253B1297698m58462j66403L39163J25495p96683m0421k09249m67162K62714l42822
4243A9543868j14567R7185o3881k17672j02191m5819K21763k82079M99731J6427
4233A9552765k57284j47268J76614K57801K92726L80821m82864k26822L654K1373
$$ plain form
4223 19571516 19285094 19407178 18976614 18981841 18656579 18703321 18783089 18924221 19011283 18684756
4213 18684756 18474984 18608774 18734264 18846083 19183209 19256019 18972057 19209073 19337184 19327736
4203 19327736 19804687 20134297 19734012 19971941 20030078 20272129 20212479 20582678 20947237 20915126
4193 20915126 21216353 21598900 21959968 22089840 22247345 22883320 22816479 22942326 23626221 24356761
4183 24356761 24415237 24973150 25231931 25507167 26231832 26839736 27417825 27891705 28073932 28415895
4173 28415895 29483560 30405662 30955990 31646777 32436081 33495596 34951086 35894255 36507394
4164 36507394 37511634 38511655 39480418 40306462 41142032 42657921 43894932 45484088 46722941
4155 46722941 48083561 49426839 50657340 51899816 53538554 55050267 56403102 57577706
$$ packed form
4223A9571516k86422J22084m30564N227l25262M6742P9768J41132Q7062l26527
4213A8684756k09772J33790J25490J11819L37126P2810k83962K37016J28111r448
4203A9327736M76951L29610m00285K37929N8137K42051n9650L70199L64559l2111
4193B0915126L01227L82547L61068J29872J57505O35975o6841J25847O83895P30540
4183B4356761N8476N57913K58781K75236P24665O07904N78089M73880J82227L41963
4173B8415895J067665R22102N50328O90787P89304J059515J455490R43169O13139
4164C6507394J004240J000021R68763Q26044Q35570J515889J237011J589156J238853
4155D6722941J360620J343278J230501J242476J638738J511713J352835J174604
$$ plain form
4147 57577706 59037063 60422228 61999927 63305489 64290317 65554708 67262933 68208694
4139 68208694 69478928 69952961 70922983 72296795 72639399 72744591 73125048 73401412 73813365
4130 73813365 73882466 73903712 74047489 73451446 72809348 73219956 72562168 71466817 70392423
4121 70392423 69366060 68462495 67323564 65883086 64542502 63456492 61977504 60792489
4113 60792489 59283986 57738268 56312817 54658534 52950349 51524352 50041711 48404900
4105 48404900 47079735 45752281 44647586 43573263 42106759 40747940 39508119 38426443
4097 38426443 37448927 36343254 35132089 34036469 33430443 32760657 31565656 30613654 29525673
4088 29525673 28848931 28026239 27555522 27374348 26738416 26598898 26082966 25856648 25349542
$$ packed form
4147E7577706J459357J385165J577699J305562R84828J264391J708225R45761
4139F8208694J270234M74033R70022J373812L42604J05192L80457K76364M11953
4130G3813365O9101K1246J43777n96043o42098M10608o57788j095351j074394
4121G0392423j026363r03565j138931j440478j340584j086010j478988j185015
4113F0792489j508503j545718j425451j654283j708185j425997j482641j636811
4105D8404900j325165j327454j104695j074323j466504j358819j239821j081676
4097C8426443r77516j105673j211165j095620o06026o69786j195001r52002j087981
4088B9525673o76742q22692m70717j81174o35932j39518n15932k26318n07106
$$ plain form
4079 25349542 25300804 25027126 24954958 25024230 24496608 23581526 22839589 22203363 20890157 20846536
4069 20846536 20052695 19718023 19225682 18816663 18497504 18081190 17916203 17152895 16517274
4060 16517274 16217548 15685067 15451952 15620059 15624853 15015576 15105119 15282278 15120582 14637291
4050 14637291 14059388 13628215 14027720 13787066 13947540 13658449 13122555 13235029 13295222 13341778
4040 13341778 13301935 13052317 12853265 12957709 12600890 12324477 12160392 12154453 11913869 11540380
4030 11540380 11642385 11548087 11674244 11814658 11524006 11385453 11470774 11278673 10888170 10608628
4020 10608628 10627876 10625225 10606841 10058780 10158060 10635749 10525770 10631833 10504731 10532260
4010 10532260 10489237 10412122 10509748 10591810 10252034 10447720 10484969 10272549 10119120 10146401
$$ packed form
4079B5349542m8738k73678p2168O9272n27622r15082p41937o36226j313206m3621
4069B0846536p93841l34672m92341m09019l19159m16314j64987p63308o35621
4060A6517274k99726n32481k33115J68107M794o09277Q9543J77159j61696m83291
4050A4637291n77903m31173L99505k40654J60474k89091n35894J12474O0193M6556
4040A3341778l9843k49618j99052J04444l56819k76413j64085n939k40584l73489
4030A1540380J02005r4298J26157J40414k90652j38553Q5321j92101l90503k79542
4020A0608628J9248k651j8384n48061R9280M77689j09979J06063j27102K7529
4010A0532260m3023p7115R7626Q2062l39776J95686L7249k12420j53429K7281
$$ plain form
4000 10146401 10372489 10296918 10439157 10600156 10479883 10677495 10835846 10988468 10867643 10858233
3990 10858233 10883783 11378368 11568992 11399667 11142907 11110213 10957207 10996312 10591682 10496921
3980 10496921 10616596 10777582 10744095 10767400 11003112 10817338 10509089 10570697 10582526 10570476
3970 10570476 10648771 10750620 10815764 10945843 11025987 11447694 11794015 11894583 12140050 11943698
3960 11943698 12160882 11702332 11770876 11757314 11569317 11632237 11624293 11577682 11719181 11714333 11082642
3949 11082642 11108780 11292931 11541022 11644423 12463815 12291987 12298957 12468612 12148382 12347080
3939 12347080 12059114 12463134 12566234 12363300 12084982 12452729 12504531 12106241 12147290 12761149
3929 12761149 12571383 13150509 13493415 12709454 12681212 12928051 12839448 12561413 12594152 13054164
$$ packed form
4000A0146401K26088p5571J42239J60999j20273J97612J58351J52622j20825r410
3990A0858233K5550M94585J90624j69325k56760l2694j53006L9105m04630r4761
3980A0496921J19675J60986l3487K3305K35712j85774l08249O1608J1829j2050
3970A0570476P8295J01849O5144J30079Q0144M21707L46321J00568K45467j96352
3960A1943698K17184m58550O8544j3562j87997O2920p944m6611J41499m848o31691
3949A1082642K6138J84151K48091J03401Q19392j71828O970J69655l20230J98698
3939A2347080k87966M04020J03100k02934k78318L67747N1802l98290M1049O13859
3929A2761149j89766N79126L42906p83961k8242K46839q8603k78035L2739M60012
$$ plain form
3919 13054164 13421348 13283006 13011575 13194191 13470030 13669181 13683186 13725156 14199385 14106565
3909 14106565 14487017 14374383 14399728 14276715 14881373 15190153 15236837 15247277 15392569 15857471
3899 15857471 15657014 15188222 15436307 15946241 15955681 16445595 16506314 16473145 16950781 17157235
3889 17157235 17026846 17023407 16924625 17360856 17281521 17541609 17850872 18286427 18540687 18447829
3879 18447829 18486699 18803049 19007158 19494816 19832660 20033043 20103633 20318781 20682385 21093727
3869 21093727 21009804 21386970 21783770 21795085 22483350 22611948 22883364 23130881 23588121 23460150
3859 23460150 23750413 24449181 24680078 24956290 25559812 26034809 26465184 27075308 27684399
3850 27684399 27632048 28010502 28130480 28287505 29103954 29332475 29950988 30683469 31210329 31772914
$$ packed form
3919A3054164L67184j38342k71431J82616K75839J99151J4005M1970M74229r2820
3909A4106565L80452j12634K5345j23013O04658L08780M6684J0440J45292M64902
3899A5857471k00457m68792K48085N09934R440M89914O0719l3169M77636K06454
3889A7157235j30389l439r8782M36231p9335K60088L09263M35555K54260r2858
3879A8447829L8870L16350K04109M87658L37844K00383P0590K15148L63604M11342
3869B1093727q3923L77166L96800J1315O88265J28598K71416K47517M57240j27971
3859B3460150K90263O98768K30897K76212O03522M74997M30375O10124O09091
3850B7684399n2351L78454J19978J57025Q16449K28521O18513P32481N26860N62585
$$ plain form
3840 31772914 32204248 32736856 33180908 33952941 34462819 35026431 35755017 36253717 37005714
3831 37005714 37712836 38522412 38956311 39836381 40473158 41687752 42303736 42859630 43716014
3822 43716014 44943634 45629315 46716677 47910404 48680033 49856140 50658946 51563663 52454159
3813 52454159 53985440 55287638 56607716 57970790 59055410 60347215 61634331 63033357
3805 63033357 64401272 65670140 67133631 68301277 69619616 70672236 72633601 74062094
3797 74062094 75297466 76751584 77942802 79482872 80661894 82099252 83864749 84941317
3789 84941317 86398860 87513861 88697851 90272816 91438175 91749158 92281451 93260978 94245331
3780 94245331 94996984 95540141 95541205 95584449 95596049 95739042 95596451 95436914 95454000 95094944
$$ packed form
3840C1772914M31334N32608M44052P72033N09878N63612P28586M98700P51997
3831C7005714P07122Q09576M33899Q80070O36777J214594O15984N55894Q56384
3822D3716014J227620O85681J087362J193727P69629J176107Q02806R04717Q90496
3813E2454159J531281J302198J320078J363074J084620J291805J287116J399026
3805F3033357J367915J268868J463491J167646J318339J052620J961365J428493
3797G4062094J235372J454118J191218J540070J179022J437358J765497J076568
3789H4941317J457543J115001J183990J574965J165359L10983N32293R79527R84353
3780I4245331P51653N43157J064M3244J1600J42993j42591j59537J7086l59056
$$ plain form
3770 95094944 94701006 94151980 93569745 93076491 92830613 91848837 91008913 89800868 88646360
3761 88646360 87567955 86789263 85080061 84062226 83230546 81662138 80519810 79650603 78557919
3752 78557919 77730745 76414209 74873215 74314820 73440376 72084019 71089123 70056157 69110320
3743 69110320 68885240 67961848 66579165 66297553 65936130 64894267 64619421 64025714 63680323
3734 63680323 63159294 62744615 62386348 62077315 62226057 62002281 61922849 61950453 61986760 61423555
3724 61423555 61769249 61846446 61681550 61675494 62164547 62162969 61837525 61765428 61737018 61925043 61781175
3713 61781175 61799266 61849636 61647961 61610069 61416586 61118392 60840154 60541583 60497438 60371530
3703 60371530 60080895 59909681 59592934 59680167 59390312 59176498 59784337 59096120 58881966 58971278
$$ packed form
3770I5094944l93938n49026n82235m93254k45878r81776q39924j208045j154508
3761H8646360j078405p78692j709202j017835q31680j568408j142328q69207j092684
3752G8557919q27174j316536j540994n58395q74444j356357r94896j032966r45837
3743F9110320k25080r23392j382683k81612l61423j041863k74846n93707l45391
3734F3680323n21029m14679l58267l09033J48742k23776p9432K7604L6307n63205
3724F1423555L45694P7197j64896o056M89053j578l25444p2097k8410J88025j43868
3713F1781175J8091N0370k01675l7892j93483k98194k78238k98571m4145j25908
3703F0371530k90635j71214l16747Q7233k89855k13814O07839o88217k14154Q9312
$$ plain form
3693 58971278 58836862 58872963 59532106 59794289 59942084 60137024 60933770 61427607 61623604 62334565
3683 62334565 62891188 63674815 64617463 65578140 65892729 66819103 68087699 69881290 71065026
3674 71065026 72212507 73455581 74765206 76672599 77703607 79195522 80763065 82242071
3666 82242071 83532893 84876246 86431815 87736335 88674955 89700653 90718027 92042047
3658 92042047 92876348 93474720 93781811 94212359 94666398 95187232 95232593 95111114 94871789 94474222
3648 94474222 94291481 94095216 93485952 92387090 91615688 90791619 89994665 89234259 88242747
3639 88242747 87365221 86872066 86164922 85244901 84829863 84236976 83861514 83289325 82859562
3630 82859562 82481538 81941506 81564815 81088071 80869516 81081346 80905078 80481447 80466224 80311461
$$ packed form
3693E8971278j34416L6101O59143K62183J47795J94940P96746M93837J95997P10961
3683F2334565N56623P83627R42648R60677L14589R26374J268596J793591J183736
3674G1065026J147481J243074J309625J907393J031008J491915J567543J479006
3666H2242071J290822J343353J555569J304520R38620J025698J017374J324020
3658I2042047Q34301N98372L07091M30548M54039N20834M5361j21479k39325l97567
3648I4474222j82741j96265o09264j098862p71402q24069p96954p60406r91512
3639H8242747q77526m93155p07144r20021m15038n92887l75462n72189m29763
3630H2859562l78024n40032l76691m76744k18555K11830j76268m23631j5223j54763
$$ plain form
3620 80311461 80072540 79933894 79899892 79875412 79530497 79016184 79093367 78548418 78516477 77862054
3610 77862054 76981539 75693561 74761007 73717570 73173653 71879346 70828779 69560717 68244783
3601 68244783 66927970 65545665 64379630 62718876 61456813 59960818 58745481 57583422
3593 57583422 56102520 54446194 53113340 51630520 50405275 49147576 47597077 46314629
3585 46314629 45468087 44031978 43329033 42520599 41616687 40659611 39887413 39042253 38504154
3576 38504154 37811238 37105674 36901545 36385186 35662081 35454752 35406673 35018082 34545795 34112643
3566 34112643 34413981 34122191 33743448 33681258 33279738 33441762 33410375 33589406 33199131 32674930
3556 32674930 32458461 32343477 32070964 31455333 31155714 30787874 30423777 29980254 30092496
$$ packed form
3620H0311461k38921j38646l4002k4480l44915n14313P7183n44949l1941o54423
3610G7862054q80515j287978r32554j043437n43917j294307j050567j268062j315934
3601F8244783j316813j382305j166035j660754j262063j495995j215337j162059
3593E7583422j480902j656326j332854j482820j225245j257699j550499j282448
3585D6314629q46542j436109p02945q08434r03912r57076p72198q45160n38099
3576C8504154o92916p05564k04129n16359p23105k07329m8079l88591m72287m33152
3566C4112643L01338k91790l78743o2190m01520J62024l1387J79031l90275n24201
3556C2674930k16469j14984k72513o15631k99619l67840l64097m43523J12242
$$ plain form
3547 30092496 29630741 29007322 28527694 28290694 27545426 26946290 26458272 25790656 25236626
3538 25236626 24573064 23968787 23142501 22182328 22123686 21523647 20783896 20679303 19856165 19596989
3528 19596989 19285192 18212850 17600894 17338396 16894975 16802787 16523408 16157572 15815046
3519 15815046 15070406 14548078 14057476 13553982 13285295 13342046 13283706 12887012 12695549 12373355
3509 12373355 12281256 12373587 11982057 11764725 11525381 11687333 11566662 11118359 10591977 10685651
3499 10685651 10043282 10084846 10191759 9834288 9504718 9143829 9364735 9003705 8808038 8538404
3489 8538404 8407299 8493947 8421039 8502486 8524073 8286297 7892190 7792820 7878067 7753742 7545234
3478 7545234 7518036 8081912 7906192 7171963 7231742 7311029 7140283 7190616 7031800 6704458
$$ packed form
3547C0092496m61755o23419m79628k37000p45268n99136m88018o67616n54030
3538B5236626o63562o04277q26286r60173n8642o00039p39751j04593q23138k59176
3528A9596989l11797j072342o11956k62498m43421r2188k79379l65836l42526
3519A5815046p44640n22328m90602n03494k68687N6751n8340l96694j91463l22194
3509A2373355r2099R2331l91530k17332k39344J61952j20671m48303n26382R3674
3499A0685651o42369M1564J06913l57471l29570l60889K20906l61030j95667k69634
3489H538404j31105Q6648p2908Q1447K1587k37776l94107r9370Q5247j24325k08508
3478G545234k7198N63876j75720p34229N9779P9287j70746N0333j58816l27342
$$ plain form
3468 6704458 6288350 6232982 6400416 6409353 6099719 6409726 6013897 5797414 5529476 5505313
3458 5505313 5354440 5824762 5771584 5944549 5546780 4938372 5093304 5162167 5385058 5178436
3448 5178436 5306192 5289312 4735904 5127724 4764360 4655329 4688410 4416111 4815422 4706255
3438 4706255 4303323 4216458 4430757 4234484 4561387 4456408 4050646 4206493 4562586 4463508
3428 4463508 4598906 4379932 4017895 4116150 4119544 3756553 3709312 3837289 3864823 4030513
3418 4030513 3928157 4021396 3832068 3876113 3737114 3892224 3742861 3864460 3840918 3592646
3408 3592646 3487966 3270412 3506379 3476788 3450468 3363796 3372677 3569245 3442998 3337380
3398 3337380 3356969 3336246 3300054 3103289 3317875 3050192 3343981 3227280 2964032 3223226
$$ packed form
3468F704458m16108n5368J67434Q937l09634L10007l95829k16483k67938k4163
3458E505313j50873M70322n3178J72965l97769o08408J54932O8863K22891k06622
3448E178436J27756j6880n53408L91820l63364j09031L3081k72299L99311j09167
3438D706255m02932q6865K14299j96273L26903j04979m05762J55847L56093r9078
3428D463508J35398k18974l62037R8255L394l62991m7241J27977K7534J65690
3418D030513j02356R3239j89328M4045j38999J55110j49363J21599k3542k48272
3408C592646j04680k17554K35967k9591k6320q6672Q881J96568j26247j05618
3398C337380J9589k0723l6192j96765K14586k67683K93789j16701k63248K59194
$$ plain form
3388 3223226 3449329 3083004 3341154 3328194 3204931 2815752 3056442 3139857 3043803 3016830
3378 3016830 2916923 3158172 2792081 2528020 3024028 2926794 2622378 2900914 2874910 2701173
3368 2701173 3126402 2922015 3282262 3312435 2661979 2657394 2651246 2492023 2342013 2352396 2413147
3357 2413147 2324311 2620780 2542146 2520333 2942336 2951101 2913061 2933426 2938186 2929890 3083808
3346 3083808 3302709 3348987 3266753 3054757 2934539 2445111 2495661 2721702 2606468 2503094
3336 2503094 2286505 2328222 2349789 2449737 2470772 2400596 2392912 2779258 2435306 2561177 2569506
3325 2569506 2846327 2865984 2799579 2762378 2898046 3144315 2929740 3334847 3612354 3509795
3315 3509795 3594063 3661002 3699617 3460174 3195735 2899745 2657223 2357069 2412063 2601232
$$ packed form
3388C223226K26103l66325K58150j2960j23263l89179K40690Q3415r6054k6973
3378C016830r9907K41249l66091k64061M96008r7234l04416K78536k6004j73737
3368B701173M25229k04387L60247L0173o50456m585o148j59223j50010J0383O0751
3357B413147q8836K96469p8634k1813M22003Q765l8040K0365M760q296J53918
3346C083808K18901M6278q2234k11996j20218m89428N0550K26041j15234j03374
3336B503094k16589M1717K1567R9948K1035p0176p684L86346l43952J25871Q329
3325B569506K76821J9657o6405l7201J35668K46269k14575M05107K77507j02559
3315C509795Q4268O6939L8615k39443k64439k95990k42522l00154N4994J89169
$$ plain form
3305 2601232 2648047 2703538 2590014 2527744 2711339 2660087 2848388 2487383 2431089 2088681
3295 2088681 2319262 2627668 2412397 2649200 2459006 2436008 2523081 2178480 1935111 2006530
3285 2006530 2629080 2696878 2590138 2502847 2273117 2431419 2198015 2159234 2172544 1983320
3275 1983320 2040958 2411264 2398663 2215211 1995452 2182192 2209401 1859578 1999652 2215751
3265 2215751 2310169 2593105 2349280 2047241 2291453 2748767 2782559 2337540 2030493 2292779
3255 2292779 2327227 2030349 2331179 2363184 2337394 2922755 2795462 2675600 2926506 3015689
3245 3015689 2922642 3119343 3241928 3317302 3226075 3631936 3508555 2804947 2684489 2963514
3235 2963514 2855814 2904125 2753238 2389642 2143908 2047005 1837485 2028852 2242634 1969599
$$ packed form
3305B601232M6815N5491j13524o2270J83595n1252J88301l61005n6294l42408
3295B088681K30581L08406k15271K36803j90194k2998Q7073l44601k43369P1419
3285B006530O22550O7798j06740q7291k29730J58302k33404l8781J3310j89224
3275A983320N7638L70306j2601j83452k19759J86740K7209l49823J40074K16099
3265B215751R4418K82936k43825l02039K44212M57314L3792m45019l07047K62286
3255B292779L4448k96878L00830L2005k5790N85361j27293j19862K50906Q9183
3245C015689r3047J96701J22585P5374r1227M05861j23381p03608j20458K79025
3235B963514j07700M8311j50887l63596k45734r6903k09520J91367K13782k73035
$$ plain form
3225 1969599 2054817 1594059 1439610 1293112 1165428 1225239 1309479 1350253 1693668 1266244
3215 1266244 1347125 1452520 963437 999602 1398332 1559789 1340829 1007661 1128558 706417
3205 706417 902620 637199 787882 1003703 1284502 1327062 980117 1154699 882469 1012203
3195 1012203 1226820 1118371 1157849 804533 730258 815421 761599 934304 922883 908238 672866
3184 672866 741438 709845 635738 978017 1079793 1216293 1280099 612278 438896 371574 1004367
3173 1004367 1089804 691519 379939 454598 437322 539904 508563 674531 921860 1156968
3163 1156968 771217 540534 236292 531505 406054 858257 856703 687938 1011265 1140454
3153 1140454 971881 772503 628765 311229 213079 547556 563725 619190 528958 170998
$$ packed form
3225A969599Q5218m60758j54449j46498j27684N9811Q4240M0774L43415m27424
3215A266244Q0881J05395m89083L6165L98730J61457k18960l33168J20897m22141
3205G06417J96203k65421J50683K15821K80799M2560l46945J74582k72230J29734
3195A012203K14617j08449L9478l53316p4275Q5163n3822J72705j1421j4645k35372
3184F72866O8572l1593p4107L42279J01776J36500O3806o67821j73382o7322O32793
3173A004367Q5437l98285l11580P4659j7276J02582l1341J65968K47329K35108
3163A156968l85751k30683l04242K95213j25451M52203j554j68765L23327J29189
3153A140454j68573j99378j43738l17536r8150L34477J6169N5465r0232l57960
$$ plain form
3143 170998 519032 436816 612932 212492 221134 112047 51065 -72282 -63951 417323 507460
3132 507460 -174385 -221703 5861 -5025 -31351 105588 191419 137457 86083 -37974 -104017
3121 -104017 181794 429621 323210 104521 16580 -17104 115291 271616 399734 498752
3111 498752 221400 -48798 549573 669119 270383 267737 36641 25390 2342 273259
3101 273259 487504 617130 -51931 -187574 79151 654751 935080 1110582 683030 133478
3091 133478 234415 146715 46868 109884 3813 -102611 119588 304902 424065 645497
3081 645497 766176 627851 776630 363929 556921 352667 560216 867576 1011684 872346
3071 872346 399301 261212 322597 151949 -20680 64670 76213 -43927 61864 -32151
$$ packed form
3143A70998L48034q2216J76116m00440Q642j09087o0982j23347Q331M81274R0137
3132E07460o81845m7318K27564j0886k6326J36939Q5831n3962n1374j24057o6043
3121a04017K85811K47827j06411k18689q7941l3684J32395J56325J28118R9018
3111D98752k77352k70198N98371J19546l98736k646k31096j1251k3048K70917
3101B73259K14245J29626o69061j35643K66725N75600K80329J75502m27552n49552
3091A33478J00937q7700r9847O3016j06071j06424K22199J85314J19163K21432
3081F45497J20679j38325J48779m12701J92992k04254K07549L07360J44108j39338
3071H72346m73045j38089O1385j70648j72629Q5350J1543j20140J05791r4015
$$ plain form
3061 -32151 -442950 -309562 163736 -33965 240742 227874 -35826 202190 239517 121215
3051 121215 126932 -46066 502068 227839 219644 262258 126665 382777 257723 66105 190278
3040 190278 313459 249502 278177 -155207 15615 443618 312814 346955 23710 -342656
3030 -342656 -69514 -385779 -212446 -301952 110052 81728 -25144 198782 45639 -91372
3020 -91372 -136978 -231654 -280982 -260543 -495500 -359432 -56089 162509 475006 302590 -146819
3009 -146819 -120533 119054 32502 66478 -209571 -72188 76453 32327 149691 -509712
2999 -509712 -528137 -77196 -23959 -16402 154452 98425 96990 -73511 -226497 -425932 -518814
2988 -518814 -616766 -638295 -92169 189177 229845 98211 -64792 -358232 -338799 -292363 114757
$$ packed form
3061c2151m10799J33388M73298j97701K74707j2868k63700K38016L7327j18302
3051A21215N717j72998N48134k74229q195M2614j35593K56112j25054j91618J24173
3040A90278J23181o3957K8675m33384J70822M28003j30804L4141l23245l66366
3030c42656K73142l16265J73333q9506M12004k8324j06872K23926j53143j37011
3020i1372m5606r4676m9328K0439k34957J36068L03343K18598L12497j72416m49409
3009a46819K6286K39587q6552L3976k76049J37383J48641m4126J17364o59403
2999e09712j8425M50941N3237P557J70854n6027j435j70501j52986j99435r2882
2988e18814r7952k1529N46126K81346M0668j31634j63003k93440J9433M6436M07120
$$ plain form
2977 114757 -20432 -55351 189884 117244 -101843 283322 148727 -387306 -190923 273434
2967 273434 178470 -130136 -98618 -100321 300740 122370 -102579 122928 214382 -693385 -299599
2956 -299599 384219 130879 -228782 -251984 -432010 -311364 -382218 -202702 94197 382789
2946 382789 213784 81959 198282 356147 344594 188864 175724 -123126 -118443 -118187 -87920
2935 -87920 -47635 414263 401599 327608 274684 373064 -14087 333867 307496 -127606 66886
2924 66886 20938 -114821 57626 103716 175817 -507978 -429946 -188583 -249701 -49509 33313
2913 33313 168221 -22276 221054 384156 153221 218085 214892 318374 189517 314202
2903 314202 290259 380850 258254 -26865 -258407 -121071 -7055 -129900 277130 496688
$$ packed form
2977A14757j35189l4919K45235p2640k19087L85165j34595n36033J96383M64357
2967B73434r4964l08606L1518j703M01061j78370k24949K25507R1454r07767L93786
2956b99599O83818k53340l59661k3202j80026J20646p0854J79516K96899K88592
2946C82789j69005j31825J16323J57865j1553j55730j3140k98850M683K56L0267
2935h7920M0285M61898j2664p3991n2924R8380l87151L47954k6371m35102J94492
2924F6886m5948j35759J72447M6090P2101o83795P8032K41363o1118K00192Q2822
2913C3313J34908j90497K43330J63102k30935O4864l193J03482j28857J24685
2903C14202k3943R0591j22596k85119k31542J37336J14016j22845M07030K19558
$$ plain form
2893 496688 677083 481072 329888 233863 123024 516180 635530 329117 -139422 73176
2883 73176 294356 557300 -84226 -265097 -76755 -399716 8503 40780 27079 -94713
2873 -94713 -71614 -267900 -218835 101916 722251 752915 1117554 545566 73469 25887 347397
2862 347397 449918 298082 227325 -47860 462082 272765 230848 402873 766718 365035
2852 365035 -26146 358781 72375 100500 138650 -32606 -344764 -532243 -64134 -276329
2842 -276329 -256624 -86842 -159389 -237559 -185589 317431 -275852 -333326 -153234 -172832 -328567
2831 -328567 -165652 -499028 -746106 -174994 407595 -221781 -260599 -485441 -18139 -189369
2821 -189369 -243481 -529253 -163810 -4301 -333555 -58647 37627 43076 5377 447066 -103812
$$ packed form
2893D96688J80395j96011j51184r6025j10839L93156J19350l06413m68539K12598
2883G3176K21180K62944o41526j80871J88342l22961M08219L2277j3701j21792
2873i4713K3099j96286M9065L20751O20335L0664L64639n71988m72097m7582L21510
2862C47397J02521j51836p0757k75185N09942j89317m1917J72025L63845m01683
2852C65035l91181L84927k86406K8125L8150j71256l12158j87479M68109k12195
2842b76329J9705J69782p2547p8170N1970N03020n93283n7474J80092j9598j55735
2831c28567J62915l33376k47078N71112N82589o29376l8818k24842M67302j71230
2821a89369n4112k85772L65443J59509l29254K74908R6274N449l7699M41689n50878
$$ plain form
2810 -103812 -450039 -426529 -368669 -101103 -429146 -507725 -113607 -350772 -265937 -172234 -477071
2799 -477071 -469838 -599697 -596183 -406386 -688158 -389874 -537611 -561886 -389656 -277248 -221971
2788 -221971 -350260 -450629 -234178 -108192 161301 -318362 -373783 -481015 -684628 -370599
2778 -370599 -583462 -660150 -444996 -819815 -373961 -317155 -400581 -169223 9802 -283696
2768 -283696 -509444 -112158 -505080 -526653 -304351 -244298 67034 -192618 194724 242763
2758 242763 2695 -15030 59717 -461705 -280129 -176316 -426880 -337626 -142579 -173373
2748 -173373 -327682 -731420 -323218 52709 300485 224314 229214 -59879 -351701 -422286
2738 -422286 -606317 -817817 -1189957 -759959 -517717 -444944 -347659 -349392 -475754 -404168 -292390
$$ packed form
2810a03812l46227K3510N7860K67566l28043p8579L94118k37165Q4835R3703l04837
2799d77071P233j29859L514J89797k81772K98284j47737k4275J72230J12408N5277
2788b21971j28289j00369K16451J25986K69493m79663n5421j07232k03613L14029
2778c70599k12863p6688K15154l74819M45854N6806q3426K31358J79025k93498
2768b83696k25748L97286l92922k1573K22302O0053L11332k59652L87342M8039
2758B42763k40068j7725P4747n21422J81576J03813k50564Q9254J95047l0794
2748a73373j54309m03738M08202L75927K47776p6171M900k89093k91822p0585
2738d22286j84031k11500l72140M29998K42242P2773R7285j733j26362P1586J11778
$$ plain form
2727 -292390 -677910 -724995 -698132 -674244 -393802 -378340 -362831 -728595 -787506 -493784 -348681
2716 -348681 -414579 -605587 -598211 -35898 -503816 -583654 -879756 -214105 -9509 -443057
2706 -443057 -667504 -324717 -399110 -673337 -342637 -439237 -1023593 -895097 -642608 -500431
2696 -500431 215274 106868 38469 -485618 -759439 -386833 -194885 -62676 -255680 -431561
2686 -431561 -489167 -707313 -414380 -545772 -456642 -823051 -652955 -417641 -646292 -416417
2676 -416417 -397558 -136909 -522836 -174010 -237198 -667366 -596794 -235460 -143844 21308
2666 21308 -223710 -337374 -348023 -414653 -369089 -34667 -122454 -75002 -240332 -742059 -292840
2655 -292840 -3746 -273975 -612790 -575561 -449411 -321989 -463479 -497131 -285733 -414351
$$ packed form
2727b92390l85520m7085K6863K3888K80442J5462J5509l65764n8911K93722J45103
2716c48681o5898j91008P376N62313m67918p9838k96102O65651K04596m33548
2706d43057k24447L42787p4393k74227L30700r6600n84356J28496K52489J42177
2696e00431P15705j08406o8399n24087k73821L72606J91948J32209j93004j75881
2686d31561n7606k18146K92933j31392Q9130l66409J70096K35314k28651K29875
2676d16417J8859K60649l85927L48826o3188m30168P0572L61334R1616J65152
2666B1308k45018j13664j0649o6630M5564L34422q7787M7452j65330n01727M49219
2655b92840K89094k70229l38815L7229J26150J27422j41490l3652K11398j28618
$$ plain form
2645 -414351 -426567 -266008 -182212 -286698 -257368 -122553 -367441 -54310 -72877 -342237
2635 -342237 -88276 -431202 -638565 -424152 -468871 -552863 -222241 -360557 -922048 -753422
2625 -753422 -729742 -481955 -891042 -764923 -785154 -510165 -566352 -623612 -257628 157291
2615 157291 313310 -59612 -419777 -386071 -118398 -183992 -221655 -271604 -274446 -255772 20022
2604 20022 -397151 -420772 -436122 -166842 -141400 -202512 -269905 -149699 -362844 -743070 -519246
2593 -519246 -407904 -860400 -824736 -621964 -530754 -246292 -338088 -282703 -203926 -329283 -544056
2582 -544056 -477735 -54498 -410897 -693839 -287412 -29091 -261442 -576685 -636883 -706235
2572 -706235 -144587 -276265 -318098 -173858 -594802 -212555 -513551 -769972 -516089 -528773
$$ packed form
2645d14351j2216J60559Q3796j04486K9330J34815k44888L13131j8567k69360
2635c42237K53961l42926k07363K14413m4719q3992L30622j38316n61491J68626
2625g53422K3680K47787m09087J26119k0231K74989n6187n7260L65984M14919
2615A57291J56019l72922l60165L3706K67673o5594l7663m9949k842J8674K75794
2604B0022m17173k3621j5350K69280K5442o1112o7393J20206k13145l80226K23824
2593e19246J11342m52496L5664K02772R1210K84462r1796N5385P8777j25357k14773
2582e44056O6321M23237l56399k82942M06427K58321k32351l15243o0198o9352
2572g06235N61648j31678m1833J44240m20944L82247l00996k56421K53883j2684
$$ plain form
2562 -528773 -101261 169408 104103 10579 -313099 -152619 133154 -87725 174380 138001
2552 138001 -47429 -134735 -195708 -59853 91350 127540 -101201 -429474 -94120 -62932
2542 -62932 -229592 -40737 284197 39553 -351673 -678821 -441970 -392580 -459145 -334759
2532 -334759 -322419 -221832 -343100 -593951 -380122 -317510 -174896 -426669 -547145 -515334
2522 -515334 -738943 -282755 128015 199273 443060 -348499 -698888 -350390 -70888 -146461
2512 -146461 -259711 -623841 -687838 -477987 -749356 -437085 -395442 -496085 -435524 -285230
2502 -285230 -339900 -271747 94616 297400 266496 1992 35311 141217 27850 -157175
2492 -157175 -561977 -516610 -438577 -325665 36456 240747 -286625 -649958 -884402 -781504
$$ packed form
2562e28773M27512K70669o5305r3524l23678J60480K85773k20879K62105l6379
2552A38001j85430q7306o0973J35855J51203L6190k28741l28273L35354L1188
2542f2932j66660J88855L24934k44644l91226l27148K36851M9390o6565J24386
2532c34759J2340J00587j21268k50851K13829O2612J42614k51773j20476L1811
2522e15334k23609M56188M10770P1258K43787p91559l50389L48498K79502p5573
2512a46461j13250l64130o3997K09851k71369L12271M1643j00643O0561J50294
2502b85230n4670O8153L66363K02784l0904k64504L3319J05906j13367j85025
2492a57175m04802M5367P8033J12912L62121K04291n27372l63333k34444J02898
$$ plain form
2482 -781504 -257924 -271451 -203511 -117553 -186038 -122918 -134298 -340603 -487213 -381870 -258434
2471 -258434 -426300 -323449 -202175 -584793 -555366 -448952 -49604 -26069 227177 -156084
2461 -156084 -424756 -456422 -410242 -488192 -382141 59842 76557 62044 -249609 -281704 -298694
2450 -298694 -426952 -478577 -228738 80444 7826 136691 84479 492518 281126 76436
2440 76436 392743 209367 -74660 -195390 -544131 -257453 -553220 -153070 252059 209995
2430 209995 185602 -368755 -287717 -362867 -450719 -382492 -306858 -395461 -292319 -350019 66651
2419 66651 18460 -202241 83298 269586 104863 34434 359223 63470 317398 315131 661124
2408 661124 597218 438796 494956 462311 598653 131871 415535 437873 288285 524078
$$ packed form
2482g81504N23580j3527O7940Q5958o8485O3120j1380k06305j46610J05343J23436
2471b58434j67866J02851J21274l82618K9427J06414L99348K3535K53246l83261
2461a56084k68672l1666M6180p7950J06051M41983J6715j4513l11653l2095j6990
2450b98694j28258n1625K49839L09182p2618J28865n2212M08039k11392k04690
2440G6436L16307j83376k84027j20730l48741K86678k95767M00150M05129m2064
2430B09995k4393n54357Q1038p5150q7852O8227P5634q8603J03142n7700M16670
2419F6651m8191k20701K85539J86288j64723p0429L24789k95753K53928k267L45993
2408F61124o3906j58422N6160l2645J36342m66782K83664K2338j49588K35793
$$ plain form
2398 524078 241607 55830 -177706 14176 124626 468440 598198 517455 753550 116872
2388 116872 448714 300925 462525 380948 472716 498189 609153 448128 368134 355707 452219
2377 452219 282235 400743 794903 967246 1082543 1482082 1663287 1669502 1973235 2273050
2367 2273050 2402938 2764640 2935782 2568593 2261863 1895807 1582887 1034303 953659 1123565
2357 1123565 736377 545838 977273 1287441 1215073 1034186 1133803 1234676 913074 889427
2347 889427 628048 361615 1017425 946317 574774 445455 875052 899458 440091 453890
2337 453890 318763 321550 723347 805825 326462 536370 403275 336049 702375 604385 413227
2326 413227 349990 302727 879190 988142 616528 531055 519801 201731 342475 768161
$$ packed form
2398E24078k82471j85777k33536J91882J10450L43814J29758q0743K36095o36678
2388A16872L31842j47789J61600q1577R1768K5473J10964j61025p9994j2427R6512
2377D52219j69984J18508L94160J72343J15297L99539J81205O215L03733K99815
2367B273050J29888L61702J71142l67189l06730l66056l12920n48584q0644J69906
2357A123565l87188j90539M31435L10168p2368j80887R9617J00873l21602k3647
2347H89427k61379k66433O55810p1108l71543j29319M29597K4406m59367J3799
2337D53890j35127K787M01797Q2478m79363K09908j33095o7226L66326r7990j91158
2326D13227o3237m7263N76463J08952l71614q5473j1254l18070J40744M25686
$$ plain form
2316 768161 878452 867732 560319 563105 560950 654358 595321 863491 750662 628251 526251
2305 526251 607714 967892 1047344 1248753 1002068 520245 851689 821503 714122 891636
2295 891636 919701 765514 910592 1203888 1530572 1483696 1182242 1039208 974727 826448
2285 826448 816084 1005065 1080703 906460 865044 1205196 1221052 1051959 1438783 1469959 1478096
2274 1478096 1306328 1392294 1479835 1521511 1492302 1415998 1139568 1780574 1749949 1396374 1366132
2263 1366132 1273557 1331711 1311389 1780499 1868712 1801685 1551504 2034666 1611898 1851009
2253 1851009 1899323 1732100 1559981 1578567 2209912 2025905 1928660 1963734 2290001 2306755
2243 2306755 2270957 2244262 2404991 2651989 2221676 2275800 2171542 2105574 2089906 2086019 2503961
$$ packed form
2316G68161J10291j0720l07413K786k155R3408n9037K68170j12829j22411j02000
2305E26251Q1463L60178P9452K01409k46685m81823L31444l0186j07381J77514
2295H91636K8065j54187J45078K93296L26684m6876l01454j43034o4481j48279
2285H26448j0364J88981P5638j74243m1416L40152J5856j69093L86824L1176Q137
2274A478096j71768Q5966Q7541M1676k9209p6304k76430O41006l0625l53575l0242
2263A366132r2575N8154k0322M69110Q8213o7027k50181M83162m22768K39111
2253A851009M8314j67223j72119J8586O31345j84007r7245L5074L26267J6754
2243B306755l5798k6695J60729K46998m30313N4124j04258o5968j5668l887M17942
$$ plain form
2232 2503961 2665121 2643721 2415099 2375223 2347785 2750055 2924563 2781976 2746788 2808779
2222 2808779 3291968 3049294 2866147 3364926 3307407 3574734 3229623 3283916 3539693 3466460
2212 3466460 3447690 3903291 4029639 3743664 3955384 3911152 3856330 4100486 4140883 4443905
2202 4443905 4623715 4586045 4878060 5061882 5128392 5555632 5847270 5440777 5681054 6101747
2192 6101747 6366687 6655281 6550124 6793776 7436075 7714553 7658314 7964176 8175604 8214228
2182 8214228 8408816 8179052 8166669 8351253 8819605 8771481 9312834 9977941 9950426 9704931
2172 9704931 9635691 10011355 10502254 10677031 10707993 10625260 11364725 11689309 11698354 11655489 11888117
2161 11888117 11889572 12002232 12249615 12560958 13031054 13226846 13083044 13225358 13963278 14280586
$$ packed form
2232B503961J61160k1400k28622l9876k7438M02270J74508j42587l5188O1991
2222B808779M83189k42674j83147M98779n7519K67327l45111N4293K55777p3233
2212C466460j8770M55601J26348k85975K11720m4232n4822K44156M0397L03022
2202D443905J79810l7670K92015J83822O6510M27240K91638m06493K40277M20693
2192F101747K64940K88594j05157K43652O42299K78478n6239L05862K11428L8624
2182H214228J94588k29764j2383J84584M68352m8124N41353O65107k7515k45495
2172I704931o9240L75664M90899J74777L0962q2733P39465L24584R045m2865K32628
2161A1888117J455J12660K47383L11343M70096J95792j43802J42314P37920L17308
$$ plain form
2151 14280586 14302770 14870363 15265287 15569230 15905757 16326673 16685782 17753847 18334945
2142 18334945 18586903 19272558 20021518 20662836 21859808 22820648 24265588 25555461 26798233
2133 26798233 27954715 29526484 31512001 33134852 34804004 36658559 38429181 40466398
2125 40466398 42464690 44061607 46042489 47963653 50958956 54549856 58421471 62826357
2117 62826357 68647328 74949629 80988273 86278399 92028192 98503969 106576821 117338816
2109 117338816 130125592 146373033 165823656 189442827 220434624 257543451 303837599
2102 303837599 366497364 440196392 488326091 481695007 419476218 344799327 282177520
2095 282177520 231717197 193214974 162329416 139354105 122160558 108834243 97994185
$$ packed form
2151A4280586K2184N67593L94924L03943L36527M20916L59109J068065N81098
2142A8334945K51958O85655P48960O41318J196972R60840J444940J289873J242772
2133B6798233J156482J571769J985517J622851J669152J854555J770622K037217
2125D0466398J998292J596917J980882J921164K995303L590900L871615M404886
2117F2826357N820971O302301O038644N290126N749793O475777Q072852J0761995
2109A17338816J2786776J6247441J9450623K3619171L0991797L7108827M6294148
2102C03837599O2659765P3699028M8129699o631084o2218789p4676891o2621807
2095B82177520n0460323l8502223l0885558k2975311j7193547j3326315j0840058
$$ plain form
2088 97994185 90214740 83601583 79128432 75101032 69971931 63945046 58620181 53772472
2080 53772472 50085186 46429693 43658257 40958455 38882076 36708961 35058102 33589239
2072 33589239 31706862 30278407 28974960 27579738 26338240 25118639 24116927 23497528
2064 23497528 22193652 21153378 20208247 19402336 18512127 17629640 16914394 16574481 15958030
2055 15958030 15587645 15097142 14337191 13800593 13438913 13211781 12783676 12637535 12029918
2046 12029918 11788303 11398996 11152871 10902243 10542257 10229569 9720990 9537323 9532930 9401757
2036 9401757 8689517 8491608 7958316 7312954 7611619 7625196 7750811 7658759 7693407 7332518
2026 7332518 7217252 6816442 6970164 6904733 6794567 6841739 6756958 6711561 6316294 6128093
$$ packed form
2088I7994185p779445o613157m473151m027400n129101o026885n324865m847709
2080E3772472l687286l655493k771436k699802k076379k173115j650859j468863
2072C3589239j882377j428455j303447j395222j241498j219601j001712o19399
2064B3497528j303876j040274r45131q05911q90209q82487p15246l39913o16451
2055A5958030l70385m90503p59951n36598l61680k27132m28105j46141o07617
2046A2029918k41615l89307k46125k50628l59986l12688n08579j83667m393j31173
2036I401757p12240j97909n33292o45362K98665J3577J25615r2052L4648l60889
2026G332518j15266m00810J53722o5431j10166M7172q4781m5397l95267j88201
$$ plain form
2016 6128093 5455948 4927598 4879728 5209790 5467982 5211602 4646480 4678416 4692007 4651885
2006 4651885 4205238 3749951 3942393 3736506 3614141 3628856 3586727 3610946 3208954 3495236
1996 3495236 3550078 3096183 3126225 2754676 2666588 2765563 2784149 3002450 2880678 2689130
1986 2689130 2768309 2424234 2266656 1989444 2183587 2456445 2585918 2434887 2493776 2261072
1976 2261072 1623049 1794335 1866479 1583985 1624139 1638170 1663026 1427514 1251778 1437239
1966 1437239 1520327 1654468 1552786 1640568 1422498 1158629 1316825 1165011 1214620 1516967
1956 1516967 1605344 1588825 1488275 923678 1280348 1376350 918910 1283044 1437169 972599
1946 972599 1329341 1682710 1505574 1451926 1629481 1749606 1401692 1074475 962356 1247577
$$ packed form
2016F128093o72145n28350m7870L30062K58192k56380n65122L1936J3591m0122
2006D651885m46647m55287J92442k05887j22365J4715m2129K4219m01992K86282
1996C495236N4842m53895L0042l71549q8088R8975J8586K18301j21772j91548
1986B689130P9179l44075j57578k77212J94143K72858J29473j51031N8889k32704
1976B261072o38023J71286P2144k82494M0154J4031K4856k35512j75736J85461
1966A437239Q3088J34141j01682Q7782k18070k63869J58196j51814M9609L02347
1956A516967Q8377j6519j00550n64597L56670R6002m57440L64134J54125m64570
1946I72599L56742L53369j77136n3648J77555J20125l47914l27217j12119K85221
$$ plain form
1936 1247577 930315 1115946 1047325 803227 901294 1149796 1226803 1519696 1278123 1270953
1926 1270953 1105429 1096715 1061813 1157710 1141323 992844 975122 1130594 1343487 839817 362312
1915 362312 854745 1126571 942818 928892 845657 788469 871030 696660 932222 786402
1905 786402 305980 146701 217823 946075 1372778 1135064 1072568 810692 523566 556050
1895 556050 208267 -116374 289642 432218 266188 809636 772969 362650 472246 621470
1885 621470 697944 753703 682648 482304 312371 283301 458598 18739 475610 684215
1875 684215 361039 905954 827730 786187 535224 132551 -189439 331169 782840 937602
1865 937602 1033757 972346 780464 929176 930643 288757 795731 1173888 506260 331780
$$ packed form
1936A247577l17262J85631o8621k44098R8067K48502P7007K92893k41573p170
1926A270953j65524q714l4902R5897j6387j48479j7722J55472K12893n03670m77505
1915C62312M92433K71826j83753j3926q3235n7188Q2561j74370K35562j45820
1905G86402m80422j59279P1122P28252M26703k37714o2496k61876k87126L2484
1895E56050l47783l24641M06016J42576j66030N43448l6667m10319J09596J49224
1885F21470P6474N5759p1055k00344j69933k9070J75297m39859M56871K08605
1875F84215l23176N44915p8224m1543k50963m02673l21990N20608M51671J54762
1865I37602R6155o1411j91882J48712J467o41886N06974L78157o67628j74480
$$ plain form
1855 331780 598186 742079 1251231 957336 129012 322865 258853 -5659 -272823 354356
1845 354356 548922 608380 511251 500804 405231 606049 805424 1138836 1554770 1453041
1835 1453041 1310517 1560075 1801758 1714602 2047799 2547978 2576933 2050203 1371742 1487725
1825 1487725 1355529 1046667 682430 439362 461082 848034 1087207 555554 475450 521106
1815 521106 381733 422518 484513 308922 284345 225305 181883 209499 -59221 45416 -71313
1804 -71313 -174765 546522 87815 -54481 342013 405116 250124 -71504 188078 199765
1794 199765 144137 -41705 15016 117265 -96322 273675 291002 417485 332688 428354 409289
1783 409289 88995 40318 328380 -40963 -185935 84579 -52112 -253091 -238244 -396562
$$ packed form
1855C31780K66406J43893N09152k93895q28324J93853o4012k64512k67164O27179
1845C54356J94566N9458r7129j0447r5573K00818J99375L33412M15934j01729
1835A453041j42524K49558K41683q7156L33197N00179K8955n26730o78461J15983
1825A487725j32196l08862l64237k43068K1720L86952K39173n31653q0104M5656
1815E21106j39373M0785O1995j75591k4577n9040m3422K7616k68720J04637j16729
1804g1313j03452P21287m58707j42296L96494O3103j54992l21628K59582J1687
1794A99765n5628j85842N6721J02249k13587L69997J7327J26483q4797R5666j9065
1783D09289l20294m8677K88062l69343j44972K70514j36691k00979J4847j58318
$$ plain form
1773 -396562 -257228 132219 433180 323592 -118842 -219019 -88485 -556332 -295001 -284840
1763 -284840 -313983 106409 -66473 -284331 -143373 267432 139758 -165241 -49004 -44328
1753 -44328 78303 238803 -9707 -82526 -343169 -641949 -358076 275727 511191 546644
1743 546644 299453 -24060 -275967 -183524 -336387 -231424 -277755 -235268 -31871 120060
1733 120060 99765 -148299 -489140 -188126 413554 -73976 44199 35589 388833 366109
1723 366109 274624 499293 156340 -75125 -354577 -430631 -201146 188878 -10746 132252
1713 132252 290364 76408 -166015 -492688 -424386 -71841 -180388 -13647 -203513 91325
1703 91325 360085 130201 131206 72482 267053 65343 -94180 24532 -2955 -139277 -23109
$$ packed form
1773c96562J39334L89447L00961j09588m42434j00177J30534m67847K61331J0161
1763b84840k9143M20392j72882k17858J40958M10805j27674l04999J16237M676
1753d4328J22631J60500k48510p2819k60643k98780K83873O33803K35464L5453
1743E46644k47191l23513k51907R2443j52863J04963m6331M2487K03397J51931
1733A20060k0295k48064l40841L01014O01680m87530J18175q610L53244k2724
1723C66109r1485K24669l42953k31465k79452p6054K29485L90024j99624J42998
1713A32252J58112k13956k42423l26673O8302L52545j08547J66741j89866K94838
1703I1325K68760k29884J005n8724J94571k01710j59523J18712k7487j36322J16168
$$ plain form
1692 -23109 223821 27490 -158922 -228056 130336 -204577 -262258 -143798 -17628 -16899 -186635
1681 -186635 -30794 -261576 -158422 -278785 -605510 -555480 -685563 -504375 -391494 -565666
1671 -565666 -117751 -44463 -296510 -151040 23632 58494 22201 -83537 -321223 -19049
1661 -19049 -372969 -844899 -572075 -232162 40601 -226347 -28532 -112258 -323044 -405835
1651 -405835 -2571 80404 76471 -387858 29567 228467 -34724 -253618 -3666 -224450
1641 -224450 -310013 195523 202636 350637 -67544 -348939 114210 406628 292633 161800
1631 161800 -104449 236484 177914 96507 203902 394127 -92401 -293788 -573866 -771571
1621 -771571 -222071 -37176 269759 -65271 -305262 -6681 -393378 -481333 -84842 263322
$$ packed form
1692b3109K46930j96331j86412o9134L58392l34913n7681J18460J26170P29j69736
1681a86635J55841k30782J03154j20363l26725N0030j30083J81188J12881j74172
1671e65666M47915P3288k52047J45470J74672L4862l6293j05738k37686L02174
1661a9049l53920m71930K72824L39913K72763k66948J97815q3726k10786q2791
1651d05835M03264Q2975l933m64329M17425J98900k63191k18894K49952k20784
1641b24450q5563N05536P113J48001m18181k81395M63149K92418j13995j30833
1631A61800k66249L40933n8570q1407J07395J90225m86528k01387k80078j97705
1621g71571N49500J84895L06935l35030k39991K98581l86697q7955L96491L48164
$$ plain form
1611 263322 429998 256293 -62105 -163878 206183 149811 -77024 -297746 -208280 -48680
1601 -48680 67005 -29137 -400940 -696998 -299683 -21813 -226755 -229702 -185505 194474 175171
1590 175171 305126 16946 -118779 272475 47588 71432 200215 234067 361922 134892
1580 134892 -386623 -300175 16831 -23092 97773 53024 -26920 -29161 21080 -446000 -273357
1569 -273357 -163922 -501504 -585450 -593626 -270254 1673 -230312 74308 -128050 143266
1559 143266 287123 59658 -211320 -275257 -509907 -358939 -312646 -119702 318190 -44697
1549 -44697 107501 54152 -155321 -319363 -300683 -315508 57140 -93648 -191863 -540800 -337748
1538 -337748 -141129 15245 -373786 -151061 -264556 -459336 293269 48041 -32971 -34072
$$ packed form
1611B63322J66676j73705l18398j01773L70061n6372k26835k20722Q9466J59600
1601d8680J15685r6142l71803k96058L97315K77870k04942k947M4197L79979j9303
1590A75171J29955k88180j35725L91254k24887K3844J28783L3852J27855k27030
1580A34892n21515Q6448L17006l9923J20865m4749p9944k241N0241m67080J72643
1569b73357J09435l37582q3946q176L23372K71927k31985L04620k02358K71316
1559A43266J43857k27465k70978o3937k34650J50968M6293J92944M37892l62887
1549d4697J52198n3349k09473j64042J8680j4825L72648j50788r8215l48937K03052
1538c37748J96619J56374l89031K22725j13495j94780P52605k45228q1012j101
$$ plain form
1528 -34072 -43215 222992 71447 -115122 -408134 -49861 255284 84626 276184 -8378
1518 -8378 -136949 -38263 -51818 229113 26502 37125 139896 14391 -113882 -258699 -259755
1507 -259755 -220581 -240635 -119134 -86174 -384519 -260444 -125685 -18670 -208200 -595840
1497 -595840 -517665 -409718 -145749 57347 -165580 -125939 -280072 -526083 -609819 -355220
1487 -355220 -383840 -286387 -91554 -91804 -38418 -131242 -314892 -207289 -383591 -95767 240904
1476 240904 308120 -187587 -333613 -375383 -348563 -329221 -235302 -6929 -462665 -717275 -610488
1465 -610488 -585373 -169365 148626 -341480 -127932 -127571 -417793 -764353 -607407 -454856
1455 -454856 -169712 -245066 -603307 -366745 -179077 56155 160596 298938 -160433 -105501
$$ packed form
1528c4072r143K66207j51545j86569k93012L58273L05145j70658J91558k84562
1518h378j28571R8686j3555K80931k02611J0623J02771j25505j28273j44817j056
1507b59755L9174k0054J21501L2960k98345J24075J34759J07015j89530l87640
1497e95840P8175J07947K63969K03096k22927L9641j54133k46011q3736K54599
1487c55220k8620R7453J94833k50N3386r2824j83650J07603j76302K87824L36671
1476B40904O7216m95707j46026m1770K6820J9342R3919K28373m55736k54610J06787
1465f10488K5115M16008L17991m90106K13548L61k90222l46560J56946J52551
1455d54856K85144p5354l58241K36562J87668K35232J04441J38342m59371N4932
$$ plain form
1445 -105501 43489 -203940 -422946 -129575 -427734 -466535 -374753 -453712 -323305 -347181
1435 -347181 -30205 -64527 265823 400269 10844 -150987 -64893 48953 103268 62662
1425 62662 -32364 -502761 -468613 -162831 -140563 -638443 -239228 35607 -6967 -544799 -693277
1414 -693277 -372758 -206461 -6213 25882 -32086 -217155 -262292 76214 -380871 -374647 112001
1403 112001 252623 536133 206312 6647 -215042 -143644 222371 129189 -174479 -500378
1393 -500378 -41215 -473838 -524008 -56532 -550667 -666529 -246826 148820 244058 -61565
1383 -61565 -33160 101098 -32376 65392 52045 5706 -575417 -687591 -29067 594223 444556
1372 444556 311560 60488 -70246 -236153 -363384 -335344 -143623 -118424 -361974 -132871
$$ packed form
1445a05501J48990k47429k19006K93371k98159l8801R1782p8959J30407k3876
1435c47181L16976l4322L30350J34446l89425j61831Q6094J13846N4315m0606
1425F2662r5026m70397L4148L05782K2268m97880L99215K74835m2574n37832j48478
1414f93277L20519J66297K00248L2095n7968j85069m5137L38506m57085O224M86648
1403A12001J40622K83510l29821j99665k21689P1398L66015r3182l03668l25899
1393e00378M59163m32623n0170M67476m94135j15862M19703L95646R5238l05623
1383f1565K8405J34258j33474R7768j3347m6339n81123j12174O58524O23290j49667
1372D44556j32996k51072j30734j65907j27231K8040J91721K5199k43550K29103
$$ plain form
1362 -132871 198940 -104023 -319061 -228970 -179973 -78943 -285264 -222847 83199 83127 -231998
1351 -231998 -153320 168063 63170 -161015 29412 219267 -259272 -363893 -494222 81926
1341 81926 -83855 -159672 254382 88652 -52636 -451265 -264981 -240721 -223114 -67316
1331 -67316 -459062 -154407 -227405 -377203 -252313 -168750 -61746 40533 85261 67144 -221303
1320 -221303 -286406 -289621 -153340 -214124 49832 -80623 -578159 -567872 -674459 154649 330876
1309 330876 -104719 -160125 65961 -94571 -87726 -100294 -377872 157000 156497 -93947 -100952
1298 -100952 -243388 -440724 -500553 -537498 -536897 -412656 -98904 325971 393539 -12655 -34008
1287 -34008 62005 -294219 -22348 61354 -215443 -405826 -400134 -413496 -124059 -69053 -231691
$$ packed form
1362a32871L31811l02963k15038R0091M8997J01030k06321O2417L06046p2l15125
1351b31998P8678L21383j04893k24185J90427J89855m78539j04621j30329N76148
1341H1926j65781p5817M14054j65730j41288l98629J86284K4260J7607J55798
1331f7316l91746L04655p2998j49798J24890Q3563J07004J02279M4728j8117k88447
1320b21303o5103l215J36281o0784K63956j30455m97536J0287j06587Q29108J76227
1309C30876m35595n5406K26086j60532O845j2568k77578N34872n03k50444p005
1298a00952j42436j97336n9829l6945O01J24241L13752M24875O7568m06194k1353
1287c4008R6013l56224K71871Q3702k76797j90383N692j3362K89437N5006j62638
$$ plain form
1276 -231691 78158 71878 -218044 -118779 -44887 304700 -79485 -396133 -31675 -69754 -281523
1265 -281523 -111433 -258172 160547 -71990 56911 466509 303299 275944 89026 -231675
1255 -231675 -83058 -125473 -249555 -323820 -487840 -370994 -516659 -246347 -43882 38972
1245 38972 101444 -567915 -705589 -285393 200335 475027 18064 -59727 76356 197964
1235 197964 133222 82799 77911 -616277 -811090 -312960 -223896 4687 -263290 -538927 -541578
1224 -541578 -418121 -183193 -130581 163154 23681 -201480 196535 141634 -273978 105698
1214 105698 -63176 -664315 -276997 68132 -106830 -293933 -201272 -336663 -262815 -199146
1204 -199146 -145592 -45363 46960 354306 273651 -72848 -445427 -405549 85040 619703
$$ packed form
1276b31691L09849o280k89922R9265P3892L49587l84185l16648L64458l8079k11769
1265b81523J70090j46739M18719k32537J28901M09598j63210k7355j86918l20701
1255b31675J48617m2415j24082p4265j64020J16846j45665K70312K02465Q2854
1245C8972O2472o69359j37674M20196M85728K74692m56963p7791J36083J21608
1235A97964o4742n0423m888o94188j94813M98130Q9064K28583k67977k75637k651
1224e41578J23457K34928N2612K93735j39473k25161L98015n4901m15612L79676
1214A05698j68874o01139L87318L45129j74962j87103R2661j35391P3848O3669
1204a99146N3554J00229R2323L07346q0655l46499l72579L9878M90589N34663
$$ plain form
1194 619703 324404 -170921 -768101 -708044 -148729 -453408 -443084 -417981 -128841 -92383
1184 -92383 -33130 -23043 -375836 -317245 -249963 -178411 -161752 -461214 -634746 -325384 -120775
1173 -120775 -341938 -219910 -357432 -200729 -110951 3342 -220874 -408936 -405423 125088
1163 125088 228785 237316 165847 -78368 -257282 -479348 -293442 -411019 -424536 -701864
1153 -701864 -605807 -440661 -60150 343499 574483 572522 137110 -270334 -261839 -183972 56395
1142 56395 -92798 259593 226595 -55838 -740621 -652181 -110330 -127768 -268998 -219693 -190930
1131 -190930 -590274 -327921 42409 39223 209500 -261290 -430546 -9775 -80714 -167224
1121 -167224 -337192 175249 210956 43551 -176842 -53447 -391747 -178074 -97668 -301639
$$ packed form
1194F19703k95299m95325n97180O0057N59315l04679J0324K5103K89140L6458
1184i2383N9253J0087l52793N8591O7282P1552J6659k99462j73532L09362K04609
1173a20775k21163J22028j37522J56703Q9778J14293k24216j88062L513N30511
1163A25088J03697Q531p1469k44215j78914k22066J85906j17577j3517k77328
1153g01864R6057J65146L80511M03649K30984j961m35412m07444Q495P7867K40367
1142E6395j49193L52391l2998k82433o84783Q8440N41851j7438j41230M9305K8763
1131a90930l99344K62353L70330l186J70277m70790j69256M20771p0939q6510
1121a67224j69968N12441L5707j67405k20393J23395l38300K13673Q0406k03971
$$ plain form
1111 -301639 -173736 -126713 -1543 144036 -39816 -219012 -386384 -178790 77432 396696
1101 396696 540184 67731 -28949 -129631 -48062 -353356 -211652 -96176 297530 402631
1091 402631 483418 288727 71464 -150485 -204621 106297 -197099 98110 118011 -405149
1081 -405149 -409399 126485 51655 -210281 -124928 -471036 -334265 -232077 -522772 -235735
1071 -235735 -125954 -281805 -88909 -140545 -69838 -304450 -271860 197210 -365595 -260074
1061 -260074 -148338 -332482 -394970 -194987 -235469 -513346 -196626 56085 29889 -200225
1051 -200225 -27272 249941 164902 -166893 -602441 -275951 -228303 5734 -113336 -399231
1041 -399231 -233554 -20119 -152304 -26617 -124529 -449836 -219352 -327052 -147576 -102800
$$ packed form
1111c01639J27903M7023J25170J45579j83852j79196j67372K07594K56222L19264
1101C96696J43488m72453r6680j00682Q1569l05294J41704J15476L93706J05101
1091D02631Q0787j94691k17263k21949n4136L10918l03396K95209J9901n23160
1081d05149m250N35884p4830k61936Q5353l46108J36771J02188k90695K87037
1071b35735J09781j55851J92896n1636P0707k34612L2590M69070n62805J05521
1061b60074J11736j84144o2488J99983m0482k77877L16720K52711k6196k30114
1051b00225J72953K77213q5039l31795m35548L26490M7648K34037j19070k85895
1041c99231J65677K13435j32185J25687r7912l25307K30484j07700J79476M4776
$$ plain form
1031 -102800 93234 154449 94216 295664 174447 27400 95486 314722 415513 206308
1021 206308 206505 51352 -90643 -55986 115085 227985 288531 96985 -73218 -339865 -88758
1010 -88758 -229907 -241091 77815 75462 -171228 -1397 63757 8086 201931 96006 -31751
999 -31751 49724 -85038 47345 -256392 -189304 -174172 -207052 -421428 -407044 -146027 -46882
988 -46882 -466814 -73508 -50546 -464754 -218724 -53127 -63864 341993 474512 119623
978 119623 -44032 -420620 -217924 -357378 67357 147054 139777 32697 -240871 -398245
968 -398245 -187214 -583859 -565767 -184233 77433 76670 -18836 282310 185608 -5895 -229656
957 -229656 -93122 266475 -43707 -134171 -338784 94190 174744 232896 306817 244976 155912
$$ packed form
1031a02800J96034O1215o0233K01448j21217j47047O8086K19236J00791k09205
1021B06308J97j55153j41995L4657J71071J12900O0546j91546j70203k66647K51107
1010h8758j41149j1184L18906k353k46690J69831O5154n5671J93845j05925j27757
999c1751Q1475j34762J32383l03737O7088J5132l2880k14376J4384K61017R9145
988d6882m19932L93306K2962m14208K46030J65597j0737M05857J32519l54889
978A19623j63655l76588K02696j39454M24735P9697p277j07080k73568j57374
968c98245K11031l96645J8092L81534K61666p63r5506L01146r6702j91503k23761
957b29656J36534L59597l10182r0464k04613M32974Q0554N8152P3921o1841q9064
$$ plain form
946 155912 -205374 -414055 7997 73766 65974 -240456 -289409 -17408 -81924 -159106 -447577
935 -447577 -337037 -227970 -195061 -92892 154210 39477 -20814 -53692 246298 364700
925 364700 314099 255106 -42894 33803 1575 -235672 -169327 -115324 10207 305679 270150
914 270150 180407 160573 -372697 -496799 -180300 -344990 -342359 -290348 -67485 -237967 -320754
903 -320754 -419859 -262781 -260597 -360510 -346796 -238129 -129763 -462328 -27899 -413995 -337181
892 -337181 -451243 -324553 -25631 -260278 -123467 -549772 -298589 139482 150762 94554
882 94554 -562917 -463071 243161 452255 11944 -320054 117406 243989 -319380 102930
872 102930 152050 -53268 -83407 -378554 428771 516180 239732 -154880 71568 -41196
$$ packed form
946A55912l61286k08681M22052O5769p792l06430m8953K72001o4516p7182k88471
935d47577J10540J09067L2909J02169K47102j14733o0291l2878K99990J18402
925C64700n0601n8993k98000P6697l2228k37247O6345N4003J25531K95472l5529
914B70150q9743j9834n33270j24102L16499j64690K631N2011K22863j70482q2787
903c20754r9105J57078K184r9913J3714J08667J08366l32565M34429l86096P6814
892c37181j14062J26690K98922k34647J36811m26305K51183M38071J1280n6208
882I4554o57471R9846P06232K09094m40311l31998M37460J26583n63369M22310
872A02930M9120k05318l0139k95147Q07325Q7409k76448l94612K26448j12764
$$ plain form
862 -41196 -325593 132356 431702 82064 -226854 -62396 129892 -97337 29142 -246406
852 -246406 9147 68070 -34091 100731 210627 -11036 -129427 -203323 -355606 123112
842 123112 99107 46502 86779 565771 184289 150386 -447825 -602210 127609 265040 -352800
831 -352800 -82690 46847 200152 -207476 127331 633632 -72468 -397470 -300291 -360583
821 -360583 46149 176629 -131105 -218935 -201186 -43221 -43818 -636847 -638395 -48297 -407852
810 -407852 -547060 -404966 16187 -98992 -316548 100156 -3266 282648 355775 71772
800 71772 59015 -294655 -187840 -51380 69503 375126 102379 76879 235216 93040
790 93040 78477 199956 -142886 -279390 13523 246981 233512 219025 -295699 -350459 -100746
$$ packed form
862d1196k84397M57949K99346l49638l08918J64458J92288k27229J26479k75548
852b46406K55553N8923j02161J34822J09896k21663j18391p3896j52283M78718
842A23112k4005n2605M0277M78992l81482l3903n98211j54385P29819J37431o17840
831c52800K70110J29537J53305m07628L34807N06301p06100l25002R7179o0292
821c60583M06732J30480l07734q7830J7749J57965n97n93029j548N90098l59555
810d07852j39208J42094M21153j15179k17556M16704j03422K85914P3127k84003
800G1772j2757l53670J06815J36460J20883L05623k72747k5500J58337j42176
790I3040j4563J21479l42842j36504K92913K33458j3469j4487n14724n4760K49713
$$ plain form
779 -100746 -285986 -97414 -112541 42449 -287035 -18476 122071 98696 164873 -102363
769 -102363 -173306 -275719 -207578 -160075 68621 466772 333035 161093 -490700 -429140 -617219
758 -617219 -501312 247778 528402 463082 435763 962811 580157 -17372 125391 371672
748 371672 528408 482017 227277 108666 65677 162149 143410 351597 496697 483607 482879
737 482879 3201 -120371 -10942 316033 488205 235942 -99847 227015 117139 214284
727 214284 213128 97881 186243 310134 125346 95027 308764 26659 -9987 -100635 -69602
716 -69602 98323 262365 328621 289873 74988 307288 395040 97493 -42666 -58366 33783
705 33783 105763 337961 -77528 -237409 -270377 -99551 -6538 66238 79174 130161 129950 -108085
$$ packed form
779a00746j85240J88572j5127J54990l29484K68559J40547k3375O6177k67236
769a02363p0943j02413O8141M7503K28696L98151j33737j71942o51793O1560j88079
758f17219J15907P49090K80624o5320k7319N27048l82654n97529J42763K46281
748C71672J56736m6391k54740j18611m2989R6472j8739K08187J45100j3090p28
737D82879m79678j23572J09429L26975J72172k52263l35789L26862j09876R7145
727B14284j156j15247Q8362J23891j84788l0319K13737k82105l6646r0648L1033
716f9602J67925J64042O6256l8748k14885K32300Q7752k97547j40159j5700R2149
705C3783P1980K32198m15489j59881l2968J70826R3013P2776J2936N0987k11k38035
$$ plain form
693 -108085 -266248 170969 177966 -63607 709818 563791 138720 -92158 170964 232211
683 232211 183123 -91795 368822 359028 -4442 -176585 78911 -79359 -226395 -284320 231826
672 231826 713772 310242 194863 30108 216327 -106372 446110 271750 -83359 -51138
662 -51138 327721 61573 -166458 34374 -156379 -385627 -739202 -81515 301652 297422
652 297422 -74948 -191030 -162834 -30327 183310 352007 277741 -137648 85691 114861
642 114861 188595 27035 -58937 -118303 -304376 -148998 34680 137055 134965 334474 551639
631 551639 334667 578341 93370 -184342 136510 207021 202878 103308 -51555 130198 267197
620 267197 -353448 -484024 -326040 123876 -161954 -163973 -184025 -144803 -108962 -133102 60791
$$ packed form
693a08085j58163M37217O997k41573P73425j46027m25071k30878K63122O1247
683B32211m9088k74918M60617r794l63470j72143K55496j58270j47036n7925N16146
672B31826M81946m03530j15379j64755J86219l22699N52482j74360l55109L2221
662e1138L78859k66148k28031K00832j90753k29248l53575O57687L83167m230
652B97422l72370j16082K8196J32507K13637J68697p4266m15389K23339K9170
642A14861P3734j61560q5972n9366j86073J55378J83678J02375k090J99509K17165
631E51639k16972K43674m84971k77712L20852P0511m143r9570j54863J81753J36999
620B67197o20645j30576J57984M49916k85830k019k0052L9222L5841k4140J93893
$$ plain form
609 60791 189731 -281899 -255071 -362991 -84292 -49997 -1992 -157322 -319413 -345597 -624867
598 -624867 -197604 429892 204768 318394 48443 317077 275869 325534 251660 -136886
588 -136886 -34325 -82871 339441 223901 250888 219681 -184728 -398483 -548434 -263458
578 -263458 -182396 142113 280467 -10196 117837 135653 541230 226158 141406 177147 300627
567 300627 -8418 -278587 -200260 -167853 776 245674 -61489 -172189 -13439 -91455
557 -91455 -305765 -79954 49163 575483 539044 279300 -149522 -132556 -249009 -326203 150675
546 150675 201227 17034 -10512 -447165 -589932 -250660 -96845 -172591 73214 259390
536 259390 50463 188235 377827 -20796 18349 -194513 -291139 243726 675633 774408
$$ packed form
609F0791J28940m71630K6828j07920K78699L4295M8005j55330j62091k6184k79270
598f24867M27263O27496k25124J13626k69951K68634m1208M9665p3874l88546
588a36886J02561m8546M22312j15540K6987l1207m04409k13755j49951K84976
578b63458Q1062L24509J38354k90663J28033J7816M05577l15072q4752L5741J23480
567C00627l09045k70169P8327L2407J68629K44898l07163j10700J58750p8016
557i1455k14310K25811J29117N26320l6439k59744m28822J6966j16453p7194M76878
546A50675N0552j84193k7546m36653j42767L39272J53815p5746K45805J86176
536B59390k08927J37772J89592l98623L9145k12862r6626N34865M31907R8775
$$ plain form
526 774408 281050 -151534 78385 200397 166494 406430 694153 584593 208677 18172
516 18172 282969 562410 20183 -289457 122956 -12258 -176238 -56066 -24417 664783
506 664783 512457 -79931 -271178 -104935 -148633 -325121 -403323 -264642 -171359 -324651
496 -324651 -587880 -92203 225962 250519 442943 391267 315244 -52130 -1409 123320 -113854
485 -113854 25968 -241567 -243901 -17011 169131 464618 177237 332231 305570 68839
475 68839 268822 239021 68566 -58631 74280 -380979 -202802 256784 -80600 -161675
465 -161675 -151481 -171538 -375859 -258255 -18638 503811 919901 380514 8822 -62655
455 -62655 126334 253759 383284 410133 32297 -56923 -81308 -154745 -210971 -449995 -50289
$$ packed form
526G74408m93358m32584K29919J22012l3903K39936K87723j09560l75916j90505
516A8172K64797K79441n42227l09640M12413j35214j63980J20172L1649O89200
506F64783j52326n92388j91247J66243m3698j76488p8202J38681R3283j53292
496c24651k63229M95677L18165K4557J92424n1676p6023l67374N0721J24729k37174
485a13854J39822k67535k334K26890J86142K95487k87381J54994k6661k36731
475F8839J99983k9801j70455j27197J32911m55259J78177M59586l37384q1075
465a61675J0194k0057k04321J17604K39617N22449M16090n39387l71692p1477
455f2655J88989J27425J29525K6849l77836q9220k4385p3437n6226k39024L99706
$$ plain form
444 -50289 27285 -165241 27689 293229 516107 375211 -120924 -75406 246487 162725 48662
433 48662 -255332 -242214 -84376 -345226 78711 315255 -62321 54564 -64555 -116075
423 -116075 -107264 -210105 33925 -51244 -427913 -313865 181813 216069 45445 72545 499860
412 499860 441948 347167 541952 285785 -151826 -249992 -270545 -634208 -273606 216083 801818
401 801818 758160 406330 574132 594812 296854 -147373 -361883 17095 121289 368266
391 368266 271275 -24554 290181 82055 96511 177362 622896 104633 270756 346334 486806
380 486806 519006 241340 133174 199133 400725 485641 270035 167985 318830 53451
370 53451 88831 -22749 341234 490097 544671 17404 14981 327571 163782 -468514 -147546
$$ packed form
444e0289P7574j92526J92930K65540K22878j40896m96135M5518L21893q3762j14063
433D8662l03994J3118J57838k60850M23937K36544l77576J16885j19119n1520
423a16075Q811j02841K44030q5169l76669J14048M95678L4256j70624K7100M27315
412D99860n7912r4781J94785k56167m37611r8166k0553l63663L60602M89689N85735
401H01818m3658l51830J67802K0680k97958m44227k14510L78978J04194K46977
391C68266r6991k95829L14735k08126J4456Q0851M45534n18263J66123P5578J40472
380D86806L2200k77666j08166O5959K01592Q4916k15606j02050J50845k65379
370E3451L5380j11580L63983J48863N4574n27267k423L12590j63789o32296L20968
$$ plain form
359 -147546 57876 -91143 347429 366216 -99188 -377528 53927 321693 134584 316467
349 316467 -153562 -105272 198457 228859 742853 690853 478993 339591 430458 427141 345001
338 345001 261959 145564 154466 3002 486149 698423 894896 449302 -374449 -231665
328 -231665 87873 322590 449531 49288 -89714 228125 -40548 -209741 46321 -32104
318 -32104 89373 61953 -4951 202896 103459 79539 154397 256663 139925 84669 -187879
307 -187879 -381145 -136667 -247577 -108181 321921 -11063 76545 -104507 -239764 43212
297 43212 559072 999115 424102 258175 275307 513749 475129 -105179 -351224 -451517
287 -451517 -143524 -282256 -103699 -153732 -336843 263914 594361 367641 -42858 250384
$$ packed form
359a47546K05422j49019M38572J8787m65404k78340M31455K67766j87109J81883
349C16467m70029M8290L03729L0402N13994n2000k11860j39402R0867l317q2140
338C45001q3042j16395Q902j51464M83147K12274J96473m45594q23751J42784
328b31665L19538K34717J26941m00243j39002L17839k68673j69193K56062p8425
318c2104J21477k7420o6904K07847r9437k3920P4858J02266j16738n5256k72548
307a87879j93266K44478j10910J39396M30102l32984Q7608j81052j35257K82976
297D3212N15860M40043n75013j65927J7132K38442l8620n80308k46045j00293
287d51517L07993j38732J78557n0033j83111O00757L30447k26720m10499K93242
$$ plain form
277 250384 145034 40727 180440 -301568 -98754 -222270 326014 182949 -130222 272670
267 272670 51161 -187135 -273492 201988 -138804 207982 789593 366352 26274 -103462
257 -103462 -7101 -107770 -68063 -57599 -35986 -86418 -163983 -263206 329364 532393 364287
246 364287 214801 -153152 175300 644501 623831 551592 145216 300350 380456 53385
236 53385 161892 277846 435527 329661 701920 863531 609387 225555 378602 402574
226 402574 818254 651537 250925 543208 451615 515426 388873 -162048 150145 292314
216 292314 368485 420056 369730 393097 397824 118740 442407 448423 550864 623737 606105 855952
204 855952 780257 415494 222599 157984 298775 204810 189435 150865 233658 276000 18193
$$ packed form
277B50384j05350j04307J39713m82008K02814j23516N48284j43065l13171M02892
267B72670k21509k38296q6357M75480l40792L46786N81611m23241l40078j29736
257a03462R6361j00669L9707J0464K1613n0432p7565r9223N92570K03029j68106
246C64287j49486l67953L28452M69201k0670p2239m06376J55134Q0106l27071
236E3385J08507J15954J57681j05866L72259J61611k54144l83832J53047K3972
226D02574M15680j66717m00612K92283r1593O3811j26553n50921L12193J42169
216B92314P6171N1571n0326K3367M727k79084L23667O016J02441P2873j7632K49847
204H55952p5695l64763j92895o4615J40791r3965j5375l8570Q2793M2342k57807
$$ plain form
193 18193 55016 -324 295965 376630 579644 461872 88646 278172 303445 77847 12798
182 12798 -216292 53413 258570 386008 551449 178590 65852 496185 282670 -65651
172 -65651 -220219 93751 -143017 -169931 -63352 -171201 -191886 682027 -53765 -243693
162 -243693 -101636 -189595 -333581 10566 10099 220764 96869 266841 67598 184096 402831
151 402831 262573 653653 366693 181061 -17734 703443 731564 279331 178925 280286
141 280286 422198 169352 -193486 -85504 38672 338113 -159368 -148181 -356034 -35581
131 -35581 43387 -66419 -24952 24358 338516 558937 87594 -123730 -176299 -30613 -4580
120 -4580 -97189 -303978 -199123 -150671 -416431 -258966 81245 -4130 -111032 174510 364911
$$ packed form
193A8193L6823n5340K96289Q0665K03014j17772l73226J89526K5273k25598o5049
182A2798k29090K69705K05157J27438J65441l72859j12738M30333k13515l48321
172f5651j54568L13970k36768k6914J06579j07849k0685Q73913p35792j89928
162b43693J42057q7959j43986L44147m67K10665j23895J69972j99243J16498K18735
151D02831j40258L91080k86960j85632j98795P21177K8121m52233j00406J01361
141B80286J41912k52846l62838J07982J24176K99441m97481J1187k07853L20453
131c5581P8968j09806M1467M9310L14158K20421m71343k11324n2569J45686K6033
120d580r2609k06789J04855M8452k65760J57465L40211q5375j06902K85542J90401
$$ plain form
109 364911 259604 194623 295938 443197 516257 322901 171641 321205 -31820 31740
99 31740 57957 198660 24949 113012 54865 4812 497763 213267 353531 -190043 -328348
88 -328348 -152357 -142937 -220632 -123398 -143693 -331826 77607 282353 12866 -20202 95960
77 95960 276087 130498 229307 -67048 -347642 -1450 -109155 -157240 -108982 -131356 -50118
66 -50118 -220933 -184440 -82706 -50090 -176272 -219210 -193112 -213830 -98017 -90002 -437521
55 -437521 34381 261659 -109149 -29560 41067 360539 208568 50261 66283 -56680 -95422
44 -95422 -36416 41631 61614 -10253 -169545 -94093 241907 261959 -172533 -232401 178333
33 178333 212185 105467 -73341 125565 25831 -203279 -457981 -110508 229620 102856
$$ packed form
109C64911j05307o4981J01315J47259P3060j93356j51260J49564l53025O3560
99C1740K6217J40703j73711Q8063n8147n0053M92951k84496J40264n43574j38305
88c28348J75991R420p7695R7234k0295j88133M09433K04746k69487l3068J16162
77I5960J80127j45589R8809k96355k80594L46192j07705m8085M8258k2374Q1238
66e0118j70815L6493J01734L2616j26182m2938K6098k0718J15813Q015l47519
55d37521M71902K27278l70808P9589P0627L19472j51971j58307J6022j22963l8742
44i5422N9006P8047J9983p1867j59292P5452L36000K0052m34492n9868M10734
33A78333L3852j06718j78808J98906r9734k29110k54702L47473L40128j26764
$$ plain form
23 102856 -76106 9919 -21321 -309772 -134207 -70782 -22798 -150026 -176430 -223419 -248708
12 -248708 -326909 -348952 -81238 61807 145460 -2436 -43839 -293288 -307269 -207812 -152168
1 -152168 -99656
0 -99656
$$ packed form
23A02856j78962Q6025l1240k88451J75565O3425M7984j27228k6404m6989k5289
12b48708p8201k2043K67714J43045Q3653j47896m1403k49449j3981R9457N5644
1a52168N2512
0i9656
$$ Imaginary data points
##PAGE= N=2
##DATA TABLE= (X++(I..I)), XYDATA
$$ plain form
16383 -2286632 -2265868 -2196946 -2225916 -2012888 -1888484 -1967353 -1786247 -1556865 -1662749 -1665314
16373 -1665314 -1573298 -1685584 -1472961 -1207713 -1354500 -1389734 -1453173 -1653238 -1431415 -1341622
16363 -1341622 -1253238 -1282820 -1402491 -1462955 -1473290 -1059810 -958856 -1016600 -1190952 -745801
16353 -745801 -865853 -1075189 -810322 -673288 -912574 -934475 -927670 -735450 -1021216 -1103748
16343 -1103748 -840005 -814260 -658413 -530178 -556944 -709592 -531299 -621795 -623172 -407553
16333 -407553 -435924 -703537 -882688 -991235 -857681 -587898 -500619 -350010 -415726 -473206
16323 -473206 -190488 -409679 -321355 -242690 14132 227767 211860 -124493 -182010 -265116
16313 -265116 -46426 -62627 50195 344398 223570 206329 -25594 467642 462750 425031
$$ packed form
16383b286632K0764O8922k8970K13028J24404p8869J81106K29382j05884k565
16373a665314R2016j12286K12623K65248j46787l5234o3439k00065K21823Q9793
16363a341622Q8384k9582j19671o0464j0335M13480J00954n7744j74352M45151
16353g45801j20052k09336K64867J37034k39286k1901O805J92220k85766q2532
16343a103748K63743K5745J55847J28235k6766j52648J78293r0496j377K15619
16333d07553k8371k67613j79151j08547J33554K69783Q7279J50609o5716n7480
16323d73206K82718k19191Q8324P8665K56822K13635j5907l36353n7517q3106
16313b65116K18690j6201J12822K94203j20828j7241k31923M93236m892l7719
$$ plain form
16303 425031 657571 756545 781769 627804 647165 403023 289962 198675 414689 481507
16293 481507 741827 447091 426766 496884 624326 422983 219908 170263 361459 581258
16283 581258 1120882 1199109 921167 832883 911291 939198 1000434 1023203 1235945 1158768 972835
16272 972835 1157125 955431 764074 1149599 1302602 1234511 1166381 1150280 1023428 784395
16262 784395 957905 1230855 1402905 1165403 730884 762170 886759 1148274 1319867 1436660
16252 1436660 1621273 1261043 1051076 1285231 1147243 1246928 1780191 1793584 1689094 1326088
16242 1326088 1150143 1211639 1725096 1772715 1252024 1147394 1579520 1460115 1636322 1439163
16232 1439163 1509003 1587782 1352160 1503034 1964420 1699096 1636277 1612746 1743787 1725142
$$ packed form
16303D25031K32540R8974K5224j53965J9361k44142j13061r1287K16014O6818
16293D81507K60320k94736k0325P0118J27442k01343k03075m9645J91196K19799
16283E81258N39624P8227k77942q8284P8408K7907O1236K2769K12742p7177j85933
16272I72835J84290k01694j91357L85525J53003o8091o8130j6101j26852k39033
16262G84395J73510K72950J72050k37502m34519L1286J24589K61515J71593J16793
16252A436660J84613l60230k09967K34155j37988R9685N33263J3393j04490l63006
16242A326088j75945O1496N13457M7619n20691j04630M32126j19405J76207j97159
16232A439163O9840P8779k35622J50874M61386k65324o2819k3531J31041j8645
$$ plain form
16222 1725142 1883611 2072091 2358883 2138838 2321298 1855400 1857526 2335044 2208906 1997541
16212 1997541 1880446 1688053 1765183 2053915 1939093 2522366 2337370 2103117 2023998 1908600
16202 1908600 1881264 2064558 2199664 1973748 1893144 2243631 2242198 2314050 2124153 1812046
16192 1812046 1810309 1977035 2182586 2254142 2349493 2631288 2462442 2344669 2096634 1884858
16182 1884858 2061746 2311654 2621097 2622903 2476975 2165615 2156841 2367067 2649063 2802564
16172 2802564 2516089 2576512 2544571 2280047 2482958 2523634 2634965 2585748 2296120 2477746
16162 2477746 2559038 2659235 2716423 2932873 2951222 2700748 2584784 2416061 3040329 2957285
16152 2957285 2580595 2225852 2097930 2510042 2835560 2786946 2436915 2182687 2294674 2721256
$$ packed form
16222A725142J58469J88480K86792k20045J82460m65898K126M77518j26138k11365
16212A997541j17095j92393P7130K88732j14822N83273j84996k34253p9119j15398
16202A908600k7336J83294J35106k25916q0604L50487j433P1852j89897l12107
16192A812046j737J66726K05551P1556R5351K81795j68846j17773k48035k11776
16182A884858J76888K49908L09443J806j45928l11360q774K10226K81996J53501
16172B802564k86475O0423l1941k64524K02911M0676J11331m9217k89628J81626
16162B477746Q1292J00197N7188K16450J8349k50474j15964j68723O24268q3044
16152B957285l76690l54743j27922M12112L25518m8614l50031k54228J11987M26582
$$ plain form
16142 2721256 2526024 2270392 2529260 2599426 2530600 2955692 2691065 2568316 2779475 2808253
16132 2808253 2718897 3174162 3012450 2556287 2698861 2636161 2555781 2374760 2301392 2602172
16122 2602172 2674618 2386016 2379664 2152853 2551470 3175432 2941523 2336237 2413248 2676577
16112 2676577 2870434 2785872 2521946 2894447 2703947 2556383 2581596 3209264 2994134 2476850
16102 2476850 2525446 2439799 2458350 2839212 2952422 2907557 2784318 2832444 2492435 2673147
16092 2673147 2820818 2664461 2761441 2827748 2883053 3031586 2895408 2316810 2461454 2408813
16082 2408813 2809753 3111249 2996946 2688165 2895141 3005286 2750580 2570972 2810293
16073 2810293 2989415 2573407 3129187 3249660 2965617 3340095 3019159 2563666 2873530
$$ packed form
16142B721256j95232k55632K58868P0166o8826M25092k64627j22749K11159K8778
16132B808253q9356M55265j61712m56163J42574o2700q0380j81021p3368L00780
16122B602172P2446k88602o352k26811L98617O23962k33909o05286P7011K63329
16112B676577J93857q4562k63926L72501j90500j47564K5213O27668k15130n17284
16102B476850M8596q5647J8551L80862J13210m4865j23239M8126l40009J80712
16092B673147J47671j56357R6980O6307N5305J48533j36178n78598J44644n2641
16082B408813M00940L01496j14303l08781K06976J10145k54706j79608K39321
16073B810293J79122m16008N55780J20473k84043L74478l20936m55493L09864
$$ plain form
16064 2873530 3222347 2905697 2308622 2794868 3290873 3115237 3025721 2987815 2495669 2613833
16054 2613833 3044760 2808351 2679125 2613700 2762822 3012648 3212687 3015236 2359039 2540777
16044 2540777 2658810 2554744 2531426 2630731 2478579 2594090 2929874 2976212 3049819 3120801
16034 3120801 2984034 2830304 2946201 2743767 2751775 2813786 2825779 3028498 3478821 3510350
16024 3510350 3180157 2991374 3155885 2872215 3009325 3068278 3008750 3001511 2391904 2315310
16014 2315310 2603446 2618075 2603376 2762730 3022027 2809681 2964908 3162571 2863515 2822588
16004 2822588 2947986 2483449 2514914 2385733 2407431 2625410 2781567 2966953 2942628 2950463
15994 2950463 3078322 3080051 2892476 2770434 2690924 2808544 2685327 2275701 2562054 2670447
$$ packed form
16064B873530L48817l16650n97075M86246M96005j75636q9516l7906m92146J18164
16054B613833M30927k36409j29226o5425J49122K49826K00039j97451o56197J81738
16044B540777J18033j04066k3318R9305j52152J15511L35784M6338P3607P0982
16034C120801j36767j53730J15897k02434Q008O2011J1993K02719M50323L1529
16024C510350l30193j88783J64511k83670J37110N8953n9528p239o09607p6594
16014B315310K88136J4629j4699J59354K59297k12346J55227J97663k99056m0927
16004B822588J25398m64537L1465j29181K1698K17979J56157J85386k4325P835
15994B950463J27859J729j87575j22042p9510J17620j23217m09626K86353J08393
$$ plain form
15984 2670447 3080419 2549230 2323884 2812927 3130592 3265740 2863235 2705851 2971897
15975 2971897 2968449 2227122 2174792 2626775 2116886 2711182 2742745 2705929 3054641 2966866
15965 2966866 2808394 2709966 2632996 2669814 3093535 2725009 2884745 3122066 2901321 2683568
15955 2683568 2867420 3151334 3278679 2875541 2940633 2709494 2904915 2672831 2903992 3081992
15945 3081992 3121311 3115221 2927621 3112344 3345470 3018271 3231744 3175810 2920340 2951533
15935 2951533 2863530 2832203 2873824 2870392 2713056 2887758 2903782 2761661 2944213 2896131 2478133
15924 2478133 2275268 2577285 2971316 3014512 2823528 2859238 3052652 3037153 3396630 3002201
15914 3002201 2481109 2616577 2634427 2588328 2778416 2538650 2622514 2869183 3246748 2894166
$$ packed form
15984B670447M09972n31189k25346M89043L17665J35148m02505j57384K66046
15975B971897l448p41327n2330M51983n09889N94296L1563l6816L48712q7775
15965B966866j58472r8428p6970L6818M23721l68526J59736K37321k20745k17753
15955B683568J83852K83914J27345m03138O5092k31139J95421k32084K31161J78000
15945C081992L9319o090j87600J84723K33126l27199K13473n5934k55470L1193
15935B951533q8003l1327M1621l432j57336J74702J6024j42121J82552m8082m17998
15924B478133k02865L02017L94031M3196j90984L5710J93414j5499L59477l94429
15914C002201n21092J35468J7850m6099J90088k39766Q3864K46669L77565l52582
$$ plain form
15904 2894166 2577032 3422131 3254897 3293451 3232066 3089232 2846549 2793409 2569668 2781551
15894 2781551 2793966 2497641 2864848 2871475 2718287 2845502 2809784 2913936 2895153 2624415
15884 2624415 2822300 2566360 2492192 2753669 3283618 3187408 2906329 3074955 2899364 2805993
15874 2805993 2738835 2612343 2211644 3110864 3139999 2774341 2912206 3033419 2951472 2758351
15864 2758351 2845015 3032282 2920265 2888746 3077975 3204608 3053716 3424334 3342788 2890630
15854 2890630 3162067 3039573 3375449 2858898 2780918 2966946 3475472 3572471 3029866 2901022
15844 2901022 3058703 3208766 3362270 3225043 3211578 3024822 2884247 2691800 2737722 2751966
15834 2751966 2955089 3195064 2895696 2935411 3200397 2970439 2992005 3011430 3214993 3051360
$$ packed form
15904B894166l17134Q45099j67234L8554o1385j42834k42683n3140k23741K11883
15894B781551J2415k96325L67207O627j53188J27215l5718J04152j8783k70738
15884B624415J97885k55940p4168K61477N29949r6210k81079J68626j75591r3371
15874B805993o7158j26492m00699Q99220K9135l65658J37865J21213q1947j93121
15864B758351Q6664J87267j12017l1519J89229J26633j50892L70618q1546m52158
15854B890630K71437j22494L35876n16551p7980J86028N08526R6999n42605j28844
15844B901022J57681J50063J53504j37227j3465j86756j40575j92447M5922J4244
15834B751966K03123K39975k99368L9715K64986k29958K1566J9425K03563j63633
$$ plain form
15824 3051360 3353302 3552081 3372784 3497875 2929920 2770372 3267353 3204138 3254285 3223718
15814 3223718 3437297 3289682 2819748 2438864 2974894 3481517 3388383 2761876 2571448 2672677
15804 2672677 2689579 2815225 2451812 2608470 2749853 2685746 2596661 2810319 2976424 2906042
15794 2906042 3163617 2898885 2400793 2685094 2424731 2491944 2624398 2853887 2907399 3050465
15784 3050465 3033289 3261995 3045929 3095956 3281323 3046565 3148192 3016711 2975529 2875461
15774 2875461 3196913 2918089 2524064 2800786 2594964 3159200 3557003 3196327 3151165 3269166
15764 3269166 3125146 3116524 3411673 3179560 3032968 2952982 3158966 2923103 2779995 3051272
15754 3051272 3376959 3603960 3047932 2886307 2680935 2475283 2671735 2608625 2648405 2826757
$$ packed form
15824C051360L01942J98779j79297J25091n67955j59548M96981o3215N0147l0567
15814C223718K13579j47615m69934l80884N36030N06623r3134o26507j90428J01229
15804B672677J6902J25646l63413J56658J41383o4107q9085K13658J66105p0382
15794B906042K57575k64732m98092K84301k60363O7213J32454K29489N3512J43066
15784C050465j7176K28706k16066N0027J85367k34758J01627j31481m1182j00068
15774B875461L21452k78824l94025K76722k05822N64236L97803l60676m5162J18001
15764C269166j44020q622K95149k32113j46592p9986K05984k35863j43108K71277
15754C051272L25687K27001n56028j61625k05372k05652J96452o3110L9780J78352
$$ plain form
15744 2826757 2956770 3402684 3829601 3229785 2923251 2741320 2583633 2711977 2620646 2681846
15734 2681846 3124439 3378819 3065269 3016414 3077754 3049720 2910490 3150392 3028990 2820556
15724 2820556 2644188 2853388 2874041 3086932 3025726 2997427 3077856 3034403 2826782 3068085
15714 3068085 3198957 3005370 2922518 3132374 3303908 3017897 3257958 3158858 3015573 3305562
15704 3305562 3264605 2875599 2586642 2762292 2877661 3217362 3168837 3059526 3057642 3220155
15694 3220155 3159673 3065756 3065565 2610768 2706401 2811143 2737549 2643968 2968827 2808273 2998799
15683 2998799 2996529 2955710 2868068 3032523 3025289 2897190 3317609 3221561 3366850 2970933 2860202
15672 2860202 3062401 3171080 3008917 2972825 3021457 3297546 3324033 3056689 3136853 3093770
$$ packed form
15744B826757J30013M45914M26917n99816l06534j81931j57687J28344r1331O1200
15734B681846M42593K54380l13550m8855O1340k8034j39230K39902j21402k08434
15724B820556j76368K09200K0653K12891o1206k8299Q0429m3453k07621K41303
15714C068085J30872j93587q2852K09856J71534k86011K40061r9100j43285K89989
15704C305562m0957l89006k88957J75650J15369L39701m8525j09311j884J62513
15694C220155o0482r3917j91m54797R5633J04742p3594r3581L24859j60554J90526
15683B998799k270m0819q7642J64455p234j28099M20419r6048J45289l95917j10731
15672B860202K02199J08679j62163l6092M8632K76089K6487k67344Q0164m3083
$$ plain form
15662 3093770 2764677 2659468 2730824 3013084 3063097 3334855 3396111 3128421 3174712 2596422
15652 2596422 2634699 3000358 3177683 2761006 2762955 3317362 3015877 2856234 2754902 2292671
15642 2292671 2625020 2863647 2898299 2653022 2565284 2552041 2533954 2781241 3021176 2352127
15632 2352127 2540944 2592120 2639253 2728674 2754287 2882721 3018074 2901893 2829231 2941396
15622 2941396 2724549 2552671 2531917 2979461 3393838 3438528 3384876 3561259 3445210 3044294
15612 3044294 3132142 3023744 3214159 3221802 3095744 3333093 3255352 2555862 3015933 3491976
15602 3491976 3364089 3259309 2997581 2938972 3133443 3468414 3282128 3463210 3388149 3443583
15592 3443583 3085947 3005484 3268059 3261568 3256160 3084041 2605623 2987367 3041911 3144310
$$ packed form
15662C093770l29093j05209P1356K82260N0013K71758O1256k67690M6291n78290
15652B596422L8277L65659J77325m16677J949N54407l01485j59643j01332m62231
15642B292671L32349K38627L4652k45277q7738j3243j8087K47287K39935o69049
15632B352127J88817N1176M7133Q9421K5613J28434J35353j16181p2662J12165
15622B941396k16847j71878k0754M47544M14377M4690n3652J76383j16049m00916
15612C044294Q7848j08398J90415P643j26058K37349p7741o99490M60071M76043
15602C491976j27887j04780k61728n8609J94471L34971j86286J81082p5061N5434
15592C443583l57636q0463K62575o491n408j72119m78418L81744N4544J02399
$$ plain form
15582 3144310 3301637 3137603 2946961 3270438 3447186 2833571 2759392 2668339 2386944 2872340
15572 2872340 2916911 3271524 3185801 2704144 2665363 2705908 2576697 2650768 2951667 3070017
15562 3070017 3256525 3401418 3133037 2770392 3139389 3172928 3029580 3092940 2955550 2546082
15552 2546082 2726051 2740134 2757401 2784270 2841042 3283418 3305641 3427551 3261745 3256989 3139521
15541 3139521 2547155 2396033 2264331 2333058 2658901 2960866 2699448 2496195 2391009 2377576
15531 2377576 2397030 2793968 2866269 2833054 2902948 3072833 3225628 3480132 3298640 3526268
15521 3526268 3416807 3134376 3292010 3463862 2882265 2497175 2664286 3237007 3282154 2963988
$$ packed form
15582C144310J57327j64034j90642L23477J76748o13615p4179r1053k81395M85396
15572B872340M4571L54613q5723m81657l8781M0545j29211P4071L00899J18350
15562C070017J86508J44893k68381l62645L68997L3539j43348O3360j37390m09468
15552B546082J79969J4083J7267K6869N6772M42376K2223J21910j65806m756j17468
15541C139521n92366j51122j31702O8727L25843L01965k61418k03253j05186j3433
15531B377576J9454L96938P2301l3215O9894J69885J52795K54504j81492K27628
15521C526268j09461k82431J57634J71852n81597l85090J67111N72721M5147l18166
$$ [...]
##END NTUPLES=NMR SPECTRUM
##END=
