##TITLE=1H_TG-2364-x
 DMSO
 24 sc, 
 16.11.2022
##JCAMPDX= 6.0         $$ Bruker NMR JCAMP-DX V2.0
##DATA TYPE= NMR SPECTRUM
##DATA CLASS= NTUPLES
##ORIGIN= UXNMR, Bruker Analytische Messtechnik GmbH
##OWNER= root
$$ XWIN-NMR		Version 3.5
$$ Wed Nov 16 14:29:18 2022 Russian Standard Time (UT+4h)  she@DPX200
##.OBSERVE FREQUENCY= 200.1313499994
##.OBSERVE NUCLEUS= ^1H
##.ACQUISITION MODE= SIMULTANEOUS
##.ACQUISITION SCHEME= undefined
##.AVERAGES= 32
##.DIGITISER RES= 18
##SPECTROMETER/DATA SYSTEM= spect
##.PULSE SEQUENCE= zg30
##.SOLVENT NAME= DMSO
##.SHIFT REFERENCE= (INTERNAL, DMSO, 0, 15.7491)
##AUDIT TRAIL= $$ (NUMBER, WHEN, WHO, WHERE, WHAT)
$$ ##TITLE= Audit trail, XWIN-NMR		Version 3.5
$$ ##JCAMPDX= 5.01
$$ ##ORIGIN= Bruker BioSpin GmbH
$$ ##OWNER= she
$$ F:/spectra/data/she/nmr/H-F/1/pdata/1/auditp.txt
$$ ##AUDIT TRAIL=  $$ (NUMBER, WHEN, WHO, WHERE, WHAT)
(   1,<2022-11-16 14:27:22.20 +0400>,<she>,<DPX200>,
      <continue with go, POWCHK disabled, PULCHK disabled
       configuration hash MD5:
       00 E9 B6 7A A2 85 ED C7 34 08 36 98 17 FE 4E 26
       data hash MD5: 16K
       79 8F 7D C9 BC 43 BB 51 03 31 06 AC 5C 0C D1 E2>)
(   2,<2022-11-16 14:28:15.46 +0400>,<she>,<DPX200>,
      <Start of raw data processing
       efp BC_mod = 2 LB = 0.24 FT_mod = 6 PKNL = 1 PHC0 = -18034.65 PHC1 = 15.0007 SI = 16K 
       data hash MD5: 16K
       09 37 BF 9D A2 E6 C6 E2 71 06 C4 BD 33 1B 3F CF>)
(   3,<2022-11-16 14:28:29.89 +0400>,<she>,<DPX200>,
      <pk PHC0 = 1.633378 PHC1 = -3.4 
       data hash MD5: 16K
       9A FC 56 1B BD 04 19 C3 03 2A F9 20 44 E9 24 8E>)
(   4,<2022-11-16 14:28:33.48 +0400>,<she>,<DPX200>,
      <abs ABSG = 5 
       data hash MD5: 16K
       2E 1C 6C B5 C3 56 7D 6B C9 B0 6F F7 9F 9E 9C B5>)
$$ ##END=
$$ 
$$ hash MD5
$$ F3 24 36 BB 1A 50 71 B7 36 85 BA 74 7A CB 22 21
##$RELAX= 
##$RELAX= 
##$RELAX= 
##$RELAX= 
##$RELAX= 
##$RELAX= 
$$ Bruker specific parameters
$$ --------------------------
##$DU= <F:/spectra>
##$EXPNO= 1
##$NAME= <H-F>
##$PROCNO= 1
##$TYPE= <nmr>
##$USER= <she>
##$AMP= (0..31)
100 100 100 100 100 100 100 100 100 100 100 100 100 100 100 100 100 100 
100 100 100 100 100 100 100 100 100 100 100 100 100 100 
##$AQSEQ= 0
##$AQ_mod= 1
##$AUNM= <au_zg>
##$AUTOPOS= <>
##$BF1= 200.13
##$BF2= 200.13
##$BF3= 200.13
##$BF4= 200.13
##$BF5= 200.13
##$BF6= 200.13
##$BF7= 200.13
##$BF8= 200.13
##$BYTORDA= 1
##$CFDGTYP= 0
##$CFRGTYP= 5
##$CHEMSTR= <none>
##$CNST= (0..31)
1 1 145 1 1 1 1 1 1 1 1 1 1 1 1 1 1 1 1 1 1 1 1 1 1 1 1 1 1 1 1 1 
##$CPDPRG= <>
##$CPDPRG1= <>
##$CPDPRG2= <>
##$CPDPRG3= <>
##$CPDPRG4= <mlev>
##$CPDPRG5= <mlev>
##$CPDPRG6= <mlev>
##$CPDPRG7= <mlev>
##$CPDPRG8= <mlev>
##$CPDPRGB= <>
##$CPDPRGT= <>
##$D= (0..31)
0 1.2 0 0 0 0 0 0 0 0.06 0 0.03 0 0 0 0 0.0002 0 0 0 0 0 0 0 0 0 0 0 0 
0 0 0 
##$DATE= 1668594291
##$DBL= (0..7)
120 120 120 120 120 120 120 120 
##$DBP= (0..7)
150 150 150 150 150 150 150 150 
##$DBP07= 0
##$DBPNAM0= <>
##$DBPNAM1= <>
##$DBPNAM2= <>
##$DBPNAM3= <>
##$DBPNAM4= <>
$$ [...]
##$SUBNAM3= <"">
##$SUBNAM4= <"">
##$SUBNAM5= <"">
##$SUBNAM6= <"">
##$SUBNAM7= <"">
##$SUBNAM8= <"">
##$SUBNAM9= <"">
##$SW= 18.0517283424941
##$SWIBOX= (0..15)
0 0 2 0 0 0 0 0 0 0 0 0 0 0 0 0 
##$SW_h= 3612.71676300578
##$TD= 16384
##$TD0= 1
##$TE= 0
##$TE2= 300
##$TE3= 300
##$TEG= 300
##$TL= (0..7)
0 120 120 120 120 120 120 120 
##$TP= (0..7)
150 150 150 150 150 150 150 150 
##$TP07= 0
##$TPNAME0= <>
##$TPNAME1= <>
##$TPNAME2= <>
##$TPNAME3= <>
##$TPNAME4= <>
##$TPNAME5= <>
##$TPNAME6= <>
##$TPNAME7= <>
##$TPOAL= (0..7)
0.5 0.5 0.5 0.5 0.5 0.5 0.5 0.5 
##$TPOFFS= (0..7)
0 0 0 0 0 0 0 0 
##$TUNHIN= 0
##$TUNHOUT= 0
##$TUNXOUT= 0
##$USERA1= <user>
##$USERA2= <user>
##$USERA3= <user>
##$USERA4= <user>
##$USERA5= <user>
##$V9= 5
##$VALIST= <valist>
##$VCLIST= <CCCCCCCCCCCCCCC>
##$VD= 0
##$VDLIST= <DDDDDDDDDDDDDDD>
##$VPLIST= <PPPPPPPPPPPPPPP>
##$VTLIST= <TTTTTTTTTTTTTTT>
##$WBST= 1024
##$WBSW= 4
##$XGAIN= (0..3)
0 0 0 0 
##$XL= 0
##$YL= 0
##$YMAX_a= 231450
##$YMIN_a= -349874
##$ZGOPTNS= <>
##$ZL1= 120
##$ZL2= 120
##$ZL3= 120
##$ZL4= 120
##$ABSF1= 15.74909
##$ABSF2= -2.302759
##$ABSG= 5
##$ABSL= 3
##$ALPHA= 0
##$AQORDER= 0
##$ASSFAC= 0
##$ASSFACI= 0
##$ASSFACX= 0
##$ASSWID= 0
##$AUNMP= <proc_1d>
##$AZFE= 0.1
##$AZFW= 0.1
##$BCFW= 0
##$BC_mod= 2
##$BYTORDP= 0
##$COROFFS= 0
##$CY= -3
##$DATMOD= 1
##$DC= 0
##$DFILT= <>
##$DTYPP= 0
##$F1P= 0
##$F2P= 0
##$FCOR= 1
##$FTSIZE= 16384
##$FT_mod= 6
##$GAMMA= 0
##$GB= 0
##$INTBC= 1
##$INTSCL= 3.70164e-10
##$ISEN= 128
##$LB= 0.24
##$LEV0= 0
##$LPBIN= 0
##$MAXI= 10000
##$MC2= 0
##$MEAN= 0
##$ME_mod= 0
##$MI= 1.114404
##$NCOEF= 0
##$NC_proc= -6
##$NLEV= 6
##$NOISF1= 3.799351
##$NOISF2= 2.8
##$NSP= 0
##$NTH_PI= 0
##$NZP= 0
##$OFFSET= 15.74909
##$PC= 1
##$PHC0= -18033.02
##$PHC1= 11.6007
##$PH_mod= 1
##$PKNL= yes
##$PPARMOD= 0
##$PSCAL= 0
##$PSIGN= 0
##$REVERSE= no
##$SF= 200.130004492325
##$SI= 16384
##$SIGF1= 3
##$SIGF2= 2
##$SINO= 5.538805
##$SIOLD= 16384
##$SREGLST= <1H.CDCl3>
##$SSB= 0
##$STSI= 16384
##$STSR= 0
##$SW_p= 3612.71676300578
##$SYMM= 0
##$S_DEV= 0
##$TDeff= 16384
##$TDoff= 0
##$TI= <>
##$TILT= no
##$TM1= 0
##$TM2= 0
##$TOPLEV= 0
##$USERP1= <user>
##$USERP2= <user>
##$USERP3= <user>
##$USERP4= <user>
##$USERP5= <user>
##$WDW= 1
##$XDIM= 16384
##$YMAX_p= 462452881
##$YMIN_p= -1576069
$$ End of Bruker specific parameters
$$ ---------------------------------
##NTUPLES= NMR SPECTRUM
##VAR_NAME=  FREQUENCY,     SPECTRUM/REAL,   SPECTRUM/IMAG
##SYMBOL=    X,             R,               I
##VAR_TYPE=  INDEPENDENT,   DEPENDENT,       DEPENDENT
##VAR_FORM=  AFFN,          ASDF,            ASDF
##VAR_DIM=   16384,         16384,           16384
##UNITS=     HZ,            ARBITRARY UNITS, ARBITRARY UNITS
##FACTOR=    0.220516191357247, 1,           1
##FIRST=     3151.86549141577, 0,            0
##LAST=      -460.851271590007, 0,           0
##MIN=       -460.851271590007, -1576069,    0
##MAX=       3151.86549141577, 462452881,    0
$$ Real data points
##PAGE= N=1
##DATA TABLE= (X++(R..R)), XYDATA
$$ [...]
10764 -184859 -84048 47417 -102692 8471 50983 169752 228340 77787 -77022 -104226
10754 -104226 -164908 -262711 33229 211781 -36310 -127319 -225946 -97916 193222 72322
10744 72322 113357 -64145 -20205 -117278 -52399 92287 -169433 10511 -137992 -204227 97993
10733 97993 94199 36214 -123301 -15099 86682 47520 -54258 -166089 -90186 -249129 -302247
10722 -302247 -89685 -15116 -116964 -186715 19151 -28864 -193587 -101486 36367 66222
10712 66222 187025 128462 17020 -94793 -3802 32427 -109005 -126360 -171707 -190496 27990
10701 27990 107763 7245 133524 244195 25904 -17715 -1354 -98751 155584 -123391
10691 -123391 -93267 -80628 -311842 -493298 -35133 292880 114002 49931 221433 208761
10681 208761 440 148836 249984 105117 9756 -97025 -80887 -63648 113709 -135039
10671 -135039 -149698 -2316 49765 229740 168941 64888 -148474 12617 237291 279258
10661 279258 80884 132692 -10030 -191493 -245858 -139937 -205936 -222399 -161315 71537
10651 71537 98682 11542 -63920 -72488 10567 -9052 -131280 -197812 -260343 -190011 -38844
10640 -38844 -12454 -142090 -128034 -146308 -224716 -139655 41592 -153601 -24717 15274 -98091
10629 -98091 -133462 -110824 -36555 -77484 -129609 -179123 -1317 -65868 -138108 -173031 -118178
10618 -118178 -65803 -71876 -169829 -113711 -194265 -4532 32661 138211 -48142 -101989 -77007
10607 -77007 -238450 -103479 186027 213846 122028 -17885 -196636 53213 -84916 -278361
10597 -278361 -346454 -238483 -33123 -114104 -263345 -391780 -182276 123891 28534 -70796
10587 -70796 70030 103913 109781 135665 -87079 1400 -25352 -163680 -112837 -95940 -31542
10576 -31542 -81123 -214269 73617 -2550 -227051 -117331 -81445 -218655 -78694 119266
10566 119266 87558 19560 -96853 -50108 104659 -118691 -142230 -96897 -68863 -46373 -1185
10555 -1185 -63101 -156757 -99296 -115382 -115442 -56906 -83641 11368 -17476 -143965 40317 -20071
10543 -20071 -72445 -148867 -123866 -94952 -149840 -145345 -11000 -66814 -52123 43363 61220 188801
10531 188801 -19772 -249775 -178036 -112557 80330 -84819 -138022 -202084 -174620 -165133 -147824
10520 -147824 -17795 23327 -143831 -66413 -150811 -229679 -45295 66386 -102108 -31924
10510 -31924 -14174 -161336 -130912 -148070 -289885 -228730 -98286 -19457 40441 -82910 -97373
10499 -97373 -173245 -18802 -9394 -124162 44438 28863 -21728 -16101 177385 -30374 -141820
10488 -141820 -89916 -19123 88287 128225 -173 -136554 70398 182354 29388 -27157
10478 -27157 -228210 -62304 9624 -45960 -158877 -152150 667 -115881 -73924 -81491 -45781
10467 -45781 -77702 -13188 -60369 10255 -52910 13211 -61989 -14114 -127192 -97533 -169392
10456 -169392 -54295 -243021 -190613 -139476 -52715 -141915 -182993 -190953 -121278 -118553 -98340
10445 -98340 -10697 -73369 -148678 -124646 97904 24143 -93531 53984 130986 -2620 -50948
10434 -50948 -145374 98437 101641 -52365 -105886 -38936 -10299 -118529 -105620 -77207 -123853
10423 -123853 75512 209623 587 -27824 -139055 2308 13073 -194682 -197923 -130256
10413 -130256 24300 1794 -21410 -143026 27990 140166 203661 244530 180685 -76816
10403 -76816 -187478 -171217 38474 -28417 15195 -89401 -30650 -44766 -161280 -51637 -114372
10392 -114372 93094 69740 7460 -92542 -2244 9941 -114533 -91699 42220 -126113
10382 -126113 -197388 -165261 -108312 -8263 87097 83935 -74165 -191908 44316 -81848 962
10371 962 30932 56888 95854 4096 53480 -54297 -17598 81618 5552 -58140 111314 45428
10359 45428 25982 -129972 -151921 -126595 -255720 -220008 -239300 -144009 -127935 -357210 -130585
10348 -130585 -97037 -55818 -8768 31857 137753 -53710 -248367 -188568 -73337 -31768 45321
10337 45321 65439 -77265 -64246 -89894 -63174 6329 -13547 28076 114114 16995 87616
10326 87616 -30620 -102973 -44884 -45380 -18960 143302 -134336 -154167 74006 112435 102601
10315 102601 43870 184570 280652 195952 80739 54520 -144241 74196 120979 166926 138387
10304 138387 1691 62020 28242 68645 71006 200463 166115 31537 3865 66963 -9533
10293 -9533 134339 200878 13460 35354 -224432 -117015 -124464 -267717 -205804 -39620 42413
10282 42413 -29141 3064 -86907 -54324 -90942 -89424 46424 47947 80440 39947 -53929 2660
10270 2660 -130834 -240529 -83242 14511 -196547 -60158 161731 179515 117888 -92759
10260 -92759 -176479 -43443 33009 156868 -36119 -240053 -269461 -267948 -121341 -154161 -28450
10249 -28450 242699 346897 177904 157327 46596 13151 -100370 -103173 -166511 -23759 72161
10238 72161 19470 17483 22754 58443 99321 -13608 12192 -62524 -38852 -18931 -88880 -76886
10226 -76886 -286865 -301014 -87900 -161236 -30182 143322 -68972 -66193 120030 162658 151810
10215 151810 -43840 -262226 -278403 -220137 -195952 -75914 40831 -90259 -19604 -84900
10205 -84900 -117453 -170811 -12368 -72027 -352051 -400967 -397068 -199637 -126727 -168383 -212847
10194 -212847 -220574 -166780 77285 -17284 -72897 3319 21820 19881 168686 -119844 -170612
10183 -170612 -39416 -137313 -41396 47095 16545 63196 36750 39844 -17005 -205396 -59578
10172 -59578 19336 71518 81827 94941 -8712 -115711 -200599 -323112 -166748 -68208 -125663
10161 -125663 -96117 -184874 -323572 -257226 -303060 -347341 -146614 -266754 -131648 -132226 -99532
10150 -99532 46063 150719 -82526 -241324 -290804 -263316 -228698 4216 -31508 -461 38734
10139 38734 -148840 -50584 1557 -19402 -32088 -139708 -185021 -45284 -26437 6048 -84188
10128 -84188 -84264 7414 39424 161939 31622 -46545 -42039 -52122 69645 -141999 -207102 -139977
10116 -139977 -98744 88878 152303 -121872 -137092 2750 -173110 -177156 -30579 -71397 -228273
10105 -228273 -217901 -219180 -157544 -18105 46534 30842 120268 21282 42448 79082 -17675
10094 -17675 -189471 -192676 -131997 -28100 42144 -2441 13740 -137789 -107315 -21378 -17493
10083 -17493 -60359 -67267 -2317 31382 -30650 -102871 -10547 -111731 -157618 -128311 -133430 5749
10071 5749 -21141 43667 -142884 -51936 -146538 -58861 -77844 -280863 -303726 -396724 -129061
10060 -129061 61790 -58838 -56625 -26182 11064 -182172 -152899 -65229 -323229 -346099 -266042
10049 -266042 -233169 -525044 -501198 -120376 60922 68273 39040 18128 48305 16148 -166989
10038 -166989 -116919 -235808 -250121 -74627 -123839 -77580 -46162 -106501 -159376 -87101 25403
10027 25403 24347 38335 62533 -18524 -71643 -82149 97937 18700 46959 190452 176456
10016 176456 193220 -44975 -238627 -145296 66510 110225 81415 -65365 -142162 -114622 -220603
10005 -220603 -277555 -263074 -207780 -113312 -229042 -211628 71386 84685 -39372 -1027 -100513
9994 -100513 -160024 -206958 -106968 70570 -85120 -84127 -56219 -54054 31866 15111 90407 187003
9982 187003 134325 54519 20279 19459 52141 67789 -108844 7723 -12858 -21692 -17553 -38554
9970 -38554 104480 251717 -105435 -123045 -114715 -281807 -55585 -4447 5779 -23287 19935
9959 19935 -75591 -40366 -135779 -208728 31750 116763 -70363 -35365 20005 -44539 -169976
9948 -169976 85333 41788 25626 35814 68900 -63162 -19378 -65345 -49230 -159345 -185669
9937 -185669 -140968 -18501 7896 -57442 -98601 -61913 -69005 -63756 59584 -89174 -28708
9926 -28708 -116643 -135684 -182879 -184347 -168031 46277 -147368 -205474 -59875 6747 -29640
9915 -29640 60572 136189 20590 58635 49657 -36609 135740 89824 11010 33524 53123 123832
9903 123832 42926 -347 81793 7944 -12758 -12013 104045 9887 -12393 -26292 -91680 -131012
9891 -131012 -66743 -117287 -113369 -105581 -162662 -38696 -58616 -104453 -180864 141316 134897 -357398
9879 -357398 -224220 53101 -72981 -148705 142675 228272 98963 -21576 194926 151181
9869 151181 -70869 -81972 82652 73402 8297 106072 6673 -50307 -239161 -315328 -213764
9858 -213764 -56176 59883 -12806 -69134 -76800 -131291 -127848 94605 -231727 -298639 -80714
9847 -80714 -43106 -37772 -140055 -123802 -254468 -315045 3687 122995 94759 147111 5004
9836 5004 56818 151679 116507 -35765 116615 12775 133488 -9642 -18955 -120769 -189742
9825 -189742 231567 240094 141857 33374 -107008 14521 40113 -50875 73007 -1836 76119
9814 76119 40333 17308 54804 -1509 -74792 101934 298690 130470 -40527 -92934 -94700
9803 -94700 -66855 -125830 -154375 -13600 137159 120141 -106169 75717 176264 212078 266665
9792 266665 149734 23451 82293 -41980 130379 215674 88912 -105762 -106946 -106828 10267
9781 10267 -118011 -105799 124776 -25929 39184 -43998 -132404 -27594 7016 79816 65294
9770 65294 107026 90107 119839 81874 2113 53809 13284 -69408 -164947 -231813 -151160 -161064
9758 -161064 -211188 -292708 -137447 59759 28356 141065 2012 23550 72813 65181 142102
9747 142102 292281 -13246 -171012 -5411 -275 -59987 -67638 18484 -174777 37796 -13118
9736 -13118 -70592 83905 -93481 -218361 -8146 60721 -156563 260 -112915 -101639
9726 -101639 -98518 -36909 -16126 -149211 -151043 -252219 -303740 -29392 72091 73908 -3932
9715 -3932 -81777 -90958 -161856 -193820 123444 125307 140136 44464 -116445 -61171 22716 -100374
9703 -100374 66169 -3362 46265 244170 209537 51101 190232 395711 247776 165212
9693 165212 -45543 130702 9722 -9597 6710 130088 209314 187339 345809 187561
9683 187561 32440 170692 253340 412130 467459 306066 337966 281497 459738 310619
9673 310619 393299 284773 386961 332944 108214 304704 251723 295711 350584 358312 267777
9662 267777 521484 482312 484830 640113 787702 796288 910852 1145858 1394245 1474205 1669693
9651 1669693 1882592 2455781 3105982 3053306 2871272 2336081 1878418 1649884 1363929 1182485
9641 1182485 751150 719972 748841 826924 722023 667274 751876 735486 603833 412788 492218
9630 492218 370757 352019 362257 416200 120353 64070 304179 422263 452012 184211 321062
9619 321062 209975 359489 414937 190532 235185 357364 435461 314866 115490 95851
9609 95851 171396 141028 163404 197098 11817 -189888 -144420 -97942 56385 166365 53384
9598 53384 31109 47931 26981 104937 175197 255054 177468 143839 43639 82772 -70758
9587 -70758 -37923 63860 27148 -21628 62155 144675 54068 203727 307033 297276 123458
9576 123458 193834 219131 -125280 -304152 -2539 164611 -6558 312185 257790 225916
9566 225916 174081 -2340 29425 -57949 90844 181252 34571 -5792 -126716 -102220 45353
9555 45353 147573 57332 -18375 52474 -125927 122991 259468 201428 189185 56560 -9261
9544 -9261 -41730 -252776 -35528 79800 229743 -84969 -78360 195792 13449 21240 117901
9533 117901 321152 329299 265406 160618 58887 -33395 -67798 -401680 -211437 -70373 -52567
9522 -52567 -55168 -203596 -212250 -24574 -48260 -57960 159190 136347 213488 -62961 22989 57026
9510 57026 -27473 65061 50935 17506 120209 278875 126965 -48354 140395 98 75109
9499 75109 85164 216623 335268 131681 62665 -149831 -115075 30600 16860 -142845 -226304
9488 -226304 -76442 76530 115487 4898 -30978 112924 47676 -15964 73551 21601 -204874
9477 -204874 -107562 -2176 86416 93166 -22798 -8048 -61708 -9903 35742 -146631 -148728
9466 -148728 -184748 -96702 -91381 -151592 -175332 -158810 95257 240304 273620 284008 -756
9455 -756 243668 449004 207560 35954 176769 135574 93923 193884 51535 -114914 8444
9444 8444 -80704 45748 212947 -11438 -110117 -185639 -239031 -30014 121007 77197 -133891
9433 -133891 -179948 217 188752 151800 167792 -9799 54478 245187 226987 16261 34899
9422 34899 180170 279985 371084 253058 306642 47631 -50089 -43355 201670 176224 46338
9411 46338 315190 360191 158536 105623 180696 356696 86967 -83448 116525 143892 -148810
9400 -148810 104439 134153 29385 16523 -47467 -150549 -154939 -104483 8273 280349 332807
9389 332807 337669 148104 68772 157725 143485 30040 79199 206785 66497 -131341 -225742
9378 -225742 -125992 -419627 -444102 -25900 109355 96441 20870 -60397 -155277 -82757 104449
9367 104449 7110 -86095 144048 266244 66459 18314 132038 205413 199067 225197 -116043
9356 -116043 -352869 -98184 -130056 -99565 -1313 110582 247681 302585 249219 181049 104018
9345 104018 -210883 -216629 -266474 -220533 54608 -29532 58275 -244075 -347842 -349491 -220052
9334 -220052 187144 193890 150764 112702 -100174 -99402 -184249 -80253 -44941 -10337 18785 -164915
9322 -164915 39233 238188 176333 -65644 -31041 -31731 5873 41755 38817 12087 211178
9311 211178 355749 148104 144560 208198 58920 142611 273518 153370 135849 68668 -10484
9300 -10484 35178 -108290 51760 -13881 12197 76956 -5640 -104209 -144572 70062 213140
9289 213140 229963 268339 288401 108013 170930 173124 329039 289109 192154 142916 136973 222296
9277 222296 43174 90513 229120 49722 -27056 95058 56548 -141831 275780 316816
9267 316816 231740 150883 60598 274712 204691 131685 216656 122393 60827 82275 218911
9256 218911 181384 220703 316757 241609 189856 228984 381396 74229 86253 238282 168493
9245 168493 170846 249617 103407 75148 134669 -29729 78406 168418 212624 328290 300538
9234 300538 403395 543951 535654 472511 401848 332253 280447 195480 205102 428765 510724
9223 510724 599008 526634 527105 539237 345512 401440 470070 546627 261711 505064 493849
9212 493849 221623 193550 202442 351009 278884 389291 285116 130248 318196 578865
9202 578865 319494 255273 495747 473963 407196 489192 471866 390226 361080 499938 557412
9191 557412 596293 685480 903164 765113 708388 649452 706695 835470 692836 586133 473614
9180 473614 638678 966718 1150367 1032249 935366 1093117 1204281 1117717 1108890 1282051
9170 1282051 1541766 1734312 1847466 1913240 2041486 2160412 2289955 2553394 2436759 2623698
9160 2623698 2853062 2940399 3195464 3315732 3382934 3343434 3207432 2974621 2913204 2903293 2979524
9149 2979524 2838871 2681556 2343526 2271542 2302254 2279198 2102180 2059072 2058428 1917667 1749863
9138 1749863 1759997 1792966 2015662 2066334 2042052 2092516 2404756 2679800 2640464 2726377 3054432
9127 3054432 3343390 3453919 3538760 3778211 3879736 4110503 4132917 4203394 4162931 4263956
9117 4263956 4294235 4113321 3857290 3273897 3153983 3188523 2959283 2718017 2622428 2389215
9107 2389215 2203725 2297578 2259845 2126936 2197731 2049499 2111099 2068059 2077508 2144715 2354881
9096 2354881 2456660 2421802 2741323 2920553 2886975 3073342 3424984 3711242 3944825 4322113
9086 4322113 4726070 4932938 4923269 5095310 5302853 5823925 5918762 5906605 5632393 5460295
9076 5460295 5115270 4688029 4468562 4090573 3708754 3772684 3668762 3360986 3478494 3118313
9066 3118313 3092307 3214341 3017900 3137289 3181497 3122857 3053997 3176867 3630036 3974845
9056 3974845 4146961 4332261 4699773 4829846 5106775 5581247 5879921 5947240 6352922 6919502
9046 6919502 7248088 7377260 7452069 7560359 7185433 6898959 6571527 5793910 5242700 4625209
9036 4625209 4284158 3688864 3150900 3023493 2725108 2654152 2563391 2254096 2161515 2164167
9026 2164167 1885006 1813197 1881648 1859163 1934322 1905293 1704114 1527349 1193427 1255634 1264590
9015 1264590 1089416 1224912 1506677 1351856 1297232 1318997 1191922 1023134 1044999 1160166
9005 1160166 1135502 1048849 1001218 1009454 1028472 955573 882862 963034 865574 817168 896470 696633
8993 696633 758717 831041 609553 703989 703193 732739 630779 792930 865038 861049 958777 1026836
8981 1026836 911388 986443 915481 864793 948734 1023561 848446 899367 1124142 1018332 912929
8970 912929 1080280 1028129 847275 849703 931207 1233889 1140605 951386 974359 1044598 855697
8959 855697 789652 807868 789933 696675 727785 700758 993306 1156876 1043912 983976 979121
8948 979121 709300 952816 1083516 910657 861481 911688 1055184 1000409 1008897 881700 918458
8937 918458 950970 915289 1036554 1242504 1168023 1310322 1183262 1242361 1271502 1266378 1227470
8926 1227470 1256286 1415210 1592505 1518611 1445173 1488978 1555601 1754190 1906259 1963392 2079103
8915 2079103 2237640 2464877 2816137 2880408 3025444 3130641 3260153 3522223 3946843 4266527
8905 4266527 4332035 4700032 5288446 5501452 5652172 5738179 5747130 5592597 5419129 5078259
8895 5078259 4592557 4480208 4377942 4340162 4256949 4115563 3921799 3958069 4100575 3746153
8885 3746153 3640756 3835903 3718030 4055513 4136039 4383387 4544306 4841494 5154646 5278382
8875 5278382 5926458 6374103 6959405 7609160 8151906 8640752 9375029 9892017 9995066 10034643
8865 10034643 10140889 9851242 9352818 8633714 7912751 7512484 7105373 6567489 6209132
8856 6209132 5900571 5305733 4850203 4594131 4556408 4395344 4145722 4228128 4018949 3782636
8846 3782636 3755023 3900254 3881555 3955197 3990074 4213575 4501258 4666079 4900650 5336846
8836 5336846 5530694 5581325 5881626 6100124 6180632 6367898 6305720 6170641 6071989 5610077
8826 5610077 5165973 4526832 4237910 3967936 3439277 3051296 2926811 2714594 2428508 2344505
8816 2344505 2267184 2149969 2084847 1999833 1888080 2011499 1760534 1628074 1579367 1460725
8806 1460725 1481332 1384070 1492540 1452606 1216820 1199830 1325762 1248620 1086844 1057954 1099183
8795 1099183 978597 953984 1087218 981400 1113833 1221212 1203675 1083024 909106 987172
8785 987172 1045592 1107236 923383 967749 1198754 1220554 1186090 1121260 1049033 1048844 975682 969751
8773 969751 1121474 1130274 1024545 1092391 1326837 1295800 1281564 1486757 1348150 1357686 1370803
8762 1370803 1622760 1755047 1828782 1668056 1679302 2001848 2205012 2518779 2660466 2793907
8752 2793907 3120356 3514301 3801393 3932527 3936666 4229674 4383749 4382787 4284157 4260694 3977227
8741 3977227 3832370 3494112 3123841 2970001 2842246 2980821 2580554 2216090 2053727 2043310
8731 2043310 2044714 2140658 2124293 2433336 2527283 2371266 2576110 2727215 3060736 3417059
8721 3417059 3612179 3529862 3723706 4027949 4324301 4750178 5025214 5235117 5179604 5018089
8711 5018089 4911135 4702289 4251140 3658676 3342175 2886764 2507826 2394151 2506416 2539638
8701 2539638 2221679 1944170 1970098 1924732 1892813 1811620 1643511 1481860 1278160 1280226 1236003
8690 1236003 1431964 1596622 1683503 1791126 1840758 2075431 2165168 2082750 2078136 2140129 1965330
8679 1965330 2115831 2202059 2174842 2090742 1737092 1430141 1076607 1077543 1198196 1308095 1033320
8668 1033320 838095 891020 730643 616408 475028 666457 723204 580909 514830 368360
8658 368360 340843 222872 645451 723385 484912 651848 543106 635269 505771 430420
8648 430420 643290 627294 768294 766223 692256 484845 355745 447237 617727 630197 523650
8637 523650 480931 206634 209967 448836 478647 217473 190351 269030 209408 411272 523228
8626 523228 469023 449207 259386 176844 250453 266424 226186 233797 396197 442894 298209
8615 298209 246623 194512 107477 178772 74839 28445 134883 113858 268362 441571 374023
8604 374023 167145 59968 -36538 74976 273732 331170 210401 319189 69660 103363
8594 103363 60922 -83333 24813 -58408 159453 113562 10188 52424 53999 127767 137468
8583 137468 8445 170288 -7871 79821 233720 -16187 -69575 -163909 -108103 83535
8573 83535 140465 -27004 -77389 70528 -22842 -72177 -63775 266946 243634 66564 65053
8562 65053 259971 146905 76204 110707 170352 64530 19261 -49793 -164881 -24580 -96094
8551 -96094 -44920 10199 -185670 -210109 -125612 -265460 -45146 -148741 -67570 14201 219548
8540 219548 139141 3010 80905 224409 80393 91143 67642 -94978 -156049 44385 88134
8529 88134 -212041 129605 -26940 -242763 -154445 -54034 77031 -52802 -107303 99542
8519 99542 226097 111848 -17066 -18195 -48416 37736 2218 20286 70376 -504 -47198
8508 -47198 -68161 -165360 -33288 -49171 42062 223175 142893 70033 90515 65001 157314
8497 157314 386592 180871 134336 222998 47545 145060 -42830 -212327 -377689 -295491
8487 -295491 248778 156656 165290 53255 -11931 -267419 -114156 -126594 -90065 -12431 79265
8476 79265 263756 232254 69935 120865 110778 -132932 -71440 237 -73415 -99904 -83002
8465 -83002 -18059 189734 142427 15825 -105071 119830 36360 -114539 7132 45639 50908
8454 50908 294401 110831 36777 23080 -29098 47135 126517 -15443 -66377 -79907 150081
8443 150081 133253 -24442 122049 115717 155163 262716 123985 48971 129557 -151551 -246049
8432 -246049 -199598 -109754 -106058 -22111 -170920 -246930 -65802 -237925 -158200 55929 69323
8421 69323 -123684 -129813 57285 43184 -49846 -29393 -123989 -35227 -83602 -262829 -257359 -191295
8409 -191295 -78393 -93369 -91372 -17427 42376 -78105 -188964 50778 -1086 201114 190160
8398 190160 20500 125650 -19122 35536 98512 65996 -133934 -172551 -73230 -100635 -45862
8387 -45862 -24713 -51808 36009 -62230 -85234 71711 153148 55824 109308 77028 -109643
8376 -109643 -126231 -79539 -161901 -29614 54250 -21882 -31227 25330 -91340 -38421 -17078
8365 -17078 172396 77851 -110382 -155986 -58445 105244 -2413 -117854 -143524 -39105 -179438
8354 -179438 -236598 -371196 -294411 -77126 -98365 154704 193563 119374 79431 11728 -20500
8343 -20500 219589 14317 55823 64687 -212134 -50575 -43659 -84448 -161370 -29722 60919
8332 60919 -94441 -138064 -62351 122614 128857 65953 130423 98208 -5666 -120868 32556
8321 32556 -228450 -144012 -64634 -160620 -7314 10439 41544 92358 -12499 -90004 -101644
8310 -101644 -79150 -216510 -433290 -373165 -137333 -59709 32748 227352 38279 89521 96242
8299 96242 -196387 -212933 -221703 -253884 -141764 -82160 53544 164290 94603 98688 24141
8288 24141 107864 70423 -94429 -112124 -148962 -91683 -175056 -218202 -30645 -49770 -23822
8277 -23822 72952 51072 62329 27664 -29113 20858 156327 29406 -24108 -105823 -179022
8266 -179022 86077 75021 -114158 -16051 182588 68123 16414 115442 -3999 -85163 109260
8255 109260 145897 -80886 -113292 -49462 198585 92123 -145491 89296 66954 -73735
8245 -73735 -172873 -247483 -194466 -231378 -311951 -400864 -59054 -36254 24612 71573 -165981
8234 -165981 -333884 -279491 -24007 -114249 -108996 -224056 -76079 -139468 15773 201995 -161430
8223 -161430 -366321 -245092 -303768 -140004 -14887 40089 -82303 -202497 -102677 2940
8213 2940 199470 30854 52278 79352 -26780 -15478 -58979 -77344 -112050 -87903 -85164 -73027
8201 -73027 -47201 9763 -120400 203063 -73321 -76736 -546695 -649171 -1438777 -1576069 336392
8190 336392 369768 362330 207873 169108 222503 142582 70149 329034 -3805 -10275 -59864
8179 -59864 -149671 -28850 139123 39715 151053 196826 160627 18074 -69391 -45483 -26962
8168 -26962 100833 75476 -21878 -75998 -84020 -113232 -58107 106149 108974 -25109 143285
8157 143285 13906 136245 103750 209802 78844 -8263 -108671 -145906 31799 -35963
8147 -35963 -263531 -234315 112764 418550 121286 196268 107636 -35103 43973 -53544 140222
8136 140222 177725 58553 5829 -108656 108750 190785 15430 -34183 -37069 -22112 -141143
8125 -141143 -90080 16225 -251643 -247514 28208 -119527 -70745 -167207 4526 25174 -110823
8114 -110823 -30404 -73384 119279 84349 -97534 -19292 -159132 -192787 -113699 -150481 -130183
8103 -130183 -36859 -51816 -85563 63792 -8784 -45627 -11378 -309007 -393532 -178854 -117335
8092 -117335 -308836 -202031 -131768 -257587 -246934 -271050 -248246 -284523 -418746 -247660 -95553
8081 -95553 -99130 -207198 -83360 -64343 -154147 -304037 -277399 -209197 -274329 -194878 -69166
8070 -69166 22072 69581 -80423 -80904 144258 200847 255732 15699 78120 -23736 -77593
8059 -77593 70973 110701 199768 22706 -57687 123846 57226 -26218 157568 -80481 -160053
8048 -160053 10824 -8936 -16629 86178 13253 -73721 -62393 8071 177459 89748 113814
8037 113814 50026 80035 16912 -22832 79593 66506 24255 -174665 -62484 -12466 -113291
8026 -113291 28399 -72854 -67943 18583 136533 120458 44106 31712 125192 126556 -41529
8015 -41529 -125713 -74717 -193773 -114589 -81155 -175294 -198425 -47674 230425 103783 26892
8004 26892 -150336 -91532 3818 -171182 -115828 -109729 -88262 -62567 -119399 -212510 -184119 -177849
7992 -177849 44801 9109 -70532 62278 20980 -41539 68667 -42328 -24767 -42114 -64789
7981 -64789 -96411 -96361 -101931 -372059 -436377 -205428 -212749 -285089 -32095 -26062 -104868 35526
7969 35526 88499 -74771 -129440 -140035 -75331 102820 219659 30260 -76252 -158594 -90750
7958 -90750 -253457 -34434 -3312 -93368 -42033 -141190 -107836 -168806 -256921 -176045 -62015
7947 -62015 -146357 -187141 24574 94717 234829 93690 91986 256581 222121 -14805 -50677
7936 -50677 66898 17839 431 64762 8206 -85478 -163209 -93826 -168752 -198375 -70615
7925 -70615 37708 247229 -82284 -130588 -156022 -62504 1417 -38879 24440 -89422 -95524
7914 -95524 -83790 -320970 -173393 67751 34866 -21632 155479 159379 -46279 -168797 -50584
7903 -50584 68161 -125259 -26505 4966 101039 27952 -116249 -74555 102539 69408 -19635
7892 -19635 -36850 -7041 3193 -9768 54714 -86285 98451 97364 6068 6585 28698 102864
7880 102864 -5916 -79677 -18492 10721 -160867 -245007 -110292 -40310 -34703 258853 -1552
7869 -1552 8628 62312 -129366 -287262 -280809 -77532 -27673 7034 -170672 -118147 35044
7858 35044 208054 281531 122372 -117925 -233781 -141308 -149007 -79522 -61762 37395 61848
7847 61848 -32513 39390 8627 136096 106843 -43013 -26346 -26499 -22389 97914 -174106 -122451
7835 -122451 -34800 92022 54138 91482 -72019 -150960 -143763 -137173 -20466 2933 -152636
7824 -152636 -95463 -254227 -365767 -153097 40854 -163299 -466403 -304846 -75431 -252791
7814 -252791 -417150 -328763 -433549 -231890 -80802 219783 -41724 192730 276160 40997
7804 40997 -17390 9804 -72035 77850 108443 42508 115013 -57775 -250524 -199225 -88577
7793 -88577 -139109 -63545 -148664 -167258 -111076 -222039 -328247 -269710 -195651 -41104 -126716
7782 -126716 -161717 -84084 -82137 -141269 1167 -189527 -390345 -195973 -77611 117994 105561
7771 105561 -126004 -185392 -118300 -169684 194732 200100 88837 49482 -142786 69302 -68137
7760 -68137 21592 -115212 -235118 -70179 187389 95982 41027 220533 86609 62246 7996
7749 7996 -6527 -48635 6237 112619 65398 16291 103311 -30827 -226358 -186663 -158544
7738 -158544 -119316 42431 43972 -154753 -280353 -219101 -172470 -91778 -39747 78998 26138
7727 26138 25757 -8383 18520 -61741 66221 223203 18687 -87239 -88511 -29190 -131398
7716 -131398 -59073 -1915 -65565 -58878 37761 32586 -108641 -344038 -245841 -85582 -137955
7705 -137955 -52343 43769 -29925 -190435 -11879 5898 -287599 -226764 -207699 -144346 -133844
7694 -133844 -307975 -226249 -193926 -287019 -89121 -72114 47335 -23241 51916 133661 -120045
7683 -120045 40850 198604 157687 22941 -3268 17796 -25767 -86892 -93308 5252 -112744
7672 -112744 82958 74903 184235 177411 -155013 -33610 -663 132375 154427 -32282 -95582
7661 -95582 -16118 -78730 -58367 -11313 -72329 -67335 -211248 -252709 96018 817 -59459 -166479
7649 -166479 -122921 42926 -119333 -228118 6725 -103789 -63932 71322 96185 -90998
7639 -90998 200278 182304 23515 131347 -12582 -153418 -186291 -75371 -88369 -63575 -140632
7628 -140632 -161067 -7625 79647 -94259 7859 56410 -166110 -100854 75027 50604 -93327
7617 -93327 -77379 235568 297313 143924 126119 -9538 -49513 -88357 -16948 46216 176463
7606 176463 289525 -7409 -130279 -238897 -204178 -163022 -95638 5671 68225 -176278
7596 -176278 -376962 -221430 -120502 -76134 -30701 -42166 -5366 274906 287496 17944 -105943
7585 -105943 -117174 -93483 -60703 -220078 -260246 -117889 -169739 -197724 -160359 64756 -60655
7574 -60655 8772 -66441 -31188 31483 159477 -136466 -256462 -199905 -80720 4294 -107079
7563 -107079 -320392 -276373 147384 82988 -156671 -92088 113345 -145226 -57315 -32745 -4586
7552 -4586 -56189 -105306 50385 129795 200505 148111 183919 -28596 -170853 29595 227186
7541 227186 102313 -30492 -98796 -87661 27139 203701 84359 56627 167094 44758
7531 44758 39620 -43563 -106821 -189247 -320947 -303864 -103029 25537 -34278 158377 52419
7520 52419 -30431 -97053 -35343 142625 205925 61255 43135 59621 68671 179001 102350
7509 102350 -44149 -250064 -204506 -166210 -112548 -238956 -14155 103705 -24427 -729
7499 -729 -147395 -200183 -43463 -58688 101131 241722 236852 206717 232010 29686 2946
7488 2946 135301 113812 152992 222718 77636 131740 122760 131043 -90984 -10796 23139 -156858
7476 -156858 -189073 -162373 -87718 -161942 162225 223623 -12181 -55208 -129559 -16253 76541
7465 76541 18105 -12606 56894 64077 112347 242878 213319 99882 197596 130228 330252
7454 330252 165975 106407 185101 393356 479778 196960 420678 428871 311554 334386 253659
7443 253659 235850 343295 360670 264128 235986 294222 331245 167699 117953 250035 79155
7432 79155 -4824 -82783 -25405 95164 159860 152681 333618 272705 223659 173611 22648
7421 22648 271311 435159 262972 179183 270248 296534 227242 187830 218471 266191 205682
7410 205682 113855 323398 427620 445453 275434 360144 609704 375584 255527 213824
7400 213824 83028 270717 326284 276356 427949 412002 359944 264235 276119 301309 427556
7389 427556 275172 99157 67863 109803 60492 44722 250699 308868 220109 292273 190200
7378 190200 155244 280704 329683 488891 522284 559412 629888 319688 532665 443503 400838
7367 400838 531862 563119 561585 637645 676557 584845 468882 472045 606887 502411 580772
7356 580772 672462 864521 832927 776720 959018 1005926 1220618 1249630 1229019 1256909 1324823
7345 1324823 1423987 1405328 1502840 1650796 1826828 1941118 2328492 2775656 3035498 3511208
7335 3511208 3914800 4381600 5104862 6099019 7080369 7763681 7972742 7801275 7236833 6438396
7325 6438396 5418878 4504434 3879069 3365297 2706691 2331730 2217401 2047398 1924661
7316 1924661 1589290 1581334 1536287 1290396 1352489 1328028 951905 970892 945102 810296 576032
7305 576032 695319 811387 967647 929503 867470 766316 665454 621607 595601 826520
7295 826520 795673 730882 489413 471069 587568 473429 625451 524353 467280 359864
7285 359864 457575 489629 481786 537398 310636 313801 375231 467005 490678 600223 660157 532128
7273 532128 244959 154827 321787 325459 267278 360198 515081 324965 267075 206655 301284
7262 301284 369287 643705 680386 487260 584891 417967 344813 478707 707066 761517 532786
7251 532786 542797 746576 782930 727156 801102 899933 993641 777350 782699 1012636 1179563
7240 1179563 1132799 923345 844283 979809 1241952 1366144 1451811 1772901 1945336 2246260
7230 2246260 2580010 3021277 3590053 4261567 4684755 4709957 4357201 3840847 3313916 2700846
7220 2700846 2389520 1877129 1707725 1297182 1352399 1585852 1411626 1259382 1125798 1106566
7210 1106566 874738 940441 853315 746591 637109 437927 483693 654381 650084 393713
7200 393713 416254 600742 488018 190795 95805 193278 325786 320805 335878 161890 362631
7189 362631 396652 443699 429888 369978 257733 387097 434907 387058 177497 161838 292249
7178 292249 289860 175237 22232 -111603 -72434 -17495 125841 72486 42845 224500 216413
7167 216413 8536 61673 -21851 797 5038 289785 378574 286787 204062 230343 260464
7156 260464 -27951 -35092 -37875 130469 366762 248014 279971 219628 65223 144605 223877
7145 223877 79753 -13517 47850 22339 29216 -98730 15180 -78504 -49899 -31268 140434
7134 140434 -59745 123597 38536 225943 6026 -54212 55827 122863 81831 -11079 -69489
7123 -69489 -3996 18698 19981 228805 369086 288122 276140 176682 -15001 -214577 -111606
7112 -111606 122909 -11690 -199381 -152466 -25246 -176962 7736 9981 -98559 -224888
7102 -224888 -37446 112032 203271 177345 65162 123151 287268 220280 132033 98539 220066
7091 220066 244374 108648 139728 229187 204292 180386 185216 52620 66208 124413 99632
7080 99632 151919 120965 123487 52060 -129103 -89884 16059 -218245 -119877 56537 53735
7069 53735 -102074 -8841 -43179 20957 -95382 55949 331776 154756 99666 1413 77334
7058 77334 -60891 -35495 38325 163203 151056 136097 33001 -56699 -1705 93215 116828
7047 116828 24602 76724 5436 191654 115652 62444 156770 146798 219773 217848 40248 81710
7035 81710 -176951 18163 -102663 -41868 16813 -31987 -54260 -25693 81607 152960 390449
7024 390449 233390 113883 -55119 247777 -37430 -62787 -20787 -87511 -162437 -188548 -25495
7013 -25495 -3812 79920 56813 148832 222563 1821 63867 -51732 -57275 -39843 2111 -83659
7001 -83659 -19371 -53706 -487 -136550 83917 278553 115460 -55087 40954 -62009 -28892
6990 -28892 -59254 -234111 -223157 -102335 82671 129520 278645 147913 49734 172377 163444
6979 163444 -25997 52986 110547 100397 133551 38637 49379 -129027 127243 337544 281603
6968 281603 164692 -42384 151119 136304 8523 81708 205090 223086 99126 60175
6958 60175 -53835 -236111 -158491 -33071 201157 185467 171020 -4137 25961 153432 -49546
6947 -49546 -218301 -162717 -176560 -33547 -181210 49551 -5003 184714 28790 -101369
6937 -101369 -18726 -30764 -20673 -22407 -108180 21719 87502 -44039 81244 128350 -43626
6926 -43626 -167410 -310123 -134661 32064 89645 -130815 -131247 -255 -35803 117266 72065
6915 72065 238252 264659 224580 184608 -38394 30321 355764 270434 208105 522929 409088
6904 409088 260269 113374 143189 177433 172457 99539 78009 43648 155492 277770 148587
6893 148587 141999 19448 63485 7247 -114563 -164966 -44733 -179485 7192 6045 -59054
6882 -59054 -104122 12339 -51170 2056 -162508 51857 290642 202320 295149 368468 315433
6871 315433 201839 151563 235182 167604 208292 99964 209653 91085 108200 360721 226728
6860 226728 87743 -43884 120136 314042 216480 78872 44032 -6791 139890 84293
6850 84293 249259 353125 173980 133150 155421 79457 119707 106192 28732 -156181 -162532
6839 -162532 56715 88662 60824 254229 301897 385890 328029 440847 249416 247270 206481
6828 206481 225013 311165 149639 123191 87224 139819 149911 335965 433405 345611 202459
6817 202459 12881 -64364 82926 -11191 101946 99293 219170 40813 63401 40207 161358
6806 161358 157704 -3454 161504 224280 60014 175963 170084 70006 161098 274103 165156
6795 165156 78824 -16028 22094 79367 184601 174276 60344 150682 129385 163872 241338
6784 241338 261878 -49094 -122384 -34770 24539 136968 356287 145450 62671 215507 469844
6773 469844 438610 249001 186932 206199 211595 203517 208882 168172 285959 285291 213793 192114
6761 192114 145349 277113 247664 222391 127608 349772 267834 274542 328635 323913 207097
6750 207097 282975 302722 313148 188820 182241 322294 552601 447259 99948 322156 311235
6739 311235 479027 247579 313085 268839 173959 239535 457439 316675 183171 344712
6729 344712 471213 526828 476276 420541 433067 668226 773853 724185 502628 426668 719512
6718 719512 786858 490893 546843 698355 926180 911411 797118 676858 768936 843443 972437
6707 972437 1018789 1055577 961925 1147885 1166539 1080172 1049177 1116732 1168329 1137251 1377003
6696 1377003 1390198 1370684 1279173 1244311 1371353 1412363 1551654 1672125 1777661 1796913 1945203
6685 1945203 2225812 2195093 2151760 2192668 2312435 2125604 2062544 2029452 2077025 2183594 2227807
6674 2227807 2303560 2414594 2498107 2691416 2684942 2587659 2769604 2800921 2846012 3064001 3013294
6663 3013294 2989209 3199982 3290645 3367091 3458731 3275055 3158912 3102580 3253164 3465386
6653 3465386 3479059 3174553 3067225 2840219 2784986 2837242 2784052 2966766 3020360 2872864
6643 2872864 2752268 2992288 3118141 2945183 2941271 3049156 2833229 2744106 2663954 2766533
6633 2766533 2855017 2706903 2854817 2775064 2682515 2405480 2399249 2456001 2367397 2363062 2372303
6622 2372303 2409186 2152800 2044009 2094247 1968354 1890506 1793672 1669019 1746828 1774321 1598063
6611 1598063 1748761 1735620 1781574 1833009 1660065 1377329 1282591 1323432 1281682 1259488 1144987
6600 1144987 1192580 1102506 1101560 1046057 1012233 980682 985476 723555 779089 698998 858684 941293
6588 941293 894550 780144 798831 723959 464309 586009 626925 586280 549191 365826 335235
6577 335235 581010 427321 488834 676793 471499 482983 441044 206396 371726 400254
6567 400254 318682 170439 386783 429596 344276 442305 338569 542585 465753 257331 384284
6556 384284 431154 245178 265022 357033 436096 552683 211486 248337 306870 263512 365603
6545 365603 513508 325877 356996 480862 215060 5740 158973 76476 67377 153931 290298
6534 290298 416497 327504 156923 103853 29036 159481 467414 283111 173663 110596
6524 110596 326734 363269 235694 178852 353603 259130 282595 369831 250339 243892 324436
6513 324436 448881 367057 240042 382953 386366 312524 303581 396367 350392 453111 283308
6502 283308 82691 256273 263294 297524 186767 279355 50420 5669 409431 439662 484110
6491 484110 360496 320457 110420 242963 291359 281342 299101 139734 310198 290831 339089
6480 339089 536615 375605 246951 376460 320511 270813 350194 613910 601135 545741 648047
6469 648047 584780 581031 627777 411210 414064 607667 523707 407465 547187 540238 427606
6458 427606 633308 645244 738073 648786 456527 449445 377475 506218 749131 861290 709236
6447 709236 650824 673674 647171 818879 767403 794519 855606 793264 824660 791828 848606
6436 848606 1041649 918418 781834 982246 926756 933626 1146157 1142746 1156762 1183733 1045880
6425 1045880 1166887 1022776 968282 1345921 1194768 1324643 1500822 1347603 1375086 1300145
6415 1300145 1344106 1446891 1421133 1418117 1222036 1185493 1255903 1379021 1455347 1394963 1479831
6404 1479831 1428872 1711908 1646212 1806130 1720582 1754816 1654171 1627998 1699576 1761267 1647257
6393 1647257 1680822 1521058 1497191 1597961 1606873 1592779 1234610 1507589 1531337 1490963 1416623
6382 1416623 1325344 1584711 1649256 1655426 1732185 1751813 1778495 1892987 2029542 2015136 2057085
6371 2057085 1909644 2010386 1968722 1881933 2178283 2093725 1894676 2130946 1966512 1700887
6361 1700887 1797757 1637545 1658864 1633077 1408183 1647235 1525208 1603409 1689380 1766181 2031199
6350 2031199 1948109 1974499 1964364 1887939 1865612 1847846 1669747 1840163 2032801 2044472 1866484
6339 1866484 1764742 1843234 1761347 1666467 1459421 1578469 1595230 1540417 1527918 1455076 1374242
6328 1374242 1495106 1451257 1280397 1322599 1381125 1540410 1502462 1507483 1472570 1279407 1218616
6317 1218616 1313543 1397603 1181026 1279573 1374011 1084481 1077732 1199296 1131612 1148306 1099869
6306 1099869 1026119 895740 1003092 1094642 1071402 915042 806148 699602 858660 706605
6296 706605 683410 580539 721897 840327 579314 591958 577616 534876 581223 560595 616181
6285 616181 563422 340165 604247 578817 648271 608079 487385 617077 664770 600918 679715
6274 679715 688526 883163 842311 613598 563469 595188 554549 669784 675785 544533 510477
6263 510477 508081 490535 449555 536942 482107 530674 650934 431785 482417 641667 541256
6252 541256 478027 394226 397375 570173 442366 614004 689989 639518 552002 366691 541642
6241 541642 350571 378379 433459 510630 530024 446474 495529 527455 689269 588873 754196
6230 754196 914686 775964 805590 1018208 714634 593938 559452 465983 522612 353413
6220 353413 465423 595922 490125 549753 556804 525964 556799 666849 648572 695491 603277
6209 603277 653990 818917 812840 797195 741560 756032 860646 877175 817809 920346 677648
6198 677648 790494 946642 886496 932573 988406 1148791 1234600 1234885 1271481 1274034 1330810 1350491
6186 1350491 1510104 1403220 1501555 1617855 1637241 1442054 1473044 1611451 1699002 1904284
6176 1904284 1743595 1647321 1670417 1587569 1579771 1704601 1928836 1851091 1638608 1667611 1830912
6165 1830912 2109384 2044615 1942212 1861313 2007825 2092859 2125098 2225828 2334262 2178394
6155 2178394 2234181 2229332 2294007 2248391 2053419 2332594 2452088 2491437 2477582 2503692 2664971
6144 2664971 2579727 2499173 2718381 2904451 3175776 3067080 3078335 3169490 3405722 3663278
6134 3663278 3847250 3749732 3736798 3846142 3895192 3855811 3786072 3643275 3571369 3745495 3985119
6123 3985119 3997144 3980835 3967580 4085909 4144611 4147152 4163173 4122471 4211914 4358132 4705324
6112 4705324 4758252 4983656 5077527 4990939 4835030 5090224 5148541 5035221 5086575 5217492
6102 5217492 5165898 5170420 5205608 5233008 5251200 5269137 5351377 5266845 5214250 5365301 5404448
6091 5404448 5388665 5305274 5493941 5570231 5570692 5503346 5311797 5298484 5403595 5296518 5199761
6080 5199761 5098174 5187506 4989903 4659987 4604475 4493800 4411029 4621647 4678596 4735878
6070 4735878 4860523 4889904 4795665 4654920 4624633 4515507 4855792 4960279 5022851 5161248
6060 5161248 5012278 4891685 4909725 4955197 4798941 4466807 4378666 4223531 4229063 3974777
6050 3974777 3935749 3593717 3627615 3891055 3938336 3591672 3447401 3269663 3508004 3523435
6040 3523435 3318030 3430064 3500055 3626436 3649634 3565074 3483373 3517425 3344293 3538572
6030 3538572 3566086 3358593 3455303 3235199 3254090 3352282 2991005 2801093 2968365 3063285
6020 3063285 2963686 2940310 2586890 2545144 2498778 2601522 2663931 2559253 2443072 2349751 2390272
6009 2390272 2344866 2099325 2003847 2119000 2264086 2313328 2220537 2315223 2067464 2015190 2219952
5998 2219952 2201349 2048059 1861118 1796249 1662339 1564882 1515558 1510916 1640541 1638607 1610898
5987 1610898 1600552 1466925 1664091 1624820 1696579 1842853 1882755 1643192 1739065 1625491
5977 1625491 1738321 1740388 1781816 1778364 1554451 1467322 1419171 1404647 1430959 1448766 1318052
5966 1318052 1282841 1178930 1175866 1240423 1253424 1105557 1027648 1120996 1158766 1050226 1057578
5955 1057578 900751 933690 872351 716584 716383 896090 976071 973187 714560 778892 845664
5944 845664 963992 1056513 928425 813774 775227 805510 804814 821733 756354 708684 467163
5933 467163 617792 670869 474390 460647 623172 740411 825315 939627 710775 542092
5923 542092 735796 877697 706033 653403 710346 589942 701162 597917 490988 613325
5913 613325 549340 640666 817647 667526 588363 575253 714960 778722 952995 894043 789366
5902 789366 967840 874817 944049 835480 743391 711044 937836 1131881 911202 564462
5892 564462 588508 489388 611070 657033 740539 853117 802222 957397 832488 680727 609814
5881 609814 433783 531373 752945 958215 757008 859258 982134 912141 961842 675135
5871 675135 773725 789011 597188 585675 636068 754058 870524 875241 998804 1030188 923571
5860 923571 828229 785751 802883 942393 1051774 1043022 990548 1045031 1255601 1196879 853638
5849 853638 968502 1182911 1182050 1242460 1406035 1520892 1574631 1423921 1459579 1660488 1531760
5838 1531760 1387036 1421375 1597553 1766253 1829654 1932427 1948804 1728171 1575008 1835136
5828 1835136 1827881 1921364 1739751 1781563 1988522 1967062 1788020 1758402 1788225 1789795 1673497
5817 1673497 1832449 1882125 1957256 2111946 1982609 1908615 1918901 2059899 2003668 2043417 2008365
5806 2008365 2081104 2034824 2088619 1896559 2109375 2155325 2182016 2055453 2140941 2257497 2054671
5795 2054671 2013770 1981408 2033443 2014895 2206748 2421055 2300221 2315343 2515216 2500669 2292964
5784 2292964 2305058 2499609 2569400 2668718 2507908 2336540 2410577 2324436 2288280 2119982 1996465
5773 1996465 2182896 2299554 2366061 2246357 2017136 2060785 2173086 2220494 2252093 2194772
5763 2194772 2156417 2086336 2151946 2184500 2120811 2073488 2126052 2090148 1973061 1886443 1818870
5752 1818870 1955688 2038947 2269503 2356450 2281449 2131501 2045105 2026436 2046159 1984789 1939960
5741 1939960 1809488 1818328 1822569 1816422 1981813 2036297 1929207 1814191 1674679 1633422 1695955
5730 1695955 1758723 1859900 1829415 1874051 1698434 1483547 1519958 1557678 1481579 1509112 1448116
5719 1448116 1409090 1360335 1312747 1362105 1234743 935777 1053702 1237404 1189455 1090275 1157168
5708 1157168 1017711 1207268 1220577 1145819 1214022 1310418 1413770 1109019 1002770 1178415
5698 1178415 1171282 1264922 1040036 1180482 1239211 1109997 1202794 1069561 1015188 746777 865429
5687 865429 1154225 1034221 1098896 994244 1084505 916185 969655 1159121 1261985 1362567
5677 1362567 1261956 1177039 1189625 1104772 1043068 1306888 1386885 1185322 1128989 1043375 892188
5666 892188 1055648 1040998 1133508 1214500 1156795 1045195 1269319 1277332 1308618 1036771 916335
5655 916335 1110055 1046847 977934 1106200 973055 1168957 1117721 1044831 1180935 1141542 1124575
5644 1124575 1141095 1002262 996731 1012604 1003264 1122022 1225956 1252943 1256202 1108663 1105957
5633 1105957 1287930 1279034 1408070 1424713 1307715 1318229 1365495 1249923 1202940 1148238 1174130
5622 1174130 1084341 1212293 1410698 1244333 1311563 1413796 1460140 1513101 1401454 1320548
5612 1320548 1398216 1260575 1278287 1256969 1231394 1475227 1330052 1279675 1548906 1575890 1616424
5601 1616424 1728832 1519940 1366070 1536077 1593507 1446592 1466118 1528901 1563904 1506768
5591 1506768 1469887 1651889 1565725 1514173 1740326 1470864 1379335 1551884 1611780 1601255 1580864
5580 1580864 1604038 1418056 1484307 1515826 1705385 1610901 1647382 1539634 1498533 1694099 1581550
5569 1581550 1685285 1581651 1650103 1612221 1789078 1774002 1579635 1860310 1820439 1618274
5559 1618274 1733914 1892972 1908569 1793404 1860592 1956071 2105896 2029727 1900445 1891510 1958785
5548 1958785 2112115 2116053 2126278 2271552 2196275 2117294 2000024 2038882 2000193 2116361 2413294
5537 2413294 2235958 2275715 2330514 2214097 2288012 2264780 2253750 2174264 2096902 2147181 2374826
5526 2374826 2470561 2493084 2340769 2307930 2217068 2422333 2587481 2452658 2536951 2617863 2508530
5515 2508530 2712630 2516064 2350484 2314366 2516188 2587738 2528249 2717998 2591409 2512863
5505 2512863 2394325 2371736 2417900 2665583 2698429 2615875 2671086 2746230 2644222 2754820 2887531
5494 2887531 2748821 2876492 2965903 2936784 2935245 3016175 3063452 2988692 3209203 3105306 3296850
5483 3296850 3337355 3166417 3104054 3031153 3152995 3240291 3330318 3505418 3500771 3437295 3322636
5472 3322636 3275257 3365147 3351076 3587863 3633709 3673029 3858846 3686086 3740750 3691877 3804636
5461 3804636 3751660 3893335 3878597 3995021 4062886 4060281 4144910 4184423 4168036 4129841 4256290
5450 4256290 4200394 4047246 4155282 4186946 4461215 4656874 4412363 4428619 4645440 4689048
5440 4689048 4766377 4790978 4858670 5044463 5122848 4954127 4850825 4746130 4693905 4928231
5430 4928231 4935200 5160969 5274093 5038206 5170347 5183662 4941014 4906026 4986268 5080040 5177372
5419 5177372 5231672 5344030 5396059 5442422 5559206 5635164 5553945 5553908 5592357 5765314 5819031
5408 5819031 5647151 5697042 5836497 6049204 5971032 6083287 6010090 6035736 6235687 6144694
5398 6144694 6038123 6216972 6376458 6650669 6720792 6619412 6644653 6657349 6693415 6898832
5388 6898832 6936386 7156273 7307222 7553479 7456121 7532581 7523998 7645618 7474639 7493230 7679884
5377 7679884 7850040 7842966 7897531 8004838 8012845 8087485 8320149 8434404 8521085 8741793 8772379
5366 8772379 9008132 9060601 9270015 9544887 9663331 9701107 9878764 9912762 10021028 10228073
5356 10228073 10419162 10544676 10634496 10665972 10892181 11126525 11569622 11822602 11800338 11651139
5346 11651139 11747699 12032379 12286164 12338712 12550988 12850661 12894763 13363661 13801092 14000501
5336 14000501 14398503 14723189 14881668 15366796 15659978 15877583 16269659 16562119 17055584
5327 17055584 17578058 18059606 18158098 18347689 18926804 19458932 20008719 20389376 20935345 21628992
5317 21628992 22067294 22706766 23433271 24230423 24842471 25428989 26462444 27247324 28201799
5308 28201799 29193939 30234480 31553861 32373816 33531819 35048113 36606179 37987186
5300 37987186 39923814 41805959 43736902 45757855 47945688 50549983 52747168 55059701
5292 55059701 57511561 59990831 62584585 65411507 68197978 70927969 73653189 76731437
5284 76731437 79715468 82781945 85789354 88913290 91996930 94732906 97969651 101413170
5276 101413170 105051345 108939182 113087132 117457591 122235494 127002211 132164796 137945182
5268 137945182 144283637 150774316 157612017 164123262 169923184 174852639 178893414 182114017
5260 182114017 185024780 187681587 190313204 192795802 195483433 198319205 201190541 204493560
5252 204493560 208363640 213049821 218328199 224285312 230793383 237888571 245624562 253905248
5244 253905248 262489275 271910102 282105701 293925940 307610410 323113414 340905353
5237 340905353 360219523 378542192 392481289 400365647 404362847 406595327 406591459 401488171
5229 401488171 391233130 379627249 369829703 363199251 359873572 359627647 361620052 364477619
5221 364477619 365912056 363562404 358515132 353650737 350967886 351164649 354783491 360869207
5213 360869207 368704072 378385727 390500669 405723713 422891913 439774033 453029433
5206 453029433 460554558 462452881 455639148 438425015 413500067 383837367 349992716
5199 349992716 313513450 278328701 247040639 220702007 199051827 180671593 164935413
5192 164935413 151655241 140397285 130384454 121636115 113924642 107049487 100714880 94829282
5184 94829282 89758507 85000116 80710033 76610842 72890161 69551131 66464627 63414147
5176 63414147 60478752 57854668 55358826 53253464 51139471 49151012 47198971 45307078
5168 45307078 43864463 42272381 40757920 39326458 37869695 36516246 35323430 34244753
5160 34244753 32967837 31918002 31056410 30086743 29149593 28368338 27517293 26745049 26065856
5151 26065856 25215538 24527961 23673403 22830132 22266356 21650350 21130222 20404177 19894259
5142 19894259 19490031 18905951 18526550 17880860 17257232 17045214 16726844 16200280 15705659
5133 15705659 15234440 14992443 14595234 14066934 13723233 13390696 13124679 12550504 12061266
5124 12061266 11918338 11578712 11249917 10999487 11036959 10851976 10594526 10170272 10230525 9929961
5114 9929961 9569362 9298415 8954711 8676361 8673431 8532182 8298583 8146839 7988237 7902722
5104 7902722 7738630 7680054 7681053 7390806 7322551 7161997 7011850 6922395 6691316 6528697 6410292
5093 6410292 6427103 6217544 6036794 5849347 5924485 5828121 5804390 5789110 5591633 5452268
5083 5452268 5483303 5327011 5247412 5117901 5121316 5007623 4896503 5174011 4792685 4693111
5073 4693111 4887353 4600916 4680672 4490674 4512437 4365524 4095246 4075521 3985011 4045940
5063 4045940 3972296 3824947 3628520 3778028 3736107 3605812 3450944 3344451 3256074 3264180
5053 3264180 3271825 3174816 3351412 3180706 3044147 3049223 3027583 2948624 2803948 2855109 2768216
5042 2768216 2602071 2837967 2781549 2778978 2538495 2775019 2871890 2898651 2835160 2512213 2446421
5031 2446421 2424670 2333173 2310940 2332957 2230422 2132256 2006322 1863818 1979315 2092383
5021 2092383 2090315 1959819 1881635 1837300 1747344 1635492 1447051 1659077 1584250 1616843 1595943
5010 1595943 1602072 1582536 1534475 1614841 1673969 1710618 1803005 1772423 1301141 1353697 1662185
4999 1662185 1602988 1498401 1654213 1651798 1356054 1272488 1226468 1368556 1386476 1497314 1592261
4988 1592261 1429016 1494342 1515479 1427328 1515348 1279979 1478209 1333158 1073498 1136210
4978 1136210 1195488 1411647 1414043 1323719 1358461 1574207 1441755 1123628 1042475 1160071 1185020
4967 1185020 934449 1147519 1216406 1215060 1012792 842351 870547 931144 842506 817787 1004633
4956 1004633 1025890 1122961 1067070 1033299 1105985 841916 799449 882144 872812 799335 760127
4945 760127 565005 549595 531652 775274 884827 722835 802105 671267 862246 834593
4935 834593 877009 801903 958425 932370 1000262 909052 1055043 1190862 1103856 875181 872990
4924 872990 743587 937567 1083217 922455 905615 620270 716421 842882 664910 721043
4914 721043 757905 593727 688028 574785 404130 536691 811645 939683 852255 644194
4904 644194 630400 575298 660516 941729 930080 705049 766396 684361 527446 499848 606375
4893 606375 634381 692277 864118 882183 747281 779531 663718 789460 938896 958373 1003444
4882 1003444 787409 842649 962155 1022311 883891 931415 957555 868082 808873 742884 590636
4871 590636 595218 816600 719541 704919 885007 750502 596788 249771 329449 414754 448328
4860 448328 497795 242281 242846 434560 536160 314113 558611 511385 339254 500364 436887
4849 436887 523138 621269 908280 754882 566677 715640 721991 798996 682485 630032 630451
4838 630451 465659 596232 707078 736912 891392 764055 709349 822528 903704 826453
4828 826453 813862 734707 399728 567352 567629 556208 602397 725890 761695 622047 552969
4817 552969 649675 784948 676012 837175 882095 804942 426263 546749 685036 928603
4807 928603 794205 693078 723871 705271 678391 630211 436890 239779 298537 532968 504471
4796 504471 498673 425275 417831 211557 273238 607220 649962 652605 709943 738280 688103 745601
4784 745601 739069 720302 396135 500240 664926 783805 627865 669732 626349 685305 777615
4773 777615 514107 608079 627363 511375 392510 300157 420540 318228 404423 544767
4763 544767 609303 511902 276242 159047 477822 421111 141757 304129 363515 358272 471276
4752 471276 424687 594828 665646 624726 595223 427469 373163 242254 321854 475292 339802
4741 339802 284668 562241 472045 391770 419474 235071 271743 349516 477786 673255 484953
4730 484953 335329 388197 519908 594840 487184 383450 486158 379978 543316 482280
4720 482280 385814 333324 650500 881442 832143 817290 555075 477174 522285 796163 720326
4709 720326 627961 525992 589238 545346 433076 383271 463330 627604 668171 529832 547753
4698 547753 312433 411116 455135 745773 628321 658025 839921 696835 727533 759668 902849
4687 902849 1082934 1004882 889896 1028409 1048234 1086823 954982 889743 984037 1159706 1303779
4676 1303779 1132655 953575 1009983 990462 966525 1192398 1116316 958871 1058457 1164066
4666 1164066 1011781 963146 1017826 932558 1112148 1030931 962863 1028698 1037326 665562 461631
4655 461631 456012 626315 636001 762007 626030 688687 531461 504988 446914 346755 379216
4644 379216 367153 550326 531450 569751 758253 929600 744241 582226 462791 406301
4634 406301 658215 646909 671564 725624 693995 538002 487916 625819 723360 685183 610056
4623 610056 554416 601945 534617 447027 620263 647555 658158 667856 746074 783670 845933 814123
4611 814123 753747 823121 724469 862901 775871 665130 763705 855089 685201 685158 495128
4600 495128 582091 760715 729187 802962 698737 758074 900552 886370 925274 1027557 1005377
4589 1005377 856625 614680 757744 840178 696707 647019 630507 742291 873581 736474
4579 736474 853164 535686 546805 777689 855083 827671 900599 979295 1011287 828150 919650
4568 919650 923382 963895 1030022 886759 854276 1044677 991509 862893 780170 865136 807556
4557 807556 676992 605226 898260 1041192 967714 1019690 923855 1121990 1223592 1048053
4547 1048053 901191 994647 1062242 1087206 1078449 905792 1059218 1049417 1106202 1370851 1380907
4536 1380907 1054782 883434 885805 1030143 1079691 1074683 1256580 1016240 1191104 1248486 1163858
4525 1163858 1103918 1011600 1108802 1172247 1074992 1038422 1122798 1112635 1255967 1302140 1317653
4514 1317653 1566133 1173313 948354 945925 1277626 1575161 1441598 1206834 1281313 1194398
4504 1194398 1210533 1247084 1311270 1551358 1525255 1432013 1581462 1552810 1438732 1478457 1551124
4493 1551124 1497028 1619046 1652227 1534488 1689584 1602889 1663470 1882541 1906978 1976552 1945031
4482 1945031 1935649 1906199 1905729 1918482 1963760 1777371 1874597 2204390 2133837 2280330 2324831
4471 2324831 2422674 2488143 2620448 2652425 2620152 2616930 2815643 2880849 3048714 3074712 3051796
4460 3051796 3070520 3094813 3424854 3256199 3064347 3292355 3601900 3749411 3754971 3831297
4450 3831297 3898396 3883030 4082087 4127371 4295932 4477750 4577484 4529725 4771201 4952871
4440 4952871 4784105 4973282 4855260 5091771 5291773 5421864 5578121 5611017 5761872 5799619
4430 5799619 5796338 5886909 5956311 6273347 6158723 6437458 6491092 6528537 7041666 7056220 7185144
4419 7185144 7281658 7458476 7558460 7806906 8148915 8344075 8592039 8905921 9076992 9621415
4409 9621415 10129224 10376187 10757966 11195104 11476250 12082946 12739935 13278485 13896147 14459880
4399 14459880 15136496 15859034 16743261 17876904 18824135 19775583 21115792 22402765 23920424
4390 23920424 25768418 27702552 30051476 32793352 35997081 39644634 44186383 49195341
4382 49195341 54134799 58465134 61893199 64779492 67772336 71591130 76734245 83065768
4374 83065768 89937370 95544604 98506297 99597474 100062020 101263062 103836609 107588338
4366 107588338 112560612 117258364 118858597 116416195 111608317 106385366 102193438 99508244
4358 99508244 98033906 97347948 95740490 91704187 85660322 79129603 73217534 68141061
4350 68141061 63864402 60556946 57717779 54182668 49861328 45309865 40668048 36293318
4342 36293318 32493547 29455480 26674526 24471269 22502169 20919083 19514253 18218090
4334 18218090 17385334 16402393 15580438 14910925 14005300 13369424 12734117 12198089 11625286
4325 11625286 11340815 10887424 10427026 9894108 9570162 9603549 9342411 8957996 8639076 8521574
4315 8521574 8406113 8062518 7937293 7685981 7377148 7097263 6830696 6657720 6391133 6168751
4305 6168751 5970711 5883140 6007099 5856298 5574360 5363475 5153238 5033524 5207800 5078685
4295 5078685 4958884 5046298 4733402 4484130 4238221 4030618 3936255 4190706 3870944 3689996
4285 3689996 3578449 3617388 3595796 3667006 3557560 3606111 3514332 3407254 3232677 3254202 3287336
4274 3287336 3225510 3290380 3202827 2872891 2782764 2782865 2719494 2611130 2579397 2438216 2507467
4263 2507467 2599029 2493715 2357866 2235460 2448095 1975401 1893858 1965109 2147820 2023105
4253 2023105 1992603 1973434 1837936 1866334 1899171 2035680 1953793 1972194 1877218 1899987 1824585
4242 1824585 1894047 1960118 1848978 1724080 1680493 1777374 1855810 1763043 1776230 1712796 1606852
4231 1606852 1748365 1663897 1495404 1615941 1554397 1450271 1425623 1479781 1471955 1521042 1579084
4220 1579084 1547186 1448427 1240657 1305910 1268539 1171600 1231612 1409760 1295110 1415411 1472345
4209 1472345 1239160 1123061 1122359 1110132 1259261 1355804 1359680 1236836 1282297 1215556 1259953
4198 1259953 1301504 1212153 1157509 1218408 1298214 1120876 993189 1137971 1148082 1232899 1129142
4187 1129142 984892 1129041 1181782 1182811 1122567 1328073 1353639 1002865 1153422 991553
4177 991553 1001474 1015889 1210849 1160223 1197161 1368208 1248109 1187075 1099627 995709 1192071
4166 1192071 1328583 1309321 1393032 1492956 1443969 1333125 1339308 1180908 1127895 1186337 1418803
4155 1418803 1430634 1478487 1426285 1391361 1324184 1497894 1501734 1517740 1317243 1273718 1446212
4144 1446212 1600054 1399705 1771984 1729141 1690247 1758601 1793983 1847874 1799279 2000673 2130977
4133 2130977 2108914 2224538 2128215 2074408 2108882 2288643 2292137 2306331 2227291 2137491 2471543
4122 2471543 2658599 2705441 2483616 2535154 2358949 2394401 2439013 2605176 2559996 2599545 2684412
4111 2684412 2573461 2584743 2548276 2572318 2655913 2746851 2957625 3093910 3122816 3204005 3327681
4100 3327681 3444700 3675511 3666402 3797910 3797858 3902368 4179350 4381997 4542832 4784708 5068135
4089 5068135 5410914 5595175 5931768 6286560 6395453 6518264 6888569 7287090 7691526 8039582
4079 8039582 8314231 8995162 9396539 10071819 10717895 11003747 11590003 12354883 12989943 13895570
4069 13895570 14859300 15942377 17030841 18294700 20029014 22233900 24369442 26403729
4061 26403729 28355044 29994610 31012658 31613871 32236711 33134462 33940707 34035783 32942623
4052 32942623 30899735 28370435 25864778 23463272 21294462 19578401 18258934 17017998
4044 17017998 16032211 15325044 14547693 14064425 13433053 13039812 12901944 12542023 12362097
4035 12362097 12129074 11701954 11448237 11338328 11345797 11284266 11113545 10954730 10914830 11012442
4025 11012442 11013568 10956497 11069356 11054548 11215943 11212670 11226142 11295892 11288113 11326039 11375744
4014 11375744 11510864 11599447 11742508 11693002 11714328 11710909 11462082 11257783 11278843 11256015 11209405
4003 11209405 11239957 10993492 11053986 11011258 10866787 10781736 10623515 10445303 10493112 10468304
3993 10468304 10437181 10124792 9860897 9856154 9869823 10205286 10431833 10460307 10435176 9801322
3983 9801322 9215368 8612988 8239883 7685003 7005927 6761149 6561625 6212490 5941876 5686130
3973 5686130 5535958 5226863 4810590 4846182 4795430 4681476 4479628 4202309 4023513 3816477
3963 3816477 3650320 3607223 3543820 3441551 3536304 3779723 3574260 3392087 3103495 2986407
3953 2986407 2846691 2808797 2847134 2979721 2915004 2838952 2706775 2901273 2865742 2579202
3943 2579202 2406072 2411321 2489096 2745245 2488682 2310819 2348427 2269320 2189746 2261061 2092956
3932 2092956 2082071 2107051 1887478 1765784 1864711 2034150 1721103 1735926 1838027 1989004
3922 1989004 1868399 1705054 1669454 1724784 1617373 1461219 1455974 1746846 1656346 1725279 1831966
3911 1831966 1872187 1614865 1497582 1546749 1546079 1414565 1521072 1403035 1270627 1474630
3901 1474630 1401160 1327255 1359340 1504893 1256716 1220524 1314957 1185778 1272746 1321550 1243590
3890 1243590 1229833 1274374 1172521 1394182 1480575 1341852 1396951 1310044 1025874 1012356 1169401
3879 1169401 1212101 1392282 1177462 1375132 1403108 1259321 1091018 1121994 1285156 1365035
3869 1365035 1293105 1378025 1308055 1398384 1362734 1209352 1370265 1519093 1418198 1376102 1354760
3858 1354760 1284118 1458247 1459181 1504824 1349390 1280906 1398253 1494178 1309906 1123777 1330843
3847 1330843 1375126 1190106 1250353 1533856 1316732 1505353 1591350 1439412 1646914 1585129
3837 1585129 1498654 1525535 1631050 1557449 1502717 1611000 1636894 1363155 1395392 1668272 1799969
3826 1799969 1736413 1715659 1693055 1845784 1861915 1737043 1819632 1961942 1970185 1927637 1990575
3815 1990575 2044304 2017608 2153934 2240831 2182264 2186688 2292755 2246334 2139379 2396747 2555769
3804 2555769 2569935 2560713 2419208 2589845 2669178 2603689 2859000 2769899 2673098 2871591 2667141
3793 2667141 2757842 2930401 3301790 3423302 3235827 3177356 3403725 3477179 3460172 3492030
3783 3492030 3427672 3467187 3870836 4006373 3817288 4169059 4513991 4581346 4629311 5018221
3773 5018221 5226167 5293300 5461057 5573273 5839085 5973693 6261200 6532761 6877582 6869274
3763 6869274 7299204 7539055 7873901 8252072 8572934 9105464 9491685 10169271 10529874 10937202
3753 10937202 11696906 12468137 13186000 14007395 14851514 15769323 16702430 17969658 18933762
3744 18933762 20334069 21678612 23034913 23963215 25087672 26394838 27508788 28555160
3736 28555160 29229179 29797003 30305294 30659493 30966567 31180243 31308445 31407614 31425401 31159281
3726 31159281 30954409 30427523 29871057 29328552 28526988 27599369 26618853 25742249 24603873
3717 24603873 23417029 22312707 21198058 19865678 18782652 17647326 16530191 15725275
3709 15725275 14852697 13929636 13238193 12473715 11933656 11340869 10553980 10177628 9790231
3700 9790231 9294290 8825246 8476575 8084127 7883363 7738325 7255222 6938788 6709531 6335741
3690 6335741 6289362 6262575 6199655 6137698 5767818 5380142 5290580 5130267 5048721 5040818 5171701
3679 5171701 5008641 4662222 4674883 4572634 4387337 4264930 4174878 4053717 3880989 4067635
3669 4067635 3998115 3906612 4079354 4242180 4239755 4163904 4249254 4210948 4239715 4160710 3896612
3658 3896612 4044429 4167471 4154182 4184316 4025769 4227349 4341129 4303287 4215252 4483060
3648 4483060 4412196 4130388 4214572 4376170 4311667 4220217 4178649 4051333 4193186 4126464 4123318
3637 4123318 4143132 3962271 3890878 3980882 4113984 4129600 4316414 4367693 4226374 4119513
3627 4119513 4277384 4262450 4341662 4458284 4531768 4444733 4476557 4614600 4710380 4755792 4743988
3616 4743988 4861127 4995370 5298353 5298090 5406123 5461505 5819077 5987991 6436238 6690481
3606 6690481 6665427 6914333 6979730 7335089 7358117 7603518 7726604 8018967 8159823 8463818
3596 8463818 8652857 8982674 9254499 9649218 9930941 10132055 10309132 10586799 10774618 11061198
3586 11061198 11338357 11341376 11532955 12033007 12297350 12308115 12523033 12884904 13349427 13683089
3576 13683089 13859941 13862136 14112543 14428067 14771640 14975845 15249083 15776121 16330013 16663033
3566 16663033 17335647 17943997 18591622 18932963 19396037 19852459 20181171 20667225 21033817
3557 21033817 21392127 21631875 21804231 21993091 22235659 22600612 22742319 22566216 22692907
3548 22692907 22620720 22377772 22486717 22406495 22187147 21831284 21693512 20981967 20625820 20316854
3538 20316854 19585920 18969298 18474481 18008755 17453964 16749127 16270113 15557818 14890094
3529 14890094 14406520 13716432 13160279 12687605 12014789 11554338 10894350 10396129 10182867
3520 10182867 9679824 9439576 8940113 8450511 8308915 7758225 7449714 7244083 7041504
3511 7041504 7054869 6768964 6449959 6408140 6270733 6067067 5902163 5745055 5507776 5545691
3501 5545691 5458024 5212989 5146448 4822980 4780055 4811735 4857155 4724633 4510914 4369060
3491 4369060 4328742 4201843 4366471 4205260 3894300 3967681 3817269 3764809 3726356 3610702
3481 3610702 3489372 3351112 3407133 3324348 3314948 3258617 3277049 3086418 2975681 3007433 3083922
3470 3083922 2909487 2809407 2606279 2619050 2568018 2515009 2436146 2330211 2186377 2207063
3460 2207063 2237056 2107083 2003990 1990441 2115467 2142985 2119845 2178349 2146366 2034885 1937877
3449 1937877 1773999 1851683 1772437 1710347 1714407 1783474 1666664 1436882 1428558 1773340 1752180
3438 1752180 1625086 1611448 1715607 1922393 1845641 1691941 1618432 1582670 1642215 1592555 1443285
3427 1443285 1518751 1461058 1303815 1316017 1425406 1544939 1373869 1300970 1334249 1429871 1462169
3416 1462169 1348363 1360757 1374662 1375446 1500256 1401230 1214230 1141529 1024922 939411 894615
3405 894615 939253 984359 1065157 1148963 1007418 937777 1092375 1193951 1087083 915356 866346
3394 866346 831206 849787 1019030 859428 790785 802333 776759 710615 499991 573497 748519
3383 748519 672469 711129 687862 672571 759989 815444 886017 827319 662696 627771 767908
3372 767908 803702 820850 824557 888422 825706 642183 583643 682088 567459 583212 584913 692998
3360 692998 824447 737967 656710 575812 658622 702827 558032 561285 544688 505221 387861
3349 387861 500402 714444 765383 655517 704564 527201 602490 502643 350148 502094
3339 502094 567831 564225 527044 642706 487795 420746 469469 530407 442114 400211 478868
3328 478868 694335 737350 759827 606038 626616 748857 702445 553073 435401 469627 482234
3317 482234 619000 562517 485412 481471 275563 419573 607875 422772 218435 390574
3307 390574 686802 668409 517036 476726 350955 408901 310674 403825 389410 393243 422367
3296 422367 603335 566177 672119 718572 663987 597984 365797 311661 465548 472901 524131
3285 524131 809685 423231 381135 356261 330226 469471 419596 335822 409503 569017 481397
3274 481397 312540 540801 327710 239674 383352 304615 578129 780791 632092 690620
3264 690620 584216 495776 543807 706912 707435 804913 793386 704391 776791 840048 864360 758743
3252 758743 792745 828889 750275 583081 436901 539364 422590 373960 500870 536467 687881
3241 687881 587723 715260 796965 857380 727072 511699 488861 445611 499526 647233 654860
3230 654860 1037795 1080998 1176169 1072817 895646 1012023 1154117 1420835 1365388 1355564 1158558
3219 1158558 894481 911282 1064209 1201899 1023679 919744 1127327 1009974 1147579 1063740
3209 1063740 1133997 1078873 879839 752194 711938 723963 753644 748614 643922 642327 725687
3198 725687 703052 528615 496819 539449 690156 746238 752778 1012937 720338 592723 696159
3187 696159 553161 421341 134901 225949 362312 473180 522752 539328 378597 324889
3177 324889 378648 396110 406698 317992 318314 171888 306000 561713 564709 396337 289830
3166 289830 375530 537559 428999 246771 199168 108040 362710 495917 372032 366070 153672
3155 153672 295229 287757 239895 585328 667129 643143 620453 519191 547624 693333 444091
3144 444091 335143 403188 706645 828122 788978 903047 833388 835401 1149587 1084320 1164809
3133 1164809 1240974 1205162 1118086 1032214 974838 1068586 898490 838344 958138 953292 1011367
3122 1011367 818712 497095 605391 537776 487940 530726 446805 385128 390627 516284 403097
3111 403097 256667 104440 122781 235753 164304 301811 439104 380955 262215 182791
3101 182791 222774 448358 479899 84752 52029 253638 342686 182024 293208 339566 411113
3090 411113 200249 106410 177346 180677 133936 169028 151234 229804 133133 -58931 133379
3079 133379 355657 315639 146090 177385 266712 235493 155463 38378 146099 129110 156660
3068 156660 78202 91908 60943 21890 -57917 -202963 -14394 11454 213703 272521 245548
3057 245548 188761 117707 204087 78279 166117 265434 191873 314814 262272 298644 290293
3046 290293 39033 9172 202411 194464 119683 -225098 -148160 35818 71581 238297 235343
3035 235343 259938 268520 119238 199234 199406 339010 248159 284538 322315 521424 534442 279637
3023 279637 314506 158207 86378 192554 60493 7350 109367 -202858 -136033 -27141
3013 -27141 172738 100121 148515 202362 150734 -35858 4576 197116 135878 259879 261422
3002 261422 387490 471395 67548 49656 94497 383140 375789 228483 394606 484128 171019
2991 171019 172153 90138 90914 220014 66721 69265 -91510 91091 302966 276050 149714
2980 149714 90193 20617 240613 200335 123684 151989 54099 145514 262415 116172 -41910
2969 -41910 -37668 9143 62425 208603 135402 207332 -167811 -121624 151508 96280 68375
2958 68375 -3852 168863 82521 67179 -20926 11149 138725 123646 103986 130516 93456
2947 93456 123694 134113 34379 83232 145890 256299 103402 296427 211931 -6920 -240294
2936 -240294 -102165 -85800 -63794 -42196 42073 243352 106801 126419 109400 132046 141300
2925 141300 85626 14608 54942 63105 38261 -58672 88723 249874 235089 263052 195367
2914 195367 138343 150752 193435 5576 -38961 160636 87319 206842 261110 375379 213584
2903 213584 95077 139622 229479 291435 403245 416120 297457 21645 49605 129723 70442
2892 70442 114177 59076 142802 94047 100517 166880 120224 268750 278195 186957 241961 418790
2880 418790 421197 369872 279786 334779 365951 532862 493657 160170 302113 347475 315118
2869 315118 199262 144989 135708 321758 168013 15178 169860 89633 112400 140388 103936
2858 103936 180397 200055 263808 300319 306790 243577 9905 -36709 200349 143875 -31285
2847 -31285 174204 19765 237707 389077 152176 110471 276841 333882 198787 83313
2837 83313 -69428 -53856 193512 320050 231794 233446 261355 281059 157693 207286 253950
2826 253950 393178 360941 198421 147186 92511 197091 196650 152632 7088 -104912 -34683
2815 -34683 54960 169611 134399 35953 8678 43779 -39 100805 141416 45121 -785
2804 -785 86938 135229 293378 225157 36952 -95555 -21831 10864 66853 23996 93790 46231
2792 46231 -58257 167002 162919 -31852 -117767 -168894 -66323 -146484 -242169 16996 112789
2781 112789 145365 33262 5724 -80787 -157896 -88757 30141 -6498 28110 -64588 64519
2770 64519 119232 116884 214177 -31810 -26023 192253 77372 50177 -194509 -193656 -187777 -125528
2758 -125528 143738 124493 -95110 21946 89726 -43076 -87377 60551 43111 -138739
2748 -138739 155745 182699 174361 133600 126281 77976 92308 90895 -35133 -29878 9685 121397
2736 121397 142436 42828 -84324 -28689 15649 -69355 67889 25080 -81043 177741 225440
2725 225440 78981 140319 61483 -103971 38415 -53882 -155727 -93025 79606 91851 -76823
2714 -76823 -157796 -106228 -72337 168016 196272 -249682 -189006 -291283 -342878 -130532 122545
2703 122545 108570 93257 -8696 -27865 -54654 -276889 -295767 -137691 -151922 -105508 -171026
2692 -171026 -77563 -40075 -41906 -64642 18447 52671 340719 410738 -71649 -4082 85266
2681 85266 -108434 -166409 -97616 -69946 27729 -133242 -129093 -16705 190659 81642 -69976
2670 -69976 -63659 139420 140828 -138282 -59458 87940 192465 132010 -58338 -199137 -66787
2659 -66787 -71027 -149963 -228121 -438374 -298958 -141091 -54318 74058 -24555 72857 -33664
2648 -33664 -267344 -138946 -112641 -76400 -8606 46924 -1879 139481 57570 -108014 -45957
2637 -45957 -76617 -120977 -216393 -224833 -83568 -175774 -246343 -244604 -92600 57551 -136760
2626 -136760 -227895 -75208 -55274 -290883 -226842 115543 151555 46564 -108083 -123888 -206800
2615 -206800 -130874 39144 -39674 -281881 -227825 -191393 -176943 -113417 -163532 -179503 98125
2604 98125 147313 40449 22427 150595 88785 -125382 13887 148401 50287 -77607 25696
2593 25696 -35289 51721 -23156 199970 355424 204238 128423 53632 46950 -237636 -16618
2582 -16618 110504 53491 137291 71097 62058 -223710 -201775 -119768 -215624 -236677 -184169 -38276
2570 -38276 -61689 -332864 -387833 -239796 -161411 -203469 -28942 -64395 85323 20225 -150236
2559 -150236 -221675 -38756 11116 -64730 8902 85220 100139 22528 225425 151257 11978
2548 11978 -118257 8946 52618 -158724 -259912 -197242 -67745 -71073 -59497 7737 -77588
2537 -77588 -53135 93921 169116 204187 102230 36777 -123905 -164965 -93826 -39587 -193044
2526 -193044 19749 -31123 93244 81530 105633 242489 48935 205557 393359 214708
2516 214708 39918 -166165 -224787 -83819 -14471 52632 19622 25382 -110049 130857 109567
2505 109567 -30240 201183 67800 -196235 -140002 -285491 -184027 -163633 -290445 -308409
2495 -308409 -55320 -34584 51246 55402 -279605 -340340 -125550 -76204 8947 -285513 -221260
2484 -221260 47668 71577 -62993 -31860 -30316 -32435 77664 -185149 -236907 -135371 -67207
2473 -67207 -38062 45112 -171839 -324433 -177705 -266509 -112444 -162926 -83410 -47353 50593
2462 50593 165174 254147 120908 -99231 162300 71322 -131015 -231992 -359584 -268432
2452 -268432 -153834 -213446 91514 166783 37051 -82347 -52421 288123 255615 242078 126418
2441 126418 8900 -19445 7023 23577 90961 46404 -126110 -69625 8643 -6552 -67758
2430 -67758 115502 35962 186840 199303 389602 139635 328601 365302 217458 207694 54979
2419 54979 256396 361453 185420 42425 5685 -42702 -15006 -86854 -181567 -253974 -231884
2408 -231884 -276714 -323542 31228 -94093 -191551 -110867 -9414 -16716 86691 124326 -184129
2397 -184129 -149404 -59654 -112463 -157841 -86023 -112792 -106777 -53892 -149335 -3982 -4791 -263494
2385 -263494 -184327 -81928 67771 -115159 -74055 127219 155908 49981 2657 -36735 -104686
2374 -104686 156694 281878 113766 36358 93863 243857 181560 58808 181 -215822
2364 -215822 8968 46349 748 145360 107256 68570 228481 371743 140707 -91609
2354 -91609 -157122 54295 27497 -166004 42360 95551 -104449 -213807 -122460 -106053 -208143
2343 -208143 95541 53861 116979 140290 -49164 -74127 -179085 -313889 -228952 2695 -19220
2332 -19220 -237295 -76176 -10977 117388 110183 54107 267842 371865 -4836 137602 42901
2321 42901 -138644 -30579 -199242 -8291 87838 9139 -5491 -201215 -152132 -77851 -93643
2310 -93643 -198337 -111256 -28362 -24020 113082 98861 128253 37936 16567 163431 135902
2299 135902 82183 203470 -60060 -153170 -119466 -87738 -131418 -284130 -146717 190263 79950
2288 79950 9935 94056 -76572 -92653 -106993 -43886 -159620 -152892 13408 133217 88369
2277 88369 -22731 -85934 -117887 -124655 -60767 -90303 -123829 -157301 -142948 -61714 -81096 -208499
2265 -208499 -169478 -187022 -100435 -26099 -92804 -3155 -100046 43106 148834 117293 -68261
2254 -68261 66951 5656 192440 -120427 -32695 -96173 -253625 -84190 -14660 -61561 191694
2243 191694 222898 263760 297828 123485 102654 77264 77439 38194 40849 112643 5407 -125081
2231 -125081 -54961 126148 -16481 13389 27692 -12175 -17625 -88522 -98321 -38685 102200
2220 102200 -2310 -112427 -35625 128055 44912 226625 -4070 -1211 17924 -175971 -204509
2209 -204509 -77099 229362 248570 150544 117980 -116859 -199405 -28658 34870 -2338 -38482
2198 -38482 67224 -63509 -168893 -3233 71336 181807 75195 11534 95378 292974
2188 292974 232679 322345 295811 93839 -45802 14333 146159 148277 56390 152231 104231
2177 104231 126992 740 29957 17400 205218 435000 367496 311233 291064 90218 -5190
2166 -5190 20845 340431 436985 320045 173172 239140 345997 177198 266597 222519 74199
2155 74199 147575 122907 96114 437634 404125 351459 378475 253397 314666 508355 245660
2144 245660 192128 368953 454668 328710 415679 379435 290067 263318 275714 237067 353141
2133 353141 387752 335612 478833 430019 571073 552603 667751 785642 876725 788303 839107
2122 839107 750311 770121 885872 1015610 1200099 1219455 1171496 1179078 1279490 1308526 1321274
2111 1321274 1325768 1479746 1722052 1797575 2151345 2269702 2471498 2615850 2673950 2925795
2101 2925795 3193804 3597660 4121138 4675824 5094167 6063588 7135822 8567263 10426438
2092 10426438 13178431 15388663 15672047 13771900 11653882 9719320 7925412 6615322
2084 6615322 5228775 4239371 3789980 3480824 2863149 2479607 2575355 2463685 2309459 2082935
2074 2082935 2080927 1805131 1556004 1438590 1260756 1327435 1150335 1205821 1310402 1072835
2064 1072835 862850 860919 963781 705278 687771 622465 753337 727530 496520 590198 619673
2053 619673 541544 582800 559800 561282 536980 605535 706020 613298 482853 350779 378666
2042 378666 293056 360286 504952 486565 442794 583089 650929 692344 652147 455190 365187
2031 365187 476496 224037 235127 279088 317861 348341 329848 301344 274954 267467 101829
2020 101829 198014 72112 133823 261575 313729 366143 123310 70363 204701 439397 365798
2009 365798 353024 98116 192500 352524 164283 -1711 -119084 -176339 31002 236075
1999 236075 166188 93543 81095 104318 65405 256644 305864 100836 96891 -57096 -195708
1988 -195708 -35827 104930 19607 71945 86453 89994 68335 137321 151919 -1588 48508
1977 48508 61593 30083 46607 -15166 40640 226917 122947 71490 -126717 -28844 -12002
1966 -12002 -8263 62009 -125480 -13347 128762 20413 204537 275478 -134630 -119856 106497
1955 106497 56869 -5877 45892 -119853 81184 193856 101818 2654 -81149 63480 -31085
1944 -31085 101802 194263 112314 -43038 -76330 -170582 -193628 -81078 -177352 18571 46679
1933 46679 47086 -26410 6833 -119882 -104799 -139839 -93679 156726 144530 81943 76496 -55793
1921 -55793 -63243 25742 4649 -51296 3239 -9636 -124007 -89606 -102304 -157042 -60193 -9511
1909 -9511 -81432 -33008 -125719 -139658 -119866 68100 -164650 -93746 -161955 -113078 -28864 -148692
1897 -148692 -107813 -49431 -20889 70631 3619 36065 138256 -101565 -156058 -10375 7770
1886 7770 -86577 -38068 12623 -100755 -17506 84980 117829 176205 -12929 141113 176677
1875 176677 51320 -113228 85522 151236 -34707 13317 11596 -88201 -136969 79789 147348
1864 147348 159919 264084 137940 -45870 192919 203364 112591 -180718 -265835 -114795
1854 -114795 32947 -126718 -178124 -56424 -71183 44485 86101 46829 -78590 -43044 -177458
1843 -177458 -40368 32483 74461 22515 -48425 53877 -86559 -26069 -10041 -184519 -202725
1832 -202725 -38339 -149238 -213563 -216598 -20020 -44517 -240784 -183318 -161552 159751 143515
1821 143515 7406 194709 1910 105223 126794 68562 -250098 -333549 -328353 -183904 -17478
1810 -17478 -92345 -25036 -112273 45274 -16640 -38064 16938 49427 73428 117927 -89377
1799 -89377 -156800 -319746 -206435 -161102 -79188 -119908 -210208 5626 265774 102292 134656
1788 134656 146340 -132035 -125565 -160558 -230690 -142951 -6949 -123914 -320704 -225825 30767
1777 30767 -23877 64017 74245 81818 50283 -27701 -11774 -198909 -169960 -156802 -223434 -42546
1765 -42546 47886 10187 -169199 -112631 -57076 -105451 42656 -113346 -71404 -101363 34898
1754 34898 111589 53242 -34576 41627 -180065 -302535 -67385 -104868 -6462 5464 -39813
1743 -39813 -139524 -122491 -121861 -65779 -5979 6887 -132327 -54631 100889 94329 28025 -14280
1731 -14280 54374 117818 123734 122795 139974 -58052 -90604 -217370 -175429 -148110 -101627 -97072
1719 -97072 -121300 -231603 -190096 132248 169870 70044 174849 300202 120489 53955 -7097
1708 -7097 -20265 -118875 -67008 55089 55395 -3402 -16039 96237 66525 -174099 -283681 -262455
1696 -262455 -224943 -339666 -286994 -187588 -3489 -126853 -65596 -70955 -117087 -118609 -138529
1685 -138529 -61898 -168583 -205106 -104242 -121033 -120667 -283670 -258012 -348534 -391261 -132474
1674 -132474 -15354 -21351 103803 305718 124792 72721 70112 119935 -69465 86741 102016
1663 102016 34369 92947 -177947 -182531 -177078 -91651 -57050 -97429 -179856 -29211 110727
1652 110727 -66201 -144458 -30071 40460 -67215 -69366 -64944 -27880 -8882 67649 195708
1641 195708 46032 10603 28800 85394 30292 -60077 -81161 -197137 -238726 -242654 -248906 -124392
1629 -124392 -67342 16078 -41653 126690 -1840 -68426 -119007 -153184 -2408 -77689 182610
1618 182610 32499 -305436 -349109 -78108 -93970 -45539 -45255 -101067 -51798 -40306 2655
1607 2655 -133942 -144953 75485 -9861 -140914 -108528 90767 -30102 -129989 -138731 199568
1596 199568 134686 -70525 22103 33219 156377 -10458 -182389 81293 -63895 30643
1586 30643 141723 64428 -30155 -57189 -7805 -119194 -160241 -265824 -207273 -91115 14131
1575 14131 -30551 -146811 -104160 -198886 -54426 44950 56055 7364 -79632 -9884 -68728
1564 -68728 -90120 -25014 -49251 -139742 -175099 -183190 -45544 -108524 -3474 15020 -137238
1553 -137238 -254140 -276547 -281731 -170737 -42215 -112361 -203643 -22579 -39677 -187142 -286580
1542 -286580 -43920 25711 -37679 100505 88176 92729 196131 -13713 -184856 -191684 -123333
1531 -123333 -130304 34085 -133335 37495 110767 182888 168165 6150 154952 64195 -17426
1520 -17426 23377 -5060 -38612 -304562 -256204 -150805 -90398 79050 34873 29272 -184680
1509 -184680 -226405 -265221 -275146 -238500 -215819 -305138 -48025 8849 70710 360 47801 336413
1497 336413 282921 -31076 144204 159160 121993 28512 89022 23642 227470 215648 35483
1486 35483 -19945 13906 98668 -134157 -134119 14988 -87347 -85565 -21735 32001 320417 222134
1474 222134 264493 138725 157095 -84844 -68610 -56346 64248 -13168 16494 317 -102025
1463 -102025 -139393 -182613 -44013 -133443 -131368 -50877 -20396 -4804 202568 275512 178639
1452 178639 84537 -49476 -9927 139089 44507 4016 -103656 115423 116528 55834 59096
1441 59096 -75166 -108669 -209576 -173633 -193095 -237317 -79628 -63722 48534 309687 319187
1430 319187 70905 1474 86547 -184191 -151350 -164545 -159000 -108030 -162384 31977 -198484
1419 -198484 -180462 -174722 -161214 -219616 -63209 119930 -75520 -268745 -91233 143859 4878
1408 4878 -37915 -93706 -70400 -34032 105407 -60692 9053 -158160 -150372 -21120 242541
1397 242541 261554 285767 49923 -153871 -43701 -140782 -133467 -32907 -64860 -133995 -163634
1386 -163634 -140277 -12624 -121164 -8837 32215 89726 139356 114502 -4705 207569 237973
1375 237973 183783 189034 276139 -6594 -246808 -159203 -40477 -181605 -188976 -105430 -32993
1364 -32993 117563 91149 27532 30321 -110015 -228484 -64104 -92775 -3313 -46344 -138769
1353 -138769 96065 51538 178693 282692 291790 287670 92143 -78150 -179273 -256283 -250935
1342 -250935 -151467 -134587 -18394 -120978 -182571 -55935 21924 -118258 49364 64854 -202560
1331 -202560 -225172 -118328 -44623 -97550 -66979 65774 59218 98203 108038 55913 28556 9962
1319 9962 123273 68664 8075 25707 74584 -3842 22161 151686 60284 -119772 -186350
1308 -186350 -195692 -90836 -181811 24437 -90362 -109888 128897 -62996 46419 88093 155338
1297 155338 -11267 -120685 -74588 2691 233171 154539 -171107 -129538 119925 124945 75101
1286 75101 28094 43073 108401 -14773 -15438 -155902 -11021 122148 6410 42205 -2321
1275 -2321 -18109 -28855 96410 -7537 -139508 -37700 -75176 -53897 12322 -90774 -215777
1264 -215777 -102787 -8656 38065 -162548 -178802 -14585 185476 31350 -142564 -68478
1254 -68478 57242 179501 58921 52733 -75196 -81171 150275 166484 13356 -45379 -175879
1243 -175879 -242084 -186326 -159171 -59491 -145403 -23893 -82542 -244965 -91610 60736 19013
1232 19013 59836 -57214 -129433 -176322 -165243 -246101 -232080 -265608 -214853 -139726 -191687 -126217
1220 -126217 -3717 117775 101320 36337 13897 -36963 39262 234115 66335 210845 188897
1209 188897 37204 -81559 150482 146681 101819 35543 -277075 -78098 320506 122693
1199 122693 -104564 -68683 -24563 181747 259283 226185 76682 80600 198146 132226 50049
1188 50049 -79746 120810 74891 -12345 21357 73388 84221 -65031 -49386 -40716 3218
1177 3218 116742 -188127 -237373 -205514 -61108 10601 202694 20657 -58111 79163 -71677
1166 -71677 -302522 -150589 -82808 -146131 -69081 -96927 -97004 -173569 -145527 -107893 105356 126163
1154 126163 -23667 -228061 -156353 73868 19601 60348 -115829 -127613 -116671 -127301 32589
1143 32589 152966 110907 -56166 42913 201785 180967 -4670 -2637 28856 -116998 -59023
1132 -59023 47621 28683 223277 134783 8324 -60858 -22461 59190 272150 157340 184423
1121 184423 185070 154802 139830 106390 -28823 -90027 -130076 -12972 85066 29160 115283 263639
1109 263639 106502 148730 93821 -133215 -159674 -191377 -131696 173601 203251 39281 -135852
1098 -135852 -127810 -135863 143210 110 20064 131914 176984 107538 -182714 54002 261690
1087 261690 111922 43492 172969 60477 49827 42808 -81148 -163985 -64161 19874 97188
1076 97188 -60472 15631 20404 52924 -26210 -81132 17441 86374 133961 242393 270600 231944
1064 231944 198729 61442 25363 40459 -36156 111600 144010 119675 164522 212095 182954
1053 182954 59538 9107 12302 -102173 -28993 224435 129759 196632 218408 112499 -142235
1042 -142235 -158838 -96401 64157 -139638 -207463 -231531 -172918 42056 -153784 2586 146071
1031 146071 -92796 -284445 74945 106795 82007 -113027 -236318 -328228 33031 75634
1021 75634 113307 66737 -101471 -73757 -16063 232756 145564 -195345 -208920 -34915 -111468
1010 -111468 160851 87837 -87507 65827 171051 130247 -2084 -81280 85575 211101
1000 211101 -56476 -12013 14633 -45885 95097 -12367 167733 210162 -20139 97324
990 97324 84674 113010 -35796 -66491 -25480 60737 135982 -27512 -46300 105634 -103809
979 -103809 -145130 153548 190392 -110510 -244033 -180890 -64889 157115 147797 60753 -156682
968 -156682 -159511 -184380 -84305 -42921 128494 219141 -97681 -311325 -60173 -179329 -83703
957 -83703 -41819 -73240 -91110 5156 47637 98799 49856 -105526 124362 110023 135384 204833
945 204833 92114 -23763 259935 72334 -38777 -28333 212873 134077 158570 92960 -48563
934 -48563 -57688 -68279 -22238 3723 34854 4082 -104909 31423 193911 142451 194311 -42614
922 -42614 66843 104270 -29654 -85094 32555 214684 223226 -96915 -194807 9779 -132975
911 -132975 8284 51258 85109 151133 114135 238475 35623 35920 92137 71602 -42646
900 -42646 -45501 40764 86490 -274568 -245627 29319 251867 288002 87531 231022 72345
889 72345 -126424 -182203 -130256 132441 173760 131113 27593 -116757 -189995 -82535 61552
878 61552 90433 58483 27750 17530 108759 36314 129327 -580 54520 4927 36259 24135
866 24135 62482 60449 -2699 -26651 169103 272986 146812 135827 146845 -8604 -235679
855 -235679 -397328 -268985 -196049 -11898 49611 17744 113298 -44682 -87166 -81081 12601
844 12601 64385 161951 134757 -142947 -207335 93891 84536 158271 132170 11545 28618 175912
832 175912 41167 35198 114419 -19173 -161469 -31146 -95956 166887 100872 185627 226482
821 226482 -5403 -78220 29554 22382 -90258 12584 27612 -54917 -13631 -92628 -125762
810 -125762 -330664 -410644 -162716 191680 70006 -95389 -88796 59851 -2555 -55212 17096
799 17096 -165022 -190809 -144426 -131774 -14100 -238166 -281692 -61887 -94150 -49066 -97859
788 -97859 -101019 -168978 -176333 -11282 -17682 -56353 -152065 -372016 -209747 33608 23427 -45137
776 -45137 -72612 -32110 -7661 -114219 -178080 -294528 -143265 -68648 28410 -42026 -323432
765 -323432 -171090 113853 113182 91368 97775 162836 235198 274431 109031 4491 -6655 -76625
753 -76625 -36444 287597 250547 -70769 -51190 -189297 -101852 -15085 -200200 -328083 -159006
742 -159006 179324 62423 132754 91351 91667 178776 97710 -24987 -66941 109948 166338
731 166338 307920 414770 168559 -19846 -37170 -85364 -28467 -15634 -2068 63459 -171998
720 -171998 79769 -549 -59945 -295271 -254331 -56442 28246 153839 181753 132100 151553
709 151553 113452 -38075 -275902 -331086 -17761 -44126 127346 227581 140806 166015 33522
698 33522 -159658 65198 -10446 102716 118094 49506 129940 255977 247551 109638 -33005
687 -33005 149292 230147 201874 73105 -86432 -127544 -61002 -229477 -240915 -52322 39205
676 39205 173184 64400 -3079 -106459 62788 57768 -94185 6644 -19295 -70391 43277
665 43277 88466 -815 31678 -115980 -49042 -1128 78516 51130 -162 193127 15995
654 15995 68407 39901 -4677 -23999 -76434 -100487 -64381 -6522 -14765 -163171 -102284 -47662
642 -47662 154423 86142 54417 23410 -112122 -135185 -67356 -170698 -141216 106281 148326
631 148326 160463 122842 79107 161817 293008 67745 13666 79537 -43727 -105288 -148344
620 -148344 -58861 -62501 -106134 -36600 -8075 103823 104410 100624 209813 150565 6841 -247868
608 -247868 -155373 85933 77631 31434 -36713 -117633 -66628 80536 108943 -76595 -221956
597 -221956 -235398 -224299 122609 51823 -19082 -246893 -276057 -129178 -83706 -155563 -94484
586 -94484 -162701 -326134 -252283 -47128 -180334 -166017 21061 61638 -16941 -68775 -119542
575 -119542 -39925 -8518 -63330 67094 11278 -146979 -77487 -24470 126982 179381 -36795
564 -36795 -51674 158055 150340 119689 -146920 16109 30426 -78115 -18459 40556 -239431
553 -239431 -198499 -213523 -236828 -128976 -146665 9333 76697 -33984 -215420 140996 119157
542 119157 -82424 35143 114051 -56197 -90935 -16665 144587 190835 295525 102110 -39995
531 -39995 -125922 18776 -142647 69070 43761 -95591 -96151 -16229 35004 -61314 3575 52529
519 52529 53584 127091 68927 87850 114152 110837 66101 98498 341209 428019 178800 12487
507 12487 -118888 -71157 -36129 87057 26249 -52808 -5042 -130772 112087 226775 157158
496 157158 -5924 -176600 -157571 110570 87449 -112347 -69727 14234 97734 -160894 -6244
485 -6244 3702 -119322 -75946 -81977 22719 139804 5914 162134 192061 76815 4533
474 4533 -140219 -162570 -156903 -125607 -187486 -256431 -78959 144412 -41825 15769 5131 80088
462 80088 100080 110884 138974 -1126 -114326 914 -77133 -69811 79837 153040 79582
451 79582 142096 96376 147151 100003 82861 156221 214346 141447 107085 -78739 11100 34187
439 34187 114507 12267 3294 112305 168848 122000 55463 167738 156893 82165 88905 161482
427 161482 78246 -57566 64934 138251 -27395 -166816 -28866 115613 81945 56207 97311
416 97311 346405 205174 89867 31938 -88047 -64946 -12207 -154458 -7850 -92739 -257512
405 -257512 -37663 54249 -158676 -35565 131274 -36216 -82756 47895 86771 139309 -71867
394 -71867 -75014 -171090 23149 75915 14593 58791 -106494 -236293 -186214 -146903 53924
383 53924 -100055 -12580 4568 -181997 -50196 -82572 11960 -76467 -4505 -129612 -53088
372 -53088 -105615 136639 -112972 11197 184763 69962 133927 152845 141665 102245 23988
361 23988 -214556 -149082 -180609 12863 -30476 233640 306999 101986 -59990 -70269 -127016
350 -127016 -222735 1107 234662 -72094 -80295 22382 -78038 117780 -4907 139044
340 139044 -185983 -245870 -183191 -166345 -183663 -270166 -108006 -3479 -76989 -220491 -166152
329 -166152 14942 -192062 -158135 -127947 -8955 -17934 -1790 -78239 37465 176265 -52097
318 -52097 -141923 -363678 -186946 -79093 -103138 98222 158526 126322 -126848 -39831 95132
307 95132 68262 29638 20440 102026 -160443 -78988 49710 48669 -28506 152040 165568 125531
295 125531 -12420 142048 113268 35211 12155 124137 46595 43815 -128127 -287252 -245546
284 -245546 -103865 127005 112468 -109770 6996 -2645 -2147 -57145 -91818 -6681 -35406 -49691
272 -49691 128808 60199 -43991 -86304 2259 20441 -50903 -101114 -296525 6229 78972
261 78972 113351 -69621 35306 -16122 -8104 84939 82120 -76879 -34369 -38056 -29294 8836
249 8836 -16489 -59406 -45016 -20547 -130414 -137684 -44972 -189290 -335413 -31600 115823
238 115823 58955 101393 -55980 -81778 61833 -137733 -183734 -153483 531 105830 -24684
227 -24684 26250 27401 140931 142434 88857 146592 122494 41563 -25268 -70520 -83708 31566
215 31566 39665 94056 -117218 14647 -119066 -149915 -212776 -137619 21743 -17548 -52320
204 -52320 -6043 149212 -49557 101414 -71250 -53783 9376 -51101 -73217 79929 313079
193 313079 213730 188447 -62557 -85258 4270 -27298 -3688 -22926 -19229 115226 271479
182 271479 30657 -7216 -76788 -6157 -38219 -29209 -114812 -47889 -198060 -87687 -101372
171 -101372 -96449 37797 315018 346562 100920 62250 6110 149278 106138 94900 -89009
160 -89009 44046 -86114 11923 212671 102381 33040 -174965 -262485 -39074 -9527 111744
149 111744 209337 66151 178404 168817 13492 -70737 -45087 37951 182160 154937 -20751
138 -20751 -95201 -78238 -70546 38120 125483 93750 33168 81823 123165 -6383 -120549 -10837
126 -10837 -39452 -125525 -241600 -138872 -60638 -101947 -37822 79960 -68952 -7278 196877
115 196877 43654 139086 158550 171014 38317 -25070 -141366 1005 -123345 45859 80531
104 80531 -48673 -27687 37229 -83931 -69001 65270 77635 21171 64284 49904 12420
93 12420 2991 -100867 -90254 -103919 -81118 -27941 -49468 145423 200940 93353 71129 142288
81 142288 53990 -25833 37161 -252911 -159865 -105973 -70622 -55449 134149 259918 -49831
70 -49831 -139738 -177606 -269940 -172720 -201996 -131475 54813 108640 109311 -16495 -6590 128713
58 128713 -5501 -22593 102846 48296 -43556 51154 95704 85047 90818 108566 183525 150707
46 150707 144016 146661 90758 57928 69979 -18651 -42048 24420 42472 -8353 -66209 81253
34 81253 218595 197806 219435 152762 -15528 64604 83416 155726 224979 83229 21776 66961
22 66961 52993 34928 129639 140186 -36642 -144797 -8341 119429 238218 144125 93515
11 93515 40558 -147942 19368 20472 -92125 -61706 -5615 -75373 -103707 -128565 53186
0 53186
$$ Imaginary data points
##PAGE= N=2
##DATA TABLE= (X++(I..I)), XYDATA
16383 -727862 -698110 -908782 -889935 -865792 -774134 -787756 -743980 -827933 -824040 -797940 -755399
16372 -755399 -681404 -697934 -696519 -689695 -670318 -603241 -553963 -597189 -562600 -529165 -605874 -632960
16360 -632960 -551319 -355743 -394943 -528099 -498915 -522647 -531576 -525196 -450863 -443825 -308619
16349 -308619 -228016 -261848 -355405 -284828 -411878 -456876 -416020 -386288 -295679 -175335 -87622
16338 -87622 -244809 -226829 -167125 -28525 -208413 -323308 -269626 -130138 -51511 951 -6527
16327 -6527 73006 85183 -39169 -79959 -77109 37018 -12087 23468 135230 203413 94432
16316 94432 -27010 41150 27342 -70898 9942 171678 193044 242340 281967 101189 -17333
16305 -17333 111147 105804 127018 149531 118405 -76468 -87244 21791 294820 188053 158661
16294 158661 288977 195302 199647 314009 328879 404774 389265 406603 446553 474901 229785
16283 229785 185378 379122 276350 302303 268916 188946 208226 445836 520648 464906 471935
16272 471935 490536 444928 560558 616238 623585 558918 591719 672421 786729 778336 594817
16261 594817 422217 535626 603844 611369 598448 498469 635483 684864 701281 877916 1003844
16250 1003844 971949 883163 849117 928268 931700 978800 1059556 1076732 878312 949267 921773
16239 921773 966981 1094815 966123 905690 869586 798011 680236 886085 1123726 995203
16229 995203 836482 848352 836781 842077 935573 881986 912353 1160331 1054982 1127299 1075701
16218 1075701 1139950 1085385 992002 1061422 1084719 1084421 1122015 1165377 1169104 1188311 1135781 1055101
16206 1055101 1131724 1112923 956816 995017 1127178 1070269 1141085 1159788 1349935 1178161
16196 1178161 1039746 899620 1148476 1265778 1281494 1233646 1151703 1084208 1073061 1148097
16186 1148097 1301813 1408225 1307957 1189276 1169347 1191029 1085926 1047231 1167501 1218367
16176 1218367 1341610 1432502 1365014 1513389 1305129 1336011 1292625 1356727 1321413 1265075 1241290
16165 1241290 1348905 1193797 1211090 1378488 1451831 1546738 1345099 1326660 1455789 1447259
16155 1447259 1387752 1167182 1154646 1076151 1070619 1040938 1008741 1156538 1403160 1232953 1234159
16144 1234159 1331476 1390449 1353267 1440621 1440597 1400423 1383316 1399670 1361364 1257848 1237426 1214910
16132 1214910 1210932 1184829 1298551 1278280 1367726 1408307 1428101 1270456 1067522 1062544 1196550
16121 1196550 1298057 1559124 1580464 1553592 1438453 1409752 1480152 1355766 1328432 1222658
16111 1222658 1436323 1391500 1418646 1434705 1508061 1506671 1461010 1311495 1381347 1453627 1471696
16100 1471696 1576316 1671254 1609593 1353312 1454165 1474471 1501649 1372006 1548516 1545023
16090 1545023 1352103 1487286 1650654 1555408 1462758 1563200 1622841 1570700 1491564 1528882
16080 1528882 1492421 1598235 1570845 1532479 1609928 1754900 1693085 1452310 1476314 1575437 1627291
16069 1627291 1700358 1811437 1687883 1618842 1603948 1529845 1662329 1551403 1468327 1560955
$$ [...]
##END NTUPLES=NMR SPECTRUM
##END=
