##TITLE=1H_TG-2363
 CDCl3
 8 sc, 
 18.10.2022
##JCAMPDX= 6.0         $$ Bruker NMR JCAMP-DX V2.0
##DATA TYPE= NMR SPECTRUM
##DATA CLASS= NTUPLES
##ORIGIN= UXNMR, Bruker Analytische Messtechnik GmbH
##OWNER= root
$$ XWIN-NMR		Version 3.5
$$ Tue Oct 18 12:42:23 2022 Russian Standard Time (UT+4h)  she@DPX200
##.OBSERVE FREQUENCY= 200.1313499994
##.OBSERVE NUCLEUS= ^1H
##.ACQUISITION MODE= SIMULTANEOUS
##.ACQUISITION SCHEME= undefined
##.AVERAGES= 8
##.DIGITISER RES= 18
##SPECTROMETER/DATA SYSTEM= spect
##.PULSE SEQUENCE= zg30
##.SOLVENT NAME= CDCl3
##.SHIFT REFERENCE= (INTERNAL, CDCl3, 0, 15.7888)
##AUDIT TRAIL= $$ (NUMBER, WHEN, WHO, WHERE, WHAT)
$$ ##TITLE= Audit trail, XWIN-NMR		Version 3.5
$$ ##JCAMPDX= 5.01
$$ ##ORIGIN= Bruker BioSpin GmbH
$$ ##OWNER= she
$$ F:/spectra/data/she/nmr/H-F/1/pdata/1/auditp.txt
$$ ##AUDIT TRAIL=  $$ (NUMBER, WHEN, WHO, WHERE, WHAT)
(   1,<2022-10-18 12:41:18.92 +0400>,<she>,<DPX200>,
      <created by zg, POWCHK disabled, PULCHK disabled
       configuration hash MD5:
       00 E9 B6 7A A2 85 ED C7 34 08 36 98 17 FE 4E 26
       data hash MD5: 16K
       8F 38 FC B0 E5 6F C9 50 07 F6 98 C4 6F 74 37 79>)
(   2,<2022-10-18 12:41:21.37 +0400>,<she>,<DPX200>,
      <Start of raw data processing
       efp BC_mod = 2 LB = 0.24 FT_mod = 6 PKNL = 1 PHC0 = -18194.58 PHC1 = 13.4007 SI = 16K 
       data hash MD5: 16K
       45 A5 44 5E 8E CE 16 69 21 37 9B 10 9C 2F 0F 64>)
(   3,<2022-10-18 12:41:37.17 +0400>,<she>,<DPX200>,
      <pk PHC0 = 1.302979 PHC1 = -1.2 
       data hash MD5: 16K
       E7 49 3A 3F D1 0E D9 BF B6 C9 71 FB A9 67 1F CE>)
(   4,<2022-10-18 12:41:45.70 +0400>,<she>,<DPX200>,
      <abs ABSG = 5 
       data hash MD5: 16K
       34 6E 60 75 AB 72 93 87 6A 19 02 8C 45 0B B9 13>)
$$ ##END=
$$ 
$$ hash MD5
$$ 35 B7 88 CB B3 B5 35 89 0F 4C DF A9 89 2D 4F 23
##$RELAX= 
##$RELAX= 
##$RELAX= 
##$RELAX= 
##$RELAX= 
##$RELAX= 
$$ Bruker specific parameters
$$ --------------------------
##$DU= <F:/spectra>
##$EXPNO= 1
##$NAME= <H-F>
##$PROCNO= 1
##$TYPE= <nmr>
##$USER= <she>
##$AMP= (0..31)
100 100 100 100 100 100 100 100 100 100 100 100 100 100 100 100 100 100 
100 100 100 100 100 100 100 100 100 100 100 100 100 100 
##$AQSEQ= 0
##$AQ_mod= 1
##$AUNM= <au_zg>
##$AUTOPOS= <>
##$BF1= 200.13
##$BF2= 200.13
##$BF3= 200.13
##$BF4= 200.13
##$BF5= 200.13
##$BF6= 200.13
##$BF7= 200.13
##$BF8= 200.13
##$BYTORDA= 1
##$CFDGTYP= 0
##$CFRGTYP= 5
##$CHEMSTR= <none>
##$CNST= (0..31)
1 1 145 1 1 1 1 1 1 1 1 1 1 1 1 1 1 1 1 1 1 1 1 1 1 1 1 1 1 1 1 1 
##$CPDPRG= <>
##$CPDPRG1= <>
##$CPDPRG2= <>
##$CPDPRG3= <>
##$CPDPRG4= <mlev>
##$CPDPRG5= <mlev>
##$CPDPRG6= <mlev>
##$CPDPRG7= <mlev>
##$CPDPRG8= <mlev>
##$CPDPRGB= <>
##$CPDPRGT= <>
##$D= (0..31)
0 1.2 0 0 0 0 0 0 0 0.06 0 0.03 0 0 0 0 0.0002 0 0 0 0 0 0 0 0 0 0 0 0 
0 0 0 
##$DATE= 1666082478
##$DBL= (0..7)
120 120 120 120 120 120 120 120 
##$DBP= (0..7)
150 150 150 150 150 150 150 150 
##$DBP07= 0
##$DBPNAM0= <>
##$DBPNAM1= <>
##$DBPNAM2= <>
##$DBPNAM3= <>
##$DBPNAM4= <>
$$ [...]
##$SUBNAM3= <"">
##$SUBNAM4= <"">
##$SUBNAM5= <"">
##$SUBNAM6= <"">
##$SUBNAM7= <"">
##$SUBNAM8= <"">
##$SUBNAM9= <"">
##$SW= 18.0517283424941
##$SWIBOX= (0..15)
0 0 2 0 0 0 0 0 0 0 0 0 0 0 0 0 
##$SW_h= 3612.71676300578
##$TD= 16384
##$TD0= 1
##$TE= 0
##$TE2= 300
##$TE3= 300
##$TEG= 300
##$TL= (0..7)
0 120 120 120 120 120 120 120 
##$TP= (0..7)
150 150 150 150 150 150 150 150 
##$TP07= 0
##$TPNAME0= <>
##$TPNAME1= <>
##$TPNAME2= <>
##$TPNAME3= <>
##$TPNAME4= <>
##$TPNAME5= <>
##$TPNAME6= <>
##$TPNAME7= <>
##$TPOAL= (0..7)
0.5 0.5 0.5 0.5 0.5 0.5 0.5 0.5 
##$TPOFFS= (0..7)
0 0 0 0 0 0 0 0 
##$TUNHIN= 0
##$TUNHOUT= 0
##$TUNXOUT= 0
##$USERA1= <user>
##$USERA2= <user>
##$USERA3= <user>
##$USERA4= <user>
##$USERA5= <user>
##$V9= 5
##$VALIST= <valist>
##$VCLIST= <CCCCCCCCCCCCCCC>
##$VD= 0
##$VDLIST= <DDDDDDDDDDDDDDD>
##$VPLIST= <PPPPPPPPPPPPPPP>
##$VTLIST= <TTTTTTTTTTTTTTT>
##$WBST= 1024
##$WBSW= 4
##$XGAIN= (0..3)
0 0 0 0 
##$XL= 0
##$YL= 0
##$YMAX_a= 830646
##$YMIN_a= -596430
##$ZGOPTNS= <>
##$ZL1= 120
##$ZL2= 120
##$ZL3= 120
##$ZL4= 120
##$ABSF1= 15.78876
##$ABSF2= -2.263091
##$ABSG= 5
##$ABSL= 3
##$ALPHA= 0
##$AQORDER= 0
##$ASSFAC= 0
##$ASSFACI= 0
##$ASSFACX= 0
##$ASSWID= 0
##$AUNMP= <proc_1d>
##$AZFE= 0.1
##$AZFW= 0.1
##$BCFW= 0
##$BC_mod= 2
##$BYTORDP= 0
##$COROFFS= 0
##$CY= -3
##$DATMOD= 1
##$DC= 0
##$DFILT= <>
##$DTYPP= 0
##$F1P= 0
##$F2P= 0
##$FCOR= 1
##$FTSIZE= 16384
##$FT_mod= 6
##$GAMMA= 0
##$GB= 0
##$INTBC= 1
##$INTSCL= 3.70164e-10
##$ISEN= 128
##$LB= 0.24
##$LEV0= 0
##$LPBIN= 0
##$MAXI= 10000
##$MC2= 0
##$MEAN= 0
##$ME_mod= 0
##$MI= 1.114404
##$NCOEF= 0
##$NC_proc= -6
##$NLEV= 6
##$NOISF1= 3.799351
##$NOISF2= 2.8
##$NSP= 0
##$NTH_PI= 0
##$NZP= 0
##$OFFSET= 15.78876
##$PC= 1
##$PHC0= -18193.28
##$PHC1= 12.2007
##$PH_mod= 1
##$PKNL= yes
##$PPARMOD= 0
##$PSCAL= 0
##$PSIGN= 0
##$REVERSE= no
##$SF= 200.129996552652
##$SI= 16384
##$SIGF1= 3
##$SIGF2= 2
##$SINO= 5.538805
##$SIOLD= 16384
##$SREGLST= <1H.CDCl3>
##$SSB= 0
##$STSI= 16384
##$STSR= 0
##$SW_p= 3612.71676300578
##$SYMM= 0
##$S_DEV= 0
##$TDeff= 16384
##$TDoff= 0
##$TI= <>
##$TILT= no
##$TM1= 0
##$TM2= 0
##$TOPLEV= 0
##$USERP1= <user>
##$USERP2= <user>
##$USERP3= <user>
##$USERP4= <user>
##$USERP5= <user>
##$WDW= 1
##$XDIM= 16384
##$YMAX_p= 354440099
##$YMIN_p= -215556
$$ End of Bruker specific parameters
$$ ---------------------------------
##NTUPLES= NMR SPECTRUM
##VAR_NAME=  FREQUENCY,     SPECTRUM/REAL,   SPECTRUM/IMAG
##SYMBOL=    X,             R,               I
##VAR_TYPE=  INDEPENDENT,   DEPENDENT,       DEPENDENT
##VAR_FORM=  AFFN,          ASDF,            ASDF
##VAR_DIM=   16384,         16384,           16384
##UNITS=     HZ,            ARBITRARY UNITS, ARBITRARY UNITS
##FACTOR=    0.220516191357247, 1,           1
##FIRST=     3159.80452144307, 0,            0
##LAST=      -452.91224156271, 0,            0
##MIN=       -452.91224156271, -215556,      0
##MAX=       3159.80452144307, 354440099,    0
$$ Real data points
##PAGE= N=1
##DATA TABLE= (X++(R..R)), XYDATA
$$ [...]
5660A389930R5490J271R258J2943q0197K2598L3953m3435n59m5686l8153o1409
5648A296004O2569N4040o4690k849r178M8716n0067J3845n4070m7460J6254m2955
5636A220159M5117k7629n1509k65N6525k2485o6501j389j0556j8319j5630j0318
5624A097200k4201M8679r2080j3635N184k9802o1268k8835L7289K7531J719K8730
5612I96511M395j02247m0343j7467j621p895k3786M6803M9768m8205n7235J8619
5600H17297N2528J7046O339K990l1503r789K2588l2368j1647M694J91l3851L7796
5587H42311j2332K4579L6364L9827k7733k2827j0495m3322q0244j2004K0470j3510
5575G41084k3714L1272K3776K3157m4500l7526J19433l0448q9832N905P0015J5355
$$ y = [1389930, 1485420, 1486691, 1495949, 1508892, 1428695, 1451293, 1485246, 1441811, 1441252, 1395566, 1357413, 1296004, 1358573, 1412613, 1347923, 1345074, 1335896, 1384612, 1334545, 1348390, 1294320, 1246860, 1263114, 1220159, 1265276, 1237647, 1186138, 1185873, 1242398, 1219913, 1153412, 1152023, 1141467, 1123148, 1107518, 1097200, 1072999, 1121678, 1029598, 1015963, 1021147, 991345, 930077, 901242, 938531, 966062, 967781, 996511, 1000906, 898659, 858316, 840849, 839228, 831333, 807547, 854350, 904118, 855913, 798678, 817297, 869825, 886871, 893210, 896200, 864697, 854908, 877496, 845128, 833481, 838175, 838366, 804515, 842311, 829979, 854558, 890922, 930749, 903016, 880189, 869694, 826372, 746128, 734124, 754594, 741084, 717370, 748642, 772418, 795575, 751075, 713549, 832982, 802534, 712702, 718607, 788622, 803977]
5563H03977M4142K1078k4597n4544J5622K0268m0509K6375O2344m3849o5835Q5914
5551H50386j1453m913n08m2110M405k0338K5963k0685J4953M4394j1532n5645
5539G72917p2854P2619K0676p9514M393j8090j4160N1516M9865m8431P0243Q19
5527H09999n901l8195k6610L3804m7892K5713o3213j8475n149Q2609K8208n6492
5515G18406J5532p8315K871l817n1149j7320l2150r42J10832O6370r1933o0565
5503E77820j9919K1329N6823L5767K5657l4082l7408k1490K3917k9589j0000l090
5491E85735P737Q4791k2562j6721j4068n671M4817J8700l3399k8593N4308r626
5479F65448N778l2468l2776L2046j2121j57j5289k6151k4795j3611n469K7909
$$ y = [803977, 848119, 869197, 844600, 790056, 805678, 825946, 785437, 811812, 874156, 830307, 764472, 850386, 838933, 834020, 833512, 791402, 795807, 775469, 801432, 780747, 795700, 840094, 828562, 772917, 700063, 772682, 793358, 713844, 718237, 700147, 685987, 737503, 787368, 738937, 809180, 809999, 804098, 765903, 739293, 773097, 725205, 750918, 687705, 669230, 664081, 746690, 774898, 718406, 733938, 655623, 658494, 654677, 603528, 586208, 554058, 553116, 663948, 730318, 638385, 577820, 557901, 579230, 636053, 671820, 697477, 663395, 625987, 604497, 628414, 598825, 588825, 585735, 593472, 678263, 655701, 638980, 624912, 619241, 664058, 682758, 649359, 620766, 675074, 665448, 671226, 638758, 605982, 638028, 625907, 625750, 610461, 584310, 559515, 545904, 540435, 568344]
5467E68344J947K1102m4459k9341r887j9097K9046L2535k0750M3182K9717R116
5455F11455M3620j486p7293o56Q622J9927L0286r999k8357K5292J4695Q3896K236
5442G22238Q26k8114K8965J4587n29M5594N0490k9743p5915R5772M8295J9553
5430H92019Q687K2273n5751J3143N6721K1873L9759k0746l0172K2468L0747K7578
5418A028599j4835R4469L8083p5296n2659N5818k3896J5841O4534j177j9798L8277
5406A147960N528J4091L6085k3966j788M187j3662J097k4208P2134k1916O4176
5394A259718M8969p0295j5609J3741j9286m283J283j6811k2805M3512N3350k6815
5382A244669m7679q93P1316j7700K5089j6145l6986J05289L3251k4705nO7044
$$ y = [568344, 570291, 591393, 546934, 517593, 507706, 488609, 517655, 550190, 529440, 572622, 602339, 611455, 655075, 653589, 576296, 575640, 584262, 604189, 634475, 624476, 596119, 621411, 636106, 720002, 722238, 723064, 694950, 723915, 738502, 737973, 783567, 834057, 804314, 728399, 824171, 872466, 892019, 900706, 922979, 867228, 880371, 937092, 958965, 998724, 977978, 947806, 970274, 1001021, 1028599, 1013764, 1108233, 1146316, 1071020, 1018361, 1074179, 1050283, 1066124, 1130658, 1129481, 1109683, 1147960, 1153488, 1167579, 1203664, 1179698, 1177910, 1182097, 1168435, 1169532, 1145324, 1217458, 1195542, 1259718, 1308687, 1238392, 1222783, 1236524, 1217238, 1212955, 1214238, 1197427, 1174622, 1218134, 1271484, 1244669, 1196990, 1196097, 1267413, 1249713, 1274802, 1258657, 1221671, 1326960, 1360211, 1335506, 1335501, 1402545]
5370A402545r0208M2184O9580j8608M8999L0283N5976n4146M512j5822O78l2143
5358A443830J3720P2402O6732k2724j9073P739K5322J0773k41L583O405K934O9258
5345A680660m4557m1345J17900L3857l3012P561R686J22788j5754q609J38282
5334A967457L7850m2850J18937M4570j0793M1111j3623O5343P1972M5940R990
5323B335904O2000O5716P2209M4398P204k3531L8985J06548J2188k9848m0185
5312B651588J05962R2797J8333O515J9172P0277l2381k400O7574L7239K4749q1897
5300B977528N828L3890J7170P57k8903p8161r586K9099j03533p7619k3151Q2629
5288B825948P110p3835j11276L2558k3921o9459j11600m6187k3350o4349o0289
$$ y = [1402545, 1312337, 1354521, 1424101, 1405493, 1454492, 1484775, 1540751, 1486605, 1491117, 1475295, 1475973, 1443830, 1457550, 1529952, 1596684, 1573960, 1554887, 1562626, 1587948, 1598721, 1598480, 1602063, 1608468, 1611402, 1680660, 1636103, 1594758, 1712658, 1746515, 1713503, 1721064, 1730750, 1853538, 1837784, 1829175, 1967457, 2005307, 1962457, 2081394, 2125964, 2115171, 2156282, 2142659, 2208002, 2279974, 2325914, 2335904, 2397904, 2463620, 2535829, 2580227, 2587431, 2563900, 2602885, 2709433, 2721621, 2691773, 2651588, 2757550, 2850347, 2868680, 2875195, 2894367, 2964644, 2932263, 2929863, 2997437, 3034676, 3059425, 2977528, 2983356, 3017246, 3034416, 3035173, 3006270, 2928109, 2918523, 2947622, 2844089, 2766470, 2743319, 2825948, 2833058, 2759223, 2647947, 2680505, 2656584, 2587125, 2475525, 2429338, 2405988, 2341639, 2281350]
5277B281350n6840n1880l8193j33402p8902k4300m5033q9555O477k3305j37777
5266A608640k7691o0717n3115l3879K5392j0725j61360r0304j5999n4865k1070
5255A104307M6090j9516n01l7333k940Q1945k4411j17877j1744j210k64L6759
5243A053305p3545l832j2085o9726j4259q732n1035k987o2015m218N6429m7328
5231G59972l9545k8110L65k0549j2809Q953j7000m7516o1298R1387O0256m283
5219F89823j25248J4095k3330l5471n6354M5602N5091k4419m6833r1021K9980
5208D31915K8905p6839l2559O4874K7263j1505L5478j8162K7810j0039j3243J446
5196D55344o828j9523R519K8974l8128J0233n2006K921J7305j2199l2437l3315
$$ y = [2281350, 2224510, 2172630, 2134437, 2001035, 1922133, 1897833, 1852800, 1763245, 1769722, 1746417, 1608640, 1580949, 1520232, 1467117, 1433238, 1458630, 1447905, 1286545, 1196241, 1180242, 1125377, 1104307, 1150397, 1130881, 1130380, 1093047, 1090107, 1172052, 1147641, 1029764, 1018020, 1016810, 1016546, 1053305, 979760, 975928, 963843, 894117, 879858, 871126, 820091, 817104, 755089, 750871, 807300, 759972, 720427, 692317, 692682, 672133, 659324, 668277, 651277, 603761, 542463, 633850, 694106, 689823, 564575, 578670, 555340, 519869, 463515, 509117, 564208, 539789, 492956, 401935, 431915, 460820, 383981, 351422, 416296, 443559, 432054, 467532, 449370, 477180, 467141, 453898, 455344, 448516, 428993, 438512, 467486, 429358, 439591, 387585, 390506, 407811, 395612, 363175, 329860]
5184C29860l153j3889M1560j1270K3737j8934l1898K787R149Q1994K4253j06546
5172C27650m765P2173n121M1896m4216J0096O9546m9457l0786l0542l5012K4581
5160C46043L2413K8972n9760L2266J2506j9859j0109J7330j458k3441n6615Q4353
5148C82641M9946n5006M6105L8642k5243L5983q952l5234q51P0074n3058N9646
5136E04693o1994M9101K8620l7680J2756N5279O6224j24891m5461N3418m897K4884
5124E20052L7917r619N7075K9186L1764j1789n143K840l7832K883N506K1063j7867
5111F26036K8747Q8204n630l0546J2338m2944N3659Q4585n514L8209P593O9398
5099I24135k1067j1500j9446l6167O9356L4033K1118N6634p0267L759J2177M1020
$$ y = [329860, 326707, 312818, 354378, 343108, 366845, 347911, 316013, 318800, 327949, 409943, 434196, 327650, 322885, 395058, 389937, 431833, 387617, 397713, 467259, 417802, 387016, 356474, 321462, 346043, 378456, 407428, 347668, 379934, 392440, 372581, 362472, 379802, 378344, 354903, 298288, 382641, 432587, 377581, 423686, 462328, 437085, 473068, 464116, 428882, 428031, 498105, 445047, 504693, 442699, 491800, 520420, 482740, 495496, 550775, 616999, 492108, 446647, 500065, 495168, 520052, 557969, 548350, 605425, 634611, 666375, 654586, 649443, 652283, 614451, 617334, 622840, 643903, 626036, 654783, 742987, 737357, 706811, 719149, 676205, 729864, 814449, 808935, 847144, 854737, 924135, 903068, 891568, 872122, 835955, 905311, 939344, 960462, 1017096, 946829, 950588, 962765, 1003785]
5087A003785j8983m7635L5312L1010L693M5490r64J4682k970p893K4223P7333
5075A157083K5170r940n544K3126K1811J9329J4604K2705k6885L6348O0787k197
5063A336397K6708l0959M7297o036l4905k1678J1522P0264l8591n4035K4843O0406
5051A391233N7841j4461m2696P965o3408O4612j1605k2062L9712Q5911K3386k1395
5039A495033J2352m2970L1862j3569o8035J01635J1414M2341m049j0717R052o245
5027A558104k9302j5268L4354l591l746j0982k1954o1186N8486l319k720L2659
5015A531535l1007K9256Q480p3314L8975L9347j3530j02624J9822j4209K4529
5004A457260J6509J9503J1458n628n9989L8419J0260M67j4729J052L043P8103
$$ y = [1003785, 984802, 937167, 972479, 1003489, 1007182, 1052672, 1051708, 1066390, 1063420, 1055527, 1079750, 1157083, 1182253, 1172313, 1166769, 1189895, 1211706, 1231035, 1245639, 1268344, 1241459, 1277807, 1338594, 1336397, 1363105, 1332146, 1379443, 1373407, 1338502, 1316824, 1328346, 1398610, 1360019, 1305984, 1330827, 1391233, 1449074, 1434613, 1391917, 1399882, 1336474, 1401086, 1389481, 1367419, 1407131, 1493042, 1516428, 1495033, 1507385, 1464415, 1496277, 1482708, 1414673, 1516308, 1527722, 1570063, 1566014, 1555297, 1564349, 1558104, 1528802, 1513534, 1547888, 1544297, 1540551, 1529569, 1507615, 1446429, 1504915, 1501596, 1498876, 1531535, 1500528, 1529784, 1538264, 1464950, 1503925, 1543272, 1529742, 1427118, 1446940, 1432731, 1457260, 1473769, 1493272, 1504730, 1499102, 1439113, 1477532, 1487792, 1488259, 1473530, 1474582, 1477625, 1555728]
4992A555728N6571j0045P0125l1166n0931J3939L7499N5385l5836n262J5543K3619
4980A695169L1450m8020J7877k4153m4502L6412K2160J586j9972l6283P00R962
4968A642386K0631K6209K2528k2794N8326M135l6326O9663N718O0969K9752k2363
4956A858834J1130L0720K5994l2239k5617q686j2980P3980k558M192Q1883L0892
4944B035545j6184p6878K0299J3607K8826M9783m5023j902Q0451K1867M4701Q6043
4932B241135j4167K4878j0543o447P9158J0635L4884M9016L8699n1233k6686K8346
4920B397675M9130J4207k9220L2373M2549O3858R1427M9058p06L1382M7360N7853
4908B846946k5807j8436N3949N3601O6785K8245L8751P0108N4366p257J3178j5949
$$ y = [1555728, 1612299, 1602254, 1672379, 1641213, 1590282, 1604221, 1641720, 1697105, 1661269, 1656007, 1671550, 1695169, 1726619, 1678599, 1696476, 1672323, 1627821, 1664233, 1686393, 1687979, 1668007, 1631724, 1632424, 1642386, 1663017, 1689226, 1711754, 1688960, 1747286, 1751421, 1715095, 1784758, 1790476, 1851445, 1881197, 1858834, 1869964, 1900684, 1926678, 1894439, 1868822, 1860136, 1847156, 1921136, 1918578, 1922770, 2004653, 2035545, 2019361, 1942483, 1962782, 1976389, 2005215, 2054998, 2009975, 2008073, 2088524, 2110391, 2155092, 2241135, 2226968, 2251846, 2241303, 2234856, 2314014, 2324649, 2359533, 2408549, 2447248, 2396015, 2369329, 2397675, 2446805, 2461012, 2431792, 2464165, 2506714, 2570572, 2661999, 2711057, 2710351, 2741733, 2789093, 2846946, 2821139, 2802703, 2856652, 2910253, 2977038, 3005283, 3044034, 3114142, 3168508, 3161251, 3174429, 3158480]
4896C158480J00888P6574j468L3311P2321M633P410O2555J30744K7146J00537
4885C773131J8660M3656N8135Q3230P8604K0382K5879N0611O9270M7698Q0161
4874D349417O0552J62643J82054R2500N8505L5541J43942J33416J06248O2162
4864E386980O8627P4790J17060J39576O6781J23838J49900J13725J25634J20714
4854F487625J04594O9807J48825J78729O8867J50391J25258J59588J17715J65795
4844G777194J14193J60583J38593K01093K42816J27801R6929K08072J47449J25378
4834I340101J90599K05102J26764K23888J67910J94136J82011K45915K21076J83095
4824A1280597J64700K23630K39035K19655K90907L09612K47874K11362K48923
$$ y = [3158480, 3259368, 3335942, 3334474, 3367785, 3440106, 3444739, 3452149, 3514704, 3645448, 3672594, 3773131, 3791791, 3835447, 3893582, 3976812, 4055416, 4075798, 4101677, 4152288, 4221558, 4269256, 4349417, 4409969, 4572612, 4754666, 4847166, 4905671, 4941212, 5085154, 5218570, 5324818, 5386980, 5455607, 5530397, 5647457, 5787033, 5853814, 5977652, 6127552, 6241277, 6366911, 6487625, 6592219, 6662026, 6810851, 6989580, 7058447, 7208838, 7334096, 7493684, 7611399, 7777194, 7891387, 8051970, 8190563, 8391656, 8634472, 8762273, 8859202, 9067274, 9214723, 9340101, 9530700, 9735802, 9862566, 10086454, 10254364, 10448500, 10630511, 10876426, 11097502, 11280597, 11445297, 11668927, 11907962, 12127617, 12418524, 12728136, 12976010, 13187372, 13436295]
4815A3436295K79825K61654K41760K64270L28924L16298K54850J98427K86406
4806A5868709L72862L33730L42140L92022L84782L08357L91731L81285L80972
4797A9156590M57375N26424N06981N78655N68322N10863N94324O93226O28921
4788B4221681P53904Q24078P44532P87510Q89710R68625J018257J029620J071861
4779C2309778J184554J217727J162781J323848J412729J490105J521636J527963
4771D3151121J656091J623345J589332J689436J669033J707183J723335J800274
4763E6609150J810489J835459J843241J800949J700115J701140J739544J692840
4755G0732927J555681J362023J260798J071347Q12322O49250M49587J62838j16842
$$ y = [13436295, 13716120, 13977774, 14219534, 14483804, 14812728, 15129026, 15383876, 15582303, 15868709, 16241571, 16575301, 16917441, 17309463, 17694245, 18002602, 18394333, 18775618, 19156590, 19613965, 20140389, 20647370, 21226025, 21794347, 22305210, 22899534, 23592760, 24221681, 24975585, 25799663, 26544195, 27331705, 28221415, 29190040, 30208297, 31237917, 32309778, 33494332, 34712059, 35874840, 37198688, 38611417, 40101522, 41623158, 43151121, 44807212, 46430557, 48019889, 49709325, 51378358, 53085541, 54808876, 56609150, 58419639, 60255098, 62098339, 63899288, 65599403, 67300543, 69040087, 70732927, 72288608, 73650631, 74911429, 75982776, 76795098, 77444348, 77893935, 78056773, 77939931]
4746G7939931k68182m92312o13456p05979o90376o82980o85661n95527n71052
4737G2634406n18511l79740k99643k62277k53195k46238k38014k25150l12906
4728F9898732m49349n60559p10954r71968j163160j289659j547985j838992j988992
4719E9377114k241077k349964k390415k440763k315855k357521k334930k227689
4711D0718900k084517j977152j806634j735778j659363j453401j384923j296806
4703B7320326j216383j112196j106205j043433q25369q46457q51039q12220p36801
4694A8770223p18389o53302o54888n96992n65175n47049m76607n19925m88582
4685A3549314m43243m55859m02381l78781l01372l89648l18808l52312l23792
$$ y = [77939931, 77671749, 77179437, 76565981, 75860002, 75169626, 74486646, 73800985, 73205458, 72634406, 72115895, 71736155, 71436512, 71174235, 70921040, 70674802, 70436788, 70211638, 69898732, 69449383, 68888824, 68177870, 67205902, 66042742, 64753083, 63205098, 61366106, 59377114, 57136037, 54786073, 52395658, 49954895, 47639040, 45281519, 42946589, 40718900, 38634383, 36657231, 34850597, 33114819, 31455456, 30002055, 28617132, 27320326, 26103943, 24991747, 23885542, 22842109, 22016740, 21170283, 20319244, 19507024, 18770223, 18051834, 17398532, 16743644, 16146652, 15581477, 15034428, 14557821, 14037896, 13549314, 13106071, 12650212, 12247831, 11869050, 11567678, 11178030, 10859222, 10506910, 10183118]
4676A0183118l27410k52496k80160k26990k32043k40909k15008j94762j62879
4667H050461j94745j38344j46790j77174j63296j57151j65849j30926j34279j42583
4657F499324j85563j16228r7330q1463q8877j53436q3932j37704j33282n7764
4647E363745l5426J0703j46259r4978m4348j39288p6189p9526m3616r5176n3274
4636D566368K4200L7493r5811k6103j09430j04974J1063m1420j00270r5845j7801
4625D047470l4660q620r2206Q977q441K9797q3503p3631Q5652p4308p1695K6471
4613C751303o2278n2985K1472m5731q1103q863j7179L1339n7802J7286n211p3279
4601C416969m7794M0909j08858m4527J2096k0065m4175k4426n4063j2837n7166
$$ y = [10183118, 9855708, 9603212, 9323052, 9096062, 8864019, 8623110, 8408102, 8213340, 8050461, 7855716, 7717372, 7570582, 7393408, 7230112, 7072961, 6907112, 6776186, 6641907, 6499324, 6313761, 6197533, 6100203, 6018740, 5929863, 5776427, 5692495, 5554791, 5421509, 5363745, 5328319, 5339022, 5192763, 5097785, 5053437, 4914149, 4837960, 4758434, 4714818, 4619642, 4566368, 4590568, 4628061, 4532250, 4506147, 4396717, 4291743, 4302806, 4261386, 4161116, 4065271, 4047470, 4012810, 4004190, 3911984, 3920961, 3912520, 3942317, 3858814, 3785183, 3870835, 3796527, 3724832, 3751303, 3689025, 3636040, 3657512, 3611781, 3530678, 3521815, 3504636, 3535975, 3478173, 3495459, 3490248, 3416969, 3369175, 3410084, 3301226, 3256699, 3268795, 3248730, 3204555, 3180129, 3126066, 3113229, 3056063]
4590C056063J4859M873l7651l0687l4605q0595M3264K1077n1320K780L275l6037
4578B875296m0899R0293q7295r2585k7229L7186j8265M8689J8326m5042n8306
4567B700169J8793L7414l3577j0750Q191L1900k4201o4043J686K8467r5953p097
4555B590999N3345l8753p274P4407o016q7577O0526m3689l852j3759J9621m0191
4543B557787m3654J5269O894k1024n0535L7298l344L9262O814J2092p535r3763
4531B455561J4567k5418j7545M5212L0630k7040o5379k7796O8802N616j7449m0477
4519B399284K0750K2624q1013j5675J9909K5422J7376j0433J2958K2127K2130
4508B455459k4165q2583k4520o192k2356L6480m0983K7359L9558K2202K2673o3449
$$ y = [3056063, 3070922, 3075795, 3038144, 3007457, 2972852, 2892257, 2935521, 2956598, 2905278, 2908058, 2911333, 2875296, 2834397, 2924690, 2837395, 2744810, 2717581, 2754767, 2736502, 2785191, 2803517, 2758475, 2700169, 2718962, 2756376, 2722799, 2712049, 2720240, 2752140, 2727939, 2663896, 2665582, 2694049, 2598096, 2590999, 2644344, 2605591, 2598317, 2672724, 2666708, 2579131, 2639657, 2595968, 2592116, 2578357, 2597978, 2557787, 2514133, 2529402, 2536296, 2515272, 2464737, 2502035, 2498691, 2537953, 2544767, 2556859, 2549324, 2455561, 2470128, 2444710, 2427165, 2472377, 2503007, 2475967, 2410588, 2382792, 2451594, 2457210, 2439761, 2399284, 2420034, 2442658, 2361645, 2345970, 2365879, 2391301, 2408677, 2398244, 2411202, 2433329, 2455459, 2431294, 2348711, 2324191, 2317999, 2295643, 2332123, 2291140, 2318499, 2358057, 2380259, 2402932, 2339483]
4496B339483K3846l5094n0618Q5296P1269o0887j6751k3792P3318J10m8944j7760
4484B339476K5550L2253j0681k3875l1812q89K8717L3967Q843J8944j2367j1690
4472B396436K7074K668K5847K3106L3910j7544K7041Q9486q2224l7522M7721L3731
4460B569730M0359l790k8136P1832P9448k9251M5180o949j3658N7188l6804R0057
4448B835206K9295o763j3942l5251P3867R475n823N4852L3990l0783q101j6114
4436B919908j5706L3075O6495J2079k8616J5892O8360N838m7273Q298k5521K2540
4424C035369k1502l2097K8287J5041K3995N3653M842L5865M4414K8731o3649K2470
4412C175419j8891m1266k3780J905M7894Q3784M4691j4484M5269K0994N5455K7226
$$ y = [2339483, 2363329, 2328235, 2277617, 2362913, 2434182, 2373295, 2356544, 2332752, 2406070, 2406180, 2357236, 2339476, 2365026, 2397279, 2386598, 2362723, 2330911, 2330022, 2358739, 2392706, 2401549, 2420493, 2408126, 2396436, 2423510, 2426178, 2452025, 2475131, 2509041, 2491497, 2518538, 2608024, 2525800, 2488278, 2535999, 2569730, 2610089, 2606299, 2578163, 2649995, 2729443, 2700192, 2745372, 2738423, 2724765, 2781953, 2745149, 2835206, 2864501, 2857738, 2843796, 2808545, 2882412, 2891887, 2886064, 2940916, 2974906, 2944123, 2936022, 2919908, 2904202, 2937277, 3003772, 3015851, 2987235, 3003127, 3071487, 3077325, 3030052, 3038350, 3012829, 3035369, 3013867, 2981770, 3010057, 3025098, 3049093, 3102746, 3107588, 3143453, 3187867, 3216598, 3152949, 3175419, 3156528, 3115262, 3091482, 3093387, 3141281, 3225065, 3269756, 3255272, 3300541, 3321535, 3376990, 3404216]
4400C404216J3014O9342q096l5090J11146l5651K7647O8912L6228N605K2277L9860
4388C719410l4542O4574Q6753N1769O6540l9611j5803L3698L2877L4968Q097q1879
4376C926851l9783k7646q1211j2472o9198r250l3188n8603k5640n8028J6237p3486
4364C454583k9519l5725j10853K3881R241n065K7400p3046L4425L5167J9464J8475
4352C368428o9986j8534k2375k4291M2979O7891K1336m6245p8675L5032P7387
4341C352947j2220Q3975L5927l1578N7432P4386M5478J7721J9968k9405q0827
4330C533804J9287L6897M9482J7639r612j3914R3394K8579p6902j7879L4465M4991
4318C740231M3029K5755K0652L2357J4656l2242J530K4728o1689M6597L0560Q875
$$ y = [3404216, 3417230, 3486572, 3478476, 3443386, 3554532, 3518881, 3546528, 3615440, 3651668, 3657273, 3679550, 3719410, 3684868, 3749442, 3836195, 3887964, 3954504, 3914893, 3899090, 3932788, 3965665, 4000633, 4008730, 3926851, 3887068, 3859422, 3778211, 3765739, 3696541, 3687291, 3654103, 3595500, 3569860, 3511832, 3528069, 3454583, 3425064, 3389339, 3278486, 3302367, 3311608, 3306543, 3333943, 3260897, 3295322, 3330489, 3349953, 3368428, 3298442, 3279908, 3257533, 3233242, 3276221, 3344112, 3365448, 3319203, 3240528, 3275560, 3352947, 3340727, 3424702, 3460629, 3429051, 3486483, 3560869, 3606347, 3624068, 3644036, 3614631, 3533804, 3553091, 3589988, 3639470, 3657109, 3647497, 3633583, 3726977, 3755556, 3678654, 3660775, 3695240, 3740231, 3783260, 3809015, 3829667, 3862024, 3876680, 3844438, 3845968, 3870696, 3809007, 3855604, 3886164, 3895039]
4306C895039k0233o276N9002L3279j4011M6821K7296k8950M7458J8768l3069L2935
4294D058059K8469O1218M5285l4911Q510M6598K8350R9127M2700N1938J1897K4654
4282D471894K2626N3707O9470M9988L4786n279J4827Q6438M6546P6408K4294K8193
4270D973898J2773M9038j4373M3105K4234Q6631O1196O4312O6254K1472J05520
4259E494060N2103J03216J4808Q7152J1972o0788J60548J01451J2052N6128Q7427
4248F120129J11752M3905Q2764M7947O5678M7834K3302J14615P6333L7501L5107
4237F806867L4483L2313M1048Q8079N9209O6214K7974J42461P9884J57760N7504
4226G593796J54749J48046Q3205R6083J10609J76130J31873J43066J55483J38996
$$ y = [3895039, 3874806, 3868530, 3927532, 3960811, 3946800, 3993621, 4020917, 3991967, 4039425, 4058193, 4025124, 4058059, 4086528, 4147746, 4193031, 4158120, 4166630, 4213228, 4241578, 4340705, 4383405, 4435343, 4447240, 4471894, 4494520, 4548227, 4617697, 4667685, 4702471, 4697192, 4712019, 4798457, 4845003, 4921411, 4945705, 4973898, 4986671, 5035709, 5021336, 5064441, 5088675, 5175306, 5236502, 5300814, 5367068, 5388540, 5494060, 5546163, 5649379, 5664187, 5751339, 5763311, 5702523, 5863071, 5964522, 5976574, 6032702, 6120129, 6231881, 6275786, 6358550, 6406497, 6472175, 6520009, 6543311, 6657926, 6734259, 6771760, 6806867, 6841350, 6873663, 6914711, 7002790, 7061999, 7128213, 7156187, 7298648, 7378532, 7536292, 7593796, 7748545, 7896591, 7979796, 8075879, 8186488, 8362618, 8494491, 8637557, 8793040, 8932036]
4216H932036J25468J00973J48731J80463Q5230J30678J26359P6204J23125R9143
4206A0128410O5648P7964R3115p404J40615J34637M0891N9093O2182R7152K1152
4195A0913455J03658J50063J70036J38395J29856J98826J88906J55842J16142
4186A2265179K37525K25822K19338J60449J92087L37523K87927L14536K83539
4177A4523925L35637K83106K74299K76959L20563L43696K95848L81431L96981
4168A7432445L83793M20165M19538L53441L96538N65384M64306M27866M76724
4159B1340200N58674N49723O25260N73663N82768O35538O67657O60025P31933
4150B6925441Q42429P66694Q00881Q59861Q34612R36383J006924J058492J130482
$$ y = [8932036, 9057504, 9158477, 9307208, 9487671, 9572901, 9703579, 9829938, 9906142, 10029267, 10128410, 10194058, 10272022, 10365137, 10357733, 10498348, 10632985, 10673876, 10732969, 10795151, 10892303, 10913455, 11017113, 11167176, 11337212, 11475607, 11605463, 11804289, 11993195, 12149037, 12265179, 12502704, 12728526, 12947864, 13108313, 13300400, 13637923, 13925850, 14240386, 14523925, 14859562, 15142668, 15416967, 15693926, 16014489, 16358185, 16654033, 17035464, 17432445, 17816238, 18236403, 18655941, 19009382, 19405920, 19971304, 20435610, 20863476, 21340200, 21898874, 22448597, 23073857, 23647520, 24230288, 24865826, 25533483, 26193508, 26925441, 27767870, 28534564, 29335445, 30195306, 31029918, 31966301, 32973225, 34031717, 35162199]
4141C5162199J158008J190012J216356J282680J337310J398433J458885J562971
4133D5766854J652549J732747J897806J935964K053335K209763K387304K515325
4125F2151647K694962K853192L113975L455792L579161L873268M195543M490443
4117I0407983M792176M915786M946070M985637M989854N109366N008576N015454
4109A30170902N160591N229704N303109N328632N453788N588949N695798N818201
4101A73749674N818167N561597N081906M676243M169185L968215L858859L511860
4093B10395706K545884J126353n09781k104392l715925n716454p973542r846211
4085A84201638j1013524j1144759j0629268r888989r064033q254958p493640o835934
$$ y = [35162199, 36320207, 37510219, 38726575, 40009255, 41346565, 42744998, 44203883, 45766854, 47419403, 49152150, 51049956, 52985920, 55039255, 57249018, 59636322, 62151647, 64846609, 67699801, 70813776, 74269568, 77848729, 81721997, 85917540, 90407983, 95200159, 100115945, 105062015, 110047652, 115037506, 120146872, 125155448, 130170902, 135331493, 140561197, 145864306, 151192938, 156646726, 162235675, 167931473, 173749674, 179567841, 185129438, 190211344, 194887587, 199056772, 203024987, 206883846, 210395706, 212941590, 214067943, 213558162, 211453770, 207737845, 202021391, 194047849, 184201638, 173188114, 162043355, 151414087, 141525098, 132461065, 124206107, 116712467, 109876533]
4077A09876533o138961n532973n009273m580451m023713l716102l315284l032473
4069G4527303k816861k555566k345957k196801j916538j715025j531387j440934
4061E8008234j325045j119297r81319q71960o71615n31574n26460m17384l09521
4052E1254059k78408j49528k2826m9703K1769J45001K87269K76698L22928M15868
4042E2223127M93864N27617N44712N71416O86575P88407P60561R41386J011634
4033E8549299J093808J013158O10221L44011L87302P36533R04764J183551J388405
4024F6211052J323233J048519N53757K88074L28592M46059P63854R18799M60353
4015G2342292m31138j596129k184691j847796j338804r48682q89643p67547n17932
$$ y = [109876533, 103737572, 98204599, 93195326, 88614875, 84591162, 80875060, 77559776, 74527303, 71710442, 69154876, 66808919, 64612118, 62695580, 60980555, 59449168, 58008234, 56683189, 55563892, 54582573, 53710613, 53038998, 52507424, 51980964, 51563580, 51254059, 50975651, 50826123, 50803297, 50753594, 50775363, 50920364, 51207633, 51484331, 51807259, 52223127, 52716991, 53244608, 53789320, 54360736, 55047311, 55835718, 56596279, 57537665, 58549299, 59643107, 60656265, 61266486, 61610497, 61997799, 62734332, 63639096, 64822647, 66211052, 67534285, 68582804, 69136561, 69424635, 69753227, 70199286, 70963140, 71881939, 72342292, 71911154, 70315025, 68130334, 66282538, 64943734, 63995052, 63105409, 62337862, 61819930]
4006F1819930l66978k08731m3403J26376J81669K59871L75106L70592M14043N08687
3996F3437162M34631M84324N06463M93416O07474N06335M63691M88094M61182
3987F7882772M62856K71983K94141L25048L53977K93397K39260L16376K52852
3978G0692662K96155K16935J11366J04588J80623J04202R8474Q2331J02306P3089
3968G2062731J03115Q1416R1549J45412K03076K23257K52826K92506L66893M13537
3958G4236318M33561N59968O29240P40131R53333R57704J065191J161648J338613
3949H2075707J535988J645890J867256J975608K234121K406621K742011L063733
3941I9546935L321117L413559L615555L691863L742144L781152L843725L882206
$$ y = [61819930, 61452952, 61244221, 61200818, 61327194, 61508863, 61768734, 62143840, 62514432, 62928475, 63437162, 63871793, 64356117, 64862580, 65355996, 65963470, 66469805, 66933496, 67421590, 67882772, 68345628, 68617611, 68911752, 69236800, 69590777, 69884174, 70123434, 70439810, 70692662, 70988817, 71205752, 71317118, 71421706, 71602329, 71706531, 71805005, 71887336, 71989642, 72062731, 72165846, 72247262, 72338811, 72484223, 72687299, 72910556, 73163382, 73455888, 73822781, 74236318, 74669879, 75229847, 75859087, 76599218, 77552551, 78510255, 79575446, 80737094, 82075707, 83611695, 85257585, 87124841, 89100449, 91334570, 93741191, 96483202, 99546935, 102868052, 106281611, 109897166, 113589029, 117331173, 121112325, 124956050, 128838256]
3933A28838256M065268M002767M108118M314612M319210M409794M596764M772631
3925A63427420M810644M779924M533164L936666L530198L196053L186784L038384
3917A94439237K625810J642787K04645j355972k696655m085269n970478q181261
3909A76622844j0027677j0658116j0434966r813750r194039q358780p669301o869076
3901A03597139o300455n624580n200717m846949m389521m149835l871036l538170
3893F5675876l294267l020436k714597k504141k378610k291398k092938j894470
3885D5485019j804532j611552j606041j568968j454786j335052j295865j218765
3877C3589458j141681j007379q96712q83651r28885q20803o95428o78466p02361
$$ y = [128838256, 132903524, 136906291, 141014409, 145329021, 149648231, 154058025, 158654789, 163427420, 168238064, 173017988, 177551152, 181487818, 185018016, 188214069, 191400853, 194439237, 197065047, 198707834, 198912479, 197556507, 194859852, 190774583, 184804105, 176622844, 166595167, 155937051, 145502085, 135688335, 126494296, 118135516, 110466215, 103597139, 97296684, 91672104, 86471387, 81624438, 77234917, 73085082, 69214046, 65675876, 62381609, 59361173, 56646576, 54142435, 51763825, 49472427, 47379489, 45485019, 43680487, 42068935, 40462894, 38893926, 37439140, 36104088, 34808223, 33589458, 32447777, 31440398, 30543686, 29660035, 28731150, 27910347, 27214919, 26536453, 25834092]
3868B5834092o41139n28311n82961n48891m56027l73051m00124m69260n06869
3859B1327459m08925l83306l09745k75172l23368l28968j98849k58950l00858
3850A8539318k58169k14616k27109k70830k24520k23212j77294j72606j50193
3841A6620769j47540j66995j50185p7067j78047j53909j59173j55358j41575j19578
3831A5171342j28486j47811o4431j09756q0360l4066j17860p3373K1607J2734
3821A4449540L2334O655R807N690J0007j730N930N4548N3998K0020O8239M3064
3809A4758102P6032J58646N5015Q5820J28945R5436Q0957J61256Q2758J35885
3799A5818852J89093J19853R5178J42577J56184J82547J78150J00729J72202J73371
$$ y = [25834092, 25192953, 24664642, 24081681, 23532790, 23076763, 22703712, 22303588, 21834328, 21327459, 20918534, 20535228, 20225483, 19950311, 19626943, 19297975, 19099126, 18840176, 18539318, 18281149, 18066533, 17839424, 17568594, 17344074, 17120862, 16943568, 16770962, 16620769, 16473229, 16306234, 16156049, 16078982, 15900935, 15747026, 15587853, 15432495, 15290920, 15171342, 15042856, 14895045, 14830614, 14720858, 14640498, 14606432, 14488572, 14415199, 14436806, 14449540, 14481874, 14488529, 14498336, 14504026, 14514033, 14512303, 14518233, 14572781, 14626779, 14646799, 14715038, 14758102, 14834134, 14992780, 15047795, 15133615, 15262560, 15357996, 15438953, 15600209, 15682967, 15818852, 16007945, 16127798, 16222976, 16365553, 16521737, 16704284, 16882434, 16983163, 17155365, 17328736]
3789A7328736K17024K10301K09460K36528J61536J94356L29275K37552L07378
3780A9432146K94108K46994L68434K68773J74881K31688K21683Q0710K20664J60137
3770B1700218J80911J19179l298m5057k49525l07098l56320m84041n47958p04780
3760A9302231p45866p22527p48205o01297o55123n90563n68450m12240l70443
3751A3887517l79840l92629l38033j88439k00337k27975k31140k82859j47525
3742A1498740j22158p7707j05476q5226j03268j20625r3507q5902n1714q0083
3732A0573074m0996l964o3216r0649o7541j070p4531q2752j38539n2815k4798
3721I932203j83643j70494j58062j17027k07718j79966j76155j38621p2858r6418
$$ y = [17328736, 17545760, 17756061, 17965521, 18202049, 18363585, 18557941, 18887216, 19124768, 19432146, 19726254, 19973248, 20341682, 20610455, 20785336, 21017024, 21238707, 21319417, 21540081, 21700218, 21881129, 22000308, 21997010, 21951953, 21702428, 21395330, 21039010, 20554969, 20007011, 19302231, 18556365, 17833838, 17085633, 16484336, 15829213, 15238650, 14670200, 14257960, 13887517, 13507677, 13115048, 12777015, 12588576, 12388239, 12160264, 11929124, 11646265, 11498740, 11376582, 11298875, 11193399, 11108173, 11004905, 10884280, 10790773, 10704871, 10653157, 10573074, 10532078, 10528114, 10464898, 10374249, 10306708, 10305638, 10231107, 10148355, 10009816, 9957001, 9932203, 9748560, 9578066, 9420004, 9302977, 9095259, 8915293, 8739138, 8600517, 8527659, 8431241]
3711H431241j23356k1218r2906j12460n5427r2743r900l758j523m2916q6042j16010
3699G672982R686J04092j24993q603R3997J22769k0263l606L5477m9294M5406
3688G877650J00414P5837O7272J59665m123O0034J44390J46168K1218O8508J06405
3677H823438J33933J00174O1648J85650Q5274O5258Q5602J31795O0834N8455N6380
3666I848441R9744P3513Q3161L8648M9416k479j6376N3283j0298k8907J4555l8509
3654A0164192J2885j2173K196M0861o9349r9667q4537n0458j0060m9739Q427k3235
3642I829343k8718k334k7183J5561m4755j12298n0836P136m4010k9524l1359M3440
3630I524463l2235p041M8304j7193L6907j2697J0209j6198l5581L1732M2995k5676
$$ y = [8431241, 8307885, 8286667, 8193761, 8081301, 8025874, 7933131, 7923231, 7919473, 7917950, 7875034, 7788992, 7672982, 7682668, 7786760, 7661767, 7653164, 7747161, 7869930, 7849667, 7846061, 7881538, 7832244, 7877650, 7978064, 8053901, 8121173, 8280838, 8276715, 8336749, 8481139, 8627307, 8648525, 8717033, 8823438, 8957371, 9057545, 9119193, 9304843, 9390117, 9455375, 9540977, 9672772, 9733606, 9792061, 9848441, 9948185, 10021698, 10104859, 10143507, 10192923, 10190444, 10174068, 10227351, 10217053, 10188146, 10202701, 10164192, 10177077, 10164904, 10167100, 10207961, 10138612, 10038945, 9954408, 9903950, 9893890, 9844151, 9852578, 9829343, 9800625, 9798291, 9771108, 9786669, 9741914, 9629616, 9578780, 9585916, 9541906, 9512382, 9481023, 9524463, 9492228, 9485187, 9533491, 9516298, 9553205, 9540508, 9550717, 9534519, 9498938, 9530670, 9573665, 9547989]
3618I547989m8336N9337M0104M9220k1381r47J0323o352J6736K4719O4774L3285
3606I769471L0441K1707J07320O1190M2295L9752J01377Q7396J41356R2933K6045
3595A0521283J24791J13745M7003P7732J46892J23220R8051M3610J06966J11219
3585A1514512P2746J37106N2833O8864J95893Q5107L2027Q8308J14245J23996
3575A2485637J22264J86947J78540J00465K00265J55660J61158J79114J67128
3566A3937178J21038J68360J67028K18035L15198J71376K27872K77589K55219
3557A5858893J82363K97315L50844K72501L39020L45454L47713L30313M13182
3548A8737598L48228L53889L70597M02490L41266L98728M24259M17881L80185
$$ y = [9547989, 9499653, 9558990, 9599094, 9648314, 9626933, 9625986, 9636309, 9629957, 9646693, 9671412, 9736186, 9769471, 9799912, 9821619, 9928939, 9990129, 10032424, 10072176, 10173553, 10260949, 10402305, 10495238, 10521283, 10646074, 10759819, 10806822, 10884554, 11031446, 11154666, 11252717, 11296327, 11403293, 11514512, 11587258, 11724364, 11777197, 11846061, 12041954, 12127061, 12159088, 12247396, 12361641, 12485637, 12607901, 12794848, 12973388, 13073853, 13274118, 13429778, 13590936, 13770050, 13937178, 14058216, 14226576, 14393604, 14611639, 14926837, 15098213, 15326085, 15603674, 15858893, 16041256, 16338571, 16689415, 16961916, 17300936, 17646390, 17994103, 18324416, 18737598, 19085826, 19439715, 19810312, 20212802, 20554068, 20952796, 21377055, 21794936, 22175121]
3539B2175121L80414M49375M10054L48309L49815L17854M19109L86802K53933
3530B5490786L57780L08178L56275L60240K99493K57040K90586L14693K69068
3521B8304139K51713K82154L79690L49078L13367L19412L77537L82307M11673
3512C1371070M34600M52134M61333N22732N48007N99364O23608P02904O74637
3503C6390389P48010P97665P43306R09008R26748R95882J019690R97742J038856
3494D4567296J073955J064401J141593J161043J157834J152079J167296J183729
3486E3669226J135033J060107J112303J060242R71901R94977Q77079Q07088Q56176
3477F2544132P71510P41731O96484O11549N21690N05106M47061M18036M17733
$$ y = [22175121, 22555535, 23004910, 23414964, 23763273, 24113088, 24430942, 24850051, 25236853, 25490786, 25848566, 26156744, 26513019, 26873259, 27172752, 27429792, 27720378, 28035071, 28304139, 28555852, 28838006, 29217696, 29566774, 29880141, 30199553, 30577090, 30959397, 31371070, 31805670, 32257804, 32719137, 33241869, 33789876, 34389240, 35012848, 35715752, 36390389, 37138399, 37936064, 38679370, 39588378, 40515126, 41511008, 42530698, 43528440, 44567296, 45641251, 46705652, 47847245, 49008288, 50166122, 51318201, 52485497, 53669226, 54804259, 55864366, 56976669, 58036911, 59008812, 60003789, 60880868, 61687956, 62544132, 63315642, 64057373, 64753857, 65365406, 65887096, 66392202, 66839263, 67257299, 67675032]
3468F7675032K85236K65267K99558J84216N9818O2766J38457Q6990K4473j7279
3458F9064534n4356j20226j60843k57232l31120k55007l25999m96881n64584m75466
3448F6022820o64478o79063o48740p13223p80223p93133q18426r32717r34649
3439E9058168r90169r28946j046617r81015r95987j100712j138481j148046j093274
3430D9634921j131570j148918j045967j083918j099128r91598q70370q45028q65133
3421D0553291p47291o17677o81105o35639m51147m89358l93477k40903l14958
3412C5981736k58387j73532j73812j32581k6992o5481k6981Q9236L8153M6651
3402C5298010O6516J23591J89247R4652J73249J87311J57573J27319J29998K11556
$$ y = [67675032, 67960268, 68225535, 68525093, 68709309, 68769127, 68831893, 68970350, 69057340, 69081813, 69064534, 69010178, 68889952, 68729109, 68471877, 68140757, 67885750, 67559751, 67062870, 66498286, 66022820, 65358342, 64679279, 64030539, 63317316, 62537093, 61743960, 60925534, 59992817, 59058168, 58067999, 57139053, 56092436, 55111421, 54115434, 53014722, 51876241, 50728195, 49634921, 48503351, 47354433, 46308466, 45224548, 44125420, 43133822, 42263452, 41418424, 40553291, 39806000, 39188323, 38507218, 37871579, 37420432, 36931074, 36537597, 36296694, 35981736, 35723349, 35549817, 35376005, 35243424, 35216432, 35150951, 35123970, 35213206, 35251359, 35298010, 35364526, 35488117, 35677364, 35772016, 35945265, 36132576, 36290149, 36417468, 36547466, 36759022]
3392C6759022J83315K47800J46573J80576J60635K44185K08616K42734K53638
3383C8627094K57417K14463K45161L33151K71778K45513L30004K69229K47903
3374D1041713M74567K94453L63139L01492K40805L83879L34291K94281K84826
3365D4013446K99037K54396K00356J74334J64241Q9721J26580K8199P2253O5805
3355D5488368N2378N2392M6760R6518R3181J56988K19702J86150L09229L31686
3345D7033352L82443M24483M07726N92560O21060O66852O98228Q16455P10869
3336E2354028Q67495R28934R48401J109646J090713J065858J159024J244704J261109
3327F2029912J253653J241553J267706J305122J345607J448309J394504J310049
$$ y = [36759022, 36942337, 37190137, 37336710, 37517286, 37677921, 37922106, 38130722, 38373456, 38627094, 38884511, 39098974, 39344135, 39677286, 39949064, 40194577, 40524581, 40793810, 41041713, 41516280, 41810733, 42173872, 42475364, 42716169, 43100048, 43434339, 43728620, 44013446, 44312483, 44566879, 44767235, 44941569, 45105810, 45195531, 45322111, 45350310, 45422563, 45488368, 45540746, 45593138, 45639898, 45736416, 45829597, 45986585, 46206287, 46392437, 46701666, 47033352, 47415795, 47840278, 48248004, 48840564, 49461624, 50128476, 50826704, 51643159, 52354028, 53221523, 54150457, 55098858, 56208504, 57299217, 58365075, 59524099, 60768803, 62029912, 63283565, 64525118, 65792824, 67097946, 68443553, 69891862, 71286366, 72596415]
3319G2596415J306738J285213J276982J266779J230832J161287J104082J110448
3311H2338776J100481R18286Q72814Q48175P85181O88009O49228O70254O53719
3302H9524923N89759N58553O09175O64926P12784Q03871Q39930R66460J109467
3293I6379848J233207J364987J502013J604112J813301K001114K096286K242825
3285A10237693K375545K496230K582884K663202K765091K880303K988868K961317
3277A31951133L057168L116601L068658L053533K948571K927301K851073K653543
3269A55627581K542142K375502K182800J923191J768198J447476J239662R13646
3261A70020198O67830M04682K11811j8438k11252k51135k83097l55833k70950
$$ y = [72596415, 73903153, 75188366, 76465348, 77732127, 78962959, 80124246, 81228328, 82338776, 83439257, 84357543, 85230357, 86078532, 86863713, 87551722, 88200950, 88871204, 89524923, 90114682, 90673235, 91282410, 91947336, 92660120, 93463991, 94303921, 95270381, 96379848, 97613055, 98978042, 100480055, 102084167, 103897468, 105898582, 107994868, 110237693, 112613238, 115109468, 117692352, 120355554, 123120645, 126000948, 128989816, 131951133, 135008301, 138124902, 141193560, 144247093, 147195664, 150122965, 152974038, 155627581, 158169723, 160545225, 162728025, 164651216, 166419414, 167866890, 169106552, 170020198, 170688028, 171092710, 171304521, 171286083, 171074831, 170823696, 170540599, 170184766, 169913816]
3252A69913816j57211j34432M670J91565M55953O49432Q26748J033423J284305
3243A74068269J435994J748277J881959K066402K231115K375497K429527K520302
3235A90757342K621706K669530K765952K883591K863849K995232K955946L000619
3227B13513767L068814K991446K947600K959645K908358K838063K665074K579350
3219B36472117K358303K095745J857595J557015J198768Q10866M87887J01613
3211B46939909l30315o44263j011947j369439j671641k021203k293405k593538
3203B35004158k858478l167432l446025l651607l851954m142449m275629m451908
3195B05158676m630299m539892m706171m758577m678490m606310m607378m536239
$$ y = [169913816, 169756605, 169622173, 169626843, 169818408, 170274361, 170923793, 171750541, 172783964, 174068269, 175504263, 177252540, 179134499, 181200901, 183432016, 185807513, 188237040, 190757342, 193379048, 196048578, 198814530, 201698121, 204561970, 207557202, 210513148, 213513767, 216582581, 219574027, 222521627, 225481272, 228389630, 231227693, 233892767, 236472117, 238830420, 240926165, 242783760, 244340775, 245539543, 246350409, 246838296, 246939909, 246609594, 245965331, 244953384, 243583945, 241912304, 239891101, 237597696, 235004158, 232145680, 228978248, 225532223, 221880616, 218028662, 213886213, 209610584, 205158676, 200528377, 195988485, 191282314, 186523737, 181845247, 177238937, 172631559, 168095320]
3187A68095320m403115m370281m423481m338960m323988m407827m386928m403892
3179A33036848m421269m381430m253567m154791l938640l832161l668136l409092
3171A00977762l179958l116668k893262k726114k557160k412466k306247k208764
3163G9577123k086168j862082j788269j775151j639098j471525j452042j389044
3155F6113744j294945j233685j176685j140978j071752j008280r92463r43534
3147E7251422r13802q83056q53573p86798p37672o55338o65318o48432o49301
3138E0458132n96273m71426n32697m69525n10483m78281m42378m01745l20706
3129D6234618l45466l30324j87423l35066k90702k12379k08729j35204k12551
$$ y = [168095320, 163692205, 159321924, 154898443, 150559483, 146235495, 141827668, 137440740, 133036848, 128615579, 124234149, 119980582, 115825791, 111887151, 108054990, 104386854, 100977762, 97797804, 94681136, 91787874, 89061760, 86504600, 84092134, 81785887, 79577123, 77490955, 75628873, 73840604, 72065453, 70426355, 68954830, 67502788, 66113744, 64818799, 63585114, 62408429, 61267451, 60195699, 59187419, 58194956, 57251422, 56337620, 55454564, 54600991, 53814193, 53076521, 52421183, 51755865, 51107433, 50458132, 49861859, 49390433, 48857736, 48388211, 47877728, 47399447, 46957069, 46555324, 46234618, 45889152, 45558828, 45371405, 45036339, 44745637, 44533258, 44324529, 44189325, 43976774]
3120D3976774j46872j50654o5097k5250j02746K7617k9381j0784N6292J5654k0708
3109D3524845j193J15453Q3684j3535J12017J59961J05141J18002J66016K27930
3099D4598321K20117K05914L35769L74630M10501L96503N19305N91156P05332
3090D8357548O78957P04173Q09044Q43031R67722J108493J115031J119181J244758
3081E6947938J353407J360307J483040J555905J632328J741353J737119J989897
3073F9801294J912664J936800K016905K054957K113198K179048K172250K214806
3065H6401922K192682K206939K192739K202832K164541K096246J974029J883091
3057A03315021J707371J605015J450427J257765R07109O88217M36801O9043k97650
$$ y = [43976774, 43829902, 43679248, 43614151, 43588901, 43486155, 43513772, 43484391, 43473607, 43529899, 43545553, 43524845, 43523652, 43639105, 43722789, 43709254, 43821271, 43981232, 44086373, 44204375, 44370391, 44598321, 44818438, 45024352, 45360121, 45734751, 46145252, 46541755, 47061060, 47652216, 48357548, 49036505, 49740678, 50549722, 51392753, 52360475, 53468968, 54583999, 55703180, 56947938, 58301345, 59661652, 61144692, 62700597, 64332925, 66074278, 67811397, 69801294, 71713958, 73650758, 75667663, 77722620, 79835818, 82014866, 84187116, 86401922, 88594604, 90801543, 92994282, 95197114, 97361655, 99457901, 101431930, 103315021, 105022392, 106627407, 108077834, 109335599, 110242708, 110930925, 111367726, 111436769, 111139119]
3048A11139119n74236q95178j267959j618629j960590k170837k541825k746671
3040I7363194l006176l143988l232452l237502l301636l246822l205887l163303
3032G1825428l062770k940596k709287k619374k459901k365220k171132k050016
3024E1447132j863938j773583j637209j606075j432745j333538j230680j151198
3016C9418166j099163j022050r69470q24765q44359q13650p34614p00135o15850
3007C1794110o01877n54418n23503n41502n02366m94516l35538l38160m04131
2998B7498099m13046l29874m36977l10612k54168k21541l07322l16194k43316
2989B4665049k49597k82849l44415k07732k11187l10515k92906l36117k46293
$$ y = [111139119, 110564883, 109669705, 108401746, 106783117, 104822527, 102651690, 100109865, 97363194, 94357018, 91213030, 87980578, 84743076, 81441440, 78194618, 74988731, 71825428, 68762658, 65822062, 63112775, 60493401, 58033500, 55668280, 53497148, 51447132, 49583194, 47809611, 46172402, 44566327, 43133582, 41800044, 40569364, 39418166, 38319003, 37296953, 36327483, 35502718, 34658359, 33844709, 33110095, 32409960, 31794110, 31192233, 30637815, 30114312, 29572810, 29070444, 28575928, 28240390, 27902230, 27498099, 27085053, 26755179, 26318202, 26007590, 25753422, 25531881, 25224559, 24908365, 24665049, 24415452, 24132603, 23788188, 23580456, 23369269, 23058754, 22765848, 22429731, 22183438]
2980B2183438k93432k90825k16897k72576k82274k15168k35512k51351j26215
2971A9999188j84512j90074j67819j38485j39826j04990j21860j42588m2458r0548
2961A8676028l3540p7742k5900j2903j8249l289n2817R851M051M212M2135O5470
2949A8577307O7282L3149L564n788M5900R1535K1997P0763J02502K8226J64070
2938A9200507R5855R0352J58764J28749R0795J34043K29780J80852J68759J55318
2928B0633774J38502J74267K10420J56415J52191K24303K63167K12089J58979
2919B2324107J60857K23356J91751K52065K08003J55299J70567K74762K56482
2910B4217249K02554J97239K48847J81419K01613K79282K90423L00595J99867
$$ y = [22183438, 21890006, 21599181, 21382284, 21109708, 20827434, 20612266, 20376754, 20125403, 19999188, 19814676, 19624602, 19456783, 19318298, 19178472, 19073482, 18951622, 18809034, 18766576, 18676028, 18642488, 18564746, 18538846, 18525943, 18507694, 18504405, 18451588, 18461439, 18465490, 18469702, 18511837, 18577307, 18644589, 18677738, 18681302, 18675514, 18721414, 18812949, 18834946, 18905709, 19008211, 19036437, 19200507, 19296362, 19386714, 19545478, 19674227, 19765022, 19899065, 20128845, 20309697, 20478456, 20633774, 20772276, 20946543, 21156963, 21313378, 21465569, 21689872, 21953039, 22165128, 22324107, 22484964, 22708320, 22900071, 23152136, 23360139, 23515438, 23686005, 23960767, 24217249, 24419803, 24617042, 24865889, 25047308, 25248921, 25528203, 25818626, 26119221, 26319088]
2901B6319088L54258L37637L38642L07293L29117L74872L81020M67173M80460
2892B9689560M61273M50968M30998M89184O23147N07556N06850O26831N89835
2883C4376202O63912O84975O40481O77379O50312Q13981P70498Q11113Q05425
2874D0894278Q17904P81008Q72390Q69219J031174R41812R06910J065952J097392
2865D9278039J086080J174906J167070J103518J258357J262707J308344J323123
2857E8962144J396237J534701J563728J562590J653494J806444J886867J893554
2849G2259759K036215K139400K119592K274904K392421K477926K529431K619632
2841I0849280K829549K960266L075582L261294L468585L508080L824624M061256
$$ y = [26319088, 26673346, 27010983, 27349625, 27656918, 27986035, 28360907, 28741927, 29209100, 29689560, 30150833, 30601801, 31032799, 31521983, 32145130, 32652686, 33159536, 33786367, 34376202, 35040114, 35725089, 36365570, 37042949, 37693261, 38507242, 39277740, 40088853, 40894278, 41712182, 42493190, 43365580, 44234799, 45265973, 46207785, 47114695, 48180647, 49278039, 50364119, 51539025, 52706095, 53809613, 55067970, 56330677, 57639021, 58962144, 60358381, 61893082, 63456810, 65019400, 66672894, 68479338, 70366205, 72259759, 74295974, 76435374, 78554966, 80829870, 83222291, 85700217, 88229648, 90849280, 93678829, 96639095, 99714677, 102975971, 106444556, 109952636, 113777260, 117838516]
2833A17838516M342895M554937M888277N241867N620401O098561O439363O935258
2825A61960075P340256P590752Q037105Q217571Q400784Q523494Q476309Q558770
2817B27105116Q648060Q617959Q711654Q774408Q884885Q840900Q846578Q866364
2809B97295924Q751232Q435530Q044736P491321O738524N898390M962967L784988
2801C51403612K405648O30839j357147l675120o104032q566698j0921054j2806863
2793C11009185j4184822j4920675j5031314j4677853j3964539j3196545j2434811
2786B12598626j1496795j0616007r833436r160155q468758p921508p326547o779601
2778A40995819o303193n908158n569440n254255m994004m754485m472964m267355
$$ y = [117838516, 122181411, 126736348, 131624625, 136866492, 142486893, 148585454, 155024817, 161960075, 169300331, 176891083, 184928188, 193145759, 201546543, 210070037, 218546346, 227105116, 235753176, 244371135, 253082789, 261857197, 270742082, 279582982, 288429560, 297295924, 306047156, 314482686, 322527422, 330018743, 336757267, 342655657, 347618624, 351403612, 353809260, 354440099, 353082952, 349407832, 343303800, 334737102, 323816048, 311009185, 296824363, 281903688, 266872374, 252194521, 238229982, 225033437, 212598626, 201101831, 190485824, 180652388, 171492233, 163023475, 155101967, 147775420, 140995819, 134692626, 128784468, 123215028, 117960773, 112966769, 108212284, 103739320, 99471965]
2770I9471965l991185l818207l602724l388119l196512k944946k777931k583044
2762G3169297k543384k324625k221775k154567j920502j823445j734380j683881
2754E6762738j547751j538383j486164j432309j345975j299691j316515j351682
2746D5444268j206816j151356j175531j160696j060143j092545r94635r79539
2738C6623007j004417q85868r56854q93057q47001q42161q21976p69600q35062
2729B8767011q39582p23308p74368o94121o85278o46123p15777o19881n31724
2720B2536849n89661n62533n78378m86154n11389m17839l80904m52101m50418
2711A8107472l66110m38796l31927l58405l80004k62818l63203l02142k48536
$$ y = [99471965, 95480780, 91662573, 88059849, 84671730, 81475218, 78530272, 75752341, 73169297, 70625913, 68301288, 66079513, 63924946, 62004444, 60180999, 58446619, 56762738, 55214987, 53676604, 52190440, 50758131, 49412156, 48112465, 46795950, 45444268, 44237452, 43086096, 41910565, 40749869, 39689726, 38597181, 37602546, 36623007, 35618590, 34732722, 33775868, 32882811, 32035810, 31193649, 30371673, 29602073, 28767011, 27927429, 27204121, 26429753, 25735632, 25050354, 24404231, 23688454, 23068573, 22536849, 21947188, 21384655, 20806277, 20320123, 19808734, 19390895, 19009991, 18557890, 18107472, 17741362, 17302566, 16970639, 16612234, 16232230, 15969412, 15606209, 15304067, 15055531]
2702A5055531l03085l29664l90962k49188k67258l28014k76304k21192k45357
2693A2444507k67106k28716k38764k22480k19207j16267k50945k11396k46526
2684A0443100j42349j53536j91544j13074j47882k12224j16909j48565r8667j51002
2674H967348j84345j26903o6629q8524j05425r1055j02989j16881l9681p2096
2664G972820o6028m9977p5080j37490q7586n0326j33622q2749j11073l7955r7879
2653G043055n8315j21773p3645q4023k14896r4031n3149j18163n9379o1812n8262
2642F045607l1454m6132q4694k4208r6104m5318j15505l0719l9306o1824m7609
2631E422734j09144p2786j11265m3832j3436q9784k7697l3330l9571m5198p3293
$$ y = [15055531, 14752446, 14422782, 14031820, 13782632, 13515374, 13187360, 12911056, 12689864, 12444507, 12177401, 11948685, 11709921, 11487441, 11268234, 11151967, 10901022, 10689626, 10443100, 10300751, 10147215, 9955671, 9842597, 9694715, 9482491, 9365582, 9217017, 9118350, 8967348, 8783003, 8656100, 8589471, 8500947, 8395522, 8304467, 8201478, 8084597, 8044916, 7972820, 7906792, 7856815, 7781735, 7644245, 7556659, 7506333, 7372711, 7289962, 7178889, 7140934, 7043055, 6984740, 6862967, 6789322, 6705299, 6490403, 6396372, 6343223, 6225060, 6165681, 6103869, 6045607, 6014153, 5968021, 5883327, 5859119, 5763015, 5717697, 5602192, 5571473, 5532167, 5470343, 5422734, 5313590, 5240804, 5129539, 5085707, 5072271, 4982487, 4954790, 4921460, 4881889, 4836691, 4763398]
2620D763398k5167m7582o4079m5920n9042k0851n7012m8983l8557o7295j07946
2609D180964m5534J4781l279j38129q6182m8273q743o2615k8125q5132m7387m7168
2597C595178k7093l0950m0584l5894m3074m4914q2260J0l3072m7963J9398k2125
2585C206657q2208k7692J1577L6126l4134n6946j7573k5032o8454n0011K7460
2574B919770K8444L4201K4714p8609k3377M0792j1301l9375o044k7372J6183k7597
2562B850429n8017j8994L2778O6418K6119o8005m4183j461L9275p377l8617j2020
2550B766345k6056K7543P883K2844m526N6240R6601n9924k9011M5815L5344K1234
2538B960332K5582K9336R4705j9496L8825J9513j918O7696L4008J3303J4917M7181
$$ y = [4763398, 4738231, 4690649, 4626570, 4580650, 4521608, 4500757, 4443745, 4394762, 4356205, 4288910, 4180964, 4135430, 4150211, 4146932, 4008803, 3922621, 3874348, 3865605, 3802990, 3774865, 3689733, 3642346, 3595178, 3568085, 3537135, 3496551, 3460657, 3417583, 3372669, 3290409, 3290419, 3257347, 3209384, 3228782, 3206657, 3124449, 3096757, 3108334, 3144460, 3110326, 3053380, 3035807, 3010775, 2942321, 2892310, 2919770, 2948214, 2982415, 3007129, 2928520, 2905143, 2945935, 2934634, 2895259, 2889215, 2861843, 2878026, 2850429, 2792412, 2773418, 2806196, 2872614, 2898733, 2830728, 2786545, 2785084, 2824359, 2816982, 2778365, 2766345, 2740289, 2767832, 2775715, 2798559, 2794033, 2850273, 2946874, 2886950, 2857939, 2903754, 2939098, 2960332, 2985914, 3015250, 3109955, 3090459, 3129284, 3148797, 3146879, 3214575, 3248583, 3261886, 3276803, 3323984]
2526C323984Q3658J8540L4199L2411Q1876N3523J2222k3919j8254k4033j3911
2515C560296j5957L0781q9558r9417n3820p7131r8056m2112r9721j31922o1842
2504B821541j3769o2423j7688j13902r5707j4767l9868n3199n4931o2401n7489
2493B235397l6453n2109n5406m6156j7252q9783r2291k410J5907l5221j4757j6070
2481A793396p007j1583m6833p5479j03411l095P342n9681M665n8269L201j7815
2469A425431R780n894k5978j0321K4144n2625k3100m990k0251J0920j319q902
2457A316895J3474J8085q546L3419o0981k4258J6748p7553m2212n8013j6427L7547
2445A148178M9711M8561P532j8207p976n0471l1313j2975m5694L53p181l8468
$$ y = [3323984, 3407642, 3426182, 3460381, 3492792, 3574668, 3628191, 3640413, 3616494, 3598240, 3574207, 3560296, 3544339, 3575120, 3485562, 3386145, 3332325, 3255194, 3157138, 3115026, 3015305, 2883383, 2821541, 2807772, 2745349, 2727661, 2613759, 2518052, 2503285, 2463417, 2410218, 2355287, 2292886, 2235397, 2198944, 2146835, 2091429, 2045273, 2028021, 1938238, 1845947, 1843537, 1859444, 1824223, 1809466, 1793396, 1786389, 1774806, 1727973, 1652494, 1549083, 1545988, 1553330, 1493649, 1498314, 1440045, 1443246, 1425431, 1435211, 1429317, 1403339, 1393018, 1417162, 1364537, 1341437, 1336447, 1316196, 1327116, 1325797, 1316895, 1330369, 1348454, 1339908, 1373327, 1312346, 1288088, 1304836, 1227283, 1185071, 1127058, 1110631, 1148178, 1197889, 1246450, 1253982, 1235775, 1227799, 1177328, 1146015, 1133040, 1087346, 1087699, 1080518, 1042050]
2433A042050m2900L6307j8800q2758L5514K2351J0495n1064J3058N6176o426q9734
2421I24269l0020l8457K397Q27k025m2754q376m800K8286k263q5669M2739N8638
2408H42792m7949l6759m0729J4646k7699m7706j9161j4110j9873p382M0253J9626
2396F55949K697Q511o8161k4109m1677M1696n0603l4235N813M5520P800J4098
2384E63299r010m1741J7229m1759n2796n8213N5549l3134O2079r913M222J5516
2372D71328J671L4684r0256j658N1340o200P046q4622J2656J5639M537L9994j8616
2359D37543O638N937J1774k3558j6350J1435L5217o4317n7235N8304R288j7294
2347C97382q117O3173p0017k5444K8722L1313J9308n7792q658L2563m3716k824
$$ y = [1042050, 999150, 1035457, 1016657, 933899, 969413, 991764, 1002259, 951195, 964253, 1020429, 1014003, 924269, 894249, 855792, 858189, 859016, 856991, 814237, 805861, 801061, 829347, 827084, 741415, 784154, 842792, 794843, 758084, 717355, 732001, 704302, 656596, 637435, 623325, 603452, 596070, 636323, 655949, 658646, 667157, 598996, 574887, 533210, 574906, 524303, 490068, 495881, 541401, 549201, 563299, 554289, 512548, 529777, 488018, 435222, 377009, 432558, 399424, 461503, 451590, 455812, 471328, 472999, 507683, 417427, 415769, 467109, 460909, 467955, 383333, 395989, 411628, 416165, 456159, 437543, 444181, 450118, 461892, 438334, 421984, 433419, 468636, 404319, 347084, 405388, 414676, 397382, 389265, 452438, 382421, 356977, 385699, 417012, 436320, 378528, 369870, 402433, 358717, 355893]
2335C55893P537m4434j2050R1437m5793M3726p1919P343M5300n2192N2174R898
2323C86920n4181R085n7051n5764l1228O4967R6286l622p1630P565j1075O6326
2311C46598n188M169l3555m6450k6671k7274L6622M6848J6165q7224K3442J0637
2299B58119m7920K795k749m8472M1536m7496M160M6410K2101K6349n1801m9594
2287A53438Q4832k8317m5664n3824K0999P741K1242Q0183M0281l9993l8804m7153
2275A54961l1960K8097M1420J5582N3059l7728m6883N608j4062N3852p98k9612
2263A91536L1181l7416M1350o22r6235j4137P4258j9891q388J9139J0528Q093
2251A99396j9559O234l1436O7910q584q3495N1971L4334m1538N136k6207J1454
$$ y = [355893, 363430, 318996, 306946, 398383, 352590, 396316, 324397, 331740, 377040, 324848, 377022, 386920, 332739, 341824, 284773, 229009, 197781, 262748, 359034, 355412, 283782, 291347, 280272, 346598, 341410, 345579, 312024, 265574, 238903, 211629, 248251, 295099, 311264, 224040, 247482, 258119, 210199, 212994, 210245, 161773, 203309, 155813, 159973, 206383, 228484, 254833, 203032, 153438, 238270, 209953, 164289, 110465, 131464, 139205, 160447, 240630, 280911, 240918, 202114, 154961, 123001, 151098, 192518, 208100, 261159, 223431, 176548, 182156, 168094, 221946, 221148, 191536, 222717, 185301, 226651, 226029, 129794, 115657, 189915, 170024, 161636, 180775, 191303, 199396, 179837, 186071, 154635, 222545, 213961, 130466, 182437, 216771, 175233, 180369, 154162, 165616]
2239A65616P3415m5377m5413K9860k7104j7849O0382j2199j4346r536O2792K79
2227B20520Q630k7579R740n059J6488l2198m6423m6524k5482O7581M4847o6414
2215A18127j7211j4558n031L5630J2248j2188j5950Q7894q803k4166p5580M2456
2203A22868R208J0837n0489L8180o396n7922N498M2962j483l4438J4223l470N3092
2190A42670L3468k3481m869J4256K5111l5774k6157M0188L3155o9504k6319K9223
2178A31967j9073L26J2535L6241k1798M3890J5869Q371n5970K9564O1634m5345
2166A98211n0498n8374Q2326Q970J0399j775m0445m2925J6025N9720L1376j03866
2154A09144L8531L3523l6412j3430M9894k7819L0329k111l5387P212N168K6583
$$ y = [165616, 239031, 193654, 148241, 178101, 150997, 133148, 193530, 181331, 166985, 157449, 220241, 220520, 229150, 201571, 211311, 206252, 222740, 190542, 144119, 97595, 72113, 139694, 184541, 118127, 100916, 86358, 81327, 116957, 129205, 117017, 101067, 188961, 180158, 155992, 80412, 122868, 132076, 142913, 92424, 130604, 124208, 66286, 71784, 114746, 113263, 78825, 93048, 89578, 142670, 176138, 152657, 147788, 162044, 187155, 151381, 125224, 165412, 198567, 129063, 102744, 131967, 112894, 113220, 125755, 161996, 140198, 184088, 199957, 208328, 152358, 181922, 243556, 198211, 147713, 89339, 171665, 180635, 191034, 189259, 148814, 105889, 121914, 181634, 213010, 109144, 147675, 181198, 144786, 131356, 181250, 153431, 183760, 181649, 146262, 153474, 158642, 185225]
2142A85225K2528k2738m3567L8196J7368O1011L8666j5178l3499K3579J4555L6805
2130C22951n1774K5211J0765J0496l9709j8776n819L8970K6314J3198J6399O8694
2118D16920j6808m856N867J5366j8380m6566J9388M7003k8703J2010Q398P4688
2106D84327J7485j1043K8575q0035M0384M4979L5218k6237O6416L0818k0487J9361
2094F29761m9874M7332O4278L2842k0469o191P3718M8034Q0039N4292K5362K9544
2082A008668k8902M2484R9915P0543P4051M4775J9192R3592O1246K3897J52323
2071A661784R7081R3146R6480R3425J05384K39357K14245K19221J67614J08276
2061C096013K06497J22631R7193J98137R6905J97934K27172J40276J63611J96198
$$ y = [185225, 207753, 185015, 141448, 179644, 197012, 258023, 296689, 281511, 248012, 271591, 286146, 322951, 271177, 296388, 307153, 317649, 277940, 259164, 253345, 292315, 318629, 331827, 348226, 416920, 400112, 395256, 401123, 416489, 398109, 351543, 370931, 417934, 389231, 401241, 409639, 484327, 501812, 490769, 519344, 439309, 479693, 524672, 559890, 533653, 600069, 630887, 610400, 629761, 579887, 627219, 691497, 724339, 703870, 697679, 771397, 819431, 899470, 953762, 979124, 1008668, 979766, 1022250, 1122165, 1192708, 1266759, 1311534, 1330726, 1424318, 1485564, 1509461, 1661784, 1758865, 1852011, 1948491, 2041916, 2147300, 2386657, 2600902, 2820123, 2987737, 3096013, 3302510, 3425141, 3522334, 3720471, 3817376, 4015310, 4242482, 4382758, 4546369, 4742567]
2051D742567J56224J83901K18803J44962M9101J16359J44884J29974J68653k2245
2041F033183o8059k07600k95212m50544o33720m63735l94323m02060l63356k31173
2031B523401j31492j93608j76607j21248j46369o8435q7717r2750j19235n7800
2021A328140p2595r9519j24596q6583k6299k2693p0799N3551o4978j19714J0557
2010G04472k223m3766l6149l5323l6461J8136q0338k2181O318K2244j6297k6415
1998D52017j3162k6276K052k2288j5985J482k9448j7719m6879N7387o084j00463
1986B34634m484J0779m4565K3009P376j5266K5898J5343J804L7339j09577q1069
1974A01221L6412P5713l6631Q205q0870O0182P1673m5272j5718m8476K2530j811
$$ y = [4742567, 4898791, 5082692, 5301495, 5446457, 5495558, 5611917, 5756801, 5886775, 6055428, 6033183, 5965124, 5757524, 5462312, 5011768, 4378048, 3914313, 3519990, 3117930, 2754574, 2523401, 2391909, 2198301, 2021694, 1900446, 1754077, 1685642, 1597925, 1505175, 1385940, 1328140, 1255545, 1156026, 1031430, 944847, 918548, 895855, 825056, 878607, 813629, 693915, 704472, 702249, 658483, 622334, 587011, 550550, 568686, 488348, 466167, 472485, 494729, 478432, 452017, 438855, 412579, 414631, 392343, 376358, 377840, 348392, 330673, 283794, 341181, 335097, 234634, 230150, 240929, 196364, 219373, 226749, 211483, 237381, 252724, 254528, 291867, 182290, 101221, 137633, 213346, 176715, 184920, 104050, 164232, 235905, 190633, 174915, 126439, 148969, 147158]
1962A47158M0368m3039l0972N6879j9887o5949j4686K2093n4075J1794M1677o144
1950H5217L2768R741l1852J875K1049q8119k7299L6128r7816L0022N8026L8533
1938F8273l6849P5479R1107p2793m2526J1612l7531n2698j0624K0379k6462N1378
1926C8745J6224l9573l5950j8590P1918O0268j6674p9035P779J6196N828k3007
1914D129L6398k436L7006o9613Q571l1134j257J6122N7387l7972l4668J0070k4724
1901c2121l4411L8222N5854l501J7804K736k1129l5360j8335n1540j0324N546
1889h6559K7919l095M0073o1302k2012N6115N446L0781m2378L4885j0440j504
1877c2071j119l6399M2553K3445l2990J5481P5050L5480p0508l3786l4813k580
$$ y = [147158, 187526, 144487, 113515, 170394, 150507, 84558, 69872, 91965, 37890, 49684, 91361, 85217, 117985, 127726, 95874, 97749, 118798, 30679, 3380, 39508, -58308, -28286, 29740, 68273, 31424, 106903, 198010, 125217, 82691, 94303, 56772, 4074, -6550, 13829, -12633, 38745, 54969, 15396, -20554, -39144, 32774, 93042, 76368, -2667, 5112, 21308, 27136, 4129, 40527, 38091, 75097, 5484, 14055, -17079, -18336, -2214, 55173, 17201, -17467, -7397, -32121, -66532, -28310, 27544, 24043, 41847, 44583, 23454, -11906, -30241, -81781, -92105, -86559, -58640, -61735, -21662, -82964, -104976, -48861, -43415, -12634, -55012, -20127, -30567, -32071, -33190, -69589, -27036, -3591, -36581, -21100, 53950, 89430, 18922, -14864, -49677, -52257]
1865e2257q908k1177L3066M6825j3713l47o217K6121L6141n1238m8192l5347J1787
1852h3456J666k0875L2211P1056n4191k6896K7406O6130N1225j00878p0214O1977
1840d4839J252N5706L1449l0737l0975R45J7728l5447m6248N0800M3216n4549
1828d1699m6299K1463k9003O1066N0185K8238m9281m6450r316m9272K9110L0490
1816e0768n1620l9266P9878Q3820n6457n7510p540L0298N2344k4328l4437k7429
1804a03015j1590M0215R4541j5468l2628k6783l899j0026k5059K2386r017J6106
1792f4237L6698J0159j6638M649k9713j7352L386L8858J9137j8745L4421p8457
1780g7834K2191R571J8801k2093N4139N0723o6317m8800J6311r87L3962j5949
$$ y = [-52257, -61165, -82342, -49276, -2451, -16164, -16511, -22728, 3393, 39534, -11704, -59896, -95243, -83456, -81790, -102665, -70454, 602, -53589, -80485, -53079, 13051, 64276, -36602, -106816, -44839, -43587, 12119, 43568, 12831, -18144, -17199, 529, -34918, -81166, -30366, 12850, -41699, -87998, -66535, -95538, -34472, 15713, 43951, -5330, -51780, -61096, -110368, -81258, -50768, -102388, -141654, -61776, 22044, -34413, -91923, -99463, -69165, -16821, -41149, -75586, -103015, -114605, -74390, 20151, 4683, -27945, -54728, -58627, -68653, -93712, -71326, -80343, -64237, -27539, -17380, -34018, -29369, -59082, -76434, -73048, -34190, -15053, -33798, 623, -77834, -55643, -46072, -27271, -49364, 4775, 55498, -10819, -59619, -43308, -44295, -10333, -26282]
1768b6282m1121R1971k4123m6778j5966j8479L9970j0180k4588j307K342K1288
1756e3253m3180K9270M487n1187n628M3396K4785M6257l1148J132q724K0775j056
1743b4074j6974m2342J2896O8789p899J7293l6026o201o5265r384M1051K3518
1731d4618p6341M4671L7773k9235k5359m5335K8247l286L9870j2101J6761r912
1719g8865L4853L2286l8200J5801j906q3107l9983N9476j9312J3721K8272n4240
1707a31204J0022J8402K1283o016M40k1397l5961M3273M6140l2357M7955J9686
1695a9734k1199n0192M7062K6765l8118N058l9478l654K1351O0398j7153k3402
1683e2296R833k3908L6963o3734l8855N2253M9499m6374r0186M1528p439J7312
$$ y = [-26282, -67403, 24568, 445, -46333, -62299, -80778, -40808, -50988, -75576, -76883, -74541, -53253, -96433, -67163, -62676, -113863, -119491, -76095, -51310, -5053, -36201, -35069, -43793, -23018, -24074, -41048, -83390, -70494, -1705, -9604, 7689, -28337, -34538, -99803, -109187, -68136, -44618, -120959, -76288, -38515, -67750, -93109, -138444, -110197, -113483, -73613, -85714, -68953, -78865, -44012, -11726, -49926, -34125, -36031, -119138, -159121, -99645, -118957, -105236, -76964, -131204, -121182, -102780, -81497, -87513, -87073, -108470, -144431, -101158, -55018, -87375, -39420, -19734, -40933, -91125, -44063, -17298, -55416, -50358, -89836, -93490, -72139, -11741, -28894, -52296, -42463, -66371, -29408, -93142, -131997, -79744, -30245, -76619, -166805, -125277, -132716, -115404]
1671a15404N6494l1386j3535J5754J0279j0066l0927N4220l0367j9950o574j6073
1659a37535j1083Q0065k1167l4618M6867j2101L082L735l2266J4091L6949n8092
1647a22073l852j456K9855m952L1421R765j4226k9022o0376N9435K7503k3101
1635a01079K6582l4800l0988j7613O055L872M9181L4348o1925l7784N7874L2073
1623g4204J6467N7429J8600o3675m6173L2945j997q225k0344n395J0297L2798
1611e1477n2819J8971K0521k0228m2749r948R454J3588j0680O5422n6309k3464
1599a39718N2811l714Q3897j6691j22070O563N0377p008O4300L0030k8323j9979
1587d9525n7394P8610l525m6073r907K3068J1524m616j5964q451K4770N165k3429
$$ y = [-115404, -58910, -90296, -103831, -88077, -77798, -87864, -118791, -64571, -94938, -114888, -121462, -137535, -148618, -68553, -89720, -124338, -77471, -89572, -86490, -82755, -115021, -100930, -63981, -122073, -125925, -127381, -97526, -102478, -71057, -61292, -75518, -104540, -164916, -105481, -77978, -101079, -74497, -109297, -140285, -157898, -151843, -147971, -98790, -64442, -126367, -164151, -106277, -74204, -57737, -308, 18292, -45383, -91556, -58611, -60608, -68833, -89177, -94572, -84275, -51477, -104296, -85325, -64804, -85032, -127781, -137729, -128275, -114687, -125367, -59945, -116254, -139718, -86907, -90621, -6724, -23415, -145485, -138922, -88545, -95553, -31253, -1223, -29546, -49525, -106919, -28309, -31834, -77907, -87814, -64746, -53222, -57838, -73802, -82253, -57483, -52318, -75747]
1574g5747o8523Q4947k2073m2877j2710r909N5118j2108R896J0682J8866p0228
1562a34666o342L9160L764M7749j2566n3296j2847K7888M0120J8017n7069K3874
1550g6214R453p462n0119k1557J31183K6038o1356k2247l2399q534J7530P129
1538h8555L1978L2984K294j4478j5544L7863p0188r4398n054O0531M5022N0152
1526b7393j7985J4816j6343K6516l6205l4686o905P3241k7350j6362M9537J674
1514a7445p8181J2735L1113j2391N8557l6688l8647K4654l3891m5909Q7683M5889
1502b521k0821j8452J5874o5474j9498K5444L8044J9310k2669p1114l5108K4743
1490a32242j6545n679O5282J9295j5478J1359L0838l6969O287L5886J0391l8097
$$ y = [-75747, -144270, -59323, -81396, -124273, -136983, -146892, -91774, -103882, -93986, -83304, -64438, -134666, -141008, -101848, -98084, -50335, -62901, -116197, -129044, -101156, -61036, -43019, -100088, -76214, -66761, -74223, -124342, -145899, -14716, 11322, -50034, -72281, -104680, -113214, -95684, -88555, -56577, -23593, -21299, -35777, -51321, -13458, -83646, -178044, -183098, -122567, -77545, -27393, -45378, -30562, -46905, -20389, -56594, -91280, -98185, -24944, -52294, -68656, -19119, -17445, -95626, -82891, -51778, -64169, -5612, -42300, -80947, -56293, -90184, -136093, -48410, -2521, -23342, -41794, -25920, -91394, -110892, -85448, -47404, -28094, -50763, -121877, -156985, -132242, -148787, -154466, -89184, -69889, -85367, -74008, -43170, -80139, -73852, -37966, -27575, -65672]
1478f5672k2849M4696M399M0470l2113M610R626L7537k0408l9546J058K0911l645
1465b0926k8604q305l9875K1663K499K1556k2658N3365J8172m4915j3482N6278
1453e232K1755j25319q320K3893N2497k9680n2291k419R8375k2261n3769P5999
1441b6772n4295L1725p223n4067L6835l2433Q764J2701N66K7668n3706N25J1928
1428i7784M3435m9983O3047P7683o6500l3954K106l2961K9873J8550m159L406
1416d7241j0498P807l1593m0165O5267L1721n8338P100K2525l4065K9263O4373
1404F156o5040P06L2532k1981m546M4489o3546q1715P2217j5904O557M6996M2289
1391g90k6247q0713M2817j5030L3700K6423k6299K8599K5071M289l2431p989p7951
$$ y = [-65672, -88521, -43825, -39426, 1044, -31069, -26459, -16833, 20704, 296, -39250, -38192, -17281, -20926, -49530, -57835, -97710, -76047, -73548, -51992, -74650, -21285, -3113, -48028, -61510, -5232, 16523, -108796, -117116, -93223, -40726, -70406, -122697, -125116, -26741, -49002, -102771, -26772, -81067, -49342, -56565, -110632, -73797, -106230, -97466, -84765, -84199, -56531, -110237, -109712, -97784, -54349, -104332, -41285, 36398, -30102, -64056, -61950, -94911, -65038, -46488, -50647, -47241, -57739, -49932, -81525, -121690, -56423, -24702, -83040, -75940, -53415, -87480, -58217, 6156, -58884, -58178, -25646, -47627, -52173, -7684, -71230, -152945, -80728, -96632, -90075, -43079, -790, -27037, -107750, -64933, -79963, -46263, -19840, -46139, -17540, 7531, 11820, -20611, -28600, -106551]
1378a06551O471m3133M0697L9812K7277k5125L743m2029k4002K1283L0580m568
1366g5545q076l0703l3865L3577Q858l7060R606N947L3276L2837L0542J9697m2340
1353e3249M3180m9672l396l689n3292k0727M6226Q841k314L5185L5455j3945l8476
1340f9873o5097Q0457M3337K0095j4851o6460n4730P7309J2507n6379J0623N0232
1328c2830K8524N028n4042r426o364m1512j4234L5568L1143L3034j6613K3118
1316a8606p7674L820J3232J191n8780K4557J16566O189k2452o465j1628l3098
1304f3148K1954l8146N6579q655k9936N4258j1863L4882K1499o5625r1767P077
1292a12891M4989J5771l2755J0704M5490K6691M7360n1458J1880m385p913m753
$$ y = [-106551, -100080, -143213, -102516, -62704, -35427, -60552, -56809, -98838, -122840, -101557, -70977, -75545, -83621, -114324, -148189, -114612, -105754, -142814, -133208, -127261, -93985, -61148, -30606, -10909, -53249, -10069, -59741, -63137, -66826, -120118, -140845, -94619, -85778, -88092, -52907, -17452, -31397, -69873, -134970, -54513, -11176, 8919, -5932, -72392, -127122, -49813, -37306, -93685, -83062, -32830, -4306, 722, -53320, -62746, -69110, -110622, -124856, -89288, -58145, -25111, -41724, -18606, -96280, -92460, -79228, -78037, -136817, -112260, 4306, 10495, -11957, -18422, -30050, -63148, -41194, -79340, -22761, -31416, -61352, -7094, -18957, 15925, 37424, -28201, -119968, -112891, -67902, -52131, -84886, -74182, -28692, -2001, 45359, -6099, 5781, 1396, -6517, -11270]
1280a1270K1078j1842k9814n904k5795L1356L3453q234m0743O955J3742o215M2443
1267I210j2569J1995J326k8344o9577K4923P0630o5158k4484M6088k1863M6955
1255a0868l0859k3542J8448O3167r702m429q398P692O5138j28135k4588K1649
1243f4427Q416J177J2103P33N562n5753L854K1849k93J9253K8404m90o4764k6753
1229a11129j261J00677M7098j1650r924J8718o6492l2765l0971L7930O3663n1504
1217d7610K4593j5683m4581N5089j500m4078L086L1021l2212j2505J09538P2108
1205I7266q5814J0003k4219L0769j4745J8422j8848n2110M4749l87P671r6358
1193h3601K1423M8194N7531L5616m5023p7000M2334j6943j05906K1347K7113N3850
$$ y = [-11270, 9808, -2034, -31848, -37752, -63547, -32191, 1262, -6972, -47715, -40760, -27018, -33233, 9210, -3359, 8636, 9962, -18382, -87959, -63036, 7594, -57564, -82048, -35960, -57823, -10868, -41727, -65269, -46821, 16346, 6644, 2215, -6183, 1509, 66647, -61488, -86076, -64427, -56011, -54834, -42731, -41998, -36436, -92189, -88335, -66486, -66779, -47526, -19122, -19612, -84376, -111129, -112390, -11713, 35385, 23735, 13811, 32529, -33963, -66728, -97699, -59769, 3894, -47610, -23017, -38700, -83281, -28192, -29692, -73770, -70684, -39663, -71875, -84380, 25158, 97266, 11452, 21455, -2764, 28005, 13260, 31682, 12834, -39276, 5473, 5086, 12757, -83601, -62178, -13984, 43547, 79163, 34140, -42860, -526, -17469, -123375, -102028, -74915, -21065]
1181b1065N4929K7202n8723k9446l5476L639J6k3028M2920K9867K2250J7198m2380
1168a2097J1516n733k8016l5379Q421O0036n7161J839J05853L5736q1749m691
1156a425m9856K4135M1973N89o4389l6382K0128L8166O472l2941P301M4525J9486
1143A7782k4189o140j8393L6106Q794l802j8132q6621Q7331R479n3391K1821o0696
1130i0051j3537M5446k6493K4941j8132N119K3642j2078M1894P3946P182n2853
1118I026j3184m9009j7755P5786j4973m0489N4948n1570J1445J5022M4423Q461
1106C2131k2298J2747j7274k4381n4456L0327P7915j9001L04l2470n4658K2335
1094d8779o2811l710o3798J18220N9294O373J1636L7910p3902j0430K7957K8634
$$ y = [-21065, 33864, 61066, 2343, -27103, -62579, -58940, -58924, -81952, -39032, -9165, 13085, 30283, -12097, -581, -6314, -34330, -69709, -61288, -1252, -58413, -56574, 49279, 85015, 3266, -1425, -51281, -27146, 14827, 15416, -48973, -85355, -65227, -27061, -20589, -53530, -46229, -1704, 17782, -6407, -12547, -30940, 5166, 13960, 10158, -7974, -94595, -7264, 2215, -51176, -29355, -90051, -103588, -58142, -84635, -59694, -77826, -72707, -49065, -61143, -19249, 54697, 61879, 9026, -4158, -53167, -70922, 4864, -10109, -50598, 4350, -47220, -35775, -20753, 23670, 32131, 9833, 22580, 5306, -19075, -73531, -43204, 34711, 15710, 16014, -16456, -71114, -48779, -111590, -115300, -179098, -60878, -1584, 4789, 16425, 54335, -19567, -29997, -2040, 26594]
1082B6594N4915j30308p2123M0075N6831p014K1218p0170O666O4944j2547l5142
1070e6061P49l197J3621K2186J2920L002o502L0827l1540p0413M711N761O9079
1057d857P7128k6981n7725O8985J2801O145m9287o4408j5510M876R869O3610l7912
1044a3266J1119J075j9859L2179l7208L8127m9501m01J3325j5130l1625M2085
1032b9080L0956r829K2808j8671J5052j4152N7253j04470K4706J11543K496n9518
1020B9094k1357j3549n4237k5006N6414K7404N3560J0383m9634q1393P6955j4250
1008e616l3857l5459l2959O0620J9382M0423N4054m9811l6647J5520m4115R2504
996D4039j6605j959m0798O1750L77j3544o1196K319k3427N376j997l3198n556
$$ y = [26594, 81509, -48799, -120922, -80847, -24016, -31030, -9812, -79982, -73316, -8372, -20919, -56061, -55312, -58509, -44888, -22702, -9782, -6780, -13282, 17545, -13995, -84408, -79697, -73936, -4857, 72271, 45290, -12435, 56550, 69351, 75496, 26209, -38199, -53709, -48833, -38964, 24646, -13266, -2147, -1072, -20931, 11248, -25960, 12167, -37334, -37735, -24410, -39540, -71165, -29080, 1876, -7953, 14855, -3816, 11236, -2916, 54337, -50133, -25427, 86116, 88612, 29094, 7737, -5812, -60049, -85055, -28641, -1237, 52323, 62706, 13072, -68321, 8634, -5616, -39473, -74932, -107891, -47271, -27889, 12534, 66588, 16777, -19870, -4350, -48465, 44039, 27434, 25475, -15323, 46427, 46804, 33260, -27936, -25617, -49044, -43668, -45665, -78863, -84419]
983h4419P2197J1562L1220j8325k5622R612l1638N4995m5192l1825K6785K7602
971c048N1771K796Q284l5775P012P489j3127j0242n0410m2475K2181L8637O4271
958D7364J9253k6560J9580p5160k976P9136n8000j5466M7210q1514K1560M067
946b1506j5688M1081p439J8761l5967M989R8797n379m3878n1022O3033l0417P344
933B2709K1632K735j3969M0149P721p0691L6688M5417m1482n410k1660R900k4897
920H842k4870R580m838j6404m709M8825P0072J3838p4671L1942j2104k7015L894
907B2382k5534J4577O553m8965L8082j9032k5524J7774M3303j0045K6354J1911
895E1836K6070K160q6279J0471J6010K1209K8960l4669J1214n2273k8387K3663
$$ y = [-84419, -12222, -660, 30560, 12235, -13387, -3775, -35413, 19582, -25610, -57435, -30650, -3048, 48723, 51519, 59803, 24028, 31040, 38529, 25402, 15160, -35250, -77725, -55544, -16907, 47364, 66617, 40057, 59637, -15523, -18499, 60637, 2637, -12829, 34381, -47133, -25573, -21506, -37194, 3887, -3552, 15209, -20758, -15769, 83028, 77649, 33771, -17251, 45782, 15365, 22709, 44341, 47076, 33107, 73256, 80977, 10286, 46974, 92391, 50909, 45499, 23839, 33739, 8842, -16028, -6448, -11286, -27690, -32399, 16426, 86498, 100336, 25665, 57607, 45503, 18488, 22382, -3152, 11425, 17978, -30987, 7095, -11937, -37461, -19687, 23616, 13571, 39925, 51836, 77906, 80066, -6213, 4258, 20268, 41477, 70437, 35768, 46982, -5291, -33678, -10015]
883a0015J0345J5302M4215j6362q0108p6788K2414L8914k508o103K2051J634r348
870d6357M1223L413k1285k4987m743l9602O9443K9223K9249k0528J3739K2682
858E1470K0791K7750j8805m1540j7386J4077l430l7045m6769J1605O1177K6430
846D8325l9977K6527k578k0306L220j5581K490l5236M6898P7121q8013l9263O6814
833C0441L9879j0980K4143q3359m4398M0221N4290j6130o3932l0380J2057N5023
821F875n5629R571N3284N5838k3629o5431J0219M1884J0500k9735l5983q271K8898
808a609j719O28O594k1477p722K4181K7955P224j985j8514N2015k1913l7187O224
794A2695K415j8320j5107m9997N5394P4055o8513K0134N5676L8803j8390j6638
$$ y = [-10015, 330, 15632, 59847, 43485, -36623, -113411, -90997, -52083, -54591, -60694, -38643, -37009, -46357, -5134, -1721, -23006, -47993, -52736, -92338, -22895, 6328, 35577, 15049, 28788, 51470, 72261, 100011, 81206, 39666, 22280, 36357, 32927, -4118, -50887, -39282, 21895, 48325, 8348, 34875, 32297, 11991, 15211, -370, 2120, -33116, 13782, 90903, 2890, -36373, 30441, 70320, 59340, 83483, 124, -44274, -4053, 50237, 34107, -29825, -60205, -48148, 6875, -48754, -39183, 14101, 69939, 46310, -19121, -8902, 32982, 43482, 13747, -22236, -30507, -1609, -3328, -2700, 3894, -17583, -25305, -1124, 26831, 34055, 32070, 13556, 65571, 43658, 6471, 12695, 15110, -3210, -18317, -68314, -12920, 61135, -7378, 12756, 68432, 107235, 88845, 72207]
782G2207j3960j175J1998l2752K7858n310q4401M0227j6081n7271r407M7546j404
769b1925l3371R1914M3095n0211k2852J2500j2874N9014j5080J6283j7821q1m642
756D3949K8341o1801Q780k2167J2402J09533o0423n1286L462l3342m9711O3085
744i178M3317M2998j574l1870k9582J9097n2142j5771P771K3592L2440M5608o4322
731A0384j353L0189L0595O711m0207M6518l2850L5139J0806j8941M2998o2444
719E7545N1636k9906j8068j6025n5241k7051L4852K4176O5936j5282K9855J6779
707A19206k4326m6301j4070N4643J3925l8902k9866j5482L1323N1723m3751r82
695E7140j1635l4369K4563J2875j6899J1366N53O135m3241Q103l3133K0071J0612
$$ y = [72207, 58247, 57072, 69070, 36318, 64176, 58866, -25535, 14692, -1389, -58660, -68067, -20521, -21925, -55296, 36618, 79713, 29502, 6650, 19150, 6276, 65290, 50210, 66493, 48672, 48591, 43949, 72290, 10489, 19269, -2898, 9504, 119037, 58614, 7328, 10790, -22552, -72263, -9178, 34139, 77137, 75563, 43693, 14111, 33208, -18934, -34705, -26934, -3342, 29098, 74706, 10384, 9031, 39220, 69815, 76526, 36319, 82837, 49987, 85126, 95932, 76991, 119989, 57545, 109181, 79275, 61207, 45182, -10059, -37110, -2258, 21918, 87854, 72572, 102427, 119206, 94880, 48579, 34509, 89152, 103077, 64175, 34309, 18827, 50150, 101873, 58122, 57140, 45505, 11136, 35699, 48574, 31675, 43041, 43594, 49729, 6488, 14591, -18542, 1529, 12141]
682A2141k3696J6290M2176n4555r910n109j2543N2315M6633N116Q820j1870o7557
669a749j975N4926l1443L3282J5580k3511n676j8519O7072j5046j6121K7920K8916
656A13656k6707o2777L8895M1580o0771n9436L9993j8457M9953K9609o8860k7555
644a0877L8220j2983L6436K3607J7098k6294P771j3291m54L2987q009l5183m5624
631C404L6572J5244m362l0718O022N4384j0283k6576L3078K7286p6071L9182k2210
618D4952j9102O1465j9885O809P148l362m8925m5788L6219j1989L2989M4979l1032
605E4478p4954j3910J3140L5449M4859J8025j0616k6965P6291L8015r4803M8767
593A07776J4577l5103P747m2491o583P0169N1296o8632l0813J0956Q472j7904
$$ y = [12141, -11555, 4735, 46911, -7644, -17554, -22663, -35206, 17109, 63742, 68858, 77678, 65808, -1749, -3724, 51202, 19759, 53041, 68621, 45110, 39434, 20915, 87987, 72941, 56820, 84740, 113656, 86949, 24172, 63067, 104647, 43876, -15560, 24433, 5976, 55929, 85538, 16678, -10877, 27343, 14360, 50796, 74403, 91501, 65207, 72978, 59687, 59233, 92220, 84211, 49028, 3404, 39976, 55220, 50858, 20140, 26162, 80546, 70263, 43687, 76765, 104051, 27980, 67162, 44952, 25850, 87315, 67430, 74239, 81387, 78025, 29100, -16688, 19531, 7542, 40531, 85510, 54478, -20476, -34386, -21246, 14203, 59062, 77087, 66471, 39506, 115797, 153812, 59009, 107776, 122353, 87250, 94997, 52506, 45923, 116092, 167388, 98756, 67943, 78899, 87371, 69467]
581F9467J4494m5783L255J5207N1084o2855L2008N2732P800j08436N2893k685
569G9181n3768k1185O6066l1158p204R752l640k7882k101j7277k8667J3001O6358
556D1476L1547l4284N8009j7540k5143P989O0685L442M742n3700k8872J4908P9101
543A42360k5527n2482N0034J4873l9154j1193O500k3354J0998L7144j5834l180
531I1185l5612n860l0608k7301L4641O3891j3660k2480m6081k7942Q1532M0971
519A02676o6995J1497J9746L5728P24k8326Q981m7838n730K1588R077L184j615
506F2697J8899l5277j8142O9239l4424k6576P0447K5087J016m3122p7247K3096
494C5693L2743N013K5505l0315L4497m729o817J5224k0303K5364j4560j5960O539
$$ y = [69467, 83961, 38178, 41433, 56640, 107724, 44869, 76877, 129609, 137409, 28973, 81866, 79181, 25413, 4228, 70294, 39136, 31932, 41684, 38044, 10162, 8061, -9216, -37883, -24882, 41476, 73023, 38739, 96748, 79208, 54065, 62054, 122739, 126181, 130923, 77223, 48351, 63259, 142360, 116833, 64351, 114385, 129258, 90104, 78911, 85411, 62057, 73055, 110199, 94365, 91185, 55573, 49713, 19105, -8196, 26445, 90336, 76676, 54196, 8115, -19827, 61705, 102676, 35681, 47178, 66924, 102652, 103376, 75050, 84031, 36193, 30463, 52051, 61128, 64312, 62697, 81596, 46319, 28177, 97416, 62992, 36416, 106863, 131950, 132966, 89844, 12597, 35693, 68436, 73449, 98954, 68639, 103136, 98407, 91590, 106814, 86511, 111875, 97315, 81355, 87894]
481H7894M220K0673n905K6294j1440l5136k1464J304J7978J5380l3942J2708L6107
468A14671M707J6909o8894l5027P2757M204p4940J5159O0984J6081n3416N4173
456A27368j3893l8197J3030J0677q523m458N9087n2848n884l96j705n1436L7368
443G0190N6896K6701J0277j2148k9576m667Q1735j01467L0706Q279j9118J7989
431A35797j0462j4258q9788j7482R5952J9562K5387n5587l5235K731J3665J4982
419H5264J5064o4966K9440J1652l3698K2624o9729k8110J6240O3723q6259J4612
407b4143P1346M7225l6102L2730q1636l4266j1314R700L2803l4664J160L9258
395A2097J3928J2364K8279k5883N3669l2961M5349n6015p1628P536K383n719j5813
$$ y = [87894, 92114, 112787, 106882, 133176, 121736, 86600, 65136, 66440, 84418, 99798, 65856, 78564, 114671, 119378, 136287, 67393, 32366, 105123, 109327, 34387, 49546, 110530, 126611, 73195, 127368, 113475, 75278, 88308, 98985, 90462, 86004, 145091, 92243, 86359, 85963, 84258, 32822, 70190, 127086, 153787, 164064, 151916, 122340, 117673, 199408, 97941, 128647, 136926, 117808, 135797, 125335, 111077, 21289, 3807, 99759, 119321, 144708, 89121, 53886, 56617, 70282, 85264, 100328, 35362, 64802, 76454, 42756, 65380, -4349, -32459, -16219, 47504, -38755, -24143, 47203, 94428, 58326, 91056, 9420, -24846, -36160, -26460, 6343, -28321, -27161, 12097, 26025, 38389, 66668, 40785, 94454, 61493, 106842, 50827, -20801, -13265, -10882, -16601, -32414]
382c2414L6271N1665j5794L32N7463j5249J8748o8634o458K9614J0786j5270l7922
369A3138P110M6785p6112m8998L4325P142k3681N695N1602q01o0367K4961P94
356a8407J4859M6605m4674K4997n6202J575N9374l1037l3933N2856K5902m0393
344A522k2438P0080l1238k8798P29R5524k7777m187O6865q556J2863k0686l4106
331F9797k5641j6810j3065j7472L5858L2487P124k6760l1804l4562M2785L8786
319F0723L4253m7357l2702K9350o8574K7855J3334M9467m2427J2481L9864N86
307G6853n5549Q302q889m5518J8411P9561K934r2599n8299J5256L7823k3623P7663
294C2326k6463k2200Q2930j7337o8257N0895m1906l735p510J3931K2098k9309
$$ y = [-32414, 3857, 55522, 39728, 40060, 97523, 82274, 101022, 32388, 25930, 55544, 66330, 51060, 13138, 20248, 67033, -9079, -58077, -23752, -16610, -40291, -34596, 17006, 16205, -44162, -19201, -18407, -3548, 43057, -1617, 23380, -32822, -31247, 28127, -2910, -36843, 16013, 41915, 1522, -20916, 49164, 17926, -10872, -10143, 85381, 57604, 53417, 120282, 111726, 124589, 103903, 69797, 44156, 27346, 14281, -3191, 32667, 65154, 72278, 45518, 13714, -20848, 21937, 60723, 94976, 47619, 14917, 44267, -24307, 3548, 16882, 66349, 23922, 36403, 76267, 76853, 21304, 29606, 20717, -24801, -6390, 73171, 76105, -16494, -74793, -59537, -21714, -45337, 32326, 5863, -16337, 66593, 49256, -19001, 31894, -10012, -13747, -21257, -7326, 14772, -14537]
282a4537P4094J8230j9061k4217l0101J9657r894N7832M3757l2319j1470Q858
270H0829m4283M4794P407q8314q883M3714J4844m3209M281J0354l1331k3004J7800
257a5001J9710O0223k6758Q786M2239p8624L5552k0173l8144J8085N691J6771
245B8357M422L6034q7484l0106j6368M0514Q2885J4473m2816L520J1228P1034
233A15693K057l9850J5252k7606q2420j1083M4772O001K0499j3005j9974J8306
221B8642K8720L3437n630m0433l8927j3974k3083J8954j6008M6360P868k0689
209E237O325j184j9465L1185n358j9088Q814o142K056j3812L8720M086J8286l0016
195A9644l6830Q886L641K9118N0090p478j4222m9825K3976J6219J497M6083j1286
$$ y = [-14537, 59557, 77787, 58726, 34509, 4408, 24065, 14171, 72003, 115760, 83441, 71971, 80829, 36546, 81340, 88747, 433, -8450, 35264, 50108, 6899, 11180, 21534, -9797, -32801, -15001, 4709, 64932, 38174, 46960, 89199, 10575, 46127, 25954, -12190, 5895, 11586, 28357, 32779, 68813, -18671, -48777, -65145, -24631, 58254, 72727, 29911, 33431, 44659, 115693, 117750, 77900, 93152, 65546, -16874, -27957, 16815, 22816, 43315, 30310, 10336, 28642, 57362, 90799, 85169, 44736, 5809, -8165, -31248, -12294, -28302, 18058, 25926, 5237, 11562, 10378, -9087, 22098, 16740, -2348, 6466, 324, 2380, -11432, 27288, 31374, 49660, 19644, -17186, -8300, -4659, 24459, 74549, 67071, 52849, 3024, 27000, 43219, 44716, 90799, 79513]
182G9513m008k43j9351l4427j2141o608n6118k8304Q3852J0505l7904J2007K7170
169A3943j6075n7187Q121R2587M1620o1897j9939L9456N2968k0764k9084N2738
157I6487l5061l5284l2187N4445K2587j6899L4180j6551m008p4581j841J5950
145G237J750K8761N2832l8862l0430k0652P545M0862M6309R9k7482k0051m4998
132B920p5487M0272N4406q943L9154K7499O975K3330m4508m1513R990N860k2402
119A7553N9516j774j0651k6j1866L9814k4327J1869l9873m8316K6828K9038M899
106E2684N1409l7198k7395l0837J3318N8083n8575M578o466k9293n071N1922Q831
93D5990N43l0274l846M2617k3886k5827p815L5349N8625l9091k0487j0528n561
$$ y = [79513, 75505, 75262, 55911, 21484, 9343, 2735, -53383, -81687, 2165, 12670, -25234, -13227, 13943, -2132, -59319, -51198, 41389, 83009, 21112, 1173, 40629, 93597, 72833, 43749, 96487, 61426, 26142, -6045, 48400, 70987, 54088, 88268, 71717, 67709, -6872, -8713, 7237, 8987, 37748, 90580, 51718, 21288, 636, 8181, 49043, 95352, 95451, 67969, 47918, 2920, -72567, -32295, 22111, 13168, 52322, 79821, 86796, 110126, 65618, 24105, 34095, 39955, 17553, 77069, 75295, 64644, 64618, 52752, 92566, 68239, 80108, 40235, -8081, 18747, 47785, 52684, 104093, 66895, 39500, 8663, 21981, 80064, 21489, 26067, 19601, -9692, -14763, 37159, 45990, 46533, 16259, 12413, 55030, 31144, 5317, -2498, 32851, 91476, 52385, 31898, 21370, 15809]
80A5809j9197l911K7154L3853j5471n0617K0738K1115J0605k6262R170j7219P982
67A3749J9791R163k0475m785K8468j2966L1914k014k6546J6870L4369l6326n8705
54g493j1838J8320K215K098L777m3710P6206O7552l0329n5221j9542M9673K5795
41G7503l0835k8710j3092L0709J475k0718J7638J1632m2969J1909K8959J4105
29E7606l0885J3305q884K8098N469l4240L799K3637k9532K6909K0939j6963l2972
16B6286r343J3548K5731l2874k7444l118N4970k1817j265P360n783O2485l548
3H5188n4914j3542Q9882
0A06614
$$ y = [15809, -3388, -7299, 19855, 53708, 38237, -12380, 8358, 29473, 40078, 13816, 22986, 5767, 13749, 33540, 42703, 22228, 17443, 45911, 32945, 64859, 62845, 36299, 53169, 87538, 51212, -7493, -19331, -1011, 1204, 3302, 7079, -36631, 39575, 107127, 76798, 21577, 2035, 51708, 77503, 46668, 17958, 4866, 35575, 37050, 16332, 33970, 45602, 2633, 14542, 43501, 57606, 26721, 40026, 31142, 59240, 64709, 30469, 34268, 57905, 28373, 55282, 76221, 59258, 26286, 16943, 30491, 56222, 23348, -4096, -7214, 47756, 25939, 24674, 32034, 26251, 88736, 85188, 30274, 16732, 106614]
$$ Imaginary data points
##PAGE= N=2
##DATA TABLE= (X++(I..I)), XYDATA
16383c515642P0228P0154N9097j15P0681J9897K8953M5388L1530J09601J06705
16372b903523J7521J9785K9599M9548O4817M6352N9657N6709Q0027J4998N4993
16361b409517Q8101J5082P6691J3584K5436L5483P6916P5502O136M8391O2644
16350a885551K1380N8030N2287L4621Q1700L1717N7629M9234L2482M6923L1566
16339a387982L5354O9687M0763L9278O5929K8785N6764N8945N1528M3903O460
16328h90586O0341M9495K2882Q575P8179Q4070K0438K2321J01335L5197Q581O2612
16316c36560O6718J4503O3917P2801M8864N8963k5279N6574K9393O0367O8999
16305A79260O5126L5999M350l0728L6346R2346Q9227M4592l1552L4495J15313
$$ y = [-3515642, -3445414, -3375260, -3316163, -3316278, -3245597, -3225700, -3196747, -3151359, -3119829, -3010228, -2903523, -2886002, -2866217, -2836618, -2787070, -2722253, -2675901, -2616244, -2559535, -2479508, -2464510, -2409517, -2321416, -2306334, -2229643, -2216059, -2190623, -2155140, -2078224, -2002722, -1996586, -1948195, -1885551, -1864171, -1806141, -1753854, -1719233, -1637533, -1605816, -1548187, -1498953, -1466471, -1419548, -1387982, -1352628, -1282941, -1242178, -1202900, -1136971, -1108186, -1051422, -992477, -940949, -897046, -890586, -830245, -780750, -757868, -749293, -671114, -587044, -566606, -544285, -442950, -407753, -399172, -336560, -269842, -255339, -191422, -118621, -69757, -10794, -36073, 20501, 49894, 110261, 179260, 244386, 280385, 284735, 254007, 290353, 382699, 471926, 516518, 484966, 519461, 634774]
16294F34774K1490K3905N6438P651J3453M1580O5775M4195L8214Q5043n023K6540
16282A054035J0695J5109O3821K2909P3728R2133J4146n1570L8994M5992P1599
16271A451591R2745j6617j7830N979P7848k7680J0042J08256L8140J6771O957
16260A746202K1058N6449Q4699Q9111L7474M0772j1047l5597O4551k9716M0371
16249B104327J2144N3257M8514P380M4228L4620K1589L8982Q409o208Q6360O9423
16237B523025m263j3989K2681M8895o352L7822m636M6684L4938L1704l0775L5901
16225B721635N8445L597P343M5832N0012j4890k3808N0753R2751l8500M3182J8158
16213C014510O4067R598k6848O4078J7799J4273m5500L0815R3739l8273k717O5417
$$ y = [634774, 656264, 680169, 736607, 744258, 757711, 799291, 865066, 909261, 947475, 1032518, 1027495, 1054035, 1064730, 1079839, 1143660, 1166569, 1240297, 1332430, 1346576, 1295006, 1334000, 1379992, 1451591, 1544336, 1527719, 1509889, 1515868, 1593716, 1566036, 1576078, 1684334, 1722474, 1739245, 1746202, 1767260, 1823709, 1908408, 1997519, 2034993, 2075765, 2064718, 2029121, 2093672, 2063956, 2104327, 2116471, 2169728, 2218242, 2225622, 2269850, 2304470, 2326059, 2365041, 2373450, 2367242, 2453602, 2523025, 2518762, 2504773, 2527454, 2576349, 2569997, 2607819, 2603183, 2649867, 2684805, 2716509, 2685734, 2721635, 2780080, 2783677, 2791020, 2836852, 2886864, 2871974, 2848166, 2898919, 2991670, 2953170, 2996352, 3014510, 3078577, 3088175, 3061327, 3125405, 3143204, 3157477, 3111977, 3142792, 3236531, 3198258, 3195541, 3260958]
16201C260958L5389R159N568J0539k8520L9613N318j7182L8496k0258N6236N0635
16189C445951Q1663K7308j2800L4099o6506M5413L8923n7197N2304M3870J1267
16178C644295n2551M3279L9798N6746l8893l8129r101L0319P2306k210P322N0405
16166C803586J7736J4834O2531n3236o5672N274m5122J2754R3649Q5540J6122
16155C947996o3729n1828O4758O6146j7574k3335j9389j4019K1859L3477K7779
16144C972141J4927P7664M4967L704l9353J601K9484j1532j3172P8884O1672o2106
16132D158881k6870j4171n8599N5831J6922L4593K595M1736k9177o9963j0906
16121D100872q460M7550J9031J4446l5076L3359J09657L6325m1438Q0029p9365
$$ y = [3260958, 3296347, 3305506, 3311074, 3321613, 3293093, 3332706, 3338024, 3320842, 3359338, 3339080, 3395316, 3445951, 3527614, 3554922, 3542122, 3576221, 3509715, 3555128, 3594051, 3536854, 3589158, 3633028, 3644295, 3591744, 3635023, 3674821, 3731567, 3692674, 3654545, 3645444, 3675763, 3748069, 3745859, 3753181, 3803586, 3821322, 3836156, 3898687, 3845451, 3779779, 3785053, 3739931, 3752685, 3846334, 3931874, 3947996, 3884267, 3832439, 3897197, 3963343, 3945769, 3922434, 3903045, 3889026, 3910885, 3944362, 3972141, 3987068, 4064732, 4109699, 4113403, 4074050, 4075651, 4105135, 4093603, 4080431, 4159315, 4220987, 4158881, 4132011, 4117840, 4059241, 4115072, 4131994, 4166587, 4169182, 4210918, 4181741, 4111778, 4100872, 4092412, 4139962, 4158993, 4173439, 4138363, 4171722, 4281379, 4317704, 4276266, 4356295, 4276930]
16110D276930L363m2653J7306L068m4326K2148M745l6292K6083Q7040j9948q21
16098D296643N914j9912J7295K9290p9939M749L6878n64M5400m8575K0207k5074
16086D282312J5654K0025J932k940N16R975Q6068k8252k4407m0793j4726P8866
16074D384230J0493n8746l3612K2810k2811o3600N8833l2138j1177N0498q969
16063D295811J5262J12536Q0769q6190l0683Q9507q010p7671m234J1520J4163
16052D412780j5495J0437l5570K1404K0974J4690L2919k3386j1256j9482j3848
16041D394167m4229J292K8208M8267k4546o4727P8009l6298J3414j1385M1433
16030D423605n2394n8464O0321J9865p8367l2744M8250Q937k015N9080Q5293j8964
$$ y = [4276930, 4280293, 4237640, 4254946, 4258014, 4213688, 4235836, 4240581, 4204289, 4230372, 4317412, 4297464, 4296643, 4302557, 4282645, 4299940, 4329230, 4249291, 4254040, 4290918, 4290354, 4335754, 4287179, 4307386, 4282312, 4297966, 4317991, 4319923, 4316983, 4317499, 4327474, 4413542, 4385290, 4360883, 4320090, 4305364, 4384230, 4394723, 4335977, 4302365, 4325175, 4302364, 4238764, 4297597, 4265459, 4254282, 4304780, 4295811, 4311073, 4423609, 4504378, 4418188, 4387505, 4477012, 4469002, 4391331, 4387097, 4398617, 4412780, 4397285, 4407722, 4372152, 4393556, 4414530, 4429220, 4462139, 4438753, 4427497, 4408015, 4394167, 4349938, 4351230, 4379438, 4427705, 4403159, 4338432, 4416441, 4380143, 4393557, 4382172, 4423605, 4371211, 4312747, 4373068, 4392933, 4314566, 4281822, 4330072, 4339009, 4336994, 4396074, 4481367, 4462403]
16018D462403k3376m1235P256J3228r636L862o961Q6818N111K7381q5361K1084
16006D460574L5474q2012o861J0457k1054P5287n5423k8936K8399O3726n4600
15995D425031o9018L4683L1079K7151r0476O2454M2619r6022J00209L6638n3508
15984D450840J1209n6900J7472r846O522N688k5002k5341M5331k247J4157m3594
15972D388289O0962J02195n1786k0453r46j5084l7421J0675M9727N1121k4981
15961D512298j20570J7015K8383N2692J0588o147k0705q0172N4526O204J923p559
15949D448476L8413N4613k132n3856n3947JL3313p602q783l921j4788O5652L6189
15936D531628k3959j2051l3995k0415M4977J3779k3246o2401K7916P2434K0237
$$ y = [4462403, 4439027, 4397792, 4405048, 4418276, 4408640, 4412502, 4405541, 4492359, 4497470, 4524851, 4439490, 4460574, 4496048, 4414036, 4407175, 4417632, 4396578, 4471865, 4416442, 4387506, 4415905, 4479631, 4425031, 4356013, 4390696, 4421775, 4448926, 4358450, 4420904, 4463523, 4367501, 4467710, 4504348, 4450840, 4462049, 4405149, 4422621, 4412775, 4419297, 4424985, 4399983, 4374642, 4419973, 4417726, 4431883, 4388289, 4449251, 4551446, 4499660, 4479207, 4478261, 4463177, 4425756, 4436431, 4486158, 4537279, 4512298, 4391728, 4408743, 4437126, 4489818, 4500406, 4494259, 4473554, 4393382, 4447908, 4454112, 4456035, 4448476, 4486889, 4541502, 4539370, 4485514, 4431567, 4431568, 4464881, 4457279, 4448496, 4444575, 4429787, 4495439, 4531628, 4507669, 4495618, 4461623, 4441208, 4486185, 4499964, 4476718, 4414317, 4442233, 4514667, 4534904]
15925D534904l1192o05K7418k5078q2708L2598N0775K5292l8965N0047N0072n2640
15913D539918N1402q6041k1185J5203M7327k5818j8045m4034l459m012r7940O7142
15901D420458K0638P6545j7440j2424K4560n3475K7402K1869r3973L8604J21656
15890D574420l7028l6990j1819L876m227k9662k674j4440n217L0654P7771K0997
15878D565661J5920o2185j1468p7167k5663N5379K8856l480j3389R153P375J4067
15866D503059k1911O2980L707l4556l2791R6635J0298r0442o4327L4154P4561
15855D541367k4984K7154l7982j296J8643p5443n4377N0655M3100M0151j8348
$$ y = [4534904, 4503712, 4503107, 4530525, 4505447, 4422739, 4455337, 4506112, 4531404, 4492439, 4542486, 4592558, 4539918, 4591320, 4505279, 4484094, 4499297, 4546624, 4520806, 4502761, 4458727, 4455268, 4451256, 4353316, 4420458, 4441096, 4517641, 4500201, 4487777, 4512337, 4458862, 4486264, 4508133, 4414160, 4452764, 4574420, 4537392, 4500402, 4488583, 4492459, 4488232, 4458570, 4455896, 4441456, 4436239, 4466893, 4544664, 4565661, 4581581, 4519396, 4507928, 4430761, 4405098, 4460477, 4489333, 4485853, 4472464, 4481617, 4488992, 4503059, 4481148, 4544128, 4547835, 4513279, 4480488, 4577123, 4587421, 4496979, 4432652, 4466806, 4541367, 4516383, 4543537, 4505555, 4504259, 4522902, 4447459, 4393082, 4443737, 4486837, 4526988, 4508640]
$$ [...]
##END NTUPLES=NMR SPECTRUM
##END=
