##TITLE=1H_TG-2363-x1y
 DMSO
 8 sc, 
 24.10.2022
##JCAMPDX= 6.0         $$ Bruker NMR JCAMP-DX V2.0
##DATA TYPE= NMR SPECTRUM
##DATA CLASS= NTUPLES
##ORIGIN= UXNMR, Bruker Analytische Messtechnik GmbH
##OWNER= root
$$ XWIN-NMR		Version 3.5
$$ Mon Oct 24 16:05:46 2022 Russian Standard Time (UT+4h)  she@DPX200
##.OBSERVE FREQUENCY= 200.1313499994
##.OBSERVE NUCLEUS= ^1H
##.ACQUISITION MODE= SIMULTANEOUS
##.ACQUISITION SCHEME= undefined
##.AVERAGES= 8
##.DIGITISER RES= 18
##SPECTROMETER/DATA SYSTEM= spect
##.PULSE SEQUENCE= zg30
##.SOLVENT NAME= DMSO
##.SHIFT REFERENCE= (INTERNAL, DMSO, 0, 15.7634)
##AUDIT TRAIL= $$ (NUMBER, WHEN, WHO, WHERE, WHAT)
$$ ##TITLE= Audit trail, XWIN-NMR		Version 3.5
$$ ##JCAMPDX= 5.01
$$ ##ORIGIN= Bruker BioSpin GmbH
$$ ##OWNER= she
$$ F:/spectra/data/she/nmr/H-F/1/pdata/1/auditp.txt
$$ ##AUDIT TRAIL=  $$ (NUMBER, WHEN, WHO, WHERE, WHAT)
(   1,<2022-10-24 16:04:17.53 +0400>,<she>,<DPX200>,
      <created by zg, POWCHK disabled, PULCHK disabled
       configuration hash MD5:
       00 E9 B6 7A A2 85 ED C7 34 08 36 98 17 FE 4E 26
       data hash MD5: 16K
       6A 28 4D A9 50 7D 61 B1 2B 89 6B B2 72 80 9E CD>)
(   2,<2022-10-24 16:04:20.37 +0400>,<she>,<DPX200>,
      <Start of raw data processing
       efp BC_mod = 2 LB = 0.24 FT_mod = 6 PKNL = 1 PHC0 = -18042.46 PHC1 = 23.2007 SI = 16K 
       data hash MD5: 16K
       7C 4B A7 51 FF F0 8B 69 B8 C2 24 F8 70 C0 A7 EA>)
(   3,<2022-10-24 16:04:43.09 +0400>,<she>,<DPX200>,
      <pk PHC0 = 9.997303 PHC1 = -18.6 
       data hash MD5: 16K
       5C B9 9B 89 DF 48 27 0E 84 50 41 95 1D CF F4 B2>)
(   4,<2022-10-24 16:04:46.56 +0400>,<she>,<DPX200>,
      <abs ABSG = 5 
       data hash MD5: 16K
       3E B8 B7 77 5A F0 29 14 64 65 48 FA 97 72 01 AD>)
$$ ##END=
$$ 
$$ hash MD5
$$ F4 D6 F2 AD E8 6F D4 FD 94 32 E7 3A 70 80 45 8F
##$RELAX= 
##$RELAX= 
##$RELAX= 
##$RELAX= 
##$RELAX= 
##$RELAX= 
$$ Bruker specific parameters
$$ --------------------------
##$DU= <F:/spectra>
##$EXPNO= 1
##$NAME= <H-F>
##$PROCNO= 1
##$TYPE= <nmr>
##$USER= <she>
##$AMP= (0..31)
100 100 100 100 100 100 100 100 100 100 100 100 100 100 100 100 100 100 
100 100 100 100 100 100 100 100 100 100 100 100 100 100 
##$AQSEQ= 0
##$AQ_mod= 1
##$AUNM= <au_zg>
##$AUTOPOS= <>
##$BF1= 200.13
##$BF2= 200.13
##$BF3= 200.13
##$BF4= 200.13
##$BF5= 200.13
##$BF6= 200.13
##$BF7= 200.13
##$BF8= 200.13
##$BYTORDA= 1
##$CFDGTYP= 0
##$CFRGTYP= 5
##$CHEMSTR= <none>
##$CNST= (0..31)
1 1 145 1 1 1 1 1 1 1 1 1 1 1 1 1 1 1 1 1 1 1 1 1 1 1 1 1 1 1 1 1 
##$CPDPRG= <>
##$CPDPRG1= <>
##$CPDPRG2= <>
##$CPDPRG3= <>
##$CPDPRG4= <mlev>
##$CPDPRG5= <mlev>
##$CPDPRG6= <mlev>
##$CPDPRG7= <mlev>
##$CPDPRG8= <mlev>
##$CPDPRGB= <>
##$CPDPRGT= <>
##$D= (0..31)
0 1.2 0 0 0 0 0 0 0 0.06 0 0.03 0 0 0 0 0.0002 0 0 0 0 0 0 0 0 0 0 0 0 
0 0 0 
##$DATE= 1666613056
##$DBL= (0..7)
120 120 120 120 120 120 120 120 
##$DBP= (0..7)
150 150 150 150 150 150 150 150 
##$DBP07= 0
##$DBPNAM0= <>
##$DBPNAM1= <>
##$DBPNAM2= <>
##$DBPNAM3= <>
##$DBPNAM4= <>
$$ [...]
##$SUBNAM3= <"">
##$SUBNAM4= <"">
##$SUBNAM5= <"">
##$SUBNAM6= <"">
##$SUBNAM7= <"">
##$SUBNAM8= <"">
##$SUBNAM9= <"">
##$SW= 18.0517283424941
##$SWIBOX= (0..15)
0 0 2 0 0 0 0 0 0 0 0 0 0 0 0 0 
##$SW_h= 3612.71676300578
##$TD= 16384
##$TD0= 1
##$TE= 0
##$TE2= 300
##$TE3= 300
##$TEG= 300
##$TL= (0..7)
0 120 120 120 120 120 120 120 
##$TP= (0..7)
150 150 150 150 150 150 150 150 
##$TP07= 0
##$TPNAME0= <>
##$TPNAME1= <>
##$TPNAME2= <>
##$TPNAME3= <>
##$TPNAME4= <>
##$TPNAME5= <>
##$TPNAME6= <>
##$TPNAME7= <>
##$TPOAL= (0..7)
0.5 0.5 0.5 0.5 0.5 0.5 0.5 0.5 
##$TPOFFS= (0..7)
0 0 0 0 0 0 0 0 
##$TUNHIN= 0
##$TUNHOUT= 0
##$TUNXOUT= 0
##$USERA1= <user>
##$USERA2= <user>
##$USERA3= <user>
##$USERA4= <user>
##$USERA5= <user>
##$V9= 5
##$VALIST= <valist>
##$VCLIST= <CCCCCCCCCCCCCCC>
##$VD= 0
##$VDLIST= <DDDDDDDDDDDDDDD>
##$VPLIST= <PPPPPPPPPPPPPPP>
##$VTLIST= <TTTTTTTTTTTTTTT>
##$WBST= 1024
##$WBSW= 4
##$XGAIN= (0..3)
0 0 0 0 
##$XL= 0
##$YL= 0
##$YMAX_a= 126105
##$YMIN_a= -89263
##$ZGOPTNS= <>
##$ZL1= 120
##$ZL2= 120
##$ZL3= 120
##$ZL4= 120
##$ABSF1= 15.67527
##$ABSF2= -2.376577
##$ABSG= 5
##$ABSL= 3
##$ALPHA= 0
##$AQORDER= 0
##$ASSFAC= 0
##$ASSFACI= 0
##$ASSFACX= 0
##$ASSWID= 0
##$AUNMP= <proc_1d>
##$AZFE= 0.1
##$AZFW= 0.1
##$BCFW= 0
##$BC_mod= 2
##$BYTORDP= 0
##$COROFFS= 0
##$CY= -3
##$DATMOD= 1
##$DC= 0
##$DFILT= <>
##$DTYPP= 0
##$F1P= 0
##$F2P= 0
##$FCOR= 1
##$FTSIZE= 16384
##$FT_mod= 6
##$GAMMA= 0
##$GB= 0
##$INTBC= 1
##$INTSCL= 3.70164e-10
##$ISEN= 128
##$LB= 0.24
##$LEV0= 0
##$LPBIN= 0
##$MAXI= 10000
##$MC2= 0
##$MEAN= 0
##$ME_mod= 0
##$MI= 1.114404
##$NCOEF= 0
##$NC_proc= -8
##$NLEV= 6
##$NOISF1= 3.799351
##$NOISF2= 2.8
##$NSP= 0
##$NTH_PI= 0
##$NZP= 0
##$OFFSET= 15.76342
##$PC= 1
##$PHC0= -18032.46
##$PHC1= 4.6007
##$PH_mod= 1
##$PKNL= yes
##$PPARMOD= 0
##$PSCAL= 0
##$PSIGN= 0
##$REVERSE= no
##$SF= 200.130001625645
##$SI= 16384
##$SIGF1= 3
##$SIGF2= 2
##$SINO= 5.538805
##$SIOLD= 16384
##$SREGLST= <1H.CDCl3>
##$SSB= 0
##$STSI= 16384
##$STSR= 0
##$SW_p= 3612.71676300578
##$SYMM= 0
##$S_DEV= 0
##$TDeff= 16384
##$TDoff= 0
##$TI= <>
##$TILT= no
##$TM1= 0
##$TM2= 0
##$TOPLEV= 0
##$USERP1= <user>
##$USERP2= <user>
##$USERP3= <user>
##$USERP4= <user>
##$USERP5= <user>
##$WDW= 1
##$XDIM= 16384
##$YMAX_p= 301957010
##$YMIN_p= -3023258
$$ End of Bruker specific parameters
$$ ---------------------------------
##NTUPLES= NMR SPECTRUM
##VAR_NAME=  FREQUENCY,     SPECTRUM/REAL,   SPECTRUM/IMAG
##SYMBOL=    X,             R,               I
##VAR_TYPE=  INDEPENDENT,   DEPENDENT,       DEPENDENT
##VAR_FORM=  AFFN,          ASDF,            ASDF
##VAR_DIM=   16384,         16384,           16384
##UNITS=     HZ,            ARBITRARY UNITS, ARBITRARY UNITS
##FACTOR=    0.220516191357247, 1,           1
##FIRST=     3154.73329123547, 0,            0
##LAST=      -457.983471770314, 0,           0
##MIN=       -457.983471770314, -3023258,    0
##MAX=       3154.73329123547, 301957010,    0
$$ Real data points
##PAGE= N=1
##DATA TABLE= (X++(R..R)), XYDATA
$$ [...]
$$ plain form
12574 210050 197247 95593 249119 -121455 116791 64341 -344302 328149 568561 -90201
12564 -90201 -578784 17535 -190012 -318444 -485505 35639 -16532 -38589 374907 165979
12554 165979 137025 -56585 344575 495642 -26849 -524140 -299731 318103 51229 -45402
12544 -45402 80229 157446 111947 -518068 -292231 -363814 -237698 -57213 -319289 -595117
12534 -595117 -358591 -270635 228876 323792 46550 -244408 -290204 -277919 -203002 -645392
12524 -645392 -439514 -349883 -282049 141743 656125 88383 42678 656485 166739 -393618
12514 -393618 -77762 -91633 -244809 -543230 -518735 -208913 163259 -51072 -111754 162857
12504 162857 -615619 -133014 -226131 -345571 869 -101448 130555 249536 -43377 110235
$$ packed form
12574B10050j2803j01654J53526l70574K38246n2450m08643O72451K40412o58762
12564i0201m88583N96319k07547j28432j67061N21144n2171k2057M13496k08928
12554A65979k8954j93610M01160J51067n22491m97291K24409O17834k66874r6631
12544d5402J25631P7217m5499o30015K25837p1583J26116J80485k62076k75828
12534e95117K36526Q7956M99511R4916k77242k90958m5796J2285P4917m42390
12524f45392K05878Q9631O7834M23792N14382n67742m5705O13807m89746n60357
12514c93618L15856j3871j53176k98421K4495L09822L72172k14331o0682K74611
12504A62857p78476M82605r3117j19440L46440j02317K32003J18981k92913J53612
$$ plain form
12494 110235 290789 180535 -468086 46393 9725 294492 -151397 -184698 -59155 60935
12484 60935 71212 -227797 -233437 -299682 -337110 -33310 -400293 -407739 -275908 -536502 -562907
12473 -562907 121962 630716 93834 -246572 -450540 -36895 35771 -509073 -400996 8155
12463 8155 -232003 -256909 -339734 -226679 189574 274222 -366308 -595591 -442247 -124496
12453 -124496 -149783 96134 323277 224857 -239931 -136470 -547948 -240979 -73226 -236031
12443 -236031 97928 -109757 -300940 -518826 -112694 100085 114137 -106031 155343 294130
12433 294130 -144278 -224649 -210431 -5028 362245 95067 25836 -231359 -527281 -71309
12423 -71309 -48520 251316 87561 88747 541587 462455 199512 66543 -138804 -201300 -470480
$$ packed form
12494A10235J80554j10254o48621N14479l6668K84767m45889l3301J25543J20090
12484F0935J0277k99009n640o6245l7428L03800l66983p446J31831k60594k6405
12473e62907O84869N08754n36882l40406k03968M13645P2666n44844J08077M09151
12463H155k40158k4906q2825J13055M16253Q4648o40530k29283J53344L17751
12453a24496k5287K45917K27143r8420m64788J03461m11478L06969J67753j62805
12443b36031L33959k07685j91183k17886M06132K12779J4052k20168K61374J38787
12433B94130m38408q0371J4218K05403L67273k67178o9231k57195k95922M55972
12423g1309K2789K99836j63755J186M52840p9132k62943j32969k05347o2496k69180
$$ plain form
12412 -470480 -177061 -438712 -493573 -266560 -396811 -522583 -907124 -601439 -429824 -344108
12402 -344108 65545 185220 -156046 75595 -341847 -422745 -557073 -659096 -270455 -441492
12392 -441492 -60985 -186907 -156897 146869 307395 496814 437654 262014 145304 367050
12382 367050 -198868 -110543 -112534 -245006 -51155 -82928 30362 54252 -72017 72304
12372 72304 322630 70830 -318445 -367041 115518 278208 531774 497403 133829 182040
12362 182040 137006 -75851 -80043 34803 -103736 -204880 160969 374507 86959 320114
12352 320114 357909 91504 -322742 -35352 -108586 177964 -224241 -194909 -177281 -399901
12342 -399901 -39341 377771 478350 395147 301691 82837 218419 -12365 46367 -122746
$$ packed form
12412d70480K93419k61651n4861K27013j30251j25772l84541L05685J71615Q5716
12402c44108M09653J19675l41266K31641m17442q0898j34328j02023L88641j71037
12392d41492L80507j25922L0010L03766J60526J89419n9160j75640j16710K21746
12382C67050n65918Q8325j991j32472J93851l1773J13290K3890j26269J44321
12372G2304K50326k51800l89275m8596M82559J62690K53566l4371l63574M8211
12362A82040m5034k12857m192J14846j38539j01144L65849K13538k87548K33155
12352C20114L7795k66405m14246K87390p3234K86550m02205K9332J7628k22620
12342c99901L60560M17112J00579q3203r3456k18854J35582k30784N8732j69113
$$ plain form
12332 -122746 127757 239370 -241711 108377 370395 -21928 476002 -372107 -576301 -52522
12322 -52522 -119023 -265196 -271708 60439 -180062 -27155 531436 72563 93079 -159232
12312 -159232 -149980 -44413 -75468 140633 -54887 140898 566361 -44691 -106860 58191
12302 58191 12761 587227 756248 708218 713560 85462 -303068 -131502 -24441 -18854 263223
12291 263223 226192 89837 246412 202213 -103257 -374297 -237735 -422463 -134385 254406
12281 254406 -204373 -275042 -398655 -553184 83094 24690 -22980 -623524 -477290 -448549
12271 -448549 -107221 -268890 -589132 -416291 -312761 -38073 -40884 -338927 -316453 -297490
12261 -297490 -122167 391886 77992 8485 200287 228564 -293276 -275091 -367845 -414258
$$ packed form
12332a22746K50503J11613m81081L50088K62018l92323M97930q48109k04194N23779
12322e2522o6501j46173o512L32147k40501J52907N58591m58873K0516k52311
12312a59232R252J05567l1055K16101j95520J95785M25463o11052o2169J65051
12302E8191m5430N74466J69021m8030N342o28098l88530J71566J07061N587K82077
12291B63223l7031j36355J56575m4199l05470k71040J36562j84728K88078L88791
12281B54406m58779p0669j23613j54529O36278n8404m7670o00544J46234K8741
12271d48549L41328j61669l20242J72841J03530K74688k811k98043K2474J8963
12261b97490J75323N14053l13894o9507J91802K8277n21840J8185r2754m6413
$$ plain form
12251 -414258 -471610 -389435 -111090 -402016 -331876 156430 546589 726642 264633 150109
12241 150109 -510238 -468898 -702567 -626750 52377 41752 -45762 -250600 -302730 -442899
12231 -442899 -374038 -116202 82010 162940 113371 -130984 15510 -202716 25470 59884
12221 59884 -119653 35758 -378166 -686868 -673584 -84659 317131 388729 163541 25993
12211 25993 187615 62901 47969 349082 370662 439008 241999 -311322 201550 -256592
12201 -256592 -686042 -417438 63217 57755 4449 -160945 141630 561040 168390 110637
12191 110637 -132110 -706731 -540659 -551738 -384111 -157373 347845 40487 -410256 -157091
12181 -157091 361344 327402 186400 91994 284830 115587 169555 -329700 -283637 -123651
$$ packed form
12251d14258n7352Q2175K78345k90926P0140M88306L90159J80053m62009j14524
12241A50109o60347M1340k33669P5817O79127j0625q7514k04838n2130j40169
12231d42899O8861K57836J98212Q0930m9569k44355J46494k18226K28186L4414
12221E9884j79537J55411m13924l08702J3284N88925M01790P1598k25188j37548
12211B5993J61622j24714j4932L01113K1580O8346j97009n53321N12872m58142
12201b56592m29450K68604M80655n462n3306j65394L02575M19410l92650n7753
12191A10637k42747n74621J66072j1079J67627K26738N05218l07358m50743K53165
12181a57091N18435l3942j41002r4406J92836j69243N3968m99255M6063J59986
$$ plain form
12171 -123651 28827 293117 291806 63041 -332105 -23294 -417160 -346287 -279919 -370425
12161 -370425 -562735 -582714 -81225 -277113 16329 667301 446042 180214 -128888 -150667
12151 -150667 -86294 -39198 -300877 -131977 -947465 -702822 -299418 32117 98814 323441
12141 323441 -380393 -236913 -280649 -351246 -150509 39217 -250092 -233046 -219660 -407140
12131 -407140 -188181 74858 -213947 -870464 -1087127 -632679 -284535 -533835 -130737 -79860
12121 -79860 -39765 -159055 73524 283810 39644 -117193 -299956 385923 204694 -157670
12111 -157670 -315493 -341981 -92616 356483 1139713 164750 -492472 -464124 15957 -71099
12101 -71099 -520616 -665388 -250059 182703 89602 83886 155710 -19216 52923 -359093 -258249
$$ packed form
12171a23651J52478K64290j311k28765l95146L08811l93866P0873O6368r0506
12161c70425j92310j9979N01489j95888K93442O50972k21259k65828l09102k1779
12151a50667O4373M7096k61679J68900q15488K44643M03404L31535O6697K24627
12141C23441p03834J43480m3736p0597K00737J89726k89309J7046J3386j87480
12131d07140K18959K63039k88805o56517k16663M54448L48144k49300M03098N0877
12121g9860M0095j19290K32579K10286k44166j56837j82763O85879j81229l62364
12111a57670j57823k6488K49365M49099P83230r74963o57222K8348M80081q7056
12101g1099m49517j44772M15329M32762r3101n716P1824j74926P2139m12016J00844
$$ plain form
12090 -258249 -160818 -341412 -491708 -204976 -208040 -685548 -626001 -650851 -480291 -79430
12080 -79430 -269742 123631 139595 211476 217945 -38005 -153741 69273 -40021 -265310
12070 -265310 -121727 -328761 -336677 -194490 292752 561425 427029 -21380 21395 -6916
12060 -6916 -13488 -76127 -230091 -352617 -266228 60988 468590 110851 -321530 210698 484276
12049 484276 184188 413845 99272 12611 153349 -56577 -51696 -150065 311447 1728
12039 1728 10719 -362146 -146855 -136052 -366542 -433873 -264539 -329514 -467762 -250558 -20696
12028 -20696 -185491 -101117 378722 117155 -236506 62429 28987 -367142 -338725 -205849
12018 -205849 -47672 -6038 -321330 -219978 -838 -155703 -205977 30528 -296266 -300311
$$ packed form
12090b58249R7431j80594j50296K86732l064m77508N9547k4850J70560M00861
12080g9430j90312L93373J5964P1881O469k55950j15736K23014j09294k25289
12070b65310J43583k07034p916J42187M87242K68673j34396m48409M2775k8311
12060f916o572o2639j53964j22526Q6389L27216M07602l57739m32381N32228K73578
12049D84276l00088K29657l14573q6661J40738k09926M881r8369M61512l09719
12039A728Q991l72865K15291J0803k30490o7331J69334o4975j38248K17204K29862
12028b0696j64795Q4374M79839k61567l53661K98935l3442l96129K8417J32876
12018b05849J58177M1634l15292J01352K19140j54865n0274K36505l26794m045
$$ plain form
12008 -300311 -331992 -229764 280256 -341176 -282924 -244577 -358574 -390877 130025 -284542
11998 -284542 -467111 -608933 -635565 -480415 -352913 -166736 106060 -321944 -344167 -504769
11988 -504769 -413533 -476579 -103371 -403313 -59183 456619 -233426 -49053 157838 -99662
11978 -99662 298477 375873 239933 89887 -306303 -442551 -497943 -107377 -148307 335983
11968 335983 -118548 -409544 -232856 451819 502608 -155656 86310 299946 -492681 -393189
11958 -393189 -4927 100244 206620 94911 320463 181323 -117097 321520 520140 -258060
11948 -258060 -173657 184192 -134447 -329786 -163163 538031 563374 306837 321054 706985
11938 706985 503658 -216883 544425 921734 241550 99363 -280074 -67983 327605 479830
$$ packed form
12008c00311l1681J02228N10020o21432N8252L8347j13997l2303N20902m14567
11998b84542j82569j41822k6632J55150J27502J86177K72796m28004k2223j60602
11988e04769R1236o3046L73208k99942L44130N15802o90045J84373K06891k57500
11978i9662L98139P7396j35940j50046l96190j36248n5392L90566m0930M84290
11968C35983m54531k90996J76688O84675N0789o58264K41966K13636p92627R9492
11958c93189L88262J05171J06376j11709K25552j39140k98420M38617J98620p78200
11948b58060Q4403L57849l18639j95339J66623P01194K5343k56537J4217L85931
11938G06985k03327p20541P61308L77309o80184j42187l79437K12091L95588J52225
$$ plain form
11928 479830 365725 375849 216777 181970 27040 -259885 -204852 -158587 -368927 -182513
11918 -182513 -29570 -249682 406556 -257225 139973 93838 -328121 -80468 -277281 -88346
11908 -88346 -23009 -67392 -179712 -267684 -211961 145369 -7197 -122609 -841127 -314547
11898 -314547 281312 225888 -242194 -218166 498127 421893 611803 -138381 -42033 -15408
11888 -15408 -152525 -215881 -121413 81149 122127 129644 245872 -157467 -203833 -76739 2356
11877 2356 -29734 -166251 -48852 -235968 154453 182075 -63489 28634 192985 -249813
11867 -249813 364754 627883 129974 448296 115570 -169690 28907 -148361 -97648 58006
11857 58006 9549 -317314 -455625 -380757 -468109 -534103 -43149 210768 86501 -564479
$$ packed form
11928D79830j14105J0124j59072l4807j54930k86925N5033M6265k10340J86414
11918a82513J52943k20112O56238o63781L97198m6135m21959K47653j96813J88935
11908h8346O5337m4383j12320q7972N5723L57330j52566j15412p18518N26580
11898c14547N95859n5424m68082K4028P16293p6234J89910p50184R6348K6625
11888a5408j37117o3356R4468K02562M0978P517J16228m03339m6366J27094P9095
11877B356l2090j36517J17399j87116L90421K7622k45564R2123J64351m42798
11867b49813O14567K63129m97909L18322l32726k85260J98597j77268N0713J55654
11857E8006m8457l26863j38311P4868q7352o5994M90954K53917j24267o50980
$$ plain form
11847 -564479 -561518 -293006 -85974 275404 -116960 -535037 -500016 -510244 50313 -554142
11837 -554142 -546478 80983 -299839 70208 -225511 -390695 -84589 104387 188925 65305
11827 65305 295289 431271 -83263 -115234 340843 -129333 -514617 -418754 -147694 77608
11817 77608 136936 22445 5950 81677 -166168 -401059 -703895 -608517 -248165 -30067
11807 -30067 -129583 -291768 197254 -33750 -543482 -191457 -99644 -237101 -466898 143481
11797 143481 -10302 -207734 46496 3372 42261 -260716 -224304 -34785 178984 -235192
11787 -235192 172771 202826 -283755 -683846 -673829 -415423 -495004 -147158 258906 389271
11777 389271 282419 438507 425033 330792 -347066 141539 130373 13891 328949 656176
$$ packed form
11847e64479K961K68512K07032L61378l92364m18077L5021j0228N60557o04455
11837e54142P664O27461l80822L70047k95719j65184L06106J88976Q4538j23620
11827F5305K29984J35982n14534l1971M56077m70176l85284R5863K71060K25302
11817G7608N9328j14491j6495P5727k47845k34891l02836R5378L60352K18098
11807c0067r9516j62185M89022k31004n09732L52025R1813j37457k29797O10379
11797A43481j53783j97432K54230m3124L8889l02977L6412J89519K13769m14176
11787b35192M07963L0055m86581m00091J0017K58406p9581L47846M06064J30365
11777C89271j06852J56088j3474r4241o77858M88605j1166j16482L15058L27227
$$ plain form
11767 656176 371186 -29189 -450037 -408634 -38776 -51640 -267672 -208849 99374 324992
11757 324992 102735 106755 8483 -477546 -352777 22481 96623 -72838 -267848 -552290
11747 -552290 -401788 -214432 -243374 274461 -27129 -108711 -14638 -308148 -329116 -520637
11737 -520637 -187215 -267576 -542561 -583759 200806 81976 -42728 -77863 -223413 -116759
11727 -116759 -95020 -328411 -642760 -519717 -133307 353871 -227215 -117952 -287829 -431758
11717 -431758 -274731 -516113 -934406 -483291 116612 -20131 -104591 -834469 -219842 328715
11707 328715 295983 -36533 -118744 -264704 14126 277210 65207 160450 90323 -93866
11697 -93866 -528082 -266981 -477762 -434913 -361320 -194677 14642 289334 610222 506779
$$ packed form
11767F56176k84990m00375m20848M1403L69858j2864k16032N8823L08223K25618
11757C24992k22257M020r8272m86029J24769L75258P4142j69461j95010k84442
11747e52290J50502J87356k8942N17835l01590q1582R4073k93510k0968j91521
11737e20637L33422q0361k74985m1198P84565j18830j24704l5135j45550J06654
11727a16759K1739k33391l14349J23043L86410M87178n81086J09263j69877j43929
11717d31758J57027k41382m18293M51115N99903j36743q4460p29878O14627N48557
11707C28715l2732l32516q2211j45960K78830K63084k12003R5243p0127j84189
11697i3866m34216K61101k10781M2849P3593J66643K09319K74692L20888j03443
$$ plain form
11687 506779 711767 -105906 296697 69585 -314743 -336617 -383423 -116372 365458 39691
11677 39691 -254960 -524293 -444234 -655723 -368229 -680514 -559779 -44767 -168028 218217
11667 218217 -12926 -384422 -380331 -230890 -719943 -96859 -188499 -32508 -145101 -144069
11657 -144069 130335 -122933 -175750 186730 228295 -193506 -391771 -544695 -295063 64346
11647 64346 -226431 -485087 -313866 -388227 -427485 -208126 -414133 -266696 206465 267841
11637 267841 393257 139338 -304935 -86398 230424 128632 207693 330205 356088 62975
11627 62975 -498716 -642979 -267454 160306 210817 225092 -37924 -52176 -134113 -515138
11617 -515138 12242 8841 114753 135116 -480332 -624296 -475619 -698305 -582541 -293516
$$ packed form
11687E06779K04988q17673M02603k27112l84328k1874m6806K67051M81830l25767
11677C9691k94651k69333Q0059k11489K87494l12285J20735N15012j23261L86245
11667B18217k31143l71496M091J49441m89053O23084r1640J55991j12593J032
11657a44069K74404k53268n2817L62480M1565m21801j98265j52924K49632L59409
11647F4346k90777k58656J71221p4361l9258K19359k06007J47437M73161O1376
11637B67841J25416k53919m44273K18537L16822j01792P9061J22512K5883k93113
11627F2975n61691j44263L75525M27760N0511J4275k63016j4252q1937l81025
11617e15138N27380l401J05912K0363o15448j43964J48677k22686J15764K89025
$$ plain form
11607 -293516 -312915 -84710 585538 342903 -75467 -22448 29878 538315 404807 438250
11597 438250 459847 57383 74151 -141000 -488028 153511 169108 156504 24538 270373
11587 270373 350699 17231 -120197 -581221 -106918 494337 5553 -586935 -929530 -877569
11577 -877569 -509380 -205775 -162838 -36125 -362819 -540415 -584054 -540668 -116171 -157032
11567 -157032 -267526 30114 -57134 -203943 181710 -293204 -566499 -767519 -839365 -234037
11557 -234037 -279553 -182972 -420675 -89300 -215706 -392883 203970 559449 374329 133062
11547 133062 179371 109858 -36853 -161673 -250314 -553857 -59376 567009 249452 -63450
11537 -63450 -214514 76253 399473 324451 -58054 -57405 395638 160414 -368751 -393334 248209
$$ packed form
11607b93516j9399K28205O70248k42635m18370N3019N2326N08437j33508L3443
11597D38250K1597m02464J6768k15151l47028O41539J5597j2604j31966K45835
11587B70373Q0326l33468j37428m61024M74303O01255m88784n92488l42595N1961
11577h77569L68189L03605M2937J26713l26694j77596m3639M3386M24497m0861
11567a57032j10494K97640q7248j46809L85653m74914k73295k01020p1846O05328
11557b34037m5516R6581k37703L31375j26406j77177N96853L55479j85120k41267
11547A33062M6309o9513j46711j24820q8641l03543M94481O26385l17557l12902
11537f3450j51064K90767L23220p5022l82505O49M53043k35224n29165k4583O41543
$$ plain form
11526 248209 671159 412216 170958 -263471 -302645 -93655 -150470 127716 122979 -145467
11516 -145467 -96194 -25229 -313816 -803260 -588704 -718718 -753987 -293827 -95839 -407048
11506 -407048 -869008 -770264 -976124 -714509 -389346 -297346 22357 76649 -168821 -307133
11496 -307133 -196084 121928 -119204 306401 300234 369860 52583 -434595 -444478 -42024
11486 -42024 -205619 -141622 -99109 -25519 -274612 -515614 2037 151744 174594 -330853
11476 -330853 -508087 86891 -20904 -649715 -905681 -412399 -636416 -548971 -198368 214478
11466 214478 264710 -136158 23259 -183256 -193887 -149589 -253038 -146785 -414446 -448957
11456 -448957 -196738 338058 93021 -43722 -311815 -671089 -482345 -394652 178700 111806
$$ packed form
11526B48209M22950k58943k41258m34429l9174K08990n6815K78186m737k68446
11516a45467M9273P0965k88587m89444K14556j30014l5269M60160J97988l11209
11506d07048m61960R8744k05860K61615L25163R2000L19703N4292k45470j38312
11496c07133J11049L18012k41132M25605o167O9626l17277m87178r883M02454
11486d2024j63595O3997M2513P3590k49093k41002N17651J49707K2850n05447
11476c30853j77234N94978j07795o28811k55966M93282k24017Q7445L50603M12846
11466B14478N0232m00868J59417k06515j0631M4298j03449J06253k67661l4511
11456d48957K52219N34796k45037j36743k68093l59274J88744Q7693N73352o6894
$$ plain form
11446 111806 -165436 -301709 5671 -156143 -131671 -89517 -4748 -320130 -409045 -16261
11436 -16261 160240 53162 35125 55419 -204319 -169698 204067 80578 -128150 -43002
11426 -43002 115516 35790 206328 -146633 -257695 -94127 -651058 -460143 59968 303277
11416 303277 -129319 -605466 -628095 -382135 -375101 -404313 -158733 -2107 -30045 370829
11406 370829 479783 -129978 -399657 -336173 -206767 -465562 -495037 -283815 -320555 -72603
11396 -72603 445004 190609 -295781 -544991 -487136 -80562 180775 -51471 324312 -508268
11386 -508268 -453150 -239313 -268232 -49696 489837 440308 60238 -21597 -294640 -77634
11376 -77634 -275550 -192421 -111692 -185995 -179467 -106058 41227 -128855 -259450 -93321 184901
$$ packed form
11446A11806k77242j36273L07380j61814K4472M2154Q4769l15382q8915L92784
11436a6261J76501j07078j8037K0294k59738L4621L73765j23489k08728Q5148
11426d3002J58518p9726J70538l52961j11062J63568n56931J90915N20111K43309
11416C03277m32596m76147k2629K45960P034k9212K45580J56626k7938M00874
11406C70829J08954o09761k69679O3484J29406k58795k9475K11222l6740K47952
11396g2603N17607k54395m86390k49210N7855M06574K61337k32246L75783q32580
11386e08268N5118K13837k8919K18536N39533m9529l80070q1835k73043K17006
11376g7634j97916Q3129Q0729p4303O528P3409J47285j70082j30595J66129K78222
$$ plain form
11365 184901 332894 120981 -326292 -527151 -396376 -419751 -284453 286740 492657 -5713
11355 -5713 -172936 -176449 -61657 -531983 24008 -170387 -646904 -584981 -656289 -483836 -118116
11344 -118116 361860 89044 -470434 -352407 -243959 -402470 -422366 -3025 196726 268471
11334 268471 75673 -240118 61373 -67308 -57139 227585 36585 146088 136596 -465648
11324 -465648 -986954 -825290 -138062 599563 675005 556767 94343 118231 -258558 -193100
11314 -193100 -283249 -149975 68288 -150484 -310940 -793432 -191810 133106 -3020 -74026
11304 -74026 45133 -35128 223940 283635 -205507 -112806 58219 -259509 -199869 -204464 -815492
11293 -815492 -548059 -292972 -913884 -209618 -445601 -202261 -217481 -521890 -942669 -820145
$$ packed form
11365A84901J47993k11913m47273k00859J30775k3375J35298N71193K05917m98370
11355e713j67223l513J14792m70326N55991j94395m76517O1923p1308J72453L65720
11344a18116M79976k72816n59478J18027J08448j58511j9896M19341J99751P1745
11334B68471j92798l15791L01491j28681J0169K84724j91000J09503r492o02244
11324d65648n21306J61664O87228P37625P5442j18238m62424K3888l76789O5458
11314a93100r0149J33274K18263k18772j60456m82492O01622L24916j36126p1006
11304g4026J19159q0261K59068N9695m89142R2701J71025l17728N9640m595o11028
11293h15492K67433K55087o20912P04266k35983K43340j5220l04409m20779J22524
$$ plain form
11283 -820145 -752191 -263753 890738 287040 -183193 -251577 -10685 159362 300573 430134
11273 430134 558375 294201 150466 191114 -436918 24025 -268713 -513577 -214010 -114592
11263 -114592 -249912 -88849 86530 -331905 -428579 -345969 -679847 -792470 -393692 198501
11253 198501 629951 199665 -365383 -420841 -175070 -184437 197622 234986 388357 740662
11243 740662 389005 303176 35504 -199660 18464 170341 263261 90868 -150536 -288511
11233 -288511 354448 -80618 -5650 -416906 -316340 -592052 -783775 -354310 -231713 -752391
11223 -752391 -704169 -685731 -585608 -638489 -572472 -645649 -142104 280393 -406642 -221664
11213 -221664 49015 436583 111418 193166 771075 378028 -49737 286853 -180193 183763
$$ packed form
11283h20145O7954M88438J154491o03698m70233o8384K40892J70047J41211J29561
11273D30134J28241k64174j43735M0648o28032M60943k92738k44864K99567R9418
11263a14592j35320J61063J75379m18435r6674Q2610l33878j12623L98778N92193
11253A98501M31450m30286n65048n5458K45771r367L82059L7364J53371L52305
11243G40662l51657q5829k67672k35164K18124J51877R2920j72393k41404j37975
11233b88511O42959m35066P4968m11256J00566k75712j91723M29465J22597n20678
11223g52391M8222J8438J00123n2881O6017p3177N03545M22497o87035J84978
11213b21664K70679L87568l25165Q1748N77909l93047m27765L36590m67046L63956
$$ plain form
11203 183763 -97356 79234 457100 322574 -122693 98922 425212 67850 -100262 -316626
11193 -316626 195740 472587 389872 -197372 -481436 -99032 96035 -222683 198862 85283
11183 85283 308759 21782 312074 477597 538389 585133 235303 316852 150753 -62389
11173 -62389 -111934 67773 165408 -60622 -39129 241076 74067 -147450 -122138 -43645 -130052
11162 -130052 -86473 -389603 356976 -222061 -332598 204509 79594 -296014 -593309 -252946
11152 -252946 120022 -150192 158726 162054 -308403 -427359 -259576 -281183 265453 595710
11142 595710 579071 29596 -504727 -75849 -155491 -417332 -339526 -144875 237099 162565
11132 162565 156706 170658 350157 139550 -280940 -426639 -311141 -81220 -276735 180746
$$ packed form
11203A83763k81119J76590L77866j34526m45267K21615L26290l57362j68112k16364
11193c16626N12366K76847q2715n87244k84064L82404J95067l18718M21545j13579
11183H5283K23476k86977K90292J65523O0792M6744l49830Q1549j66099k13142
11173f2389m9545J79707R7635k26030K1493K80205j67009k21517K5312P8493q6407
11162a30052M3579l03130P46579n79037j10537N37107j24915l75608k97295L40363
11152b52946L72968k70214L08918L328m70457j18956J67783k1607N46636L30257
11142E95710j6639n49475n34323M28878p9642k61841P7806J94651L81974p4534
11132A62565n859J3952J79499k10607m20490j45699J15498K29921j95515M57481
$$ plain form
11122 180746 821761 371372 139874 -230 -295306 223913 58267 -8310 20442 -251505
11112 -251505 -166381 -169897 -44622 38075 95486 189776 362957 224210 99660 503129 233667
11101 233667 20863 -54035 446451 145896 -298767 30610 467205 898513 590522 447467
11091 447467 194280 -161131 141770 269854 297143 63175 -210415 -233549 -484346 -13795
11081 -13795 25129 -359382 -250983 -265441 -211591 -504976 -436296 -430994 -123476 215525 363039
11070 363039 726795 443100 -10633 -670810 -215679 -124591 30338 481268 -19234 -479360
11060 -479360 -244061 -66969 -21230 27825 -99019 -282129 8411 478942 312032 89125
11050 89125 141769 -289547 -101621 152085 170206 347784 231097 123953 -295896 62451
$$ packed form
11122A80746O41015m50389k31498j40104k95076N19219j65646o6577K8752k71947
11112b51505Q5124l516J25275Q2697N7411R4290J73181j38747j24550M03469k69462
11101B33667k12804p4898N00486l00555m44663L29377M36595M31308l07991j43055
11091D47467k53187l55411L02901J28084K7289k33968k73590k3134k50797M70551
11081a3795L8924l84511J08399j4458N3850k93385O8680N302L07518L39001J47514
11070C63039L63756k83695m53733o60177M55131R1088J54929M50930n00502m60126
11060d79360K35299J77092M5739M9055j26844j83110K90540M70531j66910k22907
11050H9125N2644m31316J87926K53706J8121J77578j16687j07144m19849L58347
$$ plain form
11040 62451 181589 200478 -85653 156579 274087 592183 109076 -152631 -394799 -50006
11030 -50006 -155997 -38326 381789 150122 -96694 345066 59930 -462475 -450739 -292458
11020 -292458 -465056 -431760 -126520 -50700 -206088 -60240 438903 119131 526031 222930
11010 222930 273775 240603 24198 -364265 -178196 -141204 -195249 -586843 -14816 156848
11000 156848 184204 -107902 -275845 330623 19624 -219413 -213690 -686698 -701578 -230512
10990 -230512 -95237 -211512 343567 545839 545092 -133240 -59732 213458 137955 198284 -413788
10979 -413788 75802 73633 41530 -254168 49786 319033 491634 508649 351158 145567
10969 145567 345972 -131664 -59073 -45073 170112 28536 -238311 26509 -214990 -274542
$$ packed form
11040F2451J19138J8889k86131K42232J17508L18096m83107k61707k42168L44793
11030e0006j05991J17671M20115k31667k46816M41760k85136n22405J1736J58281
11020b92458j72598L3296L05240P5820j55388J45848M99143l19772M06900l03101
11010B22930N0845l3172k16405l88463J86069L6992n4045l91594N72027J71664
11000A56848K7356k92106j67943O06468l10999k39037N723m73008j4880M71066
10990b30512J35275j16275N55079K02272p47o78332P3508K73190p5503O0329o12072
10979d13788M89590k169l2103k95698L03954K69247J72601J7015j57491k05591
10969A45567K00405m77636P2591J4000K15185j41576k66847K64820k41499n9552
$$ plain form
10959 -274542 -254191 -54551 275253 356158 302329 175695 140791 -204789 -304387 -374858 -81155
10948 -81155 66549 -707 102675 248212 626341 20414 309970 423384 856679 772334
10938 772334 384580 -117819 -294977 22521 256240 74302 -115735 90239 356410 571148
10928 571148 372284 436714 163746 -320407 -217851 117980 206185 49511 504978 529841
10918 529841 97738 302422 279854 236233 435948 360737 52299 386161 446203 372237
10908 372237 581121 326745 -187913 350466 -77929 -316352 89397 5861 77137 98401
10898 98401 599432 117944 162260 278611 315825 168451 432102 101342 -19321 132319
10888 132319 138366 102428 -159374 -121074 -235400 -142621 -33438 -14290 -92314 -25769 -101791
$$ packed form
10959b74542K0351J99640L29804Q0905n3829j26634l4904l45580r9598p0471K93703
10948h1155J47704o7256J03382J45537L78129o05927K89556J13414M33295q4345
10938G72334l87754n02399j77158L17498K33719j81938j90037K05974K66171K14738
10928E71148j98864O4430k72968m84153J02556L35831Q8205j56674M55467K4863
10918E29841m32103K04684k2568m3621J99715p5211l08438L33862O0042p3966
10908C72237K08884k54376n14658N38379m28395k38423M05749q3536P1276K1264
10898I8401N01031m81488M4316J16351L7214j47374K63651l30760j20663J51640
10888A32319O047l5938k61802L8300j14326R2779J09183J9148p8024O6545p6022
$$ plain form
10877 -101791 -23896 -113635 345917 867120 883300 521152 139836 555056 223211 -141465
10867 -141465 -199725 -226066 9940 215970 72167 245259 422144 311143 540439 208358
10857 208358 145308 464999 256114 137193 524442 409116 -443851 -300587 -322650 92159
10847 92159 254861 230247 -155619 -381574 -62944 75021 -56290 284474 440732 468035
10837 468035 244095 -139279 -83256 -205494 105705 416615 113992 -29789 -330706 -35304
10827 -35304 -102757 -435458 -77602 46010 17884 14546 96809 -257121 -317410 -83904 -10940
10816 -10940 -288849 -400418 -113071 308417 269324 465521 -35277 465979 69057 -121270
10806 -121270 -336544 -59952 118238 463141 613229 556906 576325 634633 410729 825795
$$ packed form
10877a01791P7895q9739M59552N21203J6180l62148l81316M15220l31845l64676
10867a41465n8260k6341K36006K06030j43803J73092J76885j11001K29296l32081
10857B08358o3050L19691k08885j18921L87249j15326q52967J43264k2063M14809
10847I2159J62702k4614l85866k25955L18630J37965j31311L40764J56258K7303
10837D68035k23940l83374N6023j22238L11199L10910l02623j43781l00917K95402
10827c5304o7453l32701L57856J23612k8126l338Q2263l53930o0289K33506P2964
10816a0940k77909j11569K87347M21488l9093J96197n00798N01256l96922j90327
10806a21270k15274K76592J78190L44903J50088n6323J9419N8308k23904M15066
$$ plain form
10796 825795 873076 709317 323987 156249 -8714 -232562 4802 129119 123564 -16144
10786 -16144 414899 850332 862121 776925 906567 540302 605666 761693 316673 447392
10776 447392 223681 175766 -302303 -432021 -73159 431122 289870 141413 570359 222655
10766 222655 273767 507649 229087 155089 230492 303323 794958 580299 376450 291510
10756 291510 465366 457732 335539 509636 230987 124084 585126 308780 347476 335436
10746 335436 719306 483662 763358 714546 574504 256968 161261 552229 520162 582998
10736 582998 329146 -189242 264734 859161 1148116 803186 411144 165237 502199 221624
10726 221624 110822 474852 209860 -75452 90099 327382 182247 166342 58968 244698
$$ packed form
10796H25795M7281j63759l85330j67738j64963k23848K37364J24317n555j39708
10786a6144M31043M35433J1789q5196J29642l66265O5364J56027m45020J30719
10776D47392k23711m7915m78069j29718L58862N04281j41252j48457M28946l47704
10766B22655N1112K33882k78562p3998P5403P2831M91635k14659k03849q4940
10756B91510J73856p634j22193J74097k78649j06903M61042k76346L8696j2040
10746C35436L83870k35644K79696m8812j40042l17536r5707L90968l2067O2836
10736E82998k53852n18388M53976N94427K88955l44930l92042k45907L36962k80575
10726B21624j10802L64030k64992k85312J65551K37283j45135j5905j07374J85730
$$ plain form
10716 244698 214619 -3263 -89764 424628 612071 338997 -79853 42100 -42012 -116988
10706 -116988 286552 145162 96645 27172 309853 712122 714877 764944 149356 -257715
10696 -257715 395685 325694 25732 635974 658670 664411 879880 246923 438205 113115
10686 113115 303968 432463 368847 687620 581226 500988 545772 686423 1151082 633945
10676 633945 758747 901941 470861 334052 398859 556551 -4312 -53006 -176551 -241868
10666 -241868 157795 253055 113963 -129075 85676 678279 595666 63406 736375 912091
10656 912091 726261 410444 233733 731700 674243 742637 773759 795747 387090 239676
10646 239676 643494 768471 354738 310485 251688 497096 84151 255970 896943 1183952
$$ packed form
10716B44698l0079k17882q6501N14392J87443k73074m18850J21953q4112p4976
10706a16988M03540j41390m8517o9473K82681M02269K755N0067o15588m07071
10696b57715O53400o9991k99962O10242K2696N741K15469o32957J91282l25090
10686A13115J90853J28495o3616L18773j06394q0238M4784J40651M64659n17137
10676F33945J24802J43194m31080j36809O4807J57692n60863m8694j23545o5317
10666b41868L99663R5260j39092k43038K14751N92603q2613n32260O72969J75716
10656I12091j85830l15817j76711M97967n7457O8394L1122K1988m08657j47414
10646B39676M03818J24977m13733m4253n8797K45408m12945J71819O40973K87009
$$ plain form
10636 1183952 676723 835321 957965 1032571 591378 270358 304574 489788 189306 22069
10626 22069 -105368 -186515 86375 187046 260848 482220 517806 382740 1038459 1267274
10616 1267274 827161 818608 948624 1064116 1037981 582335 66941 881419 712224 268991
10606 268991 758102 635726 533936 348640 567565 993951 716149 577951 965386 1031528
10596 1031528 1196325 1431819 1107914 746913 1192506 1002346 877300 610365 493887
10587 493887 341750 28559 495029 1056034 1478017 1385980 811509 923294 886180 1169320
10577 1169320 998742 1050528 1142054 1006580 751263 1154811 789330 550733 754976 95895
10567 95895 -68095 258102 466172 299642 553676 423781 659156 950564 954602 850320
$$ packed form
10636A183952n07229J58598J22644P4606m41193l21020L4216J85214l00482j67237
10626B2069j27437q1147K72890J00671P3802K21372L5586j35066O55719K28815
10616A267274m40113q553J30016J15492k6135m55646n15394Q14478j69195m43233
10606B68991M89111j22376j01790j85296K18925M26386k77802j38198L87435O6142
10596A031528J64797K35494l23905l61001M45593j90160j25046k66935j16478
10587D93887j52137l13191M66470N61005M21983r2037n74471J11785l7114K83140
10577A169320j70578N1786R1526j35474k55317M03548l65481k38597K04243o59081
10567I5895j63990L26197K08070j66530K54034j29895K35375K91408M038j04282
$$ plain form
10557 850320 739907 555541 913235 900089 569963 643891 420596 584006 580803 526046
10547 526046 404148 495987 677078 757129 953734 552417 719279 914451 503145 547034
10537 547034 946581 917569 384646 769155 529895 555289 776748 245943 311977 305305
10527 305305 516519 603857 760096 572049 434512 673885 474104 157516 567768 148483
10517 148483 316189 648319 1009271 738543 970447 1068163 800700 716032 724362 1345903
10507 1345903 1288086 986954 904781 1152010 652836 400943 539912 879461 674277 995632
10497 995632 679310 866388 1353595 865022 543309 631945 -11632 106036 394404 165920
10487 165920 413443 840031 1232124 1389686 1375302 1197178 1480805 1002664 722924 942084
$$ packed form
10557H50320j10413j84366L57694j3146l30126P3928k23295J63410l203n4757
10547E26046j21898R1839J81091Q0051J96605m01317J66862J95172m11306M3889
10537E47034L99547k9012n32923L84509k39260K5394K21459n30805O6034o672
10527C05305K11214Q7338J56239j88047j37537K39373j99781l16588M10252m19285
10517A48483J67706L32130L60952k70728K31904R7716k67463q4668Q330O21541
10507A345903n7817l01132q2173K47229m99174k51893J38969L39549k05184L21355
10497I95632l16322J87078M87207m88573l21713Q8636o43577J17668K88368k28484
10487A65920K47523M26588L92093J57562j4384j78124K83627m78141k79740K19160
$$ plain form
10477 942084 1030433 955828 1135306 1293301 1274623 869802 852588 1130392 994123 920197
10467 920197 1026170 659388 899931 1410716 1335721 1040588 949326 1405876 1130528 619417
10457 619417 678285 809984 699656 1135706 881244 1105469 1102463 813667 437022 542912
10447 542912 665861 771341 1511188 1253832 810949 673506 983083 1124660 1105914 846665
10437 846665 1047360 1287907 1163948 1244367 1737530 1279392 1066217 1101457 941556 1474757
10427 1474757 1796066 1499567 1038069 1415825 1706367 1831101 1987409 1869534 1845899 1589211
10417 1589211 1347126 1962591 2156973 1887852 1263202 1575046 1743077 1179010 1290676
10408 1290676 1270896 1107383 1239125 1048130 729780 949545 1415261 1604749 1622639 1205313
$$ packed form
10477I42084Q8349p4605J79478J57995j8678m04821j7214K77804j36269p3926
10467I20197J05973l66782K40543N10785p4995k95133r1262M56550k75348n11111
10457F19417N8868J31699j10328M36050k54462K24225l006k88796l76645J05890
10447E42912J22949J05480P39847k57356m42883j37443L09577J41577j8746k59249
10437H46665K00695K40547j23959Q0419M93163m58138k13175L5240j59901N33201
10427A474757L21309k96499m61498L77756K90542J24734J56308j17875k3635k56688
10417A589211k42085O15465J94382k69121o24650L11844J68031n64067J11666
10408A290676j9780j63513J31742j90995l18350K19765M65716J89488J7890m17326
$$ plain form
10398 1205313 1002121 1306776 1640507 2189907 1980440 1340358 1352760 1711646 1617237 1515267
10388 1515267 1435136 1525768 1747572 1158355 1424990 1715490 1531556 1602122 1972044 2088954
10378 2088954 2155114 1991702 1892236 2138838 2010524 1945133 1749767 1801487 2039201 1944698
10368 1944698 1997981 1873748 1787917 2054036 2018216 2059778 2048625 1984320 1877590 1469610
10358 1469610 1237313 1873439 1792163 1672328 1827789 2114955 1548495 1708340 2056727 2230848
10348 2230848 1877727 2373580 2716383 2746270 2554509 1817416 2270763 2429427 2350765 2568374
10338 2568374 2857588 2584766 2388787 2534433 2849714 2923010 2994845 3234399 2646981 2451124
10328 2451124 3097717 3257381 3620552 3494537 3040968 3127227 3556730 3554721 3474075 3182648
$$ packed form
10398A205313k03192L04655L33731N49400k09467o40082J2402L58886r4409j01970
10388A515267q0131R0632K21804n89217K66635K90500j83934P0566L69922J16910
10378B088954O6160j63412r9466K46602j28314o5391j95366N1720K37714r4503
10368A944698N3283j24233q5831K66119l5820M1562j1153o4305j06730m07980
10358A469610k32297O36126q1276j19835J55461K87166n66460J59845L48387J74121
10348B230848l53121M95853L42803K9887j91761p37093M53347J58664p8662K17609
10338B568374K89214k72822j95979J45646L15281P3296P1835K39554n87418j95857
10328B451124O46593J59664L63171j26015m53569Q6259M29503k009q0646k91427
$$ plain form
10318 3182648 2867960 3259883 3410979 3580597 3679748 3838294 3593166 3706051 3643222 3348147
10308 3348147 3209788 3426716 4008395 4759663 4899421 4545910 4829829 4946242 4401005
10299 4401005 4674313 4715061 4935462 5747276 5509286 5144501 5113234 5689645 5446006 5550729
10289 5550729 5901037 5918973 6575965 6489011 6362401 6292182 6467218 7020749 6874076 7151635
10279 7151635 7455570 7238004 7421934 7480676 7229377 6982357 7382886 7530549 7427032 7754710
10269 7754710 7637890 7602154 7886806 8013060 8511041 8708265 7806145 8247152 8436472 8359090
10259 8359090 7988148 8058068 8141812 8169341 8371741 8655887 8815623 9135447 9057324 9031048
10249 9031048 9363398 9546734 9523087 9987681 10382357 10266412 10004204 9890838 10431398 11039281
$$ packed form
10318C182648l14688L91923J51096J69618R9151J58546k45128J12885o2829k95075
10308C348147j38359K16928N81679P51268J39758l53511K83919J16413n45237
10299D401005K73308M0748K20401Q11814k37990l64785l1267N76411k43639J04723
10289E550729L50308J7936O56992q6954j26610p0219J75036N53531j46673K77559
10279G151635L03935k17566J83930N8742k51299k47020M00529J47663j03517L27678
10269G754710j16820l5736K84652J26254M97981J97224r02120M41007J89320p7382
10259H359090l70942O9920Q3744K7529K02400K84146J59736L19824p8123k6276
10249I031048L32350J83336k3647M64594L94676j15945k62208j13366N40560O07883
$$ plain form
10239 11039281 10993679 11035341 10863634 10538155 11138994 11615678 11312786 11214696 11421035 11344211
10229 11344211 11423580 11555745 11618140 11208931 11036955 10991128 10875722 10983300 10983764 10970296
10219 10970296 10873173 10131500 10132421 11290902 11024467 10712726 11172846 11059682 10535258 10515640
10209 10515640 10976464 11072592 11040139 10372208 10343651 9895424 9891870 9805960 9572786 9908067
10199 9908067 9863390 9686373 9747732 9644885 9673783 9584008 9227243 9242757 9419937 8946057
10189 8946057 9359556 9742875 9525296 9670855 9371854 9147009 9525374 9684823 9242972
10180 9242972 9485445 9522331 9298198 8876231 8938188 8979072 9208481 8763956 8278770 8135214
10170 8135214 7754685 7863356 7738357 6769775 6668789 7014604 7067892 7227970 7270971 7056661
$$ packed form
10239A1039281m5602M1662j71707l25479O00839M76684l02892r8090K06339p6824
10229A1344211P9369J32165O2395m09209j71976m5827j15406J07578M64j3468
10219A0970296r7123p41673R21J158481k66435l11741M60120j13164n24424j9618
10209A0515640M60824R6128l2453o67931k8557m48227l554q5910k33174L35281
10199I908067m4677j77017O1359j02847K8898q9775l56765J5514J77180m73880
10189H946057M13499L83319k17579J45559k99001k24845L78365J59449m41851
10180I242972K42473L6886k24133m21967O1957M0884K29409m44525m85186j43556
10170H135214l80529J08671j24999r68582j00986L45815N3288J60078M3001k14310
$$ plain form
10160 7056661 6729936 6730425 6599781 6399717 6166475 6092294 6225524 6668915 6284106 6379045
10150 6379045 5913342 5747654 5987217 5984087 6010499 5536286 5263979 5092362 5146110 5400130
10140 5400130 5519536 5545496 5445808 5165949 5405030 5099810 5531075 5516585 5363450 5100710
10130 5100710 5285652 5490087 5249235 5422160 4791554 4545738 4863920 5041983 4883282
10121 4883282 4933000 5105949 5284473 5644100 5283892 4923563 5026362 4819311 4852820 4971338
10111 4971338 4954036 4797216 5606254 5389543 5515353 5613711 4985462 4634121 4792019 4835669
10101 4835669 5375665 5381254 5180664 5149510 5286587 5953495 5435414 5176103 5089953 5422375
10091 5422375 5388482 5272180 5336687 4772835 4996572 4870326 5270983 5392110 5420589 6238825
$$ packed form
10160G056661l26725M89j30644k00064k33242p4181J33230M43391l84809R4939
10150F379045m65703j65688K39563l130K6412m74213k72307j71617N3748K54020
10140E400130J19406K5960r9688k79859K39081l05220M31265j4490j53135k62740
10130E100710J84942K04435k40852J72925o30606k45816L18182J78063j58701
10121D883282M9718J72949J78524L59627l60208l60329J02799k07051L3509J18518
10111D971338j7302j56820Q09038k16711J25810R8358o28249l51341J57898M3650
10101D835669N39996N589k00590l1154J37077O66908n18081k59311q6150L32422
10091E422375l3893j16302O4507n63852K23737j26246M00657J21127K8479Q18236
$$ plain form
10081 6238825 5689290 5463795 5425920 5554756 5811532 5438191 5466966 5675462 6215116 6090737
10071 6090737 5586945 5381553 5650548 5817289 5626266 5747123 5805684 5718988 6176634 6226782
10061 6226782 6312337 6369556 6533945 5960251 5767688 6233083 6048047 6238465 6175302 6359114
10051 6359114 6490241 6571274 6724948 6422029 6483773 6668959 6546659 6877459 6691660 6601633
10041 6601633 6592551 6647532 6283376 6163716 6482682 6961499 7072934 6961350 6843711 7264878
10031 7264878 7351862 7413829 7269189 7336410 7021364 6934787 7482431 7915866 8120681 7479777
10021 7479777 7435158 7821842 7496592 7789304 7968049 8071798 7918508 8080537 7666978 7838137
10011 7838137 8515764 8490336 8679050 8428880 8646147 8701734 9063924 9205672 9122451 8826810
$$ packed form
10081F238825n49535k25495l7875J28836K56776l73341K8775K08496N39654j24379
10071F090737n03792k05392K68995J66741j91023J20857N8561q6696M57646N0148
10061F226782Q5555N7219J64389n73694j92563M65395j85036J90418o3163J83812
10051F359114J31127Q1033J53674l02919O1744J85186j22300L30800j85799r0027
10041F601633r082N4981l64156j19660L18966M78817J11435j11584j17639M21167
10031G264878Q6984O1967j44640O7221l15046q6577N47644M33435K04815o40904
10021G479777m4619L86684l25250K92712J78745J03749j53290J62029m13559J71159
10011G838137O77627k5428J88714k50170K17267N5587L62190J41748q3221k95641
$$ plain form
10001 8826810 8709194 8876645 9124965 9530105 9501467 9296986 9681774 9784641 9853166 9582251
9991 9582251 9749084 10568473 10557452 10399760 10480516 10527001 10597557 11189223 11103724 11375440
9981 11375440 11267137 11181248 11290869 11571258 11667858 12098816 12023386 12197297 12370702 12347416
9971 12347416 12730339 12483062 12748519 12721869 12788018 13710816 14463554 14567470 14617500 14851324
9961 14851324 14651652 14834917 15098460 15022653 15371473 15750094 15914340 16019689 16511923 16741346
9951 16741346 16629752 17125692 17145867 16949302 17168171 17413025 17575971 17628456 18041180 17699980
9941 17699980 18095476 18206821 18617428 18894655 18482977 18419620 19112916 19000537 19146838 19281169
9931 19281169 19428820 19471977 19257616 19238201 19426048 19546763 20065593 20407272 20146977 20777242
$$ packed form
10001H826810j17616J67451K48320M05140k8638k04481L84788J02867O8525k70915
9991I582251J66833Q19389j1021j57692Q0756M6485P0556N91666q5499K71716
9981A1375440j08303q5889J09621K80389R6600M30958p5430J73911J73405k3286
9971A2347416L82923k47277K65457k6650O6149R22798P52738J03916N0030K33824
9961A4851324j99672J83265K63543p5807L48820L78621J64246J05349M92234K29423
9951A6741346j11594M95940K0175j96565K18869K44854J62946N2485M12724l41200
9941A7699980L95496J11345M10607K77227m11678o3357O93296j12379J46301J34331
9931A9281169J47651M3157k14361j9415J87847J20715N18830L41679k60295O30265
$$ plain form
9921 20777242 21020144 21085913 20875321 20675438 21572776 22279084 22246956 22184541 22382281 22781996
9911 22781996 23216176 23287847 23122967 23258468 23610330 23800648 23955797 23981415 24379820 24777177
9901 24777177 25384809 25434000 25411455 25287434 25277388 25127312 25509899 25768095 25683161 25701426
9891 25701426 25803927 25889584 26265170 26532438 26282811 26904941 26749719 26004357 26001233 26141748
9881 26141748 25801657 25650592 26064468 25889660 26542112 26594027 26452324 26651623 26249758 26688579
9871 26688579 26655145 27063793 26639087 26983517 27491617 27856666 28168171 28203477 28638999 28874345
9861 28874345 28741543 28700509 29313681 29765372 29404814 29472723 29726187 29986960 30499887 30222238
9851 30222238 29966921 29722354 30126980 30436498 30820466 31157604 30968802 31305798 31656012
$$ packed form
9921B0777242K42902O5769k10592j99883Q97338P06308l2128o2415J97740L99715
9911B2781996M34180P1671j64880J35501L51862J90318J55149K5618L98405L97357
9901B4777177O07632M9191k2545j24021j0046j50076L82587K58196q4934J8265
9891B5701426J02501Q5657L75586K67268k49627O22130j55222p45362l124J40515
9881B6141748l40091j51065M13876j74808O52452N1915j41703J99299m01865M38821
9871B6688579l3434M08648m24706L44430N08100L65049L11505L5306M35522K35346
9861B8874345j32802m1034O13172M51691l60558O7909K53464K60773N12927k77649
9851C0222238k55317k44567M04626L09518L83968L37138j88802L36996L50214
$$ plain form
9842 31656012 32301761 32132349 32455079 32817453 32900921 32713742 33124864 33476311 33598684 33827128
9832 33827128 33965737 34183729 34276707 34910752 35363306 35293261 35301126 35188786 35666042 36097738
9822 36097738 36024757 36493763 36893484 37483433 37550774 37916414 38188534 38706741 39184551 39819625
9812 39819625 40231180 40299367 40368985 40987654 41328339 41799299 42524836 42994130 43830793 44592075
9802 44592075 44722145 45226603 45983839 46291954 47193940 47573600 47980543 48684382 49999848
9793 49999848 50244543 50883356 51330769 51686816 52361822 53482569 53848030 54591458 55185816
9784 55185816 55750787 56840316 58170156 59058685 60068123 60419809 61133611 62120815 62742814
9775 62742814 64070964 64491630 65373494 66435513 67563740 68841026 70090951 71058346 71286506
$$ packed form
9842C1656012O45749j69412L22730L62374Q3468j87179M11122L51447J22373K28444
9832C3827128J38609K17992R2978O34045M52554p0045P865j12340M77256M31696
9822C6097738p2981M69006L99721N89949O7341L65640K72120N18207M77810O35074
9812C9819625M11555O8187O9618O18669L40685M70960P25537M69294Q36663P61282
9802D4592075J30070N04458P57236L08115R01986L79660M06943P03839J315466
9793D9999848K44695O38813M47413L56047O75006J120747L65461P43428N94358
9784E5185816N64971J089529J329840Q88529J009438L51686P13802R87204O21999
9775F2742814J328150M20666Q81864J062019J128227J277286J249925R67395K28160
$$ plain form
9766 71286506 72696816 73995264 74926292 76396061 77249442 78884729 80041150 81530509
9758 81530509 83085483 84013132 85624356 87224639 88255486 89509684 90766217 92591318
9750 92591318 94056533 95425597 96422460 98225158 99961283 101751439 103679971 104866777
9742 104866777 106904398 108539999 110633234 112868906 114515045 116622281 118172484 120143153
9734 120143153 122317062 124136657 126152036 128415751 130249987 132673049 135653066 137993755
9726 137993755 139963973 142291987 144916008 147389749 149649482 152486273 155509850 158248291
9718 158248291 160409838 162633263 165569025 168675355 171439103 174211130 177358322 180126504
9710 180126504 182861121 185963645 188521439 191665799 194841931 197278716 200134299 203507136
$$ packed form
9766G1286506J410310J298448R31028J469769Q53381J635287J156421J489359
9758H1530509J554974R27649J611224J600283J030847J254198J256533J825101
9750I2591318J465215J369064R96863J802698J736125J790156J928532J186806
9742A04866777K037621J635601K093235K235672J646139K107236J550203J970669
9734A20143153K173909J819595K015379K263715J834236K423062K980017K340689
9726A37993755J970218K328014K624021K473741K259733K836791L023577K738441
9718A58248291K161547K223425K935762L106330K763748K772027L147192K768182
9710A80126504K734617L102524K557794L144360L176132K436785K855583L372837
$$ plain form
9702 203507136 206976143 210556351 213599728 216212750 219073562 222500608 225573511 228179478
9694 228179478 230730522 233931713 237065792 240373600 243400212 245851535 248879370 251720628
9686 251720628 254139944 257162209 260107903 262697913 265109976 267233962 269685427 271818998
9678 271818998 273544436 275760606 277897541 279549213 281392379 283085943 284436163 285688917
9670 285688917 287338321 288542811 289301219 289894046 290836606 292057449 292131393 292329220 292915544
9661 292915544 292964470 292817946 292589697 292765703 291634706 290444538 290304836 290208594 289698382
9652 289698382 289088639 288934174 289056189 288448454 288243899 288833266 289553470 291512540 295299295
9643 295299295 300577843 301957010 295182572 283780827 274278314 267025871 261111079 256206517
$$ packed form
9702B03507136L469007L580208L043377K613022K860812L427046L072903K605967
9694B28179478K551044L201191L134079L307808L026612K451323L027835K841258
9686B51720628K419316L022265K945694K590010K412063K123986K451465K133571
9678B71818998J725438K216170K136935J651672J843166J693564J350220J252754
9670B85688917J649404J204490P58408N92827R42560J220843P3944J97827N86324
9661B92915544M8926j46524k28249J76006j130997j190168j39702r6242n10212
9652B89698382o09743j54465J22015o07735k04555N89367P20204J959070L786755
9643B95299295N278548J379167o774438j1401745r502513p252443n914792m904562
$$ plain form
9635 256206517 251043724 247167501 243447872 239567449 235141042 231105687 227948665 225072035
9627 225072035 221834586 218260483 214847063 211912175 208572227 205307887 201860835 198904045
9619 198904045 195884171 192928783 189845587 187122058 183730003 180616149 177692809 174718367
9611 174718367 171774787 168556826 165717660 163090157 161056727 158368088 155720935 152998946
9603 152998946 150295111 148520945 146169722 143756174 141259482 138566056 136245062 134368795
9595 134368795 131896803 129814771 127767133 125863805 124143658 122105723 120010151 118075661
9587 118075661 116276817 114455546 113274879 111219498 109537781 107261284 105482956 104064788
9579 104064788 102419411 100624410 99184230 96988205 95165045 94296567 92976661 91242499
$$ packed form
9635B56206517n162793l876223l719629l880423m426407m035355l157022k876630
9627B25072035l237449l574103l413420k934888l339948l264340l447052k956790
9619A98904045l019874k955388l083196k723529l392055l113854k923340k974442
9611A74718367k943580l217961k839166k627503k033430k688639k647153k721989
9603A52998946k703835j774166k351223k413548k496692k693426k320994j876267
9595A34368795k471992k082032k047638j903328j720147k037935k095572j934490
9587A18075661j798844j821271j180667k055381j681717k276497j778328j418168
9579A04064788j645377j795001j440180k196025j823160q68478j319906j734162
$$ plain form
9571 91242499 90279298 89307738 87924900 86112967 85095982 83762996 82695049 81442935
9563 81442935 79618375 78471009 77569178 76402588 75312921 74699011 74161554 73094783 71652837
9554 71652837 70687194 69373024 68065195 67192082 66155962 65535175 64825237 63900068 63216570
9545 63216570 62142927 61400409 60722996 59883858 59325833 58627961 57648288 57057838 56506561
9536 56506561 55681798 54750607 54171011 53732142 52786900 51824188 51177654 50235669 49553000
9527 49553000 49561827 49056012 48043034 47088099 46346938 46294506 46273064 45661289 44861738 44171242
9517 44171242 43630188 43540680 42889755 42264823 41835483 40874356 40844027 40958892 40458526 39361069
9507 39361069 38864920 38504727 38394603 37712790 37063279 36760133 36437823 35598567 35403618
$$ packed form
9571I1242499r63201r71560j382838j811933j016985j332986j067947j252114
9563H1442935j824560j147366r01831j166590j089667o13910n37457j066771j441946
9554G1652837r65643j314170j307829q73113j036120o20787p09938r25169o83498
9545F3216570j073643p42518o77413q39138n58025o97872r79673n90450n51277
9536E6506561q24763r31191n79596m38869r45242r62712o46534r41985o82669
9527D9553000Q827n05815j012978r54935p41161n2432k1442o11775p99551o90496
9517D4171242n41054q9508o50925o24932m29340r61127l0329J14865n00366j097457
9507C9361069m96149l60193j10124o81813o49511l03146l22310q39256j94949
$$ plain form
9498 35403618 35305887 34956248 34738798 34076848 33654413 32936653 33084350 32874370 32622974 31708284
9488 31708284 31919061 32143255 31712383 31365294 30526241 29907642 29281146 28665911 28636189 28479588
9478 28479588 28442992 27844639 27573013 27522129 27700226 27340884 26894403 26394701 26204273 25934769
9468 25934769 25698074 25651360 25081308 25089945 24866493 25030950 24957231 24568373 24580995 23966848
9458 23966848 23611607 23904022 23671392 23319898 22801942 22340543 22180158 21983378 22042885 21816236
9448 21816236 21137529 20572409 20550874 20714253 20791412 20532268 20154159 19797226 19368985 19355962
9438 19355962 19732040 20045701 19414844 18853034 19019712 18877536 18468529 18489398 17870330 17563830
9428 17563830 17792834 17665228 17006616 17408920 17416535 17378640 17559382 17214734 17280238 16706670
$$ packed form
9498C5403618r7731l49639k17450o61950m22435p17760J47697k09980k51396r14690
9488C1708284K10777K24194m30872l47089q39053o18599o26496o15235k9722j56601
9478B8479588l6596n98353k71626n0884J78097l59342m46481m99702j90428k69504
9468B5934769k36695m6714n70052Q637k23452J64457p3719l88858J2622o14147
9458B3966848l55241K92415k32630l51494n17956m61399j60385j96780N9507k26649
9448B1816236o78707n65120k1535J63379P7159k59144l78109l56933m28241j3023
9438A9355962L76078L13661o30857n61810J66678j42176m09007K0869o19068l06500
9428A7563830K29004j27606o58612M02304P615l7895J80742l44648O5504n73568
$$ plain form
9418 16706670 16359523 16508189 16232256 16273979 16633151 16160257 16050879 15804381 15534260 14977467
9408 14977467 14486547 14925720 15020501 14817674 14426451 14522915 14297615 14040232 13830001 13927156
9398 13927156 14083510 13660080 13774972 13879810 13781067 13322058 13211098 13082199 12901016 13110881
9388 13110881 13109962 12567357 12266739 12634115 12804660 12778590 12418766 12402176 12345292 11958244
9378 11958244 11507907 11647379 11693803 12041950 12084391 11784684 11037942 10965502 10895267 10735986
9368 10735986 10986863 11109006 10961069 11035548 11141823 10856209 10579460 11068855 10632968 10305249
9358 10305249 10917287 10858768 10695653 10386155 10029481 9976784 9753320 9355252 10099759 10020791
9348 10020791 9714206 9565186 9674734 9207113 9365770 9538755 8806997 8737835 8628434 8952264
$$ packed form
9418A6706670l47147J48666k75933M1723L59172m72894j09378k46498k70121n56793
9408A4977467m90920M39173R4781k02827l91223R6464k25300k57383k10231R7155
9398A3927156J56354m23430J14892J04838r8743m59009j10960j28899j81183K09865
9388A3110881r19n42605l00618L67376J70545k6070l59824j6590n6884l87048
9378A1958244m50337J39472M6424L48147M2441k99707p46742p2440p0235j59281
9368A0735986K50877J22143j47937P4479J06275k85614k76749M89395m35887l27719
9358A0305249O12038n8519j63115l09498l56674n2697k23464l98068P44507p8968
9348A0020791l06585j49020J09548m67621J58657J72985p31758o9162j09401L23830
$$ plain form
9338 8952264 9071100 8998600 8840906 9028015 8812981 8468571 8149806 7900837 8647556 8526410
9328 8526410 8571144 8791973 8756798 8518021 8126785 8140914 8632985 8762818 8296308 7960486
9318 7960486 7912860 8078945 8546182 8321845 7925276 7718702 7732893 7435116 7381201 7688216
9308 7688216 7675300 7283859 7213138 7063575 6887572 7057626 7165815 6953989 7089144 7374428
9298 7374428 7104693 7048615 7630361 7518418 7088961 6695259 7046611 7092494 7108739 7204265
9288 7204265 6938755 6761848 6338023 6430397 6787131 7033291 7057846 7316267 6914576 6538553
9278 6538553 6728478 6325135 6171504 6285295 6763313 6463381 6278299 6602870 6566613 6783379
9268 6783379 6755890 6830541 6237327 5792782 5839162 6705208 6390456 6396386 6654206 6551709
$$ packed form
9338H952264J18836p2500j57694J87109k15034l44410l18765k48969P46719j21146
9328H526410M4734K20829l5175k38777l91236J4129M92071J29833m66510l35822
9318G960486m7626J66085M67237k24337l96569k06574J4191k97777n3915L07015
9308G688216j2916l91441p0721j49563j76003J70054J08189k11826J35155K85284
9298G374428k69735n6078N81746j11943m29457l93702L51352M5883J6245R5526
9288G204265k65510j76907m23825R2374L56734K46160K4555K58421m01691l76023
9278F538553J89925m03343j53631J13791M78018k99932j85082L24571l6257K16766
9268F783379k7489P4651n93214m44545M6380Q66046l14752N930K57820j02497
$$ plain form
9258 6551709 6455415 6162263 5913198 5805930 5448131 5310335 5806548 5995844 5928594 5755909
9248 5755909 5569240 5659378 5940857 5668646 5602583 5548604 6191747 6243882 5552541 5568444
9238 5568444 6487272 6864134 6038948 5452555 5699160 5959420 5910423 5709932 5877767 5848191
9228 5848191 5106431 4440375 4591050 4887425 4967818 5179962 5212567 4658158 4710947 5337656
9218 5337656 5608493 5704781 5183322 5327756 5492664 5605527 5003378 4876560 4760855 4709323
9208 4709323 4999915 5531901 5046298 5348431 5384890 4792796 4988206 5410087 5277804 5245399
9198 5245399 5025603 4900977 5280393 5018080 5102201 4968647 4572201 5281040 5255986 4494721
9188 4494721 4910330 4904579 4621660 4258353 4649710 5056835 5041761 4521012 4782793 5146075
$$ packed form
9258F551709r6294k93152k49065j07268l57799j37796M96213J89296o7250j72685
9248E755909j86669R0138K81479k72211o6063n3979O43143N2135o91341J5903
9238E568444R18828L76862q25186n86393K46605K60260m8997k00491J67835k9576
9228E848191p41760o66056J50675K96375Q0393K12144L2605n54409N2789O26709
9218E337656K70837R6288n21459J44434J64908J12863o02149j26818j15705n1532
9208D709323K90592N31986m85603L02133L6459n92094J95410M21881j32283l2405
9198E245399k19796j24626L79416k62313Q4121j33554l96446P08839k5054p61265
9188D494721M15609n751k82919l63307L91357M07125j5074n20749K61781L63282
$$ plain form
9178 5146075 4714248 4945849 5457384 5326373 5207817 5157514 5012185 4860104 4840529 5120573
9168 5120573 5073065 4935503 5265342 5123545 4931266 4941604 4853271 4790538 4837926 4717285
9158 4717285 5045342 5123211 5230750 5302063 5774840 5568819 5217553 5763180 5566749 5658168
9148 5658168 5548065 5633434 5578391 5137201 5622378 5868022 5681136 5862166 6093214 5675654
9138 5675654 5414546 5543673 5998882 5650547 5957510 6033400 5908226 6453249 6535617 6764947
9128 6764947 6566326 6643667 6911731 7321543 7406775 7484061 7765718 7957102 8188813 8371163
9118 8371163 8196232 8867876 9086487 9133929 10236105 10600025 10274854 10182558 10637080 11535982
9108 11535982 12049743 12965566 13959656 14948295 15957836 16420632 17388301 18178221 19703908
$$ packed form
9178E146075m31827K31601N11535j31011j18556n0303j45329j52081j9575K80044
9168E120573m7508j37562L29839j41797j92279J0338q8333o2733M7388j20641
9158D717285L28057P7869J07539P1313M72777k06021l51266N45627j96431R1419
9148E658168j10103Q5369n5043m41190M85177K45644j86886J81030K31048m17560
9138E675654k61108J29127M55209l48335L06963P5890j25174N45023Q2368K29330
9128F764947j98621P7341K68064M09812Q5232P7286K81657J91384K31711J82350
9118H371163j74931O71644K18611M7442J102176L63920l25171r2296M54522Q98902
9108A1535982N13761R15823R94090R88639J009541M62796R67669P89920J525687
$$ plain form
9099 19703908 21919323 23638067 25901337 28118977 30352452 33069007 35347692 36391902
9091 36391902 36913628 38266778 39366568 40409740 41937948 41948615 40602288 37691387 34434697
9082 34434697 31442963 29424170 27956615 26673556 25700832 25302087 25104710 24201139 23230584
9073 23230584 22032897 21771741 21716780 22181807 22265665 22778126 23733804 25373749 26388985
9064 26388985 27417881 30133269 32339023 34430629 36854082 38872992 40531638 42768748
9056 42768748 45325351 47570333 49718613 52371551 53401606 52599409 51983898 50396285
9048 50396285 47796465 43853229 38548693 33237214 29497022 26957471 24284939 22626930
9040 22626930 21597998 20380295 19499508 18242487 16780867 16147897 15381117 14524674 14045531
$$ packed form
9099A9703908K215415J718744K263270K217640K233475K716555K278685J044210
9091C6391902N21726J353150J099790J043172J528208J0667j346327k910901l256690
9082C4434697k991734k018793j467555j283059r72724l98745j97377r03571r70555
9073B3230584j197687k61156n4961M65027Q3858N12461R55678J639945J015236
9064B6388985J028896K715388K205754K091606K423453K018910J658646K237110
9056D2768748K556603K244982K148280K652938J030055q02197o15511j587613
9048E0396285k599820l943236n304536n311479l740192k539551k672532j658009
9040B2626930j028932j217703q80787j257021j461620o32970p66780q56443m79143
$$ plain form
9031 14045531 13635197 12739740 11780433 11821909 11358650 10540681 9829211 9453119 9393034 8869178
9021 8869178 8265907 8184949 8187698 8414042 8304483 7823958 7463107 7407580 6953669 6656982
9011 6656982 6822027 7210390 7248417 6514369 6489314 6542140 6518188 6400576 6851803 6896636
9001 6896636 6645898 6531782 6456596 6680451 6446307 5617234 5625674 5847111 6217080 6345309
8991 6345309 5632731 5518227 5190705 4875801 4713359 4815849 4974586 4807791 4999067 4621216
8981 4621216 4900523 4515360 4499499 4091855 4191795 4465642 4437872 4344477 4198826 4085583
8971 4085583 3866933 3699781 3595792 3860651 3706589 3779951 3273299 3544114 3320821 3340234
8961 3340234 3444556 3476884 3756121 3395873 3500659 3358085 3219399 3202002 3346292 3663309
$$ packed form
9031A4045531m10334q95457r59307M1476m63259q17969p11470l76092o0085n23856
9021H869178o03271q0958K749K26344j09559m80525l60851n5527m53911k96687
9011F656982J65045L88363L8027p34048k5055N2826k3952j17612M51227M4833
9001F896636k50738j14116p5186K23855k34144q29073Q440K21437L69969J28229
8991F345309p12578j14504l27522l14904j62442J02490J58737j66795J91276l77851
8981D621216K79307l85163j5861m07644R9940K73847k7770r3395j45651j13243
8971D085583k18650j67152j03989K64859j54062P3362n06652K70815k23293J9413
8961C340234J04322L2328K79237l60248J04786j42574j38686j7397J44290L17017
$$ plain form
8951 3663309 3549035 3756351 3141902 3191580 3364687 3771201 3944570 3666928 3847963 3981679
8941 3981679 3818063 3729320 3889528 4040459 4167351 3695087 3590805 3609283 3780195 4223613
8931 4223613 4251898 4052928 3912225 4131189 4120703 3507868 3755179 3777901 3877359 4244082
8921 4244082 4508948 4619122 4631698 4206816 3823846 4239445 4398771 5044688 4961810 4751386
8911 4751386 4796074 4711470 5054665 4444451 4725363 5687868 5827108 5934355 5417872 5117778
8901 5117778 5618782 5998304 5903398 5845921 6327645 6501574 6447866 6695303 7074766 7721308
8891 7721308 7647110 8030967 8521936 8721265 9740165 9654026 9931830 10384026 10831134 11707083
8881 11707083 13212727 14090955 15175774 16297642 17456681 19241669 20109596 21585158
$$ packed form
8951C663309j14274K07316o14449M9678J73107M06514J73369k77642J81035J33716
8941C981679j63616q8743J60208J50931J26892m72264j04282J8478J70912M43418
8931D223613K8285j98970j40703K18964j0486o12835K47311K2722R9458L66723
8921D244082K64866J10174J2576m24882l82970M15599J59326O45917q2878k10424
8911D751386M4688q4604L43195o10214K80912R62505J39240J07247n16483l00094
8901E117778N01004L79522r4906n7477M81724J73929n3708K47437L79463O46542
8891G721308p4198L83857M90969J99329J018900q6139K77804M52196M47108Q75949
8881A1707083J505644Q78228J084819J121868J159039J784988Q67927J475562
$$ plain form
8873 21585158 23656535 25442638 26385338 27332087 28034357 27277243 25599271 23633738 21937379
8864 21937379 20449342 19758090 19205668 19198192 19359250 18875992 18020015 17468419 17550869 17705510
8854 17705510 17818156 17834653 18393415 19259366 19785105 20902539 22571113 23472705 25304723
8845 25304723 26730669 28447076 30395326 33238322 36328934 39699534 42755031 45455802
8837 45455802 48135887 48820690 48546542 46596417 43684797 40586490 37742005 35638595
8829 35638595 34085836 32338218 29851145 27330671 25113417 23189860 21567226 20459725
8821 20459725 19303329 19110288 18570078 17492891 17068471 17304729 17202865 17621613 17481148
8812 17481148 17589829 18445707 19971299 21480617 22677440 23990906 24944496 25733421 26603895
$$ packed form
8873B1585158K071377J786103R42700R46749P02270p57114j677972j965533j696359
8864B1937379j488037o91252n52422p476J61058m83258q55977n51596Q2450J54641
8854A7705510J12646J6497N58762Q65951N25739J117434J668574R01592J832018
8845B5304723J425946J716407J948250K842996L090612L370600L055497K700771
8837D5455802K680085O84803k74148j950125k911620l098307k844485k103410
8829C5638595j552759j747618k487073k520474k217254j923557j622634j107501
8821B0459725j156396j93041n40210j077187m24420K36258j01864M18748j40465
8812A7481148J08681Q55878J525592J509318J196823J313466R53590P88925Q70474
$$ plain form
8803 26603895 27848687 29229549 30644765 31398070 31304882 30504212 27909635 25346082 22606285
8794 22606285 19966527 17726383 16266798 15083004 14013213 13028922 12296763 11690693 11109435
8785 11109435 10801443 10211026 10213071 9109989 8463242 8228832 8421413 8118284 7628464 7127019
8775 7127019 7291780 7043808 6731035 6729704 6683779 7309867 7075834 6430800 6708230 6436761
8765 6436761 6369665 5712250 5617292 5573341 5358637 5443437 5336144 5248097 5894720 6015215
8755 6015215 5886637 5499299 5701619 5909618 5748439 5813522 6379764 6408278 6237010 6318378
8745 6318378 6518169 6371183 6409366 6761887 6591195 6146808 6685041 7273069 7507890 7779316
8735 7779316 8257877 8579965 8895196 9621708 10344213 11390510 12083381 13294563 14763052
$$ packed form
8803B6603895J244792J380862J415216P53305r3188q00670k594577k563553k739797
8794B2606285k639758k240144j459585j183794j069791r84291p32159o06070n81258
8785A1109435l07992n90417K045j103082o46747k34410J92581l03129m89820n01445
8775G127019J64761k47972l12773j331m5925O26088k34033o45034K77430k71469
8765F436761o7096o57415r4958m3951k14704Q4800j07293q8047O46623J20495
8755F015215j28578l87338K02320K07999j61179O5083N66242K8514j71268Q1368
8745F318378J99791j46986L8183L52521j70692m44387N38233N88028K34821K71426
8735G779316M78561L22088L15231P26512P22505J046297O92871J211182J468489
$$ plain form
8726 14763052 15828888 16548205 17880592 18493801 19056368 20052322 21265530 21370303 20863401
8717 20863401 19994460 18962042 18123022 17309392 16409543 15925352 14790342 13519692 13101404
8708 13101404 12850357 12085408 11694953 11687367 11374684 11291208 11356900 12068600 12850959 13431271
8698 13431271 14039796 14581109 15276111 16244827 16629484 17250870 17627478 18839168 20323228
8689 20323228 22045690 23724419 24416010 24623294 23698633 22012565 19594763 17407680 15958288
8680 15958288 14672917 13498438 13278974 12626495 12103905 11568989 11073575 10215396 9935286
8671 9935286 9194564 8698891 8492356 8315317 7813485 7546240 8077732 8287740 8934230 8980564
8661 8980564 9286255 9710754 10202401 10676729 10227339 10330957 10060825 10304640 10421058 9906483
$$ packed form
8726A4763052J065836P19317J332387O13209N62567R95954J213208J04773n06902
8717B0863401q68941j032418q39020q13630q99849m84191j135010j270650m18288
8708A3101404k51047p64949l90455p586l12683q3476O5692P11700P82359N80312
8698A3431271O08525N41313O95002R68716L84657O21386L76608J211690J484060
8689B0323228J722462J678729O91591K07284r24661j686068k417802k187083j449392
8680A5958288j285371j174479k19464o52479n22590n34916m95414q58179k80110
8671I935286p40722m95673k06535j77039n01832k67245N31492K10008O46490M6334
8661H980564L05691M24499M91647M74328m49390J03618k70132K43815J16418n14575
$$ plain form
8651 9906483 9851386 9189412 8062081 7819971 7694849 7110669 6123157 5802622 5457080 5153930
8641 5153930 4694761 4585400 4030566 3877306 3556233 3734568 3691093 3245954 3642737 3587200
8631 3587200 3281207 2971782 3102256 3213914 2878402 2194857 1841789 2177914 2065570 2231314
8621 2231314 2513915 2284253 2158562 1727005 1822676 1299053 1591022 1606607 1726796 1458621
8611 1458621 1659299 1690203 1646320 1930258 2094330 2050791 2169673 1787961 1990376 1492407
8601 1492407 1392864 1701395 1694970 1504368 1270011 1624694 1813448 1837456 1923720 1869485 1437739
8590 1437739 1406825 1368141 1228073 1248987 1263294 1527344 1126603 601281 531560 1227867
8580 1227867 1600940 311552 762729 1186310 576308 840572 980133 756223 921061
$$ packed form
8651I906483n5097o61974j127331k42110j25122n84180r87512l20535l45542l03150
8641E153930m59169j09361n54834j53260l21073J78335m3475m45139L96783n5537
8631C587200l05993l09425J30474J11658l35512o83545l53068L36125j12344J65744
8621B231314K82601k29662j25691m31557R5671n23623K91969J5585J20189k68175
8611A458621K00678L0904m3883K83938J64072m3539J18882l81712K02415m97969
8601A492407r9543L08531o425j90602k34357L54683J88754K4008Q6264n4235m31746
8590A437739l0914l8684j40068K0914J4307K64050m00741n25322o9721O96307
8580A227867L73073j289388M51177M23581o10002K64264J39561k23910J64838
$$ plain form
8571 921061 888750 541066 817712 796358 478242 434177 1106745 1520107 1445184 1303544
8561 1303544 1057662 1189786 1348079 906808 955951 1062874 872040 1036567 581744 623094
8551 623094 962245 910407 1290619 1048491 743386 1477077 1173150 663056 371908 19395
8541 19395 732688 1113635 1042817 742792 620197 1062832 1052733 807517 681193 863009
8531 863009 871722 1066327 830175 888694 587640 505271 610174 838093 647480 478595
8521 478595 829322 377472 125959 474683 526334 413531 605378 386179 243821 951038
8511 951038 1029026 932520 827824 753390 591751 620998 146525 7052 569809 749898
8501 749898 821899 670181 678492 706169 604472 869922 1006616 804595 529460 384715
$$ packed form
8571I21061l2311l47684K76646k1354l18116m4065O72568M13362p4923j41640
8561A303544k45882J32124J58293m41271M9143J06923j90834J64527m54823M1350
8551F23094L39151n1838L80212k42128l05105P33691l03927n10094k91148l52513
8541A9395P13293L80947p0818l00025j22595M42635j0099k45216j26324J81816
8531H63009Q713J94605k36152N8519l01054q2369J04903K27919j90613j68885
8521D78595L50727m51850k51513L48724N1651j12803J91847k19199j42358P07217
8511I51038P7988r6506j04696p4434j61639K9247m74473j39473N62757J80089
8501G49898P2001j51718Q311K7677j01697K65450J36694k02021k75135j44745
$$ plain form
8491 384715 360924 491393 661171 383484 427365 267868 972326 421271 152485 532157
8481 532157 215372 166703 264585 514137 1136997 625153 813417 450977 646266 1091999
8471 1091999 1151890 870858 850834 723871 781722 715909 537753 1261366 1115698 972196
8461 972196 913506 893335 589811 414234 235937 130738 271322 813873 405181 701608
8451 701608 217338 -55700 310280 773799 472617 -17174 541246 732967 915235 898793
8441 898793 712770 406264 328904 334194 343524 720264 739208 1040091 1293662 843898 539655
8430 539655 846265 272239 491336 632028 704448 408800 709597 1148393 919030 708977
8420 708977 498704 554428 334167 263463 365152 -124583 -486869 -302256 431851 717274
$$ packed form
8491C84715k3791J30469J69778k77687M3881j59497P04458n51055k68786L79672
8481E32157l16785m8669R7882K49552O22860n11844J88264l62440J95289M45733
8471A091999N9891k81032k0024j26963N7851o5813j78156P23613j45668j43502
8461I72196n8690k0171l03524j75577j78297j05199J40584N42551m08692K96427
8451G01608m84270k73038L65980M63519l01182m89791N58420J91721J82268j6442
8441H98793j86023l06506p7360N290R330L76740J8944L00883K53571m49764l04243
8430E39655L06610n74026K19097J40692P2420k95648L00797M38796k29363k10053
8420G08977k10273N5724k20261p0704J01689m89735l62286J84613P34107K85423
$$ plain form
8410 717274 793043 469691 380486 684159 217742 133444 316851 687808 510837 115173
8400 115173 502692 1062811 817056 652154 238949 344424 675146 500555 450503 346097
8390 346097 452559 847751 665276 686819 428188 81984 187341 95129 265347 301677
8380 301677 694919 636467 430250 540976 81788 446651 130021 178859 460988 630378
8370 630378 572830 416012 429624 799621 749343 553751 343601 465418 411015 350656 -18809
8359 -18809 270555 521749 195243 384359 199627 -160481 -204676 -9694 190502 277834
8349 277834 191075 -1950 -315592 95733 61973 5749 89515 218595 116580 425802
8339 425802 827824 909054 832711 743399 476358 275506 585603 658459 340995 189380
$$ packed form
8410G17274P5769l23352q9205L03673m66417q4298J83407L70957j76971l95664
8400A15173L87519N60119k45755j64902m13205J05475L30722j74591n0052j04406
8390C46097J06462L95192j82475K1543k58631l46204J05357r2212J70218L6330
8380C01677L93242n8452k06217J10726m59188L64863l16630M8838K82129J69390
8370F30378n7548j56818J3612L69997n0278j95592k10150J21817n4403o0359l69465
8359a8809K89364K51194l26506J89116j84732l60108m4195J94982K00196Q7332
8349B77834q6759j93025l13642M11325l3760n6224Q3766J29080j02015L09222
8339D25802M02022Q1230p6343q9312k67041k00852L10097P2856l17464j51615
$$ plain form
8329 189380 602389 1017796 802881 533783 536348 522191 -666 -50517 5370 218413 291971
8318 291971 -3328 -283466 -262779 -15964 -69813 432671 392546 -57618 -489171 62467
8308 62467 102949 -13378 329734 241229 207171 234482 88044 -241396 -221757 609172 551799
8297 551799 215629 331390 391730 475600 265737 -115098 -279924 71181 373957 446027
8287 446027 341987 -9232 79108 294274 126717 187886 -162406 -495138 38208 25887
8277 25887 -83312 599506 540742 133210 345995 357159 -537012 -330618 362691 493065
8267 493065 588125 474727 -23750 132705 -94679 207567 382078 440602 266280 492
8257 492 -133974 -69613 -71094 -211632 73401 229568 467942 88190 -80323 -425253 223091
$$ packed form
8329A89380M13009M15407k14915k69098K565j4157n22857m9851N5887K13043P3558
8318B91971k95299k80138K0687K46815n3849N02484m0125m50164m31553N51638
8308F2467M0482j16327L43112q8505l4058K7311j46438l29440J9639Q30929n7373
8297E51799l36170J15761O0340Q3870k09863l80835j64826L51105L02776P2070
8287D46027j04040l51219Q8340K15166j67557O1169l50292l32732N33346j2321
8277B5887j09199O82818n8764m07532K12785J1164q94171K06394O93309J30374
8267D93065R5060j13398m98477J56455k27384L02246J74511N8524j74322k65788
8257D92j34466O4361j481j40538K85033J56167K38374l79752j68513l44930O48344
$$ plain form
8246 223091 653407 378338 -250198 -358491 -246364 95614 306292 77965 -21884 72215
8236 72215 249641 411543 80596 -81153 435271 869963 240949 -278490 164869 145476
8226 145476 166120 351756 318360 37534 172682 -17553 143565 38247 102084 83149
8216 83149 339745 290316 98047 544207 651476 -175586 223148 104307 342553 831871
8206 831871 463726 90986 347035 112064 199056 -308212 -454473 -466671 -253857 -745995
8196 -745995 -638135 -592877 -1119353 -3023258 -3006413 1331595 1095276 790047 499592 512997
8186 512997 27654 169598 499242 403993 274617 294597 291201 1205541 660175 126470
8176 126470 186932 221650 -198025 -652258 -117902 -137296 -135106 216992 122019 -511627 -645645
$$ packed form
8246B23091M30316k75069o28536j08293J12127L41978K10678k28327r9849R4099
8236G2215J77426J61902l30947j61749N16424M34692o29014n19439M43359j9393
8226A45476K0644J85636l3396k80826J35148j90235J61118j05318O3837j8935
8216H3149K56596m9429j92269M46160J07269q27062L98734j18841K38246M89318
8206H31871l68145l72740K56049k34971Q6992n07268j46261j2198K12814m92138
8196g45995J07860M5258n26476j903905J6845M338008k36319l05229k90455J3405
8186E12997m85343J41944L29644r5249j29376J9980l396R14340n45366n33705
8176A26470O0462L4718m19675m54233N34356j9394K190L52098r4973o33646j34018
$$ plain form
8165 -645645 -276242 115534 8449 -36068 -215401 -191385 201418 533337 127393 -124533
8155 -124533 -249118 -68894 -27020 -538378 -284115 1013 -378542 -368500 98437 605490
8145 605490 365504 732130 29137 -959511 -320627 125292 17431 226645 427435 424326
8135 424326 382268 902077 474705 482022 52154 -221172 491631 659343 139955 -66924
8125 -66924 142980 391990 746860 704204 248519 -46522 338679 358038 42817 77967
8115 77967 256825 75501 -6188 31528 117527 105409 -180883 -216552 56562 219653 307943
8104 307943 -75008 16214 -34652 407169 -138877 -48158 52126 -335941 -228733 -46806
8094 -46806 -115967 37297 608862 1012550 564372 83089 61385 -238203 30873 441335
$$ packed form
8165f45645L69403L91776j07085m4517j79333K4016L92803L31919m05944k51926
8155a24533j24585J80224M1874n11358K54263K85128l79555J0042M66937N07053
8145F05490k39986L66626p02993r88648O38884M45919j07861K09214K00790l109
8135D24326m2058N19809m27372P317m29868k73326P12803J67712n19388k06879
8125f6924K09904K49010L54870m2656m55685k95041L85201J9359l15221L5150
8115G7967J78858j81324q1689L7716Q5999j2118k86292l5669K73114J63091Q8290
8104C07943l82951R1222n0866M41821n46046R0719J00284l88067J07208J81927
8094d6806o9161J53264N71565M03688m48178m81283k1704k99588K69076M10462
$$ plain form
8084 441335 138990 305594 803049 485153 -153352 -275965 -252141 -341050 -302882 -368864
8074 -368864 -428173 -405720 -191929 -240954 -26186 26813 325126 249812 -231312 -203745 5189
8063 5189 491380 -65691 304177 761107 63192 -293655 -246714 131801 66768 42451 -160405
8052 -160405 6743 160912 269586 60366 249240 329856 101271 199847 474481 205593
8042 205593 -18563 -109534 -131431 456603 64647 -433746 -261716 -616448 -303571 -343806
8032 -343806 -826752 -380648 -287664 -241496 -21700 394050 451773 -62428 -288803 -480720
8022 -480720 -211554 178691 187668 -157275 -336097 78082 446973 185493 394364 474514
8012 474514 174664 288099 276875 323064 435206 544141 123736 164211 221574 -347048
$$ packed form
8084D41335l02345J66604M97455l17896o38505j22613K3824q8909L8168o5982
8074c68864n9309K2453K13791m9025K14768N2999K98313p5314m81124K7567K08934
8063E189M86191n57071L69868M56930o97915l56847M6941L78515o5033k4317k02856
8052a60405J67148J54169J08674k09220J88874Q0616k28585R8576K74634k68888
8042B05593k24156r0971k1897N88034l91956m98393J72030l54732L12877m0235
8032c43806m82946M46104R2984M6168K19796M15750N7723n14201k26375j91917
8022d80720K69166L90245Q977l44943j78822M14179L68891k61480K08871Q0150
8012D74514k99850J13435j1224M6189J12142J08935m20405M0475N7363n68622
$$ plain form
8002 -347048 -89589 45331 -253265 -545078 -381713 -266412 -538992 -329116 60672 37292
7992 37292 -157535 -414293 -321323 -436479 -518423 -7921 200077 -416039 -266137 115830
7982 115830 -7124 197570 -10898 123741 429148 -87994 -341125 -178379 -175123 -253551
7972 -253551 -585840 -576160 -331224 -273695 -276399 -63538 -116231 -457256 -205542 -325754 -671516
7961 -671516 -268242 -12144 358271 238402 -262063 -265912 192546 298694 239683 441237
7951 441237 79784 155889 107502 -242213 -76605 -7841 -110668 95731 531228 156617
7941 156617 173680 1354 -365325 191296 -39066 -225800 -498025 -508485 -429402 -372400
7931 -372400 164205 40877 -236215 -95643 -362363 -98732 378832 -27505 344065 -80846
$$ packed form
8002c47048K57459J34920k98596k91813J63365J15301k72580K09876L89788k3380
7992C7292j94827k56758R2970j15156q1944N10502K07998o16116J49902L81967
7982A15830j22954K04694k08468J34639L05407n17142k53131J62746L256p8428
7972b53551l32289R680K44936N7529k704K12861n2693l41025K51714j20212l45762
7961f71516M03274K56098L70415j19869n00465l849M58458J06148n9011K01554
7951D41237l61453P6105m8387l49715J65608O8764j02827K06399M35497l74611
7941A56617J7063j72326l66679N56621k30362j86734k72225j0460P9083N7002
7931c72400N36605j23328k77092J40572k66720K63631M77564m06337L71570m24911
$$ plain form
7921 -80846 -357539 134342 -45140 -82131 -263228 -102987 -513760 -510700 11839 8227 -103553
7910 -103553 -477995 -330902 -270850 230779 133860 143383 -460724 -504597 -517675 -139479 144535
7899 144535 310601 404048 211893 117272 -166732 227191 610201 417537 243726 511860
7889 511860 88304 -10524 -193772 -414762 -842788 -723260 -591589 -404058 -339659 -210240
7879 -210240 45150 -284932 -150705 78253 -129251 -396392 -390159 146061 203521 -119022
7869 -119022 -275242 -267244 -102414 -148064 -272520 -150261 -71825 -16613 -404486 -373187 -410333
7858 -410333 -271953 -118422 -322319 -49757 -169462 42776 -40763 -239421 -313293 97292
7848 97292 -245459 -323442 -230787 -20180 66157 74648 -99931 -249157 -369700 -124005 -40381
$$ packed form
7921h0846k76693M91881j79482l6991j81097J60241m10773L060N22539l612j11780
7910a03553l74442J47093O0052N01629r6919R523o04107m3873j3078L78196K84014
7899A44535J66066R3447j92155r4621k84004L93923L83010j92664j73811K68134
7889E11860m23556r8828j83248k20990m28026J19528J31671J87531O4399J29419
7879b10240K55390l30082J34227K28958k07504k67141O233N36220N7460l22543
7869a19022j56220P998J64830m5650j24456J22259P8436N5212l87873L1299l7146
7858d10333J38380J53531k03897K72562j19705K12238q3539j98658p3872M10585
7848I7292l42751p7983R2655K10607Q6337Q491j74579j49226j20543K45695Q3624
$$ plain form
7837 -40381 89491 358145 390877 305803 199148 -120499 -146499 162190 -282071 -724657
7827 -724657 -281301 -21766 213779 490046 368347 -73499 -114826 -101433 -125505 -213023
7817 -213023 109624 155765 -232213 -85804 -500061 99401 146493 364049 69898 248086
7807 248086 302242 878959 -126494 -523848 -595841 -691003 -725266 -722721 -270571 -147577 -124079
7796 -124079 -357171 -595792 -871370 -557453 -419040 -242228 426147 97559 -232029 -356834
7786 -356834 -140588 -293511 -591314 -109922 -436384 -340825 -283259 -371208 14194 161447
7776 161447 49101 -239863 -399900 -147924 -157088 -692935 -161290 311884 336565 279299
7766 279299 377009 149941 -509370 -211541 -293644 -629934 -943985 -750847 20627 -86069
$$ packed form
7837d0381J29872K68654L2732q5074j06655l19647k6000L08689m44261m42586
7827g24657M43356K59535K35545K76267j21699m41846m1327J3393k4072q7518
7817b13023L22647M6141l87978J46409m14257N99462M7092K17556k94151J78188
7807B48086N4156N76717j005453l97354p1993r5162l4263K545M52150J22994K3498
7796a24079k33092k38621k75578L13917J38413J76812O68375l28588l29588j24805
7786c56834K16246j52923k97803M81392l26462R5559N7566q7949L85402J47253
7776A61447j12346k88964j60037K51976r164n35847N31645M73174K4681n7266
7766B79299R7710k27068o59311K97829q2103l36290l14051J93138P71474j06696
$$ plain form
7756 -86069 5757 -53334 -266367 367298 745298 555118 -46251 -415745 -658580 -295720
7746 -295720 -414251 -430892 -217713 128950 205102 344594 95242 20162 151754 326707
7736 326707 379241 -72505 -300114 38380 149314 58639 -149091 295756 99682 -2579
7726 -2579 -84105 -301030 -243547 -318226 -111809 -194628 -191961 -84086 -288453 -598879 -581556
7715 -581556 -843891 -815525 -228587 213173 434890 -37034 -396656 -118572 -73735 -140295
7705 -140295 35316 65081 -54309 232467 59489 96813 105490 647130 295054 -72402
7695 -72402 313359 -337735 -224567 382675 626571 481918 410676 -317885 -356036 -105560
7685 -105560 124769 28503 -359466 -523216 -700512 -841835 117912 4070 174267 529812
$$ packed form
7756h6069R1826n9091k13033O33665L78000j90180o01369l69494k42835L62860
7746b95720j18531j6641K13179L46663P6152J39492k49352p5080J31592J74953
7736C26707N2534m51746k27609L38494J10934r0675k07730M44847j96074j02261
7726b579q1526k16925N7483p4679K06417q2819K667J07875k04367l10426J7323
7715e81556k62335K8366N86938M41760K21717m71924l59622K78084M4837o6560
7705a40295J75611K9765j19390K86776j72978L7324Q677N41640l52076l67456
7695g2402L85761o51094J13168O07242K43896j44653p1242p28561l8151K50476
7685a05560K30329r6266l87969j63750j77296j41323R59747j13842J70197L55545
$$ plain form
7675 529812 86321 -126067 -97663 -248665 -113807 -85356 -540572 -229026 -157764 -324538
7665 -324538 -39056 -173131 -1025794 -662559 -4991 -283093 -362013 184038 132188 189629
7655 189629 106271 226797 168437 79310 -287603 -266414 5570 127258 141318 36656 -456305
7644 -456305 -579757 -314644 -145144 -710632 -819812 -207857 -504748 -798992 -130295 -9766
7634 -9766 -274325 -305292 -264587 229193 -265169 -301589 -466092 -691065 -534215 -757418 -817507
7623 -817507 -356206 -424129 -526648 -3298 129632 20502 -75139 -511556 -658596 -370885
7613 -370885 -57747 -142855 -577447 -528634 142460 -54892 -171019 372878 -113595 -270548
7603 -270548 -215849 -79693 -266472 -217270 -7708 -122897 -68124 -231932 -237275 -277302 286821
$$ packed form
7675E29812m43491k12388K8404j51002J34858K8451m55216L11546P1262j66774
7665c24538K85482j34075q52663L63235O57568k78102p8920N46051n1850N7441
7655A89629q3358J20526n8360q9127l66913K1189K71984J21688J4060j04662m92961
7644d56305j23452K65113J69500n65488j09180O11955k96891k94244O68697J20529
7634i766k64559l0967M0705M93780m94362l6420j64503k24973J56850k23203o0089
7623h17507M61301o7923j02519N23350J32930j09130r5641m36417j47040K87711
7613c70885L13138q5108m34592M8813O71094j97352j16127N43897m86473j56953
7603b70548N4699J36156j86779M9202K09562j15189N4773j63808n343m0027N64123
$$ plain form
7592 286821 108733 -658333 -388906 -89450 -145872 -541743 -482461 -599062 -470747 -693379
7582 -693379 -317246 -488188 -280 -106422 -308778 -236611 -146080 90100 -19252 -9930
7572 -9930 258679 -74597 -264946 -814149 -903915 -861244 -503328 -89339 -314701 -247074 137310
7561 137310 -161914 190223 399773 55343 494853 -18421 -188873 -292763 -154562 85589
7551 85589 292438 425789 594810 304760 -269298 -164627 -535808 -123064 376062 -186056
7541 -186056 -301541 -264024 -400857 -1013655 -596358 -48087 16263 -439495 -271623 17934
7531 17934 611401 418751 282078 -56210 -401695 -169979 78369 468491 476263 -239056
7521 -239056 21205 -81186 -381512 90866 568608 -23292 -43042 -68297 -8706 -419997
$$ packed form
7592B86821j78088p67066K69427K99456n6422l95871N9282j16601J28315k22632
7582f93379L76133j70942M87908j06142k02356P2167R0531K36180j09352R322
7572i930K68609l33276j90349n49203q9766M2671L57916M13989k25362O7627L84384
7561A37310k99224L52137K09550l44430M39510n13274j70452j03890J38201K40151
7551H5589K06849J33351J69021k90050n74058J04671l71181M12744M99126n62118
7541a86056j15485L7517j36833o12798M17297N48271O4350m55758J67872K89557
7531A7934N93467j92650j36673l38288l45485K31716K48348L90122P772p15319
7521b39056K60261j02391l00326M72378M77742n91900j9750k5255N9591m11291
$$ plain form
7511 -419997 -396500 -227403 -57442 -211376 -67290 282011 -17672 -209285 4835 196074
7501 196074 773497 455449 176625 -33928 115 48372 -356387 -282377 -558945 8721
7491 8721 73671 -3952 -354245 -165798 -53651 453534 320152 -204421 49582 168838
7481 168838 -6675 59668 109034 -201779 80628 132646 -35918 382604 588 10902
7471 10902 -191505 42694 181018 64452 395928 590907 899753 875875 344274 -25334
7461 -25334 343529 282660 332830 67298 -1342 96524 -462 76272 114349 344175 -147857
7450 -147857 -467415 -280701 -187518 -160374 -183154 28584 -86104 148795 282289 19668
7440 19668 2802 19970 229476 324157 133318 93066 311894 12922 307601 -92676 -131508
$$ packed form
7511d19997K3497J69097J69961j53934J44086L49301k99683j91613K14120J91239
7501A96074N77423l18048k78824k10553L4043M8257m04759P4010k76568N67666
7491H721O4950p7623l50293J88447J12147N07185j33382n24573K54003J19256
7481A68838j75513O6343M9366l10813K82407N2018j68564M18522l82016J0314
7471A0902k02407K34199J38324j16566L31476J94979L08846k3878n31601l69608
7461b5334L68863o0869N0170k65532o8640R7866r6986P6734L8077K29826m92032
7450a47857l19558J86714R3183K7144k2780K11738j14688K34899J33494k62621
7440A9668j6866J7168K09506R4681j90839m0252K18828k98972K94679m00277l8832
$$ plain form
7429 -131508 65472 182592 367504 177174 348025 322590 852827 625835 376775 928461
7419 928461 1307108 1210285 718745 733501 1120022 1377443 964676 1047596 794203 831787
7409 831787 792461 1096875 998888 1070127 1253749 1104307 1304445 1036163 1091625 1079483 871695
7398 871695 1465809 897914 619626 975293 978767 1168522 1262131 1152825 1084415 1349896
7388 1349896 1468780 1078186 1272804 1064545 1274017 1488376 1587357 2180175 1894426 1925559
7378 1925559 1904244 1679692 1899280 2443973 2118618 2280901 2699762 2753367 2392497 2322927
7368 2322927 3163471 3067223 2780770 2974963 3022133 3291183 3676332 4062301 4306062 4431463
7358 4431463 4456652 4863097 5035937 5339583 5377983 5924703 6342466 6880846 7026101 7469930
$$ packed form
7429a31508J96980J17120J84912j90330J70851k5435N30237k26992k49060N51686
7419I28461L78647r6823m91540J4756L86521K57421m12767Q2920k53393L7584
7409H31787l9326L04414r7987P1239J83622j49442K00138k68282N5462j2142k07788
7398H71695N94114n67895k78288L55667L474J89755R3609j09306o8410K65481
7388A349896J18884l90594J94618k08259K09472K14359R8981N92818k85749L1133
7378A925559k1315k24552K19588N44693l25355J62283M18861N3605l60870o9570
7368B322927Q40544r6248k86453J94193M7170K69050L85149L85969K43761J25401
7358D431463K5189M06445J72840L03646L8400N46720M17763N38380J45255M43829
$$ plain form
7348 7469930 7783426 8118250 9026916 9747286 10243535 10547660 11659057 12832698 14292287
7339 14292287 16082818 17630932 19833650 21906251 24166332 27385916 31530767 36239432
7331 36239432 41724088 47276048 52781980 56743209 57781504 53924261 47298826 39996356
7323 39996356 33409665 28038305 23570634 20473409 17864935 15570981 14171279 12694385
7315 12694385 11127305 10589413 9809552 8789759 8216458 7752015 7020796 6914177 6390793
7306 6390793 5646215 5526900 5593207 4970670 4542846 4347482 4493687 4257055 4388912 4264521
7296 4264521 3614079 3374103 2982687 3059348 3372627 3171032 3244590 2798274 2543567 2456657
7286 2456657 2021770 1698846 2306603 2096209 2126415 2220663 2014159 1751973 1504172 1615022
$$ packed form
7348G469930L13496L34824R08666P20370M96249L04125J111397J173641J459589
7339A4292287J790531J548114K202718K072601K260081L219584M144851M708665
7331C6239432N484656N551960N505932L961229J038295l857243o625435p302470
7323C9996356o586691n371360m467671l097225k608474k293954j399702j476894
7315A2694385j567080n37892p79861j019793n73301m64443p31219j06619n23384
7306F390793p44578j19315O6307o22537m27824j95364J46205k36632J31857j24391
7296D264521o50442k39976l91416P6661L13279k01595P3558m46316k54707q6910
7286B456657m34887l22924O07757k10394L0206R4248k06504k62186k47801J10850
$$ plain form
7276 1615022 1252152 1245038 1197260 1656284 1780490 1458120 1436072 1431665 1009854 1160740 1547134
7265 1547134 1540190 1290520 702082 717657 784803 657509 724597 1050804 1111012 710296 787989
7254 787989 917260 1081337 1463551 1088186 1002210 923809 395040 834490 1070989 491019
7244 491019 233853 415076 725245 972701 249950 103332 407389 780122 696044 502081
7234 502081 333712 143271 280177 453966 -262629 -194121 318868 430862 321450 196
7224 196 276972 468820 606393 420121 129188 115584 156372 128289 432713 253441 -264405
7213 -264405 -254941 -488240 186391 152958 -114630 281269 -126913 150295 283350 54216
7203 54216 298369 474620 697822 715969 518001 583930 822517 587731 200601 655749
$$ packed form
7276A615022l62870p114m7778M59024J24206l22370k2048m407m21811J50886L86394
7265A547134o944k49670n88438J5575O7146j27294O7088L26207O0208m00716P7693
7254G87989J29271J64077L82214l75365q5976p8401n28769M39450K36499n79970
7244D91019k57166J81223L10169K47456p22751j46618L04057L72733q4078j93963
7234E02081j68369j90441J36906J73789p16595O8508N12989J11994j09412l21254
7224A96K76776J91848J37573j86272k90933j3604M0788k8083L04424j79272n17846
7213b64405R464k33299O74631l3433k67588L95899m08182K77208J33055k29134
7203E4216K44153J76251K23202J8147j97968O5929K38587k34786l87130M55148
$$ plain form
7193 655749 294477 31493 23299 -147266 -167618 -84803 -89475 226676 43903 -42723 -231276
7182 -231276 -287013 432894 399126 504392 553539 353629 427343 450965 418505 480465 112675
7171 112675 -117530 321277 259066 -20839 -316822 335792 460486 115401 -447387 -122492
7161 -122492 276901 -73184 107187 462404 584660 140663 473630 453672 452593 7958
7151 7958 297209 315883 -34298 -68750 99167 -65990 -197849 34493 -79736 -276111
7141 -276111 38220 33831 -56612 181070 -84227 -459778 -566771 -469673 -391811 -142496 -415678
7130 -415678 -345615 -99954 118131 71631 254325 317131 119886 -133041 -8681 -179613
7120 -179613 -117442 151479 299590 -200356 159372 129823 300251 618658 329386 -27403
$$ packed form
7193F55749l61272k62984q194j70565k0352Q2815m672L16151j82773q6626j88553
7182b31276n5737P19907l3768J05266M9147j99910P3714K3622l2460O1960l67790
7171A12675k30205M38807o2211k79905k95983O52614J24694l45085n62788L24895
7161a22492L99393l50085J80371L55217J22256m43997L32967j9958j079m44635
7151G958K89251J8674l50181l4452J67917j65157j31859K32342j14229j96375
7141b76111L14331m389r0443K37682k65297l75551j06993R7098P7862K49315k73182
7130d15678P0063K45661K18085m6500J82694O2806j97245k52927J24360j70932
7120a79613O2171K68921J48111m99946L59728k9549J70428L18407k89272l56789
$$ plain form
7110 -27403 10072 -271685 62979 536639 437460 1018489 664552 619894 426754 -149788
7100 -149788 186562 742415 243114 -27953 112718 190887 -63820 40688 138872 57987
7090 57987 13310 -216108 -34288 -456368 -544637 -448082 -400172 -512589 -939780 -925965 -875088
7079 -875088 -486409 -297180 -296288 -438185 -177436 -352081 -206539 -28019 -258698 -163258
7069 -163258 196494 -261764 -166253 210803 -365032 -73727 -24252 119018 279587 -108679
7059 -108679 -227070 -245526 361551 195886 -37817 -45951 -109474 35214 278633 67182
7049 67182 110755 164633 452566 29018 -306373 -714834 -654091 -899435 -718373 -489041
7039 -489041 -596521 39749 20111 -333556 -512344 -744582 -332542 -350152 -548970 184552
$$ packed form
7110b7403L7475k81757L34664M73660r9179N81029l53937m4658j93140n76542
7100a49788L36350N55853m99301k71067J40671P8169k54707J04508R8184q0885
7090E7987m4677k29418J81820m22080q8269R6555M7910j12417m27191J3815N0877
7079h75088L88679J89229Q92j41897K60749j74645J45542J78520k30679R5440
7069a63258L59752m58258R5511L77056n75835K91305M9475J43270J60569l88266
7059a08679j18391j8456O07077j65665k33703q134o3523J44688K43419k11451
7049F7182M3573N3878K87933m23548l35391m08461O0743k45344J81062K29332
7039d89041j07480O36270j9638l53667j78788k32238M12040j7610j98818P33522
$$ plain form
7029 184552 243672 -79083 -87150 -238303 -498203 -504653 -631229 -561993 -713984 -418573 202119
7018 202119 387852 315063 199968 38686 -822176 -279113 -186792 -618887 -84967 207341
7008 207341 -81380 43181 304399 -173843 -101025 -266074 -21755 344301 405477 407889
6998 407889 407679 -75779 -95583 111607 -235272 39820 823098 479071 -143980 -569311
6988 -569311 -519001 97379 728183 489143 388186 137063 412766 622223 465707 31124
6978 31124 220604 339944 633616 409943 178495 207179 561977 181379 232256 181688
6968 181688 -45524 44046 64688 238707 323573 426469 602206 534835 402216 508626
6958 508626 509845 -98224 -425864 -250992 -465712 -272787 -285329 -150851 -271478 -216658
$$ packed form
7029A84552N9120l22755q067j51153k59900o450j26576O9236j51991K95411O20692
7018B02119J85733p2789j15095j61282q60862N43063R2321m32095N33920K92308
7008B07341k88721J24561K61218m78242P2818j65049K44319L66056O1176K412
6998D07889k10m83458j9804K07190l46879K75092P83278l44027o23051m25331
6988e69311N0310O16380O30804k39040j00957k51123K75703K09457j56516m34583
6978C1124J89480J19340K93672k23673k31448K8684L54798l80598N0877n0568
6968A81688k27212Q9570K0642J74019Q4866J02896J75737o7371j32619J06410
6958E08626J219o08069l27640J74872k14720J92925j2542J34478j20627N4820
$$ plain form
6948 -216658 -313180 -102794 -20422 266788 497713 450432 601180 203175 273051 483730
6938 483730 -12725 -156303 93866 223473 423189 619898 373938 -647 153715 254210
6928 254210 266423 544913 -202668 -152313 389807 528975 413224 420232 120738 -8870
6918 -8870 -359045 -620088 -510070 -355291 175185 472423 159176 114791 124713 279560 344255
6907 344255 182560 69188 204960 308131 -124417 -248911 274761 -298270 -526032 -388013
6897 -388013 -263221 -172561 -187190 -472276 -809671 -99552 88432 -595370 -459283 -302164
6887 -302164 -643747 47027 229122 457818 -90002 -53605 164980 132483 -169857 -317836
6877 -317836 -128127 107478 -130264 -41882 201874 72646 248761 287495 131667 279475
$$ packed form
6948b16658r6522K10386Q2372K87210K30925m7281J50748l98005O9876K10679
6938D83730m96455j43578K50169J29607J99716J96709k45960l74585J54362J00495
6928B54210J2213K78490p47581N0355N42120J39168j15751P008k99494j29608
6918h870l50175k61043J10018J54779N30476K97238l13247m4385R922J54847O4695
6907C44255j61695j13372J35772J03171m32548j24494N23672n73031k27762J38019
6897c88013J24792R0660j4629k85086l37395P10119J87984o83802J36087J57119
6887c02164l41583O90774J82095K28696n47820L6397K18585l2497l02340j47979
6877c17836J89709K35605k37742Q8382K43756j29228J76115L8734j55828J47808
$$ plain form
6867 279475 108841 198097 -55672 -520398 -555421 -100741 45681 -453354 -412042 -357115
6857 -357115 -413310 -553594 -174069 21482 196410 -130076 -365220 -707835 -98999 -70487
6847 -70487 -265520 -134876 -156775 -88069 -308568 -698401 -298022 -215251 -77508 44669
6837 44669 165980 61010 -788655 -396295 150326 -431377 -532092 -260217 -383318 -198446
6827 -198446 117933 -476425 -443752 104404 -32742 24498 -22097 310510 329754 231960 -74430
6816 -74430 -423440 904 -37816 -390880 -481167 126737 -249880 -455558 -432442 -230752
6806 -230752 370798 132916 -133438 -27415 -79990 -100868 446331 246454 -104135 -280904
6796 -280904 -63766 585803 78889 -299 -136295 -96813 444502 -23882 -394922 -680659
$$ packed form
6867B79475j70634Q9256k53769m64726l5023M54680J46422m99035M1312N4927
6857c57115n6195j40284L79525J95551J74928l26486k35144l42615O08836K8512
6847g0487j95033J30644k1899O8706k20499l89833M00379Q2771J37743J22177
6837D4669J21311j04970q49665L92360N46621n81703j00715K71875j23101J84872
6827a98446L16379n94358L2673N48156j37146N7240m6595L32607J9244r7794l06390
6816g4430l49010M24344l8720l53064r0287O07904l76617k05678K3116K01690
6806b30752O01550k37882k66354J06023n2575k0878N47199j99877l50589j76769
6796b80904K17138O49569n06914p9188j35996L9482N41315m68384l71040k85737
$$ plain form
6786 -680659 -621045 -526009 -536819 -480140 -61468 -95786 -88632 -116145 39063 61395 48296
6775 48296 -564136 -389617 -707597 -602347 -507879 -434307 -63002 323004 213619 75182
6765 75182 350251 -76733 28760 -79496 112894 191553 -292977 -509126 -292593 -207192
6755 -207192 -157961 -55966 44908 206089 -16345 -116503 -174842 -174695 -301399 -378676 -453808
6744 -453808 26879 42377 -322718 -675300 -1179637 -925976 -155093 -372559 -453057 -328793
6734 -328793 -455091 -336134 -810526 -975206 -229298 81254 -161930 -227476 -217992 -476759
6724 -476759 -895828 -986644 -1070949 -640382 -866301 -823592 -702498 -858522 -449127 -147119
6714 -147119 -234491 -344159 -118697 -189772 -92379 373394 195173 252445 460407 -166717
$$ packed form
6786f80659N9614R5036j0810N6679M18672l4318P154k7513J55208K2332j3099
6775D8296o12432J74519l17980J05250R4468P3572L71305L86006j09385j38437
6765G5182K75069m26984J05493j08256J92390P8659m84530k16149K16533Q5401
6755b07192M9231J01995J00874J61181k22434j00158n8339J47j26704p7277p5132
6744d53808M80687J5498l65095l52582n04337K53661P70883k17466q0498J24264
6734c28793j26298J18957m74392j64680P45908L10552k43184o5546R484k58767
6724d76759m19069r0816q4305M30567k25919M2709J21094j56024M09395L02008
6714a47119q7372j09668K25462p1075R7393M65773j78221N7272K07962o27124
$$ [...]
##END NTUPLES=NMR SPECTRUM
##END=
