##TITLE=1H_TG-2363-x
 CDCl3
 8 sc, 
 19.10.2022
##JCAMPDX= 6.0         $$ Bruker NMR JCAMP-DX V2.0
##DATA TYPE= NMR SPECTRUM
##DATA CLASS= NTUPLES
##ORIGIN= UXNMR, Bruker Analytische Messtechnik GmbH
##OWNER= root
$$ XWIN-NMR		Version 3.5
$$ Wed Oct 19 14:04:51 2022 Russian Standard Time (UT+4h)  she@DPX200
##.OBSERVE FREQUENCY= 200.1313499994
##.OBSERVE NUCLEUS= ^1H
##.ACQUISITION MODE= SIMULTANEOUS
##.ACQUISITION SCHEME= undefined
##.AVERAGES= 8
##.DIGITISER RES= 18
##SPECTROMETER/DATA SYSTEM= spect
##.PULSE SEQUENCE= zg30
##.SOLVENT NAME= CDCl3
##.SHIFT REFERENCE= (INTERNAL, CDCl3, 0, 15.7425)
##AUDIT TRAIL= $$ (NUMBER, WHEN, WHO, WHERE, WHAT)
$$ ##TITLE= Audit trail, XWIN-NMR		Version 3.5
$$ ##JCAMPDX= 5.01
$$ ##ORIGIN= Bruker BioSpin GmbH
$$ ##OWNER= she
$$ F:/spectra/data/she/nmr/H-F/1/pdata/1/auditp.txt
$$ ##AUDIT TRAIL=  $$ (NUMBER, WHEN, WHO, WHERE, WHAT)
(   1,<2022-10-19 14:03:34.23 +0400>,<she>,<DPX200>,
      <created by zg, POWCHK disabled, PULCHK disabled
       configuration hash MD5:
       00 E9 B6 7A A2 85 ED C7 34 08 36 98 17 FE 4E 26
       data hash MD5: 16K
       AD DD 44 11 41 22 40 8D 8F D9 DB 41 95 CE 36 9E>)
(   2,<2022-10-19 14:03:37.70 +0400>,<she>,<DPX200>,
      <Start of raw data processing
       efp BC_mod = 2 LB = 0.24 FT_mod = 6 PKNL = 1 PHC0 = -18033.12 PHC1 = 8.000703 SI = 16K 
       data hash MD5: 16K
       D1 D6 50 1D C7 91 DF 33 37 BF D8 57 22 B5 B9 3E>)
(   3,<2022-10-19 14:04:13.26 +0400>,<she>,<DPX200>,
      <pk PHC0 = -0.5236909 PHC1 = 3.6 
       data hash MD5: 16K
       4A 00 9B 76 12 D7 DD FE D6 92 3E 78 1C D9 92 96>)
(   4,<2022-10-19 14:04:17.51 +0400>,<she>,<DPX200>,
      <abs ABSG = 5 
       data hash MD5: 16K
       81 FA E3 84 6B 38 48 C7 41 21 99 44 82 E9 26 B9>)
$$ ##END=
$$ 
$$ hash MD5
$$ 33 25 C8 BD 28 D9 4F A7 68 2C F9 9F DC 3C C5 8B
##$RELAX= 
##$RELAX= 
##$RELAX= 
##$RELAX= 
##$RELAX= 
##$RELAX= 
$$ Bruker specific parameters
$$ --------------------------
##$DU= <F:/spectra>
##$EXPNO= 1
##$NAME= <H-F>
##$PROCNO= 1
##$TYPE= <nmr>
##$USER= <she>
##$AMP= (0..31)
100 100 100 100 100 100 100 100 100 100 100 100 100 100 100 100 100 100 
100 100 100 100 100 100 100 100 100 100 100 100 100 100 
##$AQSEQ= 0
##$AQ_mod= 1
##$AUNM= <au_zg>
##$AUTOPOS= <>
##$BF1= 200.13
##$BF2= 200.13
##$BF3= 200.13
##$BF4= 200.13
##$BF5= 200.13
##$BF6= 200.13
##$BF7= 200.13
##$BF8= 200.13
##$BYTORDA= 1
##$CFDGTYP= 0
##$CFRGTYP= 5
##$CHEMSTR= <none>
##$CNST= (0..31)
1 1 145 1 1 1 1 1 1 1 1 1 1 1 1 1 1 1 1 1 1 1 1 1 1 1 1 1 1 1 1 1 
##$CPDPRG= <>
##$CPDPRG1= <>
##$CPDPRG2= <>
##$CPDPRG3= <>
##$CPDPRG4= <mlev>
##$CPDPRG5= <mlev>
##$CPDPRG6= <mlev>
##$CPDPRG7= <mlev>
##$CPDPRG8= <mlev>
##$CPDPRGB= <>
##$CPDPRGT= <>
##$D= (0..31)
0 1.2 0 0 0 0 0 0 0 0.06 0 0.03 0 0 0 0 0.0002 0 0 0 0 0 0 0 0 0 0 0 0 
0 0 0 
##$DATE= 1666173813
##$DBL= (0..7)
120 120 120 120 120 120 120 120 
##$DBP= (0..7)
150 150 150 150 150 150 150 150 
##$DBP07= 0
##$DBPNAM0= <>
##$DBPNAM1= <>
##$DBPNAM2= <>
##$DBPNAM3= <>
##$DBPNAM4= <>
$$ [...]
##$SUBNAM3= <"">
##$SUBNAM4= <"">
##$SUBNAM5= <"">
##$SUBNAM6= <"">
##$SUBNAM7= <"">
##$SUBNAM8= <"">
##$SUBNAM9= <"">
##$SW= 18.0517283424941
##$SWIBOX= (0..15)
0 0 2 0 0 0 0 0 0 0 0 0 0 0 0 0 
##$SW_h= 3612.71676300578
##$TD= 16384
##$TD0= 1
##$TE= 0
##$TE2= 300
##$TE3= 300
##$TEG= 300
##$TL= (0..7)
0 120 120 120 120 120 120 120 
##$TP= (0..7)
150 150 150 150 150 150 150 150 
##$TP07= 0
##$TPNAME0= <>
##$TPNAME1= <>
##$TPNAME2= <>
##$TPNAME3= <>
##$TPNAME4= <>
##$TPNAME5= <>
##$TPNAME6= <>
##$TPNAME7= <>
##$TPOAL= (0..7)
0.5 0.5 0.5 0.5 0.5 0.5 0.5 0.5 
##$TPOFFS= (0..7)
0 0 0 0 0 0 0 0 
##$TUNHIN= 0
##$TUNHOUT= 0
##$TUNXOUT= 0
##$USERA1= <user>
##$USERA2= <user>
##$USERA3= <user>
##$USERA4= <user>
##$USERA5= <user>
##$V9= 5
##$VALIST= <valist>
##$VCLIST= <CCCCCCCCCCCCCCC>
##$VD= 0
##$VDLIST= <DDDDDDDDDDDDDDD>
##$VPLIST= <PPPPPPPPPPPPPPP>
##$VTLIST= <TTTTTTTTTTTTTTT>
##$WBST= 1024
##$WBSW= 4
##$XGAIN= (0..3)
0 0 0 0 
##$XL= 0
##$YL= 0
##$YMAX_a= 120679
##$YMIN_a= -173230
##$ZGOPTNS= <>
##$ZL1= 120
##$ZL2= 120
##$ZL3= 120
##$ZL4= 120
##$ABSF1= 15.74248
##$ABSF2= -2.309369
##$ABSG= 5
##$ABSL= 3
##$ALPHA= 0
##$AQORDER= 0
##$ASSFAC= 0
##$ASSFACI= 0
##$ASSFACX= 0
##$ASSWID= 0
##$AUNMP= <proc_1d>
##$AZFE= 0.1
##$AZFW= 0.1
##$BCFW= 0
##$BC_mod= 2
##$BYTORDP= 0
##$COROFFS= 0
##$CY= -3
##$DATMOD= 1
##$DC= 0
##$DFILT= <>
##$DTYPP= 0
##$F1P= 0
##$F2P= 0
##$FCOR= 1
##$FTSIZE= 16384
##$FT_mod= 6
##$GAMMA= 0
##$GB= 0
##$INTBC= 1
##$INTSCL= 3.70164e-10
##$ISEN= 128
##$LB= 0.24
##$LEV0= 0
##$LPBIN= 0
##$MAXI= 10000
##$MC2= 0
##$MEAN= 0
##$ME_mod= 0
##$MI= 1.114404
##$NCOEF= 0
##$NC_proc= -9
##$NLEV= 6
##$NOISF1= 3.799351
##$NOISF2= 2.8
##$NSP= 0
##$NTH_PI= 0
##$NZP= 0
##$OFFSET= 15.74248
##$PC= 1
##$PHC0= -18033.64
##$PHC1= 11.6007
##$PH_mod= 1
##$PKNL= yes
##$PPARMOD= 0
##$PSCAL= 0
##$PSIGN= 0
##$REVERSE= no
##$SF= 200.130005814272
##$SI= 16384
##$SIGF1= 3
##$SIGF2= 2
##$SINO= 5.538805
##$SIOLD= 16384
##$SREGLST= <1H.CDCl3>
##$SSB= 0
##$STSI= 16384
##$STSR= 0
##$SW_p= 3612.71676300578
##$SYMM= 0
##$S_DEV= 0
##$TDeff= 16384
##$TDoff= 0
##$TI= <>
##$TILT= no
##$TM1= 0
##$TM2= 0
##$TOPLEV= 0
##$USERP1= <user>
##$USERP2= <user>
##$USERP3= <user>
##$USERP4= <user>
##$USERP5= <user>
##$WDW= 1
##$XDIM= 16384
##$YMAX_p= 524150494
##$YMIN_p= -5999938
$$ End of Bruker specific parameters
$$ ---------------------------------
##NTUPLES= NMR SPECTRUM
##VAR_NAME=  FREQUENCY,     SPECTRUM/REAL,   SPECTRUM/IMAG
##SYMBOL=    X,             R,               I
##VAR_TYPE=  INDEPENDENT,   DEPENDENT,       DEPENDENT
##VAR_FORM=  AFFN,          ASDF,            ASDF
##VAR_DIM=   16384,         16384,           16384
##UNITS=     HZ,            ARBITRARY UNITS, ARBITRARY UNITS
##FACTOR=    0.220516191357247, 1,           1
##FIRST=     3150.54266957023, 0,            0
##LAST=      -462.174093435548, 0,           0
##MIN=       -462.174093435548, -5999938,    0
##MAX=       3150.54266957023, 524150494,    0
$$ Real data points
##PAGE= N=1
##DATA TABLE= (X++(R..R)), XYDATA
$$ [...]
6825 22141818 21309764 19777166 19366083 20343730 19447180 18433550 17947784 19505511 19932134
6816 19932134 19041263 18711124 19965272 19428997 18743664 18368623 18430826 16774987 16524530
6807 16524530 17217873 16787393 16847721 17504725 16975845 16352574 17912258 17670542 17386709
6798 17386709 17030888 16952224 17854091 17882305 17313187 16260985 15932897 15628537 15653388 15668994
6788 15668994 16511586 15909619 16091901 16559813 15964690 15856632 15066557 14541446 14840625
6779 14840625 15817126 15506191 14621341 13456576 13534526 14937020 14398669 14621183 14488348
6770 14488348 14224763 14105207 14418286 14528063 13573537 14600070 14020068 13343847 13343563 13557307
6760 13557307 12270898 13340801 13898900 13222924 12583031 13206808 12778784 11560989 10608669
6751 10608669 11284155 12628107 12606314 12653077 12826639 12405961 10971786 11820859 11874079 10940119
6741 10940119 11873012 11691243 11207070 11625873 11536369 11645219 12073508 11594814 10415106
6732 10415106 11295216 11700964 10978613 11153191 10511934 9661196 9486358 9600098 9518671 9794869
6722 9794869 10863123 10728069 11230591 11255870 10764489 11430406 10425228 8823240 10377898
6713 10377898 10309048 10487473 11615264 9997322 9469853 9147012 9888729 8704180 8282794
6704 8282794 10115145 9489821 8406947 8544565 8602388 8450341 8782980 8773597 7953387 8850011
6694 8850011 9561276 9715923 9570346 8916617 8952327 8467352 7515896 8514712 9601273 9152320
6684 9152320 7871861 8177051 8919829 9970390 10288788 9298157 9038936 8538372 7897248
6675 7897248 7371794 6098583 5533103 6173340 6915098 7286413 7990110 6735174 6609699
6666 6609699 8828630 8763906 9239984 8282303 9207468 9263030 7478886 7614020 7497344 6574929
6656 6574929 6095235 6541298 6930355 7313229 6787694 5978337 6291681 6294151 5785939 6665918
6646 6665918 7753385 6857856 7173900 6940882 6166743 6499699 5784064 6549787 7190896
6637 7190896 7698191 7258246 7532924 7489725 6738228 7877830 7546155 7178203 7430479 7699296
6627 7699296 5980365 5261858 6731176 6694707 6788763 7219371 7033456 6763103 6762892 7573175
6617 7573175 6449743 6038296 5645032 6635423 7537909 7023883 7254055 7817290 6980809
6608 6980809 5803379 5759342 5876026 5592255 5965461 5056443 5953046 4288212 4910948
6599 4910948 5730735 5644181 5333165 6025585 5491508 4301269 4423929 5067242 6117924
6590 6117924 5661602 7425649 6858107 6865149 6389270 5995709 6201862 7838679 7607535 7122685
6580 7122685 6091426 6764361 7897231 6781876 7101717 6889814 6653540 6483543 5552061
6571 5552061 6715152 6205765 5451275 5973889 7095157 6825241 6485043 5754087 5510590
6562 5510590 6681750 7033867 5157805 5821948 7031832 5786821 5413354 6247086 6503176
6553 6503176 7628332 6933320 4857759 5987306 7106716 7035093 6112132 6545787 6869436
6544 6869436 6195184 6961393 6543742 5899138 7322942 6956446 6758120 6652784 7584955
6535 7584955 8135930 7189155 8001167 6390765 5046128 5770671 6318675 7340533 7835630
6526 7835630 6570017 6161362 6459358 7892266 6806936 6377628 5976829 6643172 6745935
6517 6745935 6612015 7626915 8565717 7434348 6640109 8207009 7492276 7675299 7757967
6508 7757967 7367707 6631986 6955679 7456541 6425931 6113829 7738043 8650312 8610989
6499 8610989 8559323 7406685 6709457 7287078 7415819 7460689 6965925 7504910 6269422 6187578
6489 6187578 7628002 8060333 7302456 8097123 6136039 5351602 6391518 7181335 6608290
6480 6608290 7050720 8727046 8114515 7997115 9393517 9402682 8035231 9136784 8203391
6471 8203391 8190374 9522329 9886421 9942357 9989834 8886246 9278668 10103197 8776665 8706588
6461 8706588 9325787 9350095 9923839 10202230 8613552 8169874 8325665 9964762 9801725
6452 9801725 9992010 9433169 9934860 10459811 10936093 10374273 9550855 9806324 8948292 7955824
6442 7955824 7678759 8804867 9391059 9850038 10715847 10498015 9827930 11273487 11070298
6433 11070298 12007361 11684971 9631578 9672643 10204856 10049708 10926799 11790318 11499830
6424 11499830 11581551 11362418 10942981 10744831 10216761 10758744 12310545 11643301 11909588
6415 11909588 12683043 11922688 13187192 12861787 13013585 12601184 12713529 14461704 14229807
6406 14229807 14752896 14054042 13032527 12844703 12657725 13516052 12479649 12037570 13731450
6397 13731450 14023562 14287515 14888260 14621900 14367908 13766017 13598753 13857077 13407436
6388 13407436 13891345 13383368 13397480 14546464 14609057 15379896 14728615 13594002 13408560
6379 13408560 13336426 14454158 14684535 13991509 15098636 15752368 15901205 15451794 16011438
6370 16011438 15915794 16027578 16408508 15948751 16940110 17165585 17005627 17926130 16617549
6361 16617549 17481411 17976672 17201489 17929869 17193444 16543171 17199558 17212464 17685874 17146681
6351 17146681 16991049 16802593 16157323 18162085 18532199 17065200 16493763 17244440 16620893
6342 16620893 17179297 16630257 16734336 17111037 16782809 17561919 18253586 19085720 19266400
6333 19266400 19164109 19001041 18683341 18701719 18617610 19950678 20150469 20121035 19620098 18453001
6323 18453001 17621250 18136829 19195683 18847974 18795959 19502572 20218711 19771505 19937056
6314 19937056 19992552 19551767 20712586 21081288 20535737 20756623 20917175 21167867 20743136
6305 20743136 20950066 22001120 22514591 20579815 20249487 20435509 20715797 20434276 20553086
6296 20553086 21929974 22028228 21339090 21808160 20837611 20251361 20237460 20463662 21701575
6287 21701575 22214709 21269637 21644543 21265208 21064932 20664766 21200474 22418967 22869916
6278 22869916 22055213 20551725 21441164 21818963 21945140 22779419 22946344 21194381 20649829
6269 20649829 21219594 21741092 21324584 21555514 20515088 21270867 21836717 21961993 21951594
6260 21951594 20903638 21603963 22482667 22843488 22053792 21718822 22255378 22399879 21586672
6251 21586672 21678566 21717550 21822347 22180029 21104831 20275095 20690301 21734183 21723186 21454869
6241 21454869 21648489 21201552 20699425 20438530 19813053 19556202 20407844 20985555 19950909
6232 19950909 19198305 19255276 19860144 19449150 21073318 21066126 20862323 19726480 20342819 20960903
6222 20960903 21871007 21678186 20858899 20037070 19310459 20373000 20739583 20785591 21246158
6213 21246158 20008338 18821602 19091828 19686445 19287858 20068243 20672422 20455040 21013621
6204 21013621 19700901 19175115 19837903 19842101 18888278 18549525 18325606 18827402 18760098 18479960
6194 18479960 19310521 18264346 17651388 19105818 19016629 19512110 19555784 20039711 20323703
6185 20323703 19489213 18782752 18659340 18525920 18289272 18430618 18573061 18665943 18883343 18363269
6175 18363269 18034231 19030482 17665677 16729797 17481447 17916080 18087498 18392895 17443398
6166 17443398 16298891 16202829 15577950 16917009 16840720 18029789 17623721 17846894 18224054
6157 18224054 17661149 17063344 17233700 17055915 16446930 16057944 15793983 15447185 15949246
6148 15949246 16051043 17091186 15632743 14996123 15298014 15357183 16545572 15646731 16051024
6139 16051024 16515034 16220398 15546486 16555874 17115779 16657267 15944740 16897008 16729418
6130 16729418 15993941 15975523 14614316 13985628 14597756 15062539 15412589 14443542 14311937
6121 14311937 14447900 13543915 13678630 13258404 14322148 13827394 14348432 14229792 14482663
6112 14482663 13384664 13418339 15150222 14020927 13729026 14403098 14803253 13440150 13241554
6103 13241554 13943147 14093014 13750456 13501996 13851734 12891179 13198738 13022189 12315646
6094 12315646 11739683 11640538 12543663 12893490 12993787 11994567 12894488 13095088 12378583 11303616
6084 11303616 11362068 11394600 11210716 11508403 11483230 10496857 11183987 11774648 11001532 12541001
6074 12541001 12254347 11932007 11232092 10808814 11247832 11363027 11100572 10815062 11869084
6065 11869084 12576808 12905465 12062083 11607821 11024379 11359843 10441552 10692969 10497469
6056 10497469 11445261 12583154 12839853 12181446 11557432 10800200 10184625 9500050 9994990
6047 9994990 9075440 10135378 9748575 10128014 10534167 11031623 10035702 9541217 10296870
6038 10296870 9282998 9579203 10729501 12148112 12046248 11950633 11753676 12414479 12117716
6029 12117716 12035554 12115655 12056760 11261664 11146153 9803850 10870627 10859842 10645326 10286166
6019 10286166 9145718 9963215 10675280 8645324 8093538 9262738 8946217 9125892 9390232
6010 9390232 8199008 6269726 5777161 7604017 8116079 9109220 9395749 9679290 9318637
6001 9318637 9488998 9889915 10315928 10394480 9069171 10155572 10376681 10096123 11398330
5992 11398330 10641925 9332616 8292549 7360104 8458092 8523107 8075898 6500013 6641522
5983 6641522 7479260 7214905 7092094 8459924 8868790 7622796 6410209 7109528 7594838
5974 7594838 7954079 8463452 7278639 6760857 6924620 7094947 6670495 6858737 6985483
5965 6985483 6926275 7106949 7773429 8287873 7673446 7121234 7067971 6365768 6007957 4723978
5955 4723978 4545739 4020005 4290433 4571501 4252110 4821864 5361112 5855872 6482444 6030522
5945 6030522 4729780 5975745 5502283 5398530 4481192 3412275 4105968 4474642 3942354
5936 3942354 3312394 4048365 3993110 3792768 3999699 4782557 3884075 3137024 3610288 3531282
5926 3531282 3269979 2592795 3025374 3498393 3040740 3132409 3575520 4115898 3495159 4328564
5916 4328564 3555087 3424022 3840845 4292734 3694018 2110385 3362293 4045655 3270726
5907 3270726 3753409 3050953 2347714 1518503 1549565 2938173 2519294 2412955 2735265 3278639
5897 3278639 3203367 2366393 2705649 3512390 2073975 903059 2141207 2947944 2599887
5888 2599887 2509623 2184319 1736834 803196 1343116 2094575 2443209 2322552 2716872 2227028
5878 2227028 3168339 3470058 3598602 2583762 1165704 734919 1282764 1385960 1310297
5869 1310297 1052236 1345962 2422407 2159874 2547884 2611798 2677650 2571487 2277998 916549
5859 916549 846522 1341205 3021470 3002143 1560228 2281702 1896651 2337522 1879203 1500079
5849 1500079 828677 1326699 1280556 -11131 -305007 -40002 50641 919698 2478953 3008345
5839 3008345 3152075 2406321 1917489 927959 1518043 945319 1389807 651984 855582 1697890
5829 1697890 1156623 1909712 1003951 1232823 1466929 1579991 1392905 638133 1138097 -38215
5819 -38215 320632 1328995 561207 287871 -15882 804914 580099 -862508 -340039 -947168
5809 -947168 -774412 772222 876616 2111875 1621121 170363 1812065 1046774 132495
5800 132495 640423 279147 1381203 958824 -1160554 -332633 118507 -477137 -335375
5791 -335375 -123887 148047 482786 644411 661626 -137474 72472 420691 -431456 497878
5781 497878 346258 547635 278025 -176130 -207591 670700 446752 -922333 131538 267961
5771 267961 -178167 -222946 -518341 480772 905483 203638 -992478 -703047 41858 -221
5761 -221 -401574 -617611 -107086 546127 -335898 148828 1231963 1332191 136881 -716226
5751 -716226 -1007750 -394327 -808547 -2226284 -1542557 -1150372 -862135 -760897 -884383 -240822
5741 -240822 701206 560690 710145 456631 -196109 -98955 1090591 -729518 -2228900
5732 -2228900 -2628406 -897552 205864 -1690977 -787730 -906983 507333 -682979 -593476
5723 -593476 241005 -584912 -138364 -128967 10832 -1092158 -1218079 -474725 -70944 -814263
5713 -814263 -806269 66133 -278022 392231 515148 259396 405779 -408182 146186 -870095
5703 -870095 -1026580 -973446 -423229 -457481 -437228 -688534 -878606 -138599 -1044932 -1642344
5693 -1642344 -575314 -1338237 -1232655 -1832681 -875426 671431 -1347230 -1182793 -1300999
5684 -1300999 -439604 -188655 -576279 -489540 -144471 -739155 -1192413 -724594 -1163490 -1293788
5674 -1293788 -2216077 -1122239 -344829 -1030236 -1282732 -1911123 -2364952 -2449697 -1853758 -1284037
5664 -1284037 -1704016 -1774310 -2979576 -2037220 -517936 -749555 -282749 -2091294 -2964676
5655 -2964676 -392007 44381 -92670 -995063 -1158696 -1284939 -1419433 -1753983 -1663476 -210840
5645 -210840 -461350 -948366 -2138436 -789682 -498887 -1312492 -1145662 -280756 262213
5636 262213 -1040691 -1326015 -359121 2272 -759157 -928819 -662571 -264886 -193006 -1117047
5626 -1117047 -921747 -547787 -82810 -27345 98839 738936 -759676 181007 301114 -1790422
5616 -1790422 -2251066 -353926 -410914 -1116127 -2219408 -1578846 -927797 -2230521 -506425
5607 -506425 -57215 -368504 -109863 -99389 -836618 425681 165850 631166 -59911 -1472168
5597 -1472168 -1798117 -1476104 -99444 -37022 434101 152599 -590208 -560453 -249496 -99342
5587 -99342 -33833 785450 -640496 -2625023 -1019959 -35012 692890 810840 -1185326
5578 -1185326 -999911 -1925836 -197230 1176165 30335 1109766 1535387 1054803 335092
5569 335092 -449080 430445 800041 -211711 -917771 -258202 39749 -268470 -875331 -1014138
5559 -1014138 -526656 -147228 -1247058 -411816 -1034700 -611967 -823035 -943986 6327
5550 6327 -314084 -589249 -154803 -44547 -669504 -223572 -138280 899489 1192061 663325
5540 663325 757697 684425 -76003 -214564 -769853 -1037597 -972009 -869824 522627 635137
5530 635137 -44771 271174 830244 1708028 276382 352374 -108501 943855 1704445 1036026
5520 1036026 607994 100344 74068 325450 -933503 -1489377 405404 150161 -682248
5511 -682248 176277 163931 -526554 -317426 165072 484697 789200 1331922 1470373 315832
5501 315832 313276 570646 267334 -231476 1485325 730613 -1011782 -2121486 -2350595 -1503598
5491 -1503598 324347 -622155 -588739 225044 726609 351827 50761 1315187 743917
5482 743917 1003966 976616 2406466 1199092 492754 847503 931006 1488526 1934613 2075568
5472 2075568 1580180 907827 -197466 -120668 58499 245414 692200 1098515 1269923 1188433
5462 1188433 263473 689030 727899 680753 1331481 2106949 1568794 2060932 2077567 1003848
5452 1003848 1539379 2026383 1568207 2003796 2610473 2488521 2669100 2280667 2177579 1928443
5442 1928443 2819020 2931186 2190975 1224750 1120409 1798860 2324633 2098962 2519566 2965990
5432 2965990 2323448 1552703 1617985 1420396 1719090 2800011 2340674 1563055 2038592 1897474
5422 1897474 1873018 1928452 1080884 755031 2018393 1459995 1923014 2706657 2025745 1565828
5412 1565828 1075620 685495 1164608 1136728 2869210 3569615 2472002 2354935 2025397
5403 2025397 1908375 2241775 1665143 2040339 2601156 2989239 2665232 2460478 1411712
5394 1411712 1770211 2788134 2825801 3078916 1913466 1418087 1832784 2118106 2333930
5385 2333930 2676125 2927141 2347224 2483041 1608460 2223705 3399097 2837479 3084636
5376 3084636 2300165 829916 65012 2185010 1450804 2172517 1718036 1312595 1417070
5367 1417070 1999327 3640120 2613521 1157499 881419 1946203 3144183 3898634 3124920
5358 3124920 2178993 1651806 1442545 1888136 1186271 781018 1598122 1249951 1812145 2760157
5348 2760157 3045615 3492222 3091194 1760917 2231286 3236786 3818628 3089841 2762293
5339 2762293 1310132 2141042 1643576 2582264 2359976 1935465 1117349 406805 1506835
5330 1506835 1067711 1628284 1061862 2005995 906125 3303028 3198570 3582949 3588016 3147127
5320 3147127 3531452 4617942 4710606 3926854 3603726 3413847 3584645 3977648 4338457 3782654
5310 3782654 2614909 1655084 3582074 4345293 3163583 3183548 2757379 2120089 2442806
5301 2442806 2179676 2531232 4052072 3423850 3370450 3366527 1655298 1403321 2598721 2232055
5291 2232055 1944574 2886045 1107142 1724260 3027903 2393137 3240302 2833210 3752761
5282 3752761 3219397 2791078 3831075 3176787 2459625 1879107 2287390 2255618 1757671 1265698
5272 1265698 1669843 2451620 3436124 2325410 3763258 2106994 1485851 2676656 3150622
5263 3150622 2422903 2491891 3376743 3317047 2035446 2126814 1845135 2801302 3685135 2796847
5253 2796847 2170356 1716021 2779869 3183428 3425525 4414255 3588556 3303658 3421786
5244 3421786 3944756 5622412 4612173 3830234 3426646 4396335 3274177 3931859 3594856
5235 3594856 3135029 3412307 3257287 2978819 3808598 4221355 3879353 2427990 2166965
5226 2166965 3974990 3518271 2300101 2931699 2568527 1768883 1802897 2769101 3510195
5217 3510195 3499555 3235041 3295534 4325911 3181268 3410566 3642333 2323651 1845083
5208 1845083 2291027 2398241 3044132 3399605 3967345 4658697 4187765 4191944 3741078 3303124
5198 3303124 4064158 5101588 4001468 4149197 4201726 3428432 4029524 3965466 3993496 4516599
5188 4516599 3604622 3717298 4353500 3932786 4452374 4889423 4446618 3755640 4764003
5179 4764003 5214087 5732510 5352808 4550418 3268182 3130982 4264582 6106268 6855235
5170 6855235 6437420 6408834 5418420 5903906 5100347 5185369 4850380 4153428 5743396 5908587
5160 5908587 6146840 6000819 5585863 6540816 6314552 5542091 6194448 5584964 4881679 6716547
5150 6716547 7122327 7564738 7053738 5947935 5684583 7590494 8527627 7576202 7531975
5141 7531975 5724878 5300099 5970840 6347134 6400754 8294452 8327185 7094993 7340950
5132 7340950 8384936 7874449 6455001 6265276 6350631 6226473 8150231 8012020 8503269
5123 8503269 9716763 9182160 8487239 7250528 7375563 7211442 7947957 7815489 7881942
5114 7881942 8395325 7566549 7545214 8382283 9353611 9348654 8857270 9163686 9755572 9931465
5104 9931465 11305182 10662873 10433043 9834882 9179519 10232552 10971599 10522230 9914273
5095 9914273 11264766 10944841 10832555 10208604 10948295 11090815 10377952 9606008 9182352
5086 9182352 10215215 10077020 10333117 11450394 11351548 10866578 10542698 12050620 11653172
5077 11653172 11600704 12997501 12490740 11076300 10003101 10677382 12238443 12009190 12634911
5068 12634911 13608817 12624384 12295673 12076725 12469428 13000034 13875622 13882352 12473036 12477583
5058 12477583 13059448 13129282 12960129 12967445 14455784 14851073 13856242 13854898 13070942 13574428
5048 13574428 14624888 14380507 13550343 13822158 14643485 14700843 15277563 16158016 16091844 17038775
5038 17038775 16292822 15703226 16499319 16755252 16510719 16975002 17954939 16735980 17180721
5029 17180721 18046333 16729127 16904848 17311150 16940681 17626655 18635514 19303484 19260645
5020 19260645 19351716 20015523 20975928 21008362 21482243 21301052 20563953 19860028 20859685 20167618
5010 20167618 20385800 20739923 21061757 20840417 20109291 21127566 22048315 22230157 22288864
5001 22288864 22019860 22455332 22325814 21902510 21852479 22522727 22992254 23353189 23305730 23253025
4991 23253025 23172076 23654516 23315746 22799744 24352667 24276247 25138570 26260762 26466284
4982 26466284 25882341 25813123 25686871 26121025 27124136 27826374 27178409 27272208 26914745 26654748
4972 26654748 26737516 27585084 27232549 26967869 27818623 27359972 28044009 28328271 28632970 28681372
4962 28681372 28936396 29278236 29944616 31319105 29640659 28569011 28665160 29263124 29414507
4953 29414507 28756236 29518925 29445581 28671532 28726290 29412793 29355517 29050369 30055918 30910314
4943 30910314 31447449 30480159 29983209 29641324 29133827 29831935 30390749 31538072 31391356
4934 31391356 30449057 29685047 29558852 29529408 29507481 29044715 28391752 29315764 29754109 30129660
4924 30129660 29582227 29995048 29899712 29806885 29528854 29378695 28859659 27650079 28548120 29420306
4914 29420306 27682920 27055208 28707583 29205970 28893026 27515760 27730838 28180296 27644161
4905 27644161 27674029 28184465 26999354 26860619 26539578 26410704 26279785 25997070 27276161
4896 27276161 26996380 25838337 24975909 24473936 24489305 24061826 24052703 24207032 24816364 24083977
4886 24083977 23986280 24028114 24276185 23060736 22542121 22560654 23209146 22716975 21936529 22888460
4876 22888460 22342247 22257607 22972425 23157322 22090104 21081316 21149217 22479496 22494281
4867 22494281 22707934 22197577 21679070 21169742 21472683 20565454 19534431 19720814 19681663
4858 19681663 20860970 19662702 18971975 19626763 18854601 18954853 18778911 20148131 20912069
4849 20912069 20574066 20932645 20529227 20670079 20477820 20639304 21650427 22731950 22848935
4840 22848935 24233227 24994933 25984017 26805072 29486858 31300221 31469117 32655582 32226523
4831 32226523 28980658 26555659 23990040 21141839 20308240 20072978 18161370 17551978 18496614
4822 18496614 18080644 18568136 17442025 17789967 17534527 17277267 16581325 17823453 16655486
4813 16655486 15995671 15741765 15472092 14796845 13760017 14002548 15130848 14911536 14433853
4804 14433853 13955611 11320761 12001527 12744909 14199516 13039118 12816470 12638221 13257417
4795 13257417 14221780 13835467 13216113 12860397 14526297 13604301 13450942 13027767 12064509
4786 12064509 12888982 13680990 13895723 13192921 13386296 14591904 13940134 13974145 12662018
4777 12662018 12233644 12339621 11733985 11067429 11800271 12144341 12349823 13185718 12301682
4768 12301682 12281286 10979909 10567468 10961788 10751853 10976477 10098915 9706325 9837513
4759 9837513 10406919 10302357 10032789 10714510 9733011 10661221 11953468 12478870 10431849
4750 10431849 10053976 11456397 10528697 8836163 7481085 9259846 9470156 10103286 10033162
4741 10033162 8252856 9033528 9193421 8001220 7489907 7548229 8648234 9310820 8939996
4732 8939996 8854555 7875524 7272646 7506948 8886037 8203730 8923629 10085000 8715814
4723 8715814 8793189 9484844 9249734 9649184 10000791 10105208 10532274 8606755 7839832 8403330
4713 8403330 8016590 7033357 6963693 7466326 6594060 8289507 8943711 8803036 8374168 6725669
4703 6725669 7185687 7818539 7427545 7500886 6694373 6668427 7053764 9160396 9936781 8371753
4693 8371753 7650392 6826886 6819819 8005665 7390879 6920383 5798683 6288140 7422247
4684 7422247 7697299 6927991 6620704 8571629 7766636 8244306 8734025 7841734 7525069
4675 7525069 7573538 7847142 8733530 8852671 7986671 7760731 9187773 9825066 8301898
4666 8301898 7905777 9179489 8686987 9297258 9300282 8701304 8745379 9278239 7584973 7270452
4656 7270452 6662650 7279739 7592871 7144514 8108204 7374210 6776590 7060096 6909143 6591190
4646 6591190 6183829 5953737 6302209 6734690 5962236 5916785 7341738 6883410 8394667
4637 8394667 8094447 8344655 8883078 8385693 7592121 7790244 9128302 8734661 8183310
4628 8183310 8617176 8020715 6918243 7335721 7448586 7495986 7824432 8966564 7088054
4619 7088054 7976961 9533251 8379548 8481666 9077677 8948144 7768181 8321602 8430997
4610 8430997 7652516 7264338 7506356 8019619 8117970 7787705 8497702 7584608 7931060 9133223
4600 9133223 9249708 9232307 10161240 10315643 9186275 8513309 8842842 9478003 9199203 8702139
4590 8702139 9057620 8761802 7288154 6734262 7715996 9698850 9714062 8702783 9357966
4581 9357966 10169640 9214545 8692178 9367398 9528344 10519677 9099166 8645338 10205820
4572 10205820 10703259 11005165 9777073 10083055 9991417 10660591 10428684 10277668 10718314
4563 10718314 10068496 9924622 10088476 10062778 10651456 10411436 9569083 10109490 10946139 11559845
4553 11559845 11028721 11655136 13521617 13423147 13262964 13384893 12910720 11520932 11679370
4544 11679370 12352065 11929776 11952635 12324489 13050455 12218873 12961838 13659257 13187435 12655712
4534 12655712 12828163 12496280 13324686 12840480 12234743 13833951 13564244 13519259 15152089
4525 15152089 14652171 14399233 14463326 14053965 14089558 14319477 14098661 14237433 13943378 13446610
4515 13446610 14114947 14280368 12322338 12417780 13421186 13351735 14024225 12731334 13571959
4506 13571959 14240303 15988682 14678987 14555196 15070011 14598215 14020970 15026369 16519446
4497 16519446 15673624 15218960 15793993 16737590 16933365 17085128 17347877 17984148 17331416
4488 17331416 17485604 16266615 16299869 18248539 17438578 17212052 17451724 17939254 17745495
4479 17745495 17712273 18742072 20117472 19983080 19375173 19380241 19146632 19269284 19279521 19920863
4469 19920863 20796168 21080684 19573114 19199717 20626914 20966528 21904716 22726949 22626221
4460 22626221 23849545 24319897 24681999 25690616 24430762 24629625 24763172 24655380 24958875
4451 24958875 25082417 26452870 24383675 24974961 26354088 25774719 25961868 27371417 26625867
4442 26625867 27438314 28299238 29004042 27839856 28365160 29325145 28057403 29668051 30965231
4433 30965231 30898188 31063401 32088041 32231320 33177941 32712972 33133053 33021084 33223797
4424 33223797 34379414 34635333 35419586 36958912 37818562 37589010 38108504 38042859 38076107
4415 38076107 38719570 39933099 40784218 39507816 40489592 41662450 42684082 43283263 43058197
4406 43058197 43219484 44238033 46300157 46624995 46574225 48361593 49164775 47971404 49313312
4397 49313312 48365891 50454365 51392289 51579216 53173456 54414266 55136606 55599682 56539120
4388 56539120 55869090 56617244 56739229 57742229 60092013 61029998 60931192 61410638 61949512
4379 61949512 62611228 65179118 65894952 65191355 65449859 66162437 68087145 67101849 67140192
4370 67140192 68584996 69456250 70671777 71619295 72164815 73200924 74018671 75004959 74586157
4361 74586157 75579687 76350396 76883047 77494891 77180411 77569229 78409186 78157769 78680696
4352 78680696 78573917 78611927 79628826 80154553 81301578 82015136 81428900 81005561 80995355
4343 80995355 81609312 81918682 81211359 80852795 80917400 80659539 79342097 80249386 79388515
4334 79388515 78152947 76607238 76620117 77278690 76602316 76625075 75505392 75487595 74767010
4325 74767010 73751718 73692789 73186375 73026463 73241780 72768838 71266045 70255025 69289218
4316 69289218 67966992 68412126 67506536 66451670 65934206 65901996 63895648 64165356 63935672
4307 63935672 63498390 63399954 61565651 60760580 59880306 59438620 58785662 58114052 57796645
4298 57796645 56215251 55362777 54157564 54046328 55375034 54129234 52567245 50808193
4290 50808193 49515016 49391194 48640132 47882111 48193625 46209162 46497736 45535423 45234377
4281 45234377 45028979 45003237 45145739 44730257 43633938 42843813 43424163 42899134 41932483
4272 41932483 41579970 40926754 39840203 39286080 39776910 39616022 38552886 38962619 39404284
4263 39404284 38609387 38105703 37214674 38065574 37095075 36892606 36110441 35268423 35035695
4254 35035695 34884904 34015226 32373804 33706820 33430746 34254959 33726664 33802875 34061604
4245 34061604 33132975 32630232 33433781 33175231 31624026 31814792 30520673 31298503 31599589
4236 31599589 30958515 31004680 29344291 29919611 30482523 29518097 28677615 29479085 29148330
4227 29148330 28158636 26413798 26945427 28487794 28381009 29011082 28336086 27335876 27213026
4218 27213026 28903452 28149701 26931261 27652521 28683051 26976424 26916135 28258419 28938448
4209 28938448 29596724 29674002 29269925 28682706 29191523 28713445 30029950 29950616 28131268
4200 28131268 27407098 28271943 29150926 30035977 29142778 29200422 28596636 28493234 27540315 28574095
4190 28574095 29371808 29427826 29791123 29422428 29782656 29191553 29568648 29596027 30578995 29601278
4180 29601278 28721949 29148501 30461198 31408077 31436546 32273199 31716416 31165189 31589654
4171 31589654 32269152 32352858 32618713 34292958 35502511 35130976 34704654 34069470 34497062
4162 34497062 34926420 35404343 36294402 36613039 36598917 37487316 39094554 38910668 38711483
4153 38711483 39330526 41213533 41964600 41999622 42744390 43705558 42926800 43007109 42672586 43986215
4143 43986215 45177763 46618216 47443557 48394516 50410094 50006146 50090897 50091631 49996090 51175688
4133 51175688 52836230 53933116 54109386 54069555 56517025 57398707 57502115 57712564 57976090
4124 57976090 58544583 58210844 57721552 59483301 60900931 61630200 61102757 60774161 62024223
4115 62024223 63011921 63234617 62460358 61775023 61408036 62247312 61712811 60852965 61002257
4106 61002257 61698274 61058645 61032526 61255134 60813730 59653390 57206081 56329583 56582307
4097 56582307 57313426 55938330 55715468 55301739 54162224 54038170 52836797 52059591 52173804
4088 52173804 52306606 51275733 50449077 50918003 49030196 49631168 49145377 48124326 47539557
4079 47539557 47075957 47763690 47782820 48641952 48870410 49162407 48883392 50093586 48976468
4070 48976468 48070769 48051696 46307453 45609786 46250903 45276154 45289631 44861580 43864591 42786854
4060 42786854 41695680 41224539 41367762 42365792 41544881 39740088 40469758 40810538 41614165
4051 41614165 41068608 41177016 41847317 40602188 40820252 41546029 41782144 43092352 43829485
4042 43829485 43609889 43599036 44956845 44168946 44553153 45821769 45604174 44961270 43984295
4033 43984295 45105045 45873318 45443202 45396183 45488259 45526981 46784195 47114769 47395688 46724926
4023 46724926 46821289 47392627 46292320 46338449 47590346 48603591 49124130 49364075 49596769
4014 49596769 49722020 49675020 50752042 50897178 51104565 53414474 52717671 53857296 55233373
4005 55233373 54927880 55809372 57133775 58307276 59528015 60742716 61951395 63011062
3997 63011062 64421660 66092376 66598199 67924400 69625336 70815258 73109686 73993720
3989 73993720 76687686 79202443 80208770 81585191 84035914 84970708 87713111 88602618
3981 88602618 88867390 92047523 94538553 97186166 99966927 102940581 107373956 111688938
3973 111688938 115874931 119597260 122948031 126080054 130430054 133027587 133976530 132766652
3965 132766652 132057123 130785462 126866733 123759210 121894185 119100613 117796627 115679668
3957 115679668 112666255 110359138 108375771 106967522 105070310 104474298 101622712 101022966
3949 101022966 100046467 97864837 97016103 96663760 93676356 93159138 92525121 91369285 88779491
3940 88779491 88327016 87766564 85621386 83711304 83871181 80999371 79277143 79134955 78994140
3931 78994140 78092135 77027958 76151046 75306881 74175936 72289463 71517283 69551792 68810549
3922 68810549 67420146 67386837 66459634 65264048 63797818 63224100 62841011 63120276 62158812
3913 62158812 60549077 60020261 58749757 59378222 57566386 56666896 56312245 56171210 55731334
3904 55731334 55016003 55105047 55150341 54831974 53460383 53036428 53101390 52169304 50804208 50848183
3894 50848183 50413328 50846984 50461563 49758042 50185497 49681853 48557488 49151305 48326928
3885 48326928 48013379 48803279 48630115 48870823 48982776 47907606 48694201 49324251 47646482
3876 47646482 47714821 47540101 47125772 48081771 48156448 48643777 48192724 47619445 47039942 46681222
3866 46681222 45985724 47020553 47948691 48128691 48328761 47306799 47017848 46805498 47300891
3857 47300891 46665204 46336744 47618347 47909608 47861674 48052711 48137312 48061310 48887928 48247153
3847 48247153 47574107 47936863 48048294 48744602 48862350 48506751 49118654 49667754 48990741
3838 48990741 48939934 49253477 49917430 50623944 50488504 51806019 52127211 51210672 52186122
3829 52186122 51418532 50996192 53022863 52198003 51261678 51526658 51467670 51040298 51561353
3820 51561353 50647666 52286211 54279031 54452431 54770672 54947550 55481230 55510811 55341237
3811 55341237 54559561 56205361 54854298 55204404 55729438 54587018 54967466 55210818 55368333
3802 55368333 55994946 56149302 56699246 55664429 56560488 56915939 55968753 53940649 54492167
3793 54492167 56252298 55016075 55308667 55704495 55785445 56408507 56285707 56120318 56623787
3784 56623787 56761496 56992892 57202358 57124623 57041764 56012922 56568355 57933668 59211662
3775 59211662 58506068 57780686 59100791 58283004 57159550 56853084 58737992 58556053 58577939
3766 58577939 59560280 58162481 58458415 58652891 58287930 59001372 59386562 58856081 58919896
3757 58919896 59416321 57887477 57633074 57102127 56977059 57304521 57299461 57502102 57810046 58749628
3747 58749628 57697784 56320733 57524549 57296892 57307333 57012211 56776381 56892471 56858063
3738 56858063 57366819 57548039 57213329 55578442 55975975 56238350 55742404 56897154 56916250
3729 56916250 56524970 56476997 56182904 55924890 56928707 56630562 56633983 56415537 56417826 57114221
3719 57114221 57290967 57363750 57624232 57292131 57904674 58088166 57732332 58747778 57464161
3710 57464161 56783920 56505984 56814077 58196524 58695565 59782542 59704182 59917207 61110311
3701 61110311 60045138 60698543 60976372 60907206 60044521 59761124 62434190 62695049 62818723
3692 62818723 61698450 61806797 62601677 61837698 61934826 62401655 61802177 62636700 62290253
3683 62290253 62289971 64500155 64642135 63623727 64210606 64065831 64607341 65400315 66290032 67742776
3673 67742776 65974767 65031770 65774809 66479375 65226363 66011283 67216773 68126319 67997940
3664 67997940 68162261 68184691 68603734 67002448 67925521 68230587 68538992 69201207 70582510
3655 70582510 72203441 71924151 73202025 73104521 72404204 72651330 73175654 73692491 74027992
3646 74027992 74667941 75269942 76730184 77109423 77130867 76128899 75212002 75952945 76846660
3637 76846660 76552738 76443653 75914182 76260236 77450911 78220022 78931662 78529756 79762949
3628 79762949 80675664 80951895 81331410 80836216 80622016 82060648 82293641 82388317 82484389 83841855
3618 83841855 83557123 84393624 84799521 84268916 84976540 84143840 84769437 85039325 85655865
3609 85655865 87368654 87637685 87313931 87535916 88262798 89354580 89851969 90331740 90697137
3600 90697137 91774237 93448421 94510973 93672348 92891934 93884987 95880144 97227959 99578613
3591 99578613 100415809 99057096 99325449 97745825 100032270 100815304 102409430 101476946 101567326
3582 101567326 101238385 101812348 101888735 102502301 102248477 102434270 101790495 101073925 101181879
3573 101181879 102019522 102743928 101044099 101119066 98434408 97455477 98394342 98648358 98458443
3564 98458443 99002645 98443385 97126752 96750911 97477824 96980733 97114112 95395471 94976774
3555 94976774 94110493 94169295 94286102 92013107 91160679 90908401 90560528 89291133 90096117
3546 90096117 88775710 87458987 87449122 87286315 86828378 85467437 86096008 84416144 83513819
3537 83513819 83566028 84438471 84801141 84958817 83229463 83106239 81840398 81027671 80516747
3528 80516747 80582797 80672769 78979020 78870148 78873618 78459586 78636457 80310224 79080049 78480203
3518 78480203 77445797 77039591 76249532 75363882 75547216 75107657 75233358 73117449 72731020
3509 72731020 73007474 72985237 72372415 72884010 71796843 70345698 70503125 70142217 69089302
3500 69089302 68264955 66758609 67472854 67293452 66790869 66358795 65618265 65130090 65063861
3491 65063861 65727347 65434668 64513958 62563098 62688468 61126344 60842735 61414863 61217700
3482 61217700 60214333 60037204 60145180 59136747 58444757 57487192 56807902 58568934 58161435
3473 58161435 57099851 59126782 56960493 56034000 55711960 54649527 55404846 54601473 54879143
3464 54879143 55804240 55348239 55177391 55220498 54228256 54469381 53880862 55576558 55412547
3455 55412547 53569955 54160431 53170379 52867198 54450593 54353626 54375724 53709764 53129208
3446 53129208 52800094 53237646 54349243 53409812 52413058 52712332 51819202 53306604 53300814
3437 53300814 54114380 54994822 53902345 54796887 55562697 54854598 55374395 56161934 56656954
3428 56656954 56900069 57079243 57187690 58432351 59375634 59767041 60981790 61273700 60738401
3419 60738401 59228401 60465373 61944468 62441743 62526139 62880031 62369734 62245076 62257138
3410 62257138 62598092 63005361 65708252 67621723 68354496 67945613 67903017 69963195 70381378
3401 70381378 71227232 72821078 73472759 73867491 75302703 77059323 77691288 80959004 83484053
3392 83484053 85027676 85954188 85779574 86858697 86911239 85009965 85684790 86387676 86407451
3383 86407451 87917473 90056609 91210530 89433543 89315541 91267657 91851645 91891969 94827279
3374 94827279 96691175 97747745 97336942 98786317 101641941 102597360 103663611 106441847
3366 106441847 108984855 109771916 111215071 112646950 114626192 116738180 119621025 121918985
3358 121918985 123085401 125222513 127464416 129017552 131482095 133240977 136368858 138730205
3350 138730205 140061860 143004070 145856704 148551569 151100532 154095898 155304987 159469599
3342 159469599 164242665 168701892 171935823 174207259 178163164 181998454 186825515 189204104
3334 189204104 191435429 195893783 198816421 201092784 203903740 206938830 209520416 210849429
3326 210849429 213103464 213840079 214231163 215744079 215321736 214728473 213991443 211857068 212789613
3317 212789613 212659009 211000207 207041098 205120375 204004652 200086797 197817981 195256261
3309 195256261 191914064 188185581 184866140 180770582 177735347 175295311 171776652 168487374
3301 168487374 165753019 161624852 158294445 154602006 152257332 149954085 144950250 143081456
3293 143081456 141283646 138362781 135622700 132811141 131420790 130573913 128428635 126576644
3285 126576644 125380302 123502492 121854391 120295583 117892210 115871746 116488243 116651555
3277 116651555 116044297 114591141 114124742 113449739 112689965 112355767 112468543 112905845 112718483
3268 112718483 113124437 112056902 112287713 111255353 108266717 108975010 109210819 109629271 109286074
3259 109286074 108074147 109031225 109412124 108832203 108813822 109804620 109451322 109578053 110440844
3250 110440844 110824540 111270447 111387427 113805382 116733126 118318787 119690320 121475256
3242 121475256 124242043 127027966 131307465 133307273 135048684 137167906 138685274 139528357
3234 139528357 138704859 135427127 131914018 127762060 121763151 117069626 111699623 107887393
3226 107887393 104209244 100648717 97594303 95641049 94195230 91760867 89935929 87789897
3218 87789897 86471266 86335610 84919279 84797565 83822500 83220544 83638957 83464358 82190097
3209 82190097 81865212 83074217 83914088 83968965 84467961 84700853 85278902 86490440 85402742
3200 85402742 86551793 87775833 89769262 90991750 91621751 92711338 94295577 94514969
3192 94514969 96713189 99710111 100142366 101617123 103328327 105800356 106836839 109269183
3184 109269183 111093171 113006711 115017864 116340188 118844169 121367765 122917434 124585013
3176 124585013 126167715 129162045 131977532 134352344 135393528 135290670 136322763 137967315
3168 137967315 137394566 138084709 137882890 136937029 137618405 135269206 134458460 132682251 131602232
3159 131602232 128520400 126028320 124378810 122876883 119280891 116036596 113380323 110413544
3151 110413544 108366345 106007193 104024784 102318118 100272768 96556042 92663689 91423367
3143 91423367 88656931 85098039 83266189 80773840 79762650 78761819 77539528 76138139
3135 76138139 74632363 71286716 70016537 68142875 66047004 65777858 64690793 64097380
3127 64097380 62660493 61220532 58716573 57314324 55609836 54909173 54035992 54307801 54024198
3118 54024198 52921208 51320587 48728701 49788746 48936759 49144603 49711502 48525423 47353014
3109 47353014 48002271 48574214 48051349 45753681 45103347 44706678 44410472 43726637 41710250
3100 41710250 41192484 39752913 40424212 38903371 39774648 39416071 38340273 37488797 36558325
3091 36558325 37419318 36079415 35305720 34528247 34272960 34682741 34376316 33763915 34246056
3082 34246056 33278131 34350321 32906023 32929365 32912549 31549836 31615677 32189986 31632443
3073 31632443 31071871 32019236 32292193 32533277 31290428 30354267 30180811 30030191 30076189
3064 30076189 30648811 30731927 29375222 29116131 28951956 28640283 28368857 29549567 30368575
3055 30368575 28646404 29134830 29925731 30279242 30047052 29394236 29376963 30031403 30414782
3046 30414782 30418472 29745263 29789734 30817393 30418551 30482946 29653890 31236302 31377743 30773451
3036 30773451 31645279 31135674 31117560 30920995 30320518 30357451 31729646 31082216 30964647 31372933
3026 31372933 31244328 32034794 33635024 32086989 32858096 33888199 32828049 32423033 32962412
3017 32962412 35012262 35059763 35105999 34855023 34232271 34856349 34861128 35766715 36443551 35692276
3007 35692276 35899049 35967097 37211494 38443679 39373662 39737476 41205948 41763800 40188611
2998 40188611 40383137 41180257 41644423 41845242 44210598 45726694 46122871 45597065 45022162
2989 45022162 46202389 46687010 47269180 47613067 47530848 47903068 49636709 50456306 51596891
2980 51596891 52750171 53825886 53771575 54483387 56237980 55344265 57466726 58331457 58912673
2971 58912673 59682019 61224073 62348553 62447606 63831250 64686621 65264706 67036889 67819655
2962 67819655 67933197 69090800 70889147 72433609 74071651 76284208 77906126 81491449
2954 81491449 81687598 82506087 84202411 85538817 88137266 90883962 92673706 95806040
2946 95806040 96741092 99536990 102690665 104109415 106968148 110083961 114013698 116023926
2938 116023926 119911137 123638713 127332713 131336133 136119379 140605696 144627259 148691942
2930 148691942 152892000 157142916 162611799 167737425 172777135 180142668 185638871 190885729
2922 190885729 197651809 203948052 210735376 217079630 224263689 233106105 240982869 249636841
2914 249636841 258592055 267816979 276401668 284665884 295394702 305477919 315250982 324717206
2906 324717206 333638171 341664911 351000263 359038014 366271314 373831504 379057114 383483912
2898 383483912 387087062 387674125 387933731 386497980 383840795 379498802 372386472 364296385
2890 364296385 356389101 348385367 339878535 331778475 324410884 316265476 308172249 299215353
2882 299215353 289439812 279617453 268713301 258440628 248235701 239109224 228866997
2875 228866997 222111187 214999052 206805491 200260735 194519797 188241112 182470642 178354766
2867 178354766 174389879 168643745 164560385 161112746 156312607 152356274 148249324 143026836
2859 143026836 136422295 131054627 127483798 123803812 119867982 115946561 112783982 108391442
2851 108391442 104534229 102914764 99574600 96491572 94473217 91904482 90712155 89272901
2843 89272901 86233021 83366186 80392399 78389983 76477007 75333140 72779677 71458246
2835 71458246 70111600 66717774 65802999 64731862 64246009 62502332 60530747 60074035 58738358
2826 58738358 56398786 55800368 54131882 52793599 52239351 51004454 48022747 47587978 47700919
2817 47700919 46255753 46352467 45682563 44291074 43506599 42918185 42418043 41640521 39329694
2808 39329694 37635561 37153824 38073451 36478754 36345468 36473347 35041120 34187412 33368067
2799 33368067 32625436 32689343 32057756 31162034 31491306 30799526 28621051 28145924 28066421 28311882
2789 28311882 27283902 26839905 25969810 25816848 26413263 26865106 26527192 25423809 24484490
2780 24484490 23667953 23935204 24352218 24134951 22272228 21972442 22136692 23317924 22748815
2771 22748815 21741388 20175573 20743042 20209712 20563917 20256650 19805578 20115983 19535533
2762 19535533 17687555 17905767 18543719 17699900 18266475 18199414 18899644 17647790 17899729
2753 17899729 18247041 17185967 16501572 16123003 16141021 14390878 13970033 14725588 13463143
2744 13463143 13599273 13484206 13546542 13798631 13467933 12127852 11930013 12153729 11422115
2735 11422115 11906597 13148208 13427878 14021503 13360733 12175508 11703941 10359260 11461422
2726 11461422 12744145 11558848 11328353 11078634 11474477 10917863 11628843 10645932 10976380
2717 10976380 10867202 10864981 9792468 9891408 9505988 8968812 10451018 9512684 8651628 8878518
2707 8878518 10422848 9930208 9796508 10223061 9288931 9064658 9371506 8603611 8724403
2698 8724403 8842316 9076370 8068194 8192245 8136660 7345927 8151698 8710016 8186445 6645321
2688 6645321 6424200 6543737 6773453 7241180 7032454 7541170 7268070 8137766 7553325 5568701
2678 5568701 6162810 6844184 6233548 6212731 6997158 6899839 6169410 5500344 5123893 6421986
2668 6421986 6459811 5164265 5347367 5156404 5119002 5060889 5708097 6613518 5406874 4978230
2658 4978230 4866795 5787903 5670214 4876035 3947379 5605962 5300342 4886598 5512909
2649 5512909 5742614 6164624 6220144 4919997 4191158 5775504 5208297 5065044 5792623
2640 5792623 5209440 5897089 5817878 6170676 5343671 5098811 6080713 5926001 5097471 4686553
2630 4686553 4091044 3307751 4317453 5039071 6048913 5377162 4975637 5034182 5327993
2621 5327993 5369433 5098949 5260582 5253206 6556771 5854020 4844822 6119622 5483936 5329287
2611 5329287 4930099 5371383 6224792 5916985 4871924 5221307 6040947 5033916 4820014
2602 4820014 4570752 4478945 5056952 5355192 6219232 4512069 3559709 4043759 4197321 4341534
2592 4341534 4030972 2808436 4698916 4016983 3681230 3697134 3134679 2608751 3340580
2583 3340580 3568921 3384742 4119645 4051286 3998282 4450852 4729345 2408861 2266273 3030123
2573 3030123 2880020 2488489 3401305 2353051 2139246 1804833 1907304 2528447 2842885
2564 2842885 2950555 2707957 1632203 2383487 2570962 2725396 2883022 2601413 2601661 3511996
2554 3511996 4451059 4684511 2671984 1865764 2362447 1413674 607922 1834452 1714685
2545 1714685 1417510 1284224 1678002 2404642 1390256 2235582 1658340 1681838 2593787 2119709
2535 2119709 2412180 3582901 2174980 1485308 1961579 1789893 1072910 1604366 2048538
2526 2048538 2345601 3082584 2975481 1535510 1755836 1560793 959009 2139426 3370112
2517 3370112 2890825 1203960 894596 1483272 1201241 787654 599059 1684522 1029949
2508 1029949 334351 1616209 1309962 306260 299920 35385 1512443 1883166 1870082 1953734
2498 1953734 683679 246554 -136259 746983 540087 675063 1084623 2312686 2009700
2489 2009700 1373720 1441785 436113 331412 -332211 -607734 1270238 2056333 1281904
2480 1281904 2359973 1411157 1147017 1258953 1554246 -329070 -927648 586495 863860
2471 863860 764331 38262 -62638 528284 1854391 1049102 647704 -30449 -1137101 -581565
2461 -581565 -650520 627560 1040714 1150398 1330483 182389 29403 -381302 -631416 84465
2451 84465 -67981 -361326 -685359 -125781 1413640 582532 576942 -383609 -1230350 -301042
2441 -301042 770354 -251677 395278 1477975 1763525 1559640 2049058 1522519 975840
2432 975840 1963074 1565069 528757 394444 954397 -185755 -809211 -110041 653634
2423 653634 610579 538185 697631 313501 202017 946624 1392314 654604 1310366 1322500
2413 1322500 1009715 1535884 78966 -88584 414737 637758 848912 -27981 -333742
2404 -333742 1293053 1000093 761671 1638948 -155206 -138142 1908490 1331973 412745
2395 412745 -20417 418421 -185331 387439 -565892 -1271717 449528 1221214 772824 73873
2385 73873 278001 -665654 -113141 -292027 -366570 44030 -418764 -1758837 -805109 332956
2375 332956 255584 416457 1325481 1256994 1820035 2991373 2205776 928839 1411966 1330921
2365 1330921 2108557 1665320 2843948 4066392 3767620 2439656 1741120 1537525 1379761
2356 1379761 565855 560990 253708 1903420 2437643 1579964 1929243 536923 18316 1034556
2346 1034556 1538275 197957 221680 785918 1092763 1334715 1624100 2150683 2737504 2745521
2336 2745521 1534214 271319 1334627 26260 451528 -152836 384503 18237 669117
2327 669117 838547 173196 248342 -136713 564241 738520 943898 1013118 1026470 1739421
2317 1739421 742289 61646 26460 932845 1059079 1570539 1528552 938704 1215486 937952
2307 937952 1133071 -58277 -1256828 -588629 853129 738712 1411682 2679792 1731587
2298 1731587 1227125 1206347 1799806 2597582 2368041 1877409 943457 143110 386986 530521
2288 530521 915123 978929 2019403 1304511 982183 1033975 1525461 1710871 1083690 1687533
2278 1687533 1609646 1062592 613476 1049091 643608 -286330 369502 1173132 935440 2312686
2268 2312686 2355861 1194420 627971 948854 1997725 2009663 1266217 1267218 1412491 312998
2258 312998 822146 1317202 928205 56836 1317344 2336114 762146 1830519 2002645
2249 2002645 2543581 1712469 597582 1679222 2905160 3209518 2848615 1797213 986834
2240 986834 735602 -150637 200733 532119 854670 1927471 1935347 2152925 2964527 2147915
2230 2147915 2342271 1621307 1311324 2767079 2096612 2776623 2321674 2731146 1668310
2221 1668310 1385009 2309324 2064515 2034041 2477799 3271037 3462653 2583237 2923503 3040763
2211 3040763 3494078 3718380 3232299 3081059 3594256 2730596 3033840 3749317 3937751 3158883
2201 3158883 3855297 5056925 4662061 4417967 3654439 4361933 5525125 5696706 5459275
2192 5459275 5751023 5301456 5211729 6850922 7048692 7788605 7511113 6536293 6989212 7519532
2182 7519532 8091347 7327790 7451974 7187194 7464083 7186297 7774999 7892337 7503035 9050780
2172 9050780 8971848 8568704 8743652 9094794 9616524 8607613 9568844 9522336 9402527 9835599
2162 9835599 9466312 9884310 10814984 11531529 11208782 10868886 11125821 11049395 11926569 11539014
2152 11539014 11354197 11416969 11140240 10922580 11938241 13968131 14001475 14206289 15347821
2143 15347821 14914266 14316644 16095282 16800069 17185325 17807933 18641980 20368852 20708526
2134 20708526 21704589 22469386 25589105 27222208 28549620 28782371 29253979 30917059 33233322
2125 33233322 35523372 37319160 38528076 39771244 42291618 42667198 44477185 47272368
2117 47272368 50431864 55168336 60906847 65675376 71104408 77098221 83363222 87839630
2109 87839630 93232440 99981128 109668033 122611684 139037001 157517332 181623161 212302069
2101 212302069 256115961 312777565 382540333 457695828 522636458 524150494 452288281
2094 452288281 368399931 292865537 233585821 192460482 163214377 138681449 120064293
2087 120064293 106234396 96553319 88478401 82878889 77936804 74310508 70356196 63991567
2079 63991567 58938242 55110314 51538104 48406580 45302754 42611958 39440699 37144514
2071 37144514 36068757 34738990 33177401 30269554 27723020 28892277 28229384 25405176
2063 25405176 23163766 22344808 22511838 23694518 22023282 19452157 18652424 17854426 16901916
2054 16901916 16935598 17354914 16085224 15978245 14904891 14351071 14063000 13895724 14662237
2045 14662237 13741339 12693422 11936307 12070961 12316291 11689661 10864030 11312781 11317432 10569127
2035 10569127 10439233 9775943 9993643 10145786 9791223 8693293 8364869 7535677 7780212
2026 7780212 8201941 6941127 6646953 8244403 7296563 6624137 7033484 6375965 6627612
2017 6627612 6045960 5880045 5554171 3993867 3701262 3380220 4560844 4362015 4663149
2008 4663149 4895293 2690327 2281693 2936353 3118819 3577383 2946916 2878615 2924221 2391620
1998 2391620 2781869 2862414 3033047 3639604 3406369 4109905 3647203 3195915 2167210 1290477
1988 1290477 2665512 2687367 2279062 3005567 3096673 1773534 1888542 2076221 2601997 2857797
1978 2857797 2594049 2586009 1772323 1473992 2478775 2707316 2644575 2075203 1601787 1086780
1968 1086780 756738 1143640 950828 1288057 1332486 957557 1358673 1677505 1289978 732850
1958 732850 544015 807519 1255376 1966451 2189626 1639272 1416042 1114339 948219 1791018
1948 1791018 2056882 1765476 867488 -176366 603947 477205 2015610 2625730 1136557
1939 1136557 1427863 456554 217504 -86038 -1215852 -284793 86298 92923 571681 30813
1929 30813 452632 41176 206358 546659 552678 587322 643284 1874945 1435816 1568842
1919 1568842 1889065 -277051 -287807 -109874 161690 826120 1001010 212211 324539 213308
1909 213308 -265119 -909908 300810 227290 -1589545 902082 935471 -617645 -898880
1900 -898880 -536736 -545896 -976963 -2326207 -750158 752468 251790 -1253978 -457164
1891 -457164 -102471 311226 492196 631726 876152 -1014532 -1747986 -1288265 -1085807 -395825
1881 -395825 -1469695 -1440205 -1280035 -2417243 -1739850 -1205640 -669168 -2792 -287603 -32496
1871 -32496 386745 19137 1375105 1100434 1519882 931017 2007354 474128 -854216
1862 -854216 -200255 -241632 976270 -943417 -930461 -521277 -1031093 -175231 975583 345544
1852 345544 -899533 85819 -541442 -1552983 -932678 -14217 767238 -342937 1805748
1843 1805748 2125477 1403226 1590019 1985099 714390 4942 1832906 1863788 1523999
1834 1523999 780453 611017 884565 1065748 695917 941126 1305012 1234867 1369633 1149355
1824 1149355 529776 644468 1281890 1291078 1189763 748262 1178037 -631475 -890620 -248769
1814 -248769 -601990 -593350 32606 -319570 -894030 -785382 -1103686 -81111 -218640 -1167344
1804 -1167344 -1972660 -648309 -919075 -1347723 -727983 712213 1928995 824346 786635
1795 786635 555702 606232 1491643 589869 938018 741564 498230 925742 -597649 -322409
1785 -322409 539676 -259070 -668490 -928695 138793 -48059 -595414 -117838 -159105 -525124
1775 -525124 -1330893 -1351205 -703819 -562935 6889 950550 996587 -542540 1370443 754026
1765 754026 461124 51549 853412 575252 -257694 987934 -59030 354200 -428046
1756 -428046 -76996 -106003 -119102 -179960 -1768936 -828917 172654 972955 1733118 1065472
1746 1065472 658335 -217602 -640618 -1483607 190629 282588 -978228 -300753 -582823
1737 -582823 98006 -434691 -1635835 -1648818 225927 478365 -660488 -639968 530423
1728 530423 1306782 1087308 783838 -186798 -665984 357386 668670 -482323 -864989
1719 -864989 -637411 -1154510 -932541 -19774 242898 -113084 -500369 -262754 -731360 -705106
1709 -705106 -360731 1355949 -368755 -1964500 -1896658 -382822 -406927 111236 1090964
1700 1090964 566574 901190 836010 312401 -618210 -25742 119010 -711499 -609447 -780009
1690 -780009 -834534 -476191 341017 118341 -620874 -139062 -323553 -152991 -412011 -1015185
1680 -1015185 -820330 -1167197 -1669444 -893107 -1804422 -1769537 -319823 -1085250 -908671 -992125
1670 -992125 533106 810899 555621 55368 -554792 439404 174277 941433 249862 245531
1660 245531 -448009 -298196 -549041 -1391059 -1606163 -2056953 -3052324 -1204741 -213012 -1315038
1650 -1315038 -1069006 323921 100435 390942 489290 312801 -317372 -1826286 -888506
1641 -888506 -746073 -1417387 -1106922 -831278 -759923 -840801 -1554643 -635693 205031 -154575
1631 -154575 -507548 385478 -113839 -799357 -1535456 -1407057 -1517660 -535042 -574490 -1286799
1621 -1286799 -944865 -421227 -660548 -1393567 -621086 946263 -1021736 -1042085 -829818
1612 -829818 -993429 105590 -327549 -180582 381380 -225246 385532 -602272 -1492024 -1306184
1602 -1306184 -898070 -1669095 -2193757 -786360 -447459 -994127 -1083913 -525955 310503 151059
1592 151059 -923547 -918606 356504 -136365 -1437805 -1518937 -1239663 108338 -660889 -59482
1582 -59482 -283715 -1597385 -1869384 -865140 -342095 80693 -1241516 -1443442 -1211962
1573 -1211962 -420800 -630733 -1012180 -1125216 -799838 -124229 -473771 -516454 211491 266873
1563 266873 -43661 -268025 -1035863 -1385408 -1128832 -1201394 -1231879 -1366314 -1406955 -334836
1553 -334836 -624795 451378 1020813 794973 313531 234350 -616712 -1646028 -1269409 -1011275
1543 -1011275 85589 -312767 -495537 -900819 -753936 106164 53531 -1085533 -945563
1534 -945563 -288412 404522 537255 -38680 -1324649 -1941764 -1592778 -940681 -1010641 -690657
1524 -690657 -1155824 -771242 -136675 -637686 -637297 -273089 12045 -814236 -916497 -762496
1514 -762496 -1245597 -2412939 -2595427 -1334356 -1365795 -2001055 -1089822 -598894 -1368522 -291823
1504 -291823 -1149765 -1436407 362909 -384702 -172811 -481945 -2192647 -1183872 -297650
1495 -297650 -788763 -1119977 -1724518 -1622378 -1591711 -1631196 -956321 -346808 -557592 -791162
1485 -791162 -1289206 -1178971 -477227 -1364020 -1478129 -839940 -765549 -738945 -722476 84963
1475 84963 -633755 650389 -507182 -952811 -1616249 -986613 -709366 -309086 583072 560416
1465 560416 133501 -645713 -918282 110708 -678128 -417930 -907727 -1636771 -1016864 -631178
1455 -631178 -472094 -693530 -82103 -252321 -245162 -594644 -185731 -1408486 -672704 -199804
1445 -199804 -865339 -258570 -19199 -89283 -209424 -705951 184213 1266224 -316549 -1234361
1435 -1234361 -316328 -331162 -77903 391034 101297 447938 -60972 -786642 -640152 -28570
1425 -28570 -63037 -151749 -904026 -1491346 -447460 -1158320 -853762 79942 -145192 -1091305
1415 -1091305 -483153 -712083 -1203000 -480004 -1206151 -2121107 -358288 44102 -582865
1406 -582865 19418 409600 745954 -269020 45498 726307 -800158 -1212795 -1311482 -360246
1396 -360246 -819753 -1400456 -604714 -141017 -1183820 -1389560 123981 103371 -161896 -885736
1386 -885736 -849208 -994456 -1836947 -1102249 -998352 -400127 -125222 224024 954136 487856
1376 487856 691786 -1073448 -2572576 -1966885 -1542157 -924371 -1317200 -1045440 -407694
1367 -407694 -1644831 -1311021 -629802 -486515 -1986960 -619217 199075 -1188394 -669406
1358 -669406 -52636 -521460 -771718 -929449 -936579 -934099 -543154 215155 812461 -1012618
1348 -1012618 -1596984 -246799 78589 68228 -994582 -1405682 -963939 400975 187837
1339 187837 74498 -13460 -156257 -216889 660723 553870 940507 976761 4317 29600
1329 29600 373688 895343 -791725 -961076 -526815 854355 1554505 209397 -452602
1320 -452602 -1425345 308937 673797 1043229 249545 -703007 -72960 605331 -87539 -218920
1310 -218920 -386355 -860724 -1256133 -1427959 -71247 -790545 -628583 -196425 -879385 -1274574
1300 -1274574 207799 61321 -1095945 -1324005 -309664 -290604 -74478 587098 390180
1291 390180 521191 211641 586777 342982 88634 91902 -463449 -1114626 -1312358 -581093
1281 -581093 -464583 199739 -617124 -1572496 -1203341 -1023625 -802417 423378 -73821 -1070033
1271 -1070033 -1113930 -716873 366564 857906 1225806 -767974 -449579 171603 470449
1262 470449 1005055 -297439 -1083919 -596753 338042 -441924 556544 683665 548957 524789
1252 524789 -482705 -241297 42366 -330446 172068 328529 -34009 1476206 1003523
1243 1003523 2189769 1509405 1443992 1021566 684742 -919907 -573787 -345231 -469968
1234 -469968 -379970 -518706 -61104 -800565 -1684265 -1162063 386703 771703 719910 -292133
1224 -292133 445372 -213691 -44027 -540306 -378446 32699 -266178 -48342 730540 -197813
1214 -197813 -2027040 -1970832 -1982054 -2328011 -1394079 -777683 -446139 -851035 -512503 -692931
1204 -692931 -738075 -602169 36973 901620 1334523 969834 732325 517730 684936 660175
1194 660175 841245 459673 1449395 1186365 707751 -1164599 -996016 -395622 -1604811
1185 -1604811 -1646566 -477263 -1898548 -2359873 -2058102 -2059543 -552787 -146381 739954 733987
1175 733987 972101 217410 -296043 -134294 -148544 -731831 -883872 -1995358 -755949 -1183884
1165 -1183884 -1892519 -1267704 -1008658 -1412576 59816 616206 619474 456605 -1186014 577763
1155 577763 592994 -211921 1192776 1527046 -719 -240528 219675 647532 -196588 112748
1145 112748 210422 111309 1131079 254583 -1186993 -511128 378951 201261 -192417 -7656
1135 -7656 3813 268868 36066 -791171 171920 40182 347000 -126672 -1059152 -1529176
1125 -1529176 -1455761 -577759 224226 -1836185 -757912 471219 -592318 768995 1175129
1116 1175129 -454869 -1395004 -1779642 -1183362 -659776 371351 745402 119268 198021
1107 198021 405469 -948550 -1068723 -807888 460330 -1177021 -887437 455058 -519102
1098 -519102 77779 -794515 -1167469 -357894 -1047141 -1051090 -782222 -409817 565199 1496032
1088 1496032 1813129 1585399 860403 -294722 -257025 678627 -51895 -173457 -206290 -531358
1078 -531358 -753176 -1749404 -1808712 -1413207 57855 -235855 350311 339046 -744897 -1361331
1068 -1361331 -1174130 -1270574 198600 1193425 828200 -107523 -322933 1101206 154801
1059 154801 -592970 -1161101 -1165505 -1314448 -902227 -547168 -1367479 -1343177 -593612 -1242706
1049 -1242706 -700764 -783891 -62843 1738580 -9123 -153041 896770 294714 294573 602232
1039 602232 237305 -549225 -809639 -1133226 -1525678 282218 -656870 -1063638 -1869408 77963
1029 77963 62906 -117172 -1015396 -986556 -329209 -1957610 -930872 335361 -1038387 -964131
1019 -964131 -277454 -507844 -1152040 -952977 -304857 -210877 -841716 22827 -381292 -609230
1009 -609230 427288 540152 -1356496 -1451846 188624 89271 248533 783869 445094 1030684
999 1030684 1078345 615402 157244 190618 248108 -366259 684050 -71432 262684 642401
989 642401 1137390 -407192 -960393 -360695 722080 571109 -576916 -561232 -845347 -875011
979 -875011 -319651 -789476 -288180 582859 1365110 890352 1186862 1557002 -361194 -1285704
969 -1285704 459164 68455 321480 918534 833105 -18356 -967646 -1198733 -1677102 -1403711
959 -1403711 -1571796 76417 -260797 -755597 -43089 597402 402714 -123219 201454 233389
949 233389 40138 -251745 252514 267482 -129296 875205 271212 978393 1016479 -804562
939 -804562 -783457 51648 435959 -28584 25826 966903 -379717 -851085 -598942 -426360
929 -426360 377217 -1052834 367977 42306 -646816 -759611 -377636 1240349 983862
920 983862 339282 -1041177 -1341643 -893491 56075 926164 -508945 -542700 -299397 -305170
910 -305170 -186672 421945 -390991 -940573 -465007 -84376 742271 374939 1193655 1205478
900 1205478 -407594 902555 582552 600858 -204603 281094 1269866 117589 756347
891 756347 2226408 1761644 742845 839762 -200600 -555205 -607572 -4416 118622 9001
881 9001 355547 558220 460505 -252156 -113901 -594730 -821449 -403362 -93395 -305506
871 -305506 -308572 -728442 -575936 -1194626 -545630 -389761 684281 826004 -640327 -1138424
861 -1138424 -376570 1027967 -345194 -522264 111460 -1604199 -1363939 -532986 -445873
852 -445873 507305 884936 623695 357846 996757 205200 -589652 -819336 10679 -897704
842 -897704 -405616 100228 -234837 -759827 246715 417330 16908 419631 -404489 -215144
832 -215144 -198682 -617990 -1319604 -1369087 -549599 -1495913 -658389 103396 975920 860990
822 860990 -310607 -1403710 -239084 555810 311976 -203709 847107 522156 514925 -16457
812 -16457 326159 1095436 1333018 17954 59841 530211 714773 1202238 578604 -387665
802 -387665 -197007 852978 867606 273168 -1196851 101422 705289 22373 -497589 -1129718
792 -1129718 435296 248133 -1464254 -1530540 513880 227318 -312225 1529710 1069282
783 1069282 -876467 -131237 -310133 -373555 -578031 -264670 422232 -203091 -141772 735788
773 735788 1252345 292059 315119 904919 1726002 712191 2112591 1379008 379541 -15549
763 -15549 -43374 613655 855698 -368751 -625036 284030 439774 486660 -511686 -572754
753 -572754 -166766 -1060734 -651556 -397410 517150 872102 -2222 -1071680 -1804747 -569300
743 -569300 -902424 -288082 2001768 921384 -82555 -368127 1573631 646002 992671
734 992671 -62668 -1481264 -2349085 -1030565 -241201 -342405 -303342 -271403 -9520 -961611
724 -961611 -719808 -378797 -1854386 -25475 564631 755768 762192 -613332 -871596 -1012828
714 -1012828 -1002720 54435 784125 940861 1896631 933874 -411962 -540807 779965
705 779965 1181505 290893 1022423 602979 55809 1218143 252386 -61852 -415 363674
695 363674 -573287 -309909 -215516 367719 202714 -17875 -176397 -627025 -199706 -251038
685 -251038 -498801 547136 25032 118987 -196866 138389 -392735 -1515659 -1445479 190904
675 190904 36606 258457 2800705 2190186 1367469 522538 -33019 1069065 -149801
666 -149801 -694434 469587 -799769 -772873 -273357 232689 -121639 -918634 -1165075 -1549395
656 -1549395 -1204092 -187904 -32100 -337386 -745042 -1102669 -209221 -417965 -698701 -49686
646 -49686 329717 -454873 -6586 710184 -229569 -853396 -1359853 396672 1732036 1314814
636 1314814 1023346 528163 784274 1028072 -809218 -323472 765417 1011443 379297
627 379297 -1397698 -226981 83977 300862 817914 1207332 -612040 -788796 -1004407
618 -1004407 183982 -79174 744953 153622 -440052 -74499 284500 -154474 383177 746356
608 746356 321545 -50591 -236700 537260 785014 1113654 826754 -519100 -1003538 115627
598 115627 403845 -224623 -618110 18583 -24555 476505 500059 -236833 -296738 1247747
588 1247747 187815 473418 568445 430599 395964 -177496 684974 294257 -922388 -822407
578 -822407 -1169877 -1110984 471971 2476821 1065184 496997 1435342 1240150 676546 1354422
568 1354422 1625638 1333142 1775234 1345617 1213966 34015 -715706 -1222706 -724855 -406801
558 -406801 -411369 448819 369577 -341155 170409 -659930 -1346538 -822799 -157441 1291341
548 1291341 1623092 800199 -276379 1048030 721696 207425 643598 -43403 -23200 1433305
538 1433305 742977 287084 1518199 1608120 730776 1101005 458704 71372 1422525 1058286
528 1058286 667973 763207 1680741 1476899 332090 -535661 -653255 -72689 -352855 -191758
518 -191758 562114 1680821 1772334 1813265 633257 347427 -196208 713952 750198 1282417
508 1282417 105868 325872 -46394 -895985 -708375 1012022 398273 -1090069 31227
499 31227 567072 505705 33982 441872 -436 194206 1488847 1524408 1501095 1896251
489 1896251 1254935 831410 1065795 1338448 1368673 1486330 2333189 1686830 1660059 1019510
479 1019510 620761 126152 -547667 507994 529301 1841298 -103486 -1427741 -1576717
470 -1576717 212875 935837 735021 553410 460123 413382 547530 380824 108247 407284
460 407284 1597113 2048876 1165750 1204416 1260038 1586473 1595066 1201837 1674200 1667794 -54671
449 -54671 -1094691 -201035 550516 1804804 1443618 1578765 595936 1235383 -231800 -415483
439 -415483 364774 -407968 -129751 908241 1107246 689116 814416 101084 711426 1617353
429 1617353 1554748 786519 142686 -380777 -918076 -1240624 -296858 -810787 -843991 899451
419 899451 1458779 690419 -632985 664065 1160859 1374474 1247825 559241 768819 1421167
409 1421167 1512730 1202039 120897 925230 1919080 982540 -537093 -596662 -1839469 -1706153
399 -1706153 -1238239 -945459 -422879 386836 1442941 228202 -544907 -68201 365137
390 365137 427916 317342 206912 -485198 -1166158 -754224 -703066 829863 1560440 1658355
380 1658355 805459 -294457 19131 145999 -790559 -197322 65967 431690 1243468 449843
370 449843 -395178 -495462 -1326261 -583662 197547 1264093 580283 177325 -188999 -180528
360 -180528 -273676 -859871 -602200 -191866 140672 -363546 -947744 803230 152081 -630019
350 -630019 -661904 35793 1965699 2401964 1353853 635573 413571 942540 1744658 -271261
340 -271261 -249355 1310653 1231082 218346 694450 1348249 987144 1175217 1712241 1214812
330 1214812 69284 -393112 788386 1233226 590838 -6923 -12678 691301 666318 413017
320 413017 596315 1561916 1590307 -180184 -908111 -271432 337789 1114713 911721 1778067
310 1778067 2312089 319014 -424982 -59440 381200 2026571 505073 -43811 -746722
301 -746722 -552981 -152533 431338 232864 267044 190993 1011881 924180 76809 -266208
291 -266208 -389380 -179777 151718 -627731 -610585 984154 1060061 568881 307596 206651
281 206651 -504686 477480 -14437 -619049 -744744 -32764 345463 -183351 249596 -723240
271 -723240 -740112 941137 677317 540010 679420 -470154 -520803 -806315 -561900 1154797
261 1154797 1835135 -98753 366995 1834485 1545831 629451 -913203 -1087723 -298453
252 -298453 727115 -180353 176993 -144906 -397481 -1074053 -191658 874147 758349 680393
242 680393 522809 -615400 94201 1949541 1861796 275504 563511 707242 46325 -666641
232 -666641 -247458 -206351 1053739 1181912 321595 131653 1471706 1598348 1042200 -1207473
222 -1207473 -1186478 -471488 143074 1292416 1609368 1759577 1060554 922307 933815 694685
212 694685 456616 876820 421635 -380582 -759812 -531949 605181 857872 1498318 1122194
202 1122194 -1048111 -847997 260165 -326511 -481649 360201 706044 1281594 2152910
193 2152910 932033 61693 140155 -90173 797722 1539047 1405158 1435864 1217014 447053
183 447053 395891 400364 92640 -503408 -366177 -642399 -217634 -964787 173681 353133
173 353133 790719 1605704 1289061 1122320 1011279 1038719 810809 216774 610953 1259341
163 1259341 2150323 1117405 644190 302481 177576 113999 -106206 325653 345825 474687
153 474687 91995 295531 1331632 1249926 1082429 1221694 1101830 1897256 1994341 1110055
143 1110055 118462 1069757 1392672 309798 717794 878337 1034055 859662 736601 1346275
133 1346275 553294 -30786 201343 113700 169315 972818 1429961 1223075 1314737 1055320
123 1055320 633817 482571 1431916 1472176 455648 -5745 618376 1383549 2191623 2093599
113 2093599 1551680 1105388 1122621 968419 362766 -472423 -651851 -893364 -86659 117099
103 117099 -70017 1032776 1276337 1530275 922385 44915 1174923 1286545 1016612 390496
93 390496 -247821 -586085 897710 1472184 13682 502107 984040 -288643 -954097 710096
83 710096 1052621 841079 815688 392066 1103494 1061600 435811 -78947 820792 375869
73 375869 -194531 647469 850001 299357 98100 803705 754590 124402 371189 1149418
63 1149418 1291631 684794 286615 326131 -587171 163747 338248 1253593 643937 990326
53 990326 1015549 441324 916957 980769 65739 -482260 -480091 346981 289484 373185 1114604
42 1114604 881798 853252 1020217 1234303 1072947 1141210 1793004 2020149 528012 1331632
32 1331632 1011661 715590 973217 797576 1804065 786145 1039334 767068 494874 444503
22 444503 -12396 120751 523284 617840 1441718 1427623 352619 1188609 1982012 2320046
12 2320046 2024050 842678 723368 1267933 1400936 765933 554936 196212 158805 364696
2 364696 678573 629159
0 629159
$$ Imaginary data points
##PAGE= N=2
##DATA TABLE= (X++(I..I)), XYDATA
16383 -5260473 -4645898 -4994942 -6002588 -6320423 -6314649 -5391507 -4902963 -4000579 -4397203 -5657386
16373 -5657386 -5324830 -5772904 -5181114 -5023614 -5111197 -4939494 -3813917 -4263848 -5107597
16364 -5107597 -4275340 -4059704 -3087803 -3534056 -3127587 -2931528 -2858745 -4068073 -3839978
16355 -3839978 -3657583 -3173279 -2891587 -2851439 -2142314 -2552928 -2829848 -2465675 -2907575 -2490241
16345 -2490241 -3098095 -2942906 -2855012 -2377439 -2098884 -2053452 -2398018 -2338531 -1442521 -1284464
16335 -1284464 -954400 -375107 -878215 -1542139 -1399574 -1047762 -682082 -1469632 -1141908
16326 -1141908 -628540 -712396 -482792 -298704 688585 887561 -349160 -34804 33022 -225062
16316 -225062 -247342 -1114863 -1409265 -1298530 -588812 -89055 -21976 420253 1177673 864007
16306 864007 1808696 1598605 1012768 1004716 1634316 1640393 2530775 1871375 1804609 1158801
16296 1158801 85283 1634309 2319110 1997551 2051730 1341260 2159262 2355487 1421225
16287 1421225 2360064 2181927 2285170 2520115 3040458 2127790 1902396 2354323 3212321
16278 3212321 3321403 2639903 2197134 2258154 3136280 2922625 2990168 3933381 3161036 3430567
16268 3430567 3704080 4228404 3348006 3363973 3145479 3909104 3317309 4451214 3907662
16259 3907662 4113913 3752780 5090293 4894803 4399887 4198648 4104873 4793837 5816066
16250 5816066 4669516 4193963 4803930 3811901 4484552 4321268 4234780 4293319 4606139 5364199
16240 5364199 6507969 5834580 4927289 4925235 5277148 4573177 3940298 3704820 4781079
16231 4781079 5163599 4011994 4221182 4801899 4998811 5505120 5439342 5180192 5541285
16222 5541285 5147405 5908485 6797541 6023836 5687150 5122430 5161421 5624702 6294248 6885031
16212 6885031 7176715 6395637 6013516 5485826 4702951 4970879 4429400 5303065 5531884
16203 5531884 5908549 7312200 6759006 6163780 5822653 7548884 7906083 6777709 6193034
16194 6193034 6518322 6686816 6593438 6522450 7109385 5944935 5819863 5110418 6684747
16185 6684747 6929301 6759187 7269008 8011964 7443454 6971361 7227542 7941828 7536668
16176 7536668 6690481 6607991 6259775 5902742 6533000 8015506 8506872 7342136 6741053
16167 6741053 8216737 8284538 7178348 7111845 6109874 7287460 8653788 9434826 8496702
16158 8496702 8111326 7798265 7325716 7581006 7068946 7802214 7757853 7151010 6898088 7598899
16148 7598899 7720551 7428288 7724524 8711564 8150085 8227413 7463294 8181081 8022173 7856891
16138 7856891 8664782 8311565 7924877 7086866 8545233 9395035 9120178 9732090 8975845
16129 8975845 8024365 7808137 7466315 6684719 7132724 7598433 8772090 8916337 8775009
16120 8775009 7945100 8816104 8726373 7983782 7726731 7368998 7901704 8923333 7959932
16111 7959932 9287178 9783752 9647513 8558127 7768586 7891810 8651807 9343368 9323275
16102 9323275 8700884 8547469 8737514 8531216 8089728 7543452 7887912 7417170 8270717
16093 8270717 9365557 9765943 8883435 7896627 9249565 8156191 7586912 7830614 7679105
16084 7679105 8169337 8998578 9755313 9276274 8823990 7620032 8347686 9638684 9398640
16075 9398640 8963736 9451083 8724458 9731959 9459328 8165639 7240457 7688901 8009017
16066 8009017 9774414 10322105 8648757 7896784 8125504 8377804 10411827 8401235 6835954
16057 6835954 7441365 7539089 8048129 7178446 7947589 8589462 8939883 9153568 9146308 8762196
16047 8762196 8853064 9260403 8475974 9007413 8668920 8118095 7713927 7646290 8603446 9203271
16037 9203271 10417531 10072752 8113797 8584326 8507257 8396240 8487652 7936597 9754645
16028 9754645 9665711 8578635 8890439 8635363 9504028 9302160 8705448 9796857 9913552
16019 9913552 8959194 7729353 8827384 8973985 8664162 8740663 8998566 9462762 10186234
16010 10186234 8454161 9428663 9775131 9100273 8792055 8122099 8172192 9138124 10001462
16001 10001462 9804152 8209359 8076004 8077213 7707205 8161087 8329319 9002669 8758446
15992 8758446 7929541 7179778 6862727 7516231 8254690 9058255 9054129 8402521 9259450 8485917
15982 8485917 7786380 7761372 9379591 9211078 8693833 8511899 8736093 9210743 8785532
15973 8785532 8740489 8843004 8816475 10614473 9846523 9373408 9880178 9588981 7992646
15964 7992646 7792455 8123086 8356465 7692158 6987061 7219137 8121804 9281792 8905207
15955 8905207 7974828 8995119 9019514 9412852 9161121 7592020 7751425 7355921 7957195
15946 7957195 9522932 10448387 9650211 8085436 8099398 7213255 6951865 9710350 9984834
15937 9984834 8834783 9199803 9824915 9765895 10207858 9162179 8496854 8750489 8141171
15928 8141171 9807299 9538387 9178489 8750809 8529198 8924528 8650933 9508927 8160274
15919 8160274 8414712 8054027 8463345 9021801 9150070 8360012 8504429 7708026 8195155
15910 8195155 8386810 9600424 8908320 8362309 8447518 7899311 8564754 9856926 8968655
15901 8968655 7873435 8314263 8857244 8511963 8384098 9744216 10064223 9104790 9248501
15892 9248501 10327791 9504493 8787690 9047057 8531433 8691382 8706470 8699664 7622404 7976126
15882 7976126 8627841 9580197 10149518 9159555 8751609 9182942 9475791 9332113 8941816
15873 8941816 9106058 9761977 9475384 9350458 9562039 9959783 10120223 9568736 8850612
15864 8850612 9104032 8901655 8987298 9708418 9588423 8670879 7697506 8638478 8394161 8073186
15854 8073186 10261280 8815843 8642376 8889762 10255354 8647812 8127019 8547246 8369169
15845 8369169 8698083 9584642 8346584 7478414 7167290 7919299 7838676 7226222 7987113
15836 7987113 9110769 9710173 8694607 7845539 8655256 9702606 8410949 8244974 8307007
15827 8307007 7702464 7465525 7910754 8073124 8113877 9200495 8800717 7837214 8176329
15818 8176329 7687545 7218231 8848828 8067401 8961616 8383007 8389842 8922879 7769643
15809 7769643 7859818 8409239 8748799 7671756 7651819 7837671 8216397 8606374 10586122
15800 10586122 10459702 8839359 8457056 8014094 7843440 7733747 8736098 8462750 7566074
15791 7566074 7709738 8469082 9136673 8822814 8589909 8821226 9708091 9282313 9136584
15782 9136584 8522804 7563399 7605376 9019692 9183595 9207571 8227236 8205221 8105686 8436548
15772 8436548 8694346 9216529 10103942 9495327 9383148 8071493 7947104 8222841 9237127
15763 9237127 9574265 9674401 10168727 8473324 7930568 9056299 7454539 7691057 8989458
15754 8989458 8693750 9459079 9853811 9204995 9659033 10118969 9241716 10063140 10435797
15745 10435797 10934650 9348195 8743492 9389747 8687406 9143338 9117193 10237715 9664463
15736 9664463 8605798 10813357 8950777 9015318 9014569 7733751 7759256 7726613 8367655 8244931
15726 8244931 8402395 9167086 10164785 9962785 8756386 8658865 8692779 7341016 9095011
15717 9095011 8644467 9553133 9419458 9569913 9723880 9154598 9368541 9531770 10631223
15708 10631223 11104141 10122280 8098575 8271556 7600850 8566289 9045204 8670915 8364232
15699 8364232 9745384 9918217 9184058 9196620 10605925 10105663 9417826 9650846 9349143
15690 9349143 8750345 8507765 8333249 8143187 7735567 7770034 9551327 10614862 9510186
15681 9510186 9854725 9481044 8760799 7649168 7326204 8700949 8546212 8798879 9585577
15672 9585577 10985007 10885508 10329987 10727182 9053135 9344248 10069683 9675301 8303780
15663 8303780 7975602 8636738 9036393 8825383 9129227 8737188 7751703 9910493 9378691
15654 9378691 9608914 9385512 8697986 8216204 8731541 8288517 8325110 9466278 8867557
15645 8867557 8653054 7851716 7413668 8497482 9226029 8918396 8577012 8573947 8184333 7420519
15635 7420519 8423190 6792282 6828410 8419095 9449549 9811893 9396065 8768262 7788967
15626 7788967 9469858 9504035 8762475 8602565 9169742 8282446 9428942 8705230 8119407
15617 8119407 8498966 8031409 8890802 8708998 9268918 10585456 9729249 8622673 8373445
15608 8373445 8875030 9381174 9473184 9095163 8641866 8911765 8872095 8812572 8824647 8439662
15598 8439662 8330024 8313443 10040471 10099556 9311642 8420867 9780241 9493652 10250868
15589 10250868 10007728 9799438 8886494 8791718 9262328 7733920 7553559 8809390 9135651
15580 9135651 9229380 8596246 9046020 9312728 8241153 8879321 9199874 10420594 9957407
15571 9957407 8657555 9135749 8230143 9117079 10687864 9284451 9313498 10018576 9880350
15562 9880350 8218150 8668213 8770773 8626772 8743864 9556285 9520737 9608085 9144564 9233002
15552 9233002 10419682 9531359 8407181 8472491 8426964 8680329 7889085 9416225 10127004
15543 10127004 10369489 9409808 8388590 9479695 9221826 8422279 8762803 8793530 8369627
15534 8369627 8585418 9590870 9703872 9532694 8951012 7566929 8241417 9521599 8944190
15525 8944190 9468940 8287396 7822387 9009980 10239707 9459263 9365166 9033836 8820438
15516 8820438 8681747 8634891 9752320 9723609 9444209 9076459 9706996 8972897 9274148 9075244
15506 9075244 8909895 9129505 8651352 8876777 10052008 9897190 9085085 9636018 10481554
15497 10481554 8989550 8403261 9158962 8767628 9064138 9313719 9405458 8394586 8397119
15488 8397119 8492902 9597617 10651902 9416720 8204755 8269925 7925845 9108972 9508477
15479 9508477 9301268 8918521 8054734 6832576 7418885 8976513 8929595 9121186 8774633
15470 8774633 9010068 9016075 9790956 9715621 8997848 9059784 8648009 9206929 9884590 9467555
15460 9467555 9815647 9572531 8881661 9138682 9605531 9880152 10396432 9647480 8981767
15451 8981767 8670644 8283568 8581812 8593547 9078871 9906700 9387770 9695541 10122797 9222653
15441 9222653 8136197 8323263 8465958 8430523 8176825 9247064 8451833 8095893 8737030
15432 8737030 8234985 8496111 8872147 9668119 8748224 8859259 9462670 10578476 9850244
15423 9850244 8154917 8407405 7616049 7709614 7460201 7352240 8697354 9107459 9514182
15414 9514182 9500675 10484151 10049882 8864068 8763377 9533218 10858765 10244901 9811431
15405 9811431 9734325 8896166 9243940 9483773 8627592 8409296 8193624 8064437 8964168 9833782
15395 9833782 10339012 9979874 9732007 9649856 9228825 10240470 8940503 8545089 8443653
15386 8443653 7901600 8486177 8260357 7907400 8177259 9292496 9892758 9702542 10554652
15377 10554652 10314155 10485575 9936652 9981832 10359376 9706670 9704550 9264899 9126287 10037834
15367 10037834 8451756 9240603 9191235 9799098 10484360 9015901 8275208 8627494 9887106
15358 9887106 9925913 10064044 10238277 9963708 9919640 9261852 10006463 9258541 8510621 8683498
15348 8683498 8088048 9349497 10323292 9790179 9358688 9606972 9340824 9453664 10751486
15339 10751486 10540050 10293515 9524973 9157386 9996568 8927631 9913827 9530166 8327489
15330 8327489 7840571 7713546 9246315 8223234 8914569 8270539 6765051 8099431 10011493
15321 10011493 9822362 9419567 9847910 10014935 10091480 8709952 8362375 8990332 9625866
15312 9625866 10255351 10459459 9328475 9417032 8788873 10223253 9460845 9041219 9262285
15303 9262285 9571353 8849899 9321476 8786013 8836591 8576976 8371299 8780034 9700021 9454789
15293 9454789 9018977 9798370 9295052 9819172 9286187 9680342 9312646 8124108 8485052
15284 8485052 8666006 10002864 10425585 10467408 9439792 9169649 8417142 8022277 8794706
15275 8794706 9398711 9452827 9376247 10325876 10168006 9408912 9411990 10225220 10190627 8902741
15265 8902741 9000611 9231776 9187468 7860312 9059600 9804221 8942253 9559054 10112414
15256 10112414 9388512 9242275 8908864 9747771 9601416 9483193 9410648 9953348 9332587
15247 9332587 9745602 10479304 10945692 10764259 10331834 9390357 9067107 9197402 7941099
15238 7941099 8048987 9134235 9494463 9354900 9380182 8583038 9722626 9380726 9332657
15229 9332657 7370984 8825780 8521234 8244035 8004598 8113681 7450036 8484048 9415095
15220 9415095 10024253 10423391 10318253 8016319 7775717 8118138 7863942 8176882 8464225
15211 8464225 8126204 9521715 9118598 8049446 7978425 7500034 8403565 10152222 11537406
15202 11537406 10011837 9337396 8940038 7897595 8603317 9628738 9309089 9548586 10232615
15193 10232615 10202898 10621288 10031471 10014046 9967157 8856151 9185933 8529457 7645806 9290190
15183 9290190 11150724 10273702 9159961 9423252 8183963 8540852 9301247 9070422 8575178
15174 8575178 8648832 8693553 9407329 9949056 8122485 7707576 8574544 9442014 9723407 9020922
15164 9020922 9620253 10102822 11238210 9613203 8424983 9378546 9991370 10696453 9890095
15155 9890095 11074028 10885874 10391021 9644643 10588890 10376471 10879378 10699209 9323479
15146 9323479 8194770 8236713 9107183 7876129 7818688 9034382 9137592 8656942 8727177
15137 8727177 7989844 8123184 8996371 9317614 10259384 9565459 10461670 10487654 9559843 9292158
15127 9292158 9892309 10246800 10265370 9962393 9556869 8942360 9162826 8255633 7792533 8394923
15117 8394923 8177877 9126376 9563493 8549077 9160503 9904498 8531529 8306482 8796937
15108 8796937 9011364 9000338 8518665 8540509 8512586 9556097 9826841 8957752 9458311 8800344
15098 8800344 10537187 10702901 9533796 9936864 9794505 9415816 9404357 9977731 9619053
15089 9619053 10296108 10793913 10565320 10453818 10716251 9392728 9730275 9969359 8626758
15080 8626758 8321979 7708254 8102554 8708878 8848843 9050252 8406211 9430947 10283516
15071 10283516 9523267 9497541 9360063 9504975 9771778 9914756 10102081 10266212 10395010
15062 10395010 10578889 10613254 9970250 10473615 9864580 9354968 9962823 7959355 9389433
15053 9389433 9085964 7726080 7648809 8416682 8818314 8208090 7588245 8198695 9263680
15044 9263680 9909076 9926772 10157393 10473068 9726220 9171773 9751245 10510801 9423395
15035 9423395 9152307 9678886 10103036 9053950 8876842 8800079 10544369 9448072 8733688
15026 8733688 8676050 9247657 9864278 10765071 9890379 9372597 9120527 8430296 10190283
15017 10190283 9932011 10224307 10083468 9864594 9270124 8902700 8401008 9567707 9251846
15008 9251846 9313946 9970771 10335670 10228012 9008055 9699396 11576071 11378985 10490128
14999 10490128 10184354 10416288 9805902 9701169 9767503 10072363 11598753 12111907 12629715
14990 12629715 11329310 9375611 8685776 9705646 9236959 9675359 10977009 10735299 11015995
14981 11015995 10752474 10064781 9271686 9612538 10804572 9348127 9480535 9604823 10197618
14972 10197618 10417087 9046397 9229474 10490864 12355726 11691645 11111188 11518740 10663961
14963 10663961 9115644 9551766 10414526 10174825 10183763 9821495 9424895 10638286 10793304
14954 10793304 9901530 9234198 8844022 8963444 10278471 9913775 10129876 10850418 9160361
14945 9160361 9850742 10353105 9606780 9509777 9318595 9420801 9311101 9703867 9343666 9772037
14935 9772037 9234475 9287558 8701696 9175478 9611844 10345445 10058933 9487889 9714481 9293199
14925 9293199 9898456 10214949 9607410 9129201 9026701 10004288 8665303 7780904 8570396
14916 8570396 10042908 10867524 9630079 9608510 9326085 8701278 9713240 10333294 9353405
14907 9353405 8595327 8234431 9222236 9165771 10495574 10126812 9920881 9794412 9524951
14898 9524951 9817044 9006265 9922117 9637868 10830624 9416113 9993417 10167343 8844091
14889 8844091 8538864 9250737 11554201 11056762 10485356 10767194 11252614 10686866 11290789
14880 11290789 9891474 10337839 11111729 11665649 11070857 9688125 9414786 10442880 10271818
14871 10271818 10319259 10338728 10472681 9190657 8932507 9853950 9551589 9396520 9348424 8651116
14861 8651116 9309065 10193322 9469572 10403553 11322975 11148980 10602426 9977877 9301820
14852 9301820 9468168 10567705 10300074 10443072 8937284 9174108 9235436 10466248 10343146
14843 10343146 9944678 10583333 9919232 10262238 10278570 11884765 10690796 10070755 9774672
14834 9774672 9405979 9535859 10486972 10091650 8943057 8309471 8744802 9335074 9234235
14825 9234235 11348164 11498657 9942690 9854207 10178388 9629775 9756881 10086563 10021782
14816 10021782 10566778 9500117 8755818 10196373 10806380 10328865 10339666 10152310 10579234
14807 10579234 11102275 9706379 7831484 8873940 10142108 10368598 10222706 10108473 10553856
14798 10553856 10685906 10946302 10189720 9704540 9914327 11458971 12526257 11995031 11422164
14789 11422164 9842776 9751509 9651140 8901475 8372911 10085561 11041018 9400441 10373866
14780 10373866 9798003 10131979 9679190 10193913 10326722 9319150 9480326 10252562 10476026
14771 10476026 10442377 10457329 10348939 10689803 11348638 10348593 9236267 10126468 9322558
14762 9322558 10438948 11364884 10941249 10161522 11260498 11792875 11007064 10345165 8741010
14753 8741010 7600118 9043285 9167542 10340302 10281967 10356707 10150630 9877283 9671842
14744 9671842 9006143 8759770 8357314 9014351 9681125 8933169 8845586 8957582 9352403 9639633
14734 9639633 10354602 9412946 10192530 10070460 10496349 10679750 9351036 9125943 9338592
14725 9338592 10308240 9506722 9514148 10226076 11693502 11189617 9924647 10159237 10231234 10871761
14715 10871761 10396446 11476630 11518600 9134271 9611135 10112279 9604107 9548853 11439722
14706 11439722 10789602 10170352 10615871 10871407 11130454 10424373 9674853 10760835 11271783
14697 11271783 9691689 9326631 10400299 9643088 8743281 9479128 9759356 9670244 10202584
14688 10202584 10607692 10327979 11116435 9977935 10379002 10130957 9845769 10038927 10637446
14679 10637446 11473242 10395527 10328660 10274608 10025068 9316348 10641604 10902765 10188708
14670 10188708 10367950 10989919 10091468 10272466 9941726 11258931 10086470 9465253 9666353
14661 9666353 9938632 9744925 8688368 8800803 9545344 10504294 9660570 9082921 9979280
14652 9979280 9495907 10370322 9143690 9028389 10519829 10177884 9779202 9756583 10696108
14643 10696108 9775068 10058163 9654564 9358328 9601216 11048687 9894322 10628161 11172606
14634 11172606 9962760 10599839 11088014 11177393 10597232 10663593 10321383 10172369 10253755 10507175
14624 10507175 11149249 10580666 10246897 10491857 10206116 11060277 10095466 9403893 10037003
14615 10037003 10650851 10401693 10932821 9943227 9519786 9261511 9959915 9400787 9861824
14606 9861824 9938392 9211645 9066975 10191764 11111878 9697794 9996648 9560670 9333666
14597 9333666 9126005 10211383 9871028 10061972 9291966 10161480 10487207 9554243 8786562
14588 8786562 8627902 9761494 9600763 9794873 9743571 9712787 11395077 10531951 10023304
14579 10023304 8753465 8966229 9684516 9124016 8858283 8529864 8782180 9433434 9010764
14570 9010764 8701382 9139629 9938865 9771189 9406274 9994105 9235092 9337407 10420317
14561 10420317 9826586 9043256 9623591 10539201 9146734 9744606 10017559 10089639 10559241
14552 10559241 9829100 11098680 11386147 10526318 9875195 9168895 8867619 9036969 10625335
14543 10625335 10730947 10229192 9451499 9280096 9503401 9360263 10854294 10653512 10542402
14534 10542402 10285586 9942502 11223210 11035591 10528144 11107482 10946747 10113080 10839878
14525 10839878 10115271 9196201 10533838 10615794 10057136 9338033 9804034 9610209 9290582
14516 9290582 9933294 11106061 10152684 10995624 10121259 10356213 10450538 10841632 11048251
14507 11048251 10954595 10849165 10885187 10359756 10004376 10215987 11481984 10497610 8537264
14498 8537264 8955492 9103994 9935707 10464386 10534117 9987908 10081816 9789719 9729227 9555612
14488 9555612 10412054 9502999 9954746 11215990 11361078 10788922 9865698 9742332 10090263
14479 10090263 9577338 9695283 9944861 9676568 10965169 10126178 10175687 11054379 10896436
14470 10896436 10504412 11114336 11338762 10242739 9659485 9543065 10682634 11709917 11030111
14461 11030111 11170005 11384584 10954792 11263847 11431293 11215097 10029006 9968386 10417229
14452 10417229 10427787 11106424 11700616 10494479 10912063 10383268 10758946 10593556 9491784
14443 9491784 9529208 10132949 10975280 10130885 9454028 9015764 8926281 9351218 9815435 11086266
14433 11086266 11845402 11161343 10788918 10970506 10183080 10217070 10166936 9934181 10428097 11114979
14423 11114979 11451799 11088053 10432632 10142378 11896433 11233111 11391447 10412323 10486886
14414 10486886 11367131 11441131 11058109 9451070 9845997 9695445 10226872 10941643 10658099
14405 10658099 11368626 11755860 11616528 11554458 10121735 10051838 9895489 9812547 9949036 10642404
14395 10642404 10748970 11091530 10582475 10338209 10038208 10474799 9508594 8485556 8651293
14386 8651293 9833197 11459775 10835126 10042246 11119008 10554357 10718720 11284063 9802978
14377 9802978 10580096 9586116 10206221 10392324 9561288 10343079 11171811 11203979 10451148 10227101
14367 10227101 9632791 10148457 10578717 9924014 9808404 9080940 9755499 9929504 10251475
14358 10251475 9466986 9869897 9690932 9064460 10167237 9026992 9714255 11031060 11335081
14349 11335081 11229137 9992868 10529826 10686437 10091356 9833381 10398025 9629818 9479488
14340 9479488 10302501 9822249 11023911 10589248 10091106 10597407 11288315 10899542 9748444
14331 9748444 10129424 10409365 10285930 10243137 10687992 10710297 10145995 10476469 11463753 10758688
14321 10758688 10013457 9762684 9702329 9389460 9426264 10166544 10623585 11173218 11110188 10492195
14311 10492195 10335446 9249091 9689490 9875979 10028765 9081401 9557624 10295457 10065027
14302 10065027 10223392 10103345 11135117 11267850 11063590 11489012 11227378 12082169 12299364
14293 12299364 11709949 11334718 10655947 9972283 10143678 10577441 11696968 10889567 9154387
14284 9154387 10236421 10913061 11243713 10413911 11212704 11538055 11126117 10176380 9227992
14275 9227992 10173237 10758751 10191377 10395801 9804785 8604786 9486330 10602006 9995481
14266 9995481 9932040 10819403 10604762 9600450 8757864 10424219 11679426 11299038 10782182
14257 10782182 10628363 10612115 9874509 10167197 10311931 10107403 9626906 10814444 11553616
14248 11553616 10449535 10440625 11164608 10229747 10275192 10652977 10654686 10885152 11107792 10967017
14238 10967017 10996040 10735838 10350113 9040042 9308078 9512806 11843718 11312002 10678209
14229 10678209 11363582 11437756 10698649 10415942 9988741 11279673 11830803 11686586 11448684
14220 11448684 12309387 11976593 10644851 11885489 11397546 10836230 10674985 11741433 11576887
14211 11576887 10053117 9995452 9823508 9359406 10122774 9491048 9917612 10513205 10674039
14202 10674039 11458250 11171973 10434777 11498633 10906692 10251165 10060738 10761066 10494697
14193 10494697 11015625 11258814 11139738 11032187 11102700 11585480 12110565 12439826 12053830
14184 12053830 11797635 12254170 11283272 11245395 11137693 10988019 10444419 10112978 9661676
14175 9661676 10131207 9609617 10001845 10603367 10015273 10347476 10372546 10789848 10942091 10017884
14165 10017884 10084027 9947123 10658937 10173181 10907134 11144255 10761446 10941770 11178972
14156 11178972 11336144 10707272 11421254 12769118 13130541 12603702 11708941 10747924 11248931
14147 11248931 9963605 10854453 10467249 10116206 10438418 11559588 11580058 11484568 12185517
14138 12185517 11925006 12254064 12176261 11598259 11101594 11303877 11719308 11319660 11482996
14129 11482996 10958784 10862159 10988880 11733500 11354294 10233334 10063193 10219017 11056317
14120 11056317 11420790 11819967 11870942 10602115 9594998 9947895 10485621 9106344 8881079
14111 8881079 9960742 10762658 10984559 11503443 11141559 10433392 9452707 10796435 11505795
14102 11505795 11563518 11645719 11425485 11931572 13135626 11195049 10220548 10985518 10501242
14093 10501242 10416738 11030175 11045260 11272255 12429162 10755951 11442393 11689722 13810699
14084 13810699 12546795 10928437 10185171 10535727 10794162 11712237 11806956 10830273 9712800
14075 9712800 9912905 10158393 9140254 10396369 9564738 9324579 9882613 10936289 10798093
14066 10798093 10000984 10476386 10268050 10311630 10374776 10245828 8659306 8317792 8967995
14057 8967995 10657033 11362424 10962708 10803565 11805226 10612931 9606928 9924906 10558128
14048 10558128 10846457 11453469 11205757 10891680 10931041 11898981 12347428 12183583 13375159
14039 13375159 12368330 12219524 11383746 10673492 10925594 11904165 10930931 10755881 12000756
14030 12000756 10541973 9250389 10167191 10714675 10225528 10169836 9769951 10368307 11348369
14021 11348369 12050221 11898208 11149541 11276442 11883880 12610326 11815865 12012572 12344314
14012 12344314 12153734 11436820 11958015 11808548 12027285 10974246 10677810 10718468 11644167
14003 11644167 11022229 10305296 11452237 12204775 11114654 11006306 10806731 10802872 11376760
13994 11376760 10971913 11534639 11782702 10787737 9941045 11436391 12043916 10956591 10008817
13985 10008817 11141557 11604221 11467960 11257139 9544124 11436513 11293614 11320262 11018852
13976 11018852 11410804 11649948 11089546 11084393 10636283 10696855 10267992 11550569 11308598 11392720
13966 11392720 11926115 10554278 9955391 10033625 10895858 11290293 11277846 10567410 10624889 11091789
13956 11091789 11630219 10552360 10137357 10748599 11160239 11539987 11245465 10680038 11393589
13947 11393589 12090677 11897424 12847417 12908227 12023171 11568183 12109280 11504490 11634809
13938 11634809 10256120 10169237 10651796 10524799 11920351 11696606 9882860 10421626 11283482
13929 11283482 12657430 11704741 10174485 11374927 11306453 10151058 9580823 10357988 12017106
13920 12017106 11867005 12174305 9929412 10513759 11399369 11461768 10480681 10080164 10331170
13911 10331170 11008572 10892560 10694974 10821394 11580216 11914993 10940446 10860994 11869869
13902 11869869 11785385 11343018 11255748 11696868 11650418 11770670 12006893 10978784 10521905 10959801
13892 10959801 11722792 11706462 12169756 12103108 12317705 11449125 11115287 11706179 11126706 11850880
13882 11850880 10750981 10187290 10696404 11769889 11814920 11487129 10928236 10790916 10417838
13873 10417838 10057946 10338559 11543561 11317352 10300581 10909279 10561477 10869220 11169268
13864 11169268 11867902 10962202 10757915 11555780 11556801 10717730 10841569 11678034 12170559 12312908
13854 12312908 12777840 12768102 11803486 11768145 12517791 12145545 11909218 9848236 10135665 11465217
13844 11465217 12608534 12142745 13323774 13528701 12333074 12091522 10651455 11124787 11223655
13835 11223655 10883487 9808349 11010350 12712389 11434890 11617886 11125346 12183158
13827 12183158 11891208 11153055 10890754 11272309 10595243 11077990 10707620 10905070 11396880
13818 11396880 11293333 11312845 11185871 11078119 11374861 12108252 11850552 11294257 11473058
13809 11473058 12628000 11227068 11979909 11868094 10882323 11347758 11735365 11562810 11025462
13800 11025462 10251406 11515482 12003499 11843825 11289093 9472906 8616690 9227392 11131916
13791 11131916 11396913 10402378 10435412 10682937 10877811 11783258 12575315 11662794 11477261
13782 11477261 11585909 10321427 9672271 10323934 11390204 11682131 11522535 11021962 11208642
13773 11208642 10680615 11031498 10534124 10134496 10686015 11527315 11509339 12190069 11709318
13764 11709318 10644995 9950168 10541328 11733998 12397100 11503418 10836944 11898237 11832080
13755 11832080 11346506 10459930 10440451 10431222 11612106 11986397 11510350 11560042 12259456 11521279
13745 11521279 11249993 12212755 12782573 12402959 11992021 11265851 10398271 11204619 11264831
13736 11264831 11315834 12366488 12640093 12093897 10740774 10468841 11074827 11134133 10913035
13727 10913035 11850324 11564731 11078476 11013997 11494563 11942807 11202089 10299313 11384222
13718 11384222 11370486 11540910 12304479 11765980 12176610 11510623 10814636 10103204 10277810
13709 10277810 10684013 10160568 9868691 10922742 11282878 11433298 11387566 11751332 12938874
13700 12938874 11986970 11332576 10329685 10083864 11822966 11559490 11438733 12354012 11219650
13691 11219650 10535950 10426396 10995252 11689801 10475805 9548631 10538842 10941378 10780622
13682 10780622 10166039 10530537 11958068 12579606 11874139 12834916 12374801 12323439 12571170
13673 12571170 12355561 11773925 12398934 13269499 11693563 11077564 11365173 10796660 10892026
13664 10892026 11608953 12407462 13320351 11192700 10735245 11634796 10863020 11666299 12244412
$$ [...]
##END NTUPLES=NMR SPECTRUM
##END=
