##TITLE=1H_TG-2363-X1
 DMSO
 8 sc, 
 24.10.2022
##JCAMPDX= 6.0         $$ Bruker NMR JCAMP-DX V2.0
##DATA TYPE= NMR SPECTRUM
##DATA CLASS= NTUPLES
##ORIGIN= UXNMR, Bruker Analytische Messtechnik GmbH
##OWNER= root
$$ XWIN-NMR		Version 3.5
$$ Mon Oct 24 14:45:17 2022 Russian Standard Time (UT+4h)  she@DPX200
##.OBSERVE FREQUENCY= 200.1313499994
##.OBSERVE NUCLEUS= ^1H
##.ACQUISITION MODE= SIMULTANEOUS
##.ACQUISITION SCHEME= undefined
##.AVERAGES= 8
##.DIGITISER RES= 18
##SPECTROMETER/DATA SYSTEM= spect
##.PULSE SEQUENCE= zg30
##.SOLVENT NAME= DMSO
##.SHIFT REFERENCE= (INTERNAL, DMSO, 0, 15.7513)
##AUDIT TRAIL= $$ (NUMBER, WHEN, WHO, WHERE, WHAT)
$$ ##TITLE= Audit trail, XWIN-NMR		Version 3.5
$$ ##JCAMPDX= 5.01
$$ ##ORIGIN= Bruker BioSpin GmbH
$$ ##OWNER= she
$$ F:/spectra/data/she/nmr/H-F/1/pdata/1/auditp.txt
$$ ##AUDIT TRAIL=  $$ (NUMBER, WHEN, WHO, WHERE, WHAT)
(   1,<2022-10-24 14:43:57.60 +0400>,<she>,<DPX200>,
      <created by zg, POWCHK disabled, PULCHK disabled
       configuration hash MD5:
       00 E9 B6 7A A2 85 ED C7 34 08 36 98 17 FE 4E 26
       data hash MD5: 16K
       D2 71 15 07 C8 54 72 E0 A4 34 8E E8 41 B3 28 DD>)
(   2,<2022-10-24 14:44:00.93 +0400>,<she>,<DPX200>,
      <Start of raw data processing
       efp BC_mod = 2 LB = 0.24 FT_mod = 6 PKNL = 1 PHC0 = -18032.74 PHC1 = 8.6007 SI = 16K 
       data hash MD5: 16K
       3F AC E6 B6 12 95 C6 1F 84 18 AC 01 13 01 E1 19>)
(   3,<2022-10-24 14:44:20.51 +0400>,<she>,<DPX200>,
      <pk PHC0 = -4.6849 PHC1 = 3.8 
       data hash MD5: 16K
       40 D0 4C A6 67 01 5C 38 04 4B B4 32 DB 39 DC 9C>)
(   4,<2022-10-24 14:44:23.93 +0400>,<she>,<DPX200>,
      <abs ABSG = 5 
       data hash MD5: 16K
       F9 D3 FE F0 2C 58 EA 28 1E 52 6D 31 68 20 0B C5>)
$$ ##END=
$$ 
$$ hash MD5
$$ 04 8E 17 53 CE AB AA 7A 62 2B 25 7E 3A F8 AE 38
##$RELAX= 
##$RELAX= 
##$RELAX= 
##$RELAX= 
##$RELAX= 
##$RELAX= 
$$ Bruker specific parameters
$$ --------------------------
##$DU= <F:/spectra>
##$EXPNO= 1
##$NAME= <H-F>
##$PROCNO= 1
##$TYPE= <nmr>
##$USER= <she>
##$AMP= (0..31)
100 100 100 100 100 100 100 100 100 100 100 100 100 100 100 100 100 100 
100 100 100 100 100 100 100 100 100 100 100 100 100 100 
##$AQSEQ= 0
##$AQ_mod= 1
##$AUNM= <au_zg>
##$AUTOPOS= <>
##$BF1= 200.13
##$BF2= 200.13
##$BF3= 200.13
##$BF4= 200.13
##$BF5= 200.13
##$BF6= 200.13
##$BF7= 200.13
##$BF8= 200.13
##$BYTORDA= 1
##$CFDGTYP= 0
##$CFRGTYP= 5
##$CHEMSTR= <none>
##$CNST= (0..31)
1 1 145 1 1 1 1 1 1 1 1 1 1 1 1 1 1 1 1 1 1 1 1 1 1 1 1 1 1 1 1 1 
##$CPDPRG= <>
##$CPDPRG1= <>
##$CPDPRG2= <>
##$CPDPRG3= <>
##$CPDPRG4= <mlev>
##$CPDPRG5= <mlev>
##$CPDPRG6= <mlev>
##$CPDPRG7= <mlev>
##$CPDPRG8= <mlev>
##$CPDPRGB= <>
##$CPDPRGT= <>
##$D= (0..31)
0 1.2 0 0 0 0 0 0 0 0.06 0 0.03 0 0 0 0 0.0002 0 0 0 0 0 0 0 0 0 0 0 0 
0 0 0 
##$DATE= 1666608237
##$DBL= (0..7)
120 120 120 120 120 120 120 120 
##$DBP= (0..7)
150 150 150 150 150 150 150 150 
##$DBP07= 0
##$DBPNAM0= <>
##$DBPNAM1= <>
##$DBPNAM2= <>
##$DBPNAM3= <>
##$DBPNAM4= <>
$$ [...]
##$SUBNAM3= <"">
##$SUBNAM4= <"">
##$SUBNAM5= <"">
##$SUBNAM6= <"">
##$SUBNAM7= <"">
##$SUBNAM8= <"">
##$SUBNAM9= <"">
##$SW= 18.0517283424941
##$SWIBOX= (0..15)
0 0 2 0 0 0 0 0 0 0 0 0 0 0 0 0 
##$SW_h= 3612.71676300578
##$TD= 16384
##$TD0= 1
##$TE= 0
##$TE2= 300
##$TE3= 300
##$TEG= 300
##$TL= (0..7)
0 120 120 120 120 120 120 120 
##$TP= (0..7)
150 150 150 150 150 150 150 150 
##$TP07= 0
##$TPNAME0= <>
##$TPNAME1= <>
##$TPNAME2= <>
##$TPNAME3= <>
##$TPNAME4= <>
##$TPNAME5= <>
##$TPNAME6= <>
##$TPNAME7= <>
##$TPOAL= (0..7)
0.5 0.5 0.5 0.5 0.5 0.5 0.5 0.5 
##$TPOFFS= (0..7)
0 0 0 0 0 0 0 0 
##$TUNHIN= 0
##$TUNHOUT= 0
##$TUNXOUT= 0
##$USERA1= <user>
##$USERA2= <user>
##$USERA3= <user>
##$USERA4= <user>
##$USERA5= <user>
##$V9= 5
##$VALIST= <valist>
##$VCLIST= <CCCCCCCCCCCCCCC>
##$VD= 0
##$VDLIST= <DDDDDDDDDDDDDDD>
##$VPLIST= <PPPPPPPPPPPPPPP>
##$VTLIST= <TTTTTTTTTTTTTTT>
##$WBST= 1024
##$WBSW= 4
##$XGAIN= (0..3)
0 0 0 0 
##$XL= 0
##$YL= 0
##$YMAX_a= 54517
##$YMIN_a= -119193
##$ZGOPTNS= <>
##$ZL1= 120
##$ZL2= 120
##$ZL3= 120
##$ZL4= 120
##$ABSF1= 15.73257
##$ABSF2= -2.31928
##$ABSG= 5
##$ABSL= 3
##$ALPHA= 0
##$AQORDER= 0
##$ASSFAC= 0
##$ASSFACI= 0
##$ASSFACX= 0
##$ASSWID= 0
##$AUNMP= <proc_1d>
##$AZFE= 0.1
##$AZFW= 0.1
##$BCFW= 0
##$BC_mod= 2
##$BYTORDP= 0
##$COROFFS= 0
##$CY= -3
##$DATMOD= 1
##$DC= 0
##$DFILT= <>
##$DTYPP= 0
##$F1P= 0
##$F2P= 0
##$FCOR= 1
##$FTSIZE= 16384
##$FT_mod= 6
##$GAMMA= 0
##$GB= 0
##$INTBC= 1
##$INTSCL= 3.70164e-10
##$ISEN= 128
##$LB= 0.24
##$LEV0= 0
##$LPBIN= 0
##$MAXI= 10000
##$MC2= 0
##$MEAN= 0
##$ME_mod= 0
##$MI= 1.114404
##$NCOEF= 0
##$NC_proc= -9
##$NLEV= 6
##$NOISF1= 3.799351
##$NOISF2= 2.8
##$NSP= 0
##$NTH_PI= 0
##$NZP= 0
##$OFFSET= 15.7513
##$PC= 1
##$PHC0= -18037.43
##$PHC1= 12.4007
##$PH_mod= 1
##$PKNL= yes
##$PPARMOD= 0
##$PSCAL= 0
##$PSIGN= 0
##$REVERSE= no
##$SF= 200.130004050795
##$SI= 16384
##$SIGF1= 3
##$SIGF2= 2
##$SINO= 5.538805
##$SIOLD= 16384
##$SREGLST= <1H.CDCl3>
##$SSB= 0
##$STSI= 16384
##$STSR= 0
##$SW_p= 3612.71676300578
##$SYMM= 0
##$S_DEV= 0
##$TDeff= 16384
##$TDoff= 0
##$TI= <>
##$TILT= no
##$TM1= 0
##$TM2= 0
##$TOPLEV= 0
##$USERP1= <user>
##$USERP2= <user>
##$USERP3= <user>
##$USERP4= <user>
##$USERP5= <user>
##$WDW= 1
##$XDIM= 16384
##$YMAX_p= 285003321
##$YMIN_p= -2842505
$$ End of Bruker specific parameters
$$ ---------------------------------
##NTUPLES= NMR SPECTRUM
##VAR_NAME=  FREQUENCY,     SPECTRUM/REAL,   SPECTRUM/IMAG
##SYMBOL=    X,             R,               I
##VAR_TYPE=  INDEPENDENT,   DEPENDENT,       DEPENDENT
##VAR_FORM=  AFFN,          ASDF,            ASDF
##VAR_DIM=   16384,         16384,           16384
##UNITS=     HZ,            ARBITRARY UNITS, ARBITRARY UNITS
##FACTOR=    0.220516191357247, 1,           1
##FIRST=     3152.30770440549, 0,            0
##LAST=      -460.409058600289, 0,           0
##MIN=       -460.409058600289, -2842505,    0
##MAX=       3152.30770440549, 285003321,    0
$$ Real data points
##PAGE= N=1
##DATA TABLE= (X++(R..R)), XYDATA
$$ [...]
$$ plain form
7125 -833713 87389 225140 752325 320569 -154789 1071010 1672991 790786 -8146 169799
7115 169799 -286998 -753292 -695303 -504544 429939 495968 815261 873695 461106 12797
7105 12797 -871174 310206 1147764 105054 -191284 -644311 -543552 197798 65351 -375706
7095 -375706 -1416903 -209854 713032 -84653 -836672 -1297671 -1330072 -68995 -480051
7086 -480051 275022 468082 315520 678217 273030 -35044 -423622 -437753 286312 1014858
7076 1014858 324512 178630 -808662 -55652 888236 406063 1388377 38287 24096 212292
7066 212292 -529008 -283959 -280522 238494 -32967 -18718 31252 -288529 -452936 209196
7056 209196 -937176 -338849 -41737 300636 -249559 -670613 -350299 805901 633554
$$ packed form
7125h33713R21102J37751N27185m31756m75358J225799O01981q82205p98932J77945
7115A69799m56797m66294N7989J90759R34483O6029L19293N8434m12589m48309
7105A2797q83971J181380Q37558j042710k96338m53027J00759P41350j32447m41057
7095c75706j041197J207049R22886p97685p52019m60999l2401J261077m11056
7086d80051P55073J93060j52562L62697m05187l08074l88578j4131P24065P28546
7076A014858o90346j45882r87292P53010R43888m82173R82314j350090j4191J88196
7066B12292p41300K45049L437N19016k71461J4249M9970l19781j64407O62132
7056B09196j146372N98327K97112L42373n50195m21054L20314J156200j72347
$$ plain form
7047 633554 192523 191385 582547 789917 770596 425326 694172 138962 -514960 -686799
7037 -686799 -322065 154994 445855 817911 416613 -51625 1032377 833333 -272818
7028 -272818 -345536 -195275 -397961 -276066 153300 990674 1173363 1038027 700259 346942
7018 346942 709860 744418 431220 405257 1415756 1757999 1780460 843135 768198 310665
7008 310665 927906 1252009 1119520 1020879 731054 -842300 -643920 181024 281799 502407
6998 502407 1529770 1369147 972405 434964 1114260 500291 -255098 -12859 401120 104736
6988 104736 -430860 -820210 200107 13976 571466 367811 35092 -500751 -72796 134796
6978 134796 422928 670526 -269306 -792531 -577513 -179592 394216 338713 201401 364371
$$ packed form
7047F33554m41031j138L91162K07370j9321l45270K68846n55210o53922j71839
7037f86799L64734M77059K90861L72056m01298m68238J084002j99044j106151
7028b72818p2718J50261k02686J21895M29366Q37374J82689j35336l37768l53317
7018C46942L62918L4558l13198k5963J010499L42243K2461r37325p4937m57533
7008C10665O17241L24103j32489r8641k89825j573354J98380Q24944J00775K20608
6998E02407J027363j60623l96742n37441O79296o13969p55389K42239M13979k96384
6988A04736n35596l89350J020317j86131N57490k03655l32719n35843M27955K07592
6978A34796K88132K47598r39832n23225K15018L97921N73808n5503j37312J62970
$$ plain form
6968 364371 117501 -272807 -399625 249510 -437613 -402495 603761 56961 33937 285567
6958 285567 -77243 522996 171574 609531 1539895 1590532 1964778 1289951 628994 1033937
6948 1033937 905406 1525426 313311 -74465 -125665 -831819 -948447 -390877 -230183 -60779
6938 -60779 -94872 197106 1339012 1329626 -465732 926473 1449830 510885 -56063 417912
6928 417912 927795 631470 -271247 -441799 -1715304 -173679 86461 -358352 -267943 80897
6918 80897 -882890 -1496373 -1172696 -54113 632271 -310156 -1193125 -178250 -120583 -357052
6908 -357052 -348672 513563 679838 819972 321076 515995 672392 -1055585 -398487 -757219
6898 -757219 -730921 224338 257682 497049 900895 517348 576681 292438 734821 564076
$$ packed form
6968C64371k46870l90308j26818O49135o87123L5118J006256n46800k3024K51630
6958B85567l62810O00239l51422M37957R30364N0637L74246o74827o60957M04943
6948A033937j28531O20020j212115l87776n1200p06154j16628N57570J60694J69404
6938f0779l4093K91978J141906r386j795358J392205N23357r38945n66948M73975
6928D17912N09883k96325r02717j70552j273505J541625K60140m44813R0409L48840
6918H0897r63787o13483L23677J118583O86384r42427q82969J014875N7667k36469
6908c57052Q380Q62235J66275J40134m98896J94919J56397j727977O57098l58732
6898g57219K6298R55259L3344K39367M03846l83547N9333k84243M42383j70745
$$ plain form
6888 564076 675647 106103 437389 420613 954422 1115387 1019514 599657 94041 1108158
6878 1108158 647510 487380 254430 150589 230515 -48316 -483174 -1009549 -307977 148922
6868 148922 -29906 449086 841240 623615 1351849 1645832 194367 -423336 555925 -457915
6858 -457915 26340 465389 141494 449159 1666174 1098653 1155938 183488 -770767 75497
6848 75497 394974 -92855 -266060 -111648 -290868 -725351 -400966 -99354 -961839 -8168
6838 -8168 -882548 -446516 1122067 216785 -1004004 -797407 387189 -392527 -30687 51702
6828 51702 105416 590781 927947 59292 770591 71126 -646299 -581694 247091 656820
6818 656820 338062 656098 472537 231682 167317 -380680 -1184427 -1311184 -506245 -766153
$$ packed form
6888E64076J11571n69544L31286j6776N33809J60965r5873m19857n05616J014117
6878A108158m60648j60130k32950j03841P9926k78831m34858n26375P01572M56899
6868A48922j78828M78992L92154k17625P28234K93983j451465o17703R79261j013840
6858d57915M84255M39049l23895L07665J217015n67521N7285r72450r54255Q46264
6848G5497L19477m87829j73205J54412j79220m34483L24385L01612q62485R53671
6838h168q74380M36032J568583r05282j220789K06597J184596p79716L61840Q2389
6828E1702N3714M85365L37166q68655P11299o99465p17425O4605Q28785M09729
6818F56820l18758L18036j83561k40855o4365n47997q03747j26757Q04939k59908
$$ plain form
6808 -766153 -1177077 112048 353383 -160187 -354686 -462089 148675 -46190 406757 1009600
6798 1009600 904140 1219587 118026 1051861 588605 -7474 -1187662 -1098925 -661485
6789 -661485 -545677 120025 -255222 -315692 -538755 -852272 -408159 372531 615916 87780
6779 87780 -50863 782389 -23821 71691 552798 -72158 -330622 -1317548 -915209 -823849
6769 -823849 -186323 -1010435 -855705 -204163 20451 -85503 -142196 269692 565676 128905
6759 128905 -871272 -1048080 -721642 -796101 -344851 87620 -348297 267594 1516362 1802457
6749 1802457 1399231 1296289 177919 -581546 -427073 -82086 -325277 669902 686825 284052
6739 284052 -134844 -279642 -71666 181072 939991 651566 1059145 1828534 604979 1077286
$$ packed form
6808g66153m10924J289125K41335n13570j94499j07403O10764j94865M52947O02843
6798A009600j05460L15447j101561R33835m63256n96079j180188Q8737M37440
6789f61485J15808O65702l75247o0470k23063l13517M44113P80690K43385n28136
6779H7780j38643Q33252q06210R5512M81107o24956k58464r86926M02339R1360
6769h23849O37526q24112J54730O51542K24614j05954n6693M11888K95984m36771
6759A28905j000177j76808L26438p4459M51250M32471m35917O15891J248768K86095
6749A802457m03226j02942j118370p59465J54473L44987k43191R95179J6923m02773
6739B84052m18896j44798K07976K52738P58919k88425M07579P69389j223555M72307
$$ plain form
6729 1077286 1627654 1468229 518494 516828 1202619 683666 333014 -536944 -593031 -650459
6719 -650459 -374390 -196283 375494 771819 432757 622017 301029 -242886 -635102 -762174
6709 -762174 120498 141523 -39005 340639 176958 -413597 170411 633890 540060 808000
6699 808000 2061874 1469661 941383 52425 -290905 -100247 968714 911620 29133 363962
6689 363962 293565 -809782 -1155309 -805216 -1197733 -964742 -211205 -312702 182637 244858
6679 244858 762962 -34873 -401950 481853 -422908 -1145107 -319560 -368394 -239701 -552842
6669 -552842 -584115 -491831 -170868 -146293 -231238 38405 -67780 419368 97133 -235267
6659 -235267 86081 -369984 280464 363324 415734 1462837 410534 -1182808 -1318066 -471732
$$ packed form
6729A077286N50368j59425r49735j666O85791n18953l50652q69958n6087n7428
6719f50459K76069J78107N71777L96325l39062J89260l20988n43915l92216j27072
6709g62174Q82672K1025j80528L79644j63681n90555N84008M63479r3830K67940
6699H08000J253874n92213n28278q88958l43330J90658J068961n7094q82487L34829
6689C63962p0397j103347l45527L50093l92517K32991P53537j01497M95339O2221
6679B44858N18104p97835l67077Q83803r04761p22199Q25547m8834J28693l13141
6669e52842l1273R2284L20963K4575q4945K69643j06185M87148l22235l32400
6659b35267L21348m56065O50448Q2860N2410J047103j052303j593342j35258Q46334
$$ plain form
6649 -471732 -910213 531118 681264 270804 -778602 -547885 207613 307407 381676 -316001
6639 -316001 -902691 249464 595196 345495 91739 568387 325562 -163290 -148516 222857
6629 222857 330836 811425 714065 399634 685552 1410262 27805 -3175 855904 1344017
6619 1344017 921757 1071893 1146481 -582143 -727621 165660 -256609 -437111 -773631 859261
6609 859261 1070012 1035597 1518011 901005 -319760 -359757 -77727 -268488 -589678 -604689
6599 -604689 -453181 -914130 -888473 50117 594811 92244 -129411 421366 1064861 1055924
6589 1055924 1062014 259997 1247725 1020652 362424 605541 443018 888169 1208252 418785
6579 418785 832736 692243 637729 1845472 1816887 541852 681058 -327984 -1268565 -454563
$$ packed form
6649d71732m38481J441331J50146m10460j049406K30717P55498R9794P4269o97677
6639c16001n86690J152155L45732k49701k53756M76648k42825m88852J4774L71373
6629B22857J07979M80589r7360l14431K85918P24710j382457l0980Q59079M88113
6619A344017m22260J50136P4588j728624j45478Q93281m22269j80502l36520J632892
6609H59261K10751l4415M82414o17006j220765l9997K82030j90761l21190j5011
6599f04689J51508m60949K5657R38590N44694n02567k21655N50777O43495q937
6589A055924O090q02017R87728k27073o58228K43117j62523M45151L20083p89467
6579D18785M13951j40493n4514J207743k8585j275035J39206j009042r40581Q14002
$$ plain form
6569 -454563 245412 948306 574665 84019 -174498 113308 1190347 1019618 1211635 963252
6559 963252 148832 267863 1048157 1248112 1308868 1321127 1229182 377528 1322007 1095107
6549 1095107 1385045 1223936 1278529 1577198 1214781 806997 868782 2440917 706209 134801
6539 134801 310918 -153772 -319457 -415775 -114157 -344138 -592668 -774225 60721 1141815
6529 1141815 1781317 1090934 522251 694345 128615 -65457 -45734 -126075 302771 -394971
6519 -394971 -833837 -997281 -1078517 533327 732294 386863 412452 -495607 -501131 -8137
6509 -8137 618584 -611576 903143 1103642 528911 314963 156119 700418 63351 -3020
6499 -3020 -157058 -39816 122080 691582 970316 1367685 1157883 690706 572100 33575
$$ packed form
6569d54563O99975P02894l73641m90646k58517K87806J077039j70729J92017k48383
6559I63252q14420J19031P80294J99955O0756J2259r1945q51654R44479k26900
6549A095107K89938j61109N4593K98669l62417m07784O1785J572135j734708n71408
6539A34801J76117m64690j65685r6318L01618k29981k48530j81557Q34946J081094
6529A141815O39502o90383n68683J72094n65730j94072J9723q0341M28846o97742
6519c94971m38866j63444q1236J611844J98967l45431K5589r08059n524M92994
6509h137O26721j230160J514719K00499n74731k13948j58844N44299o37067o6371
6499c020j54038J17242J61896N69502K78734L97369k09802m67177j18606n38525
$$ plain form
6489 33575 211054 238210 288457 797246 394767 43448 824813 1715157 1421952 699964
6479 699964 324753 342329 441023 -440848 -856705 -27936 587152 833576 1478869 1462182
6469 1462182 1428461 1119584 566347 649200 885667 85265 -23509 764712 616317 1153472
6459 1153472 525338 934298 1537001 208390 424735 176424 355758 904720 518488
6450 518488 -192194 977305 911597 750846 1217416 1489751 1219484 471737 992196 -47978
6440 -47978 351314 -167605 -179987 138512 20502 509932 49422 -318919 417077 699105
6430 699105 800256 1760041 1457975 715861 996838 820763 1229333 1267185 1339068 891005
6420 891005 1394350 989435 976877 193289 650731 793818 392590 714473 846740 1461668
$$ packed form
6489C3575J77479K7156N0247N08789m02479l51319P81365Q90344k93205p21988
6479F99964l75211J7576R8694q81871m15857Q28769O15088K46424O45293j6687
6469A462182l3721l08877n53237Q2853K36467q00402j08774P88221j48395N37155
6459A153472o28134M08960O02703j328611K16345k48311J79334N48962l86232
6450E18488p10682J169499o5708j60751M66570K72335k70267p47747N20459j040174
6440d7978L99292n18919j2382L18499j18010M89430m60510l68341P35996K82028
6430F99105J01151R59785l02066p42114K80977j76075M08570L7852P1883m48063
6420H91005N03345m04915j2558p83588M57442J43087m01228L21883J32267O14928
$$ plain form
6410 1461668 1500958 1162855 1290509 130511 1390332 2144331 377969 229743 797664
6401 797664 535882 960599 590937 402724 90941 658373 1058819 464191 -298082 -1292563
6391 -1292563 -186018 280965 987179 728927 930390 912895 937107 1289413 310034 775159
6381 775159 60857 -405777 -298198 1107191 1071074 -374205 -574919 -370199 -424470 725413
6371 725413 1649995 1235928 136302 -530517 309354 278711 850843 1148759 992367 592530
6361 592530 803705 1343248 875188 -261877 382352 73796 -502492 -289706 472735 522692
6351 522692 1716334 2531826 1829478 1141817 501562 340436 181026 -353288 471857 873251
6341 873251 1240611 856008 641281 675130 479203 319222 210683 1129682 1299395 1607671
$$ packed form
6410A461668L9290l38103J27654j159998J259821P53999j766362j48226N67921
6401G97664k61782M24717l69662j88213l11783N67432M00446n94628p62273r94481
6391a292563J106545M66983P06214k58252K01463j7495K4212L52306r79379M65125
6381G75159p14302m66634J07579J405389l6117j445279k00714K04720n4271J149883
6371G25413R24582m14067j099626o66819Q39871l0643N72132K97916j56392l99837
6361E92530K11175N39543m68060j137065O44229l08556n76288K12786P62441M9957
6351E22692J193642Q15492p02348o87661o40255j61126j59410n34314Q25145M01394
6341H73251L67360l84603k14727L3849j95927j59981j08539R18999J69713L08276
$$ plain form
6331 1607671 1497061 1491008 1093201 756823 688600 447974 582936 1131498 1838418 1170459
6321 1170459 1545709 1610489 983865 751544 1336916 1073522 797806 1272293 1471485 1540107
6311 1540107 1899658 744505 1476464 2053105 1871526 1944439 1807139 2421114 2577023 1578662
6301 1578662 572267 1595952 1544055 663601 1242509 1578451 1830933 1356343 1326964 1692893
6291 1692893 1632284 2404930 2757918 1764990 1796106 1640287 1739195 2200460 2036065 979451
6281 979451 1535200 1906556 1766716 1947960 2077852 1921607 1937243 1474986 970543 990496
6271 990496 1763089 2140799 1393734 1375496 1502692 1422065 611076 991263 2252909 2315870
6261 2315870 1766533 2746674 1733658 1047170 2497431 2466509 1550336 1293519 1498030
$$ packed form
6331A607671j10610o053l97807l36378o8223k40626J34962N48562P06920o67959
6321A170459L75250O4780o26624k32321N85372k63394k75716M74487J99192O8622
6311A540107L59551j155153P31959N76641j81579P2913j37300O13975J55909r98361
6301A578662j006395J023685n1897q80454N78908L35942K52482m74590k9379L65929
6291A692893o0609P72646L52988r92928L1116j55819R8908M61265j64395j056614
6281I79451N55749L71356j39840J81244J29892j56245J5636m62257n04443J9953
6271I90496P72593L77710p47065j8238J27196q0627q10989L80187J261646O2961
6261B315870n49337R80141j013016o86488J450261l0922r16173k56817K04511
$$ plain form
6252 1498030 1742531 2224893 2255208 1693970 3274092 2817481 1295171 925921 362147
6243 362147 322814 148515 1049375 1905074 2606409 2772174 2471823 2397427 2299442 1664777
6233 1664777 730284 1194986 1396998 1495890 1574856 1222300 1877489 2178939 1950974 2163239
6223 2163239 1954343 1747439 847099 1322251 1682280 1953285 2174349 1832153 1853647 1608164
6213 1608164 1470749 2521165 2445691 2474867 2919400 2876346 2411634 3003129 2808658 2215979
6203 2215979 1659507 1906748 2072952 2411667 1669026 1603199 662615 2019610 1236485 786098
6193 786098 1049901 1093218 1805642 1955083 1975379 3044018 1927156 1610651 3140308 2408690
6183 2408690 2522836 2328182 1830782 2144864 2533830 2185198 2565604 3173019 3608029 3825129
$$ packed form
6252A498030K44501M82362L0315n61238J580122m56611j522310l69250n63774
6243C62147l9333j74299R00860Q55699P01335J65765l00351p4396r7985o34665
6233A664777r34493M64702K02012R8892P8966l52556O55189L01450k27965K12265
6223B163239k08896k06904r00340M75152L60029K71005K21064l42196K1494k45483
6213A608164j37415J050416p5474K9176M44533m3054m64712N91495j94471n92679
6203B215979n56472K47241J66204L38715p42641o5827r40584J356995p83125m50387
6193G86098K63803M3317P12424J49441K0296J068639j116862l16505J529657p31618
6183B408690J14146j94654m97400L14082L88966l48632L80406O07415M35010K17100
$$ plain form
6173 3825129 3088920 2506108 1865121 1620250 1961502 2067544 3138016 3595698 3294696
6164 3294696 2943164 2484427 1863933 1450233 971514 1261347 1030821 1608922 2135819 1757385
6154 1757385 1631228 2970080 2500837 2446766 1384406 1632620 2571361 1833080 1649970
6145 1649970 2735016 2542823 2118796 2704265 3260950 2582123 2476170 2580915 2895131
6136 2895131 2554111 3201440 3082480 2000630 1974529 2281506 3335128 3231136 3025646
6127 3025646 3130094 2386500 2946261 2933449 2452734 2474074 3021035 2784472 3486859 3955040
6117 3955040 4049261 3854322 4456122 3132471 3338379 3717224 3265261 3644152 2929992 3180798
6107 3180798 3590099 3174609 3169594 3018178 2942509 3724554 3741598 3312615 2368244 2764193
$$ packed form
6173C825129p36209n82812o40987k44871L41252J06042J070472M57682l01002
6164C294696l51532m58737o20494m13700m78719K89833k30526N78101N26897l78434
6154A757385j26157J338852m69243n4071j062360K48214R38741p38281j83110
6145A649970J085046j92193m24027N85469N56685o78827j05953J04745L14216
6136B895131l41020O47329j18960j081850k6101L06977J053622j03992k05490
6127C025646J04448p43594N59761j2812m80715K1340N46961k36563P02387M68181
6117C955040R4221j94939O01800j323651K05908L78845m51963L78891p14160K50806
6107C180798M09301m15490n015j51416p5669P82045J7044m28983r44371L95949
$$ plain form
6097 2764193 3489540 3614745 3485976 3834037 2894082 2755856 3131785 2840397 3821977 3623176
6087 3623176 3866729 4155955 3476487 2958936 3187780 3773206 3120660 4379257 3723238
6078 3723238 3495423 2668641 3067471 3868492 3087731 2805681 3481845 3505468 3039213 3777244
6068 3777244 4509258 4820957 4922383 4623699 5018985 4522743 4118621 5496421 5432222 4860753
6058 4860753 5368715 5904289 5796698 5822774 5285890 5164377 5287301 5384629 5226914 5966087
6048 5966087 4944946 4630013 5579027 6575850 5962993 6169283 5863514 5538024 5874900
6039 5874900 5335027 6075292 5528169 6342957 6949127 6348683 6310162 6866937 6568934 6697228
6029 6697228 6551319 5794726 5837455 6493780 6502113 7391314 6956193 5839561 5770753 5938788
$$ packed form
6097B764193P25347J25205j28769L48061r39955j38226L75929k91388R81580j98801
6087C623176K43553K89226o79468n17551K28844N85426o52546J258597o56019
6078C723238k27815q26782L98830Q01021p80761k82050O76164K3623m66255P38031
6068C777244P32014L11699J01426k98684L95286m96242m04122J377800o4199n71469
6058D860753N07962N35574j07591K6076n36884j21513J22924R7328j57715P39173
6048E966087j021141l14933R49014R96823o12857K06290l05769l25490L36876
6039E874900n39873P40265n47123Q14788O06170o00444l8521N56775k98003J28294
6029F697228j45909p56593M2729O56325Q333Q89201m35121j116632o8808J68035
$$ plain form
6019 5938788 6783564 5890735 6082497 6459864 7153843 7297902 8135540 8057932 8517283 8227135
6009 8227135 7691291 8682104 7689965 8707738 9590682 9253900 8171637 8323457 7901363
6000 7901363 9366360 9461394 9444326 10086970 10791384 9968869 10136594 10313623 10811169 10794920
5990 10794920 11011850 11092014 10940945 11226672 11851519 12978053 13828288 14153558 13695930
5981 13695930 13549755 13230279 13667167 14985197 16404952 16417851 15205789 15813741 17271024
5972 17271024 18277178 17423932 16708213 17639218 18604330 19498611 19214597 19907524 19833864
5963 19833864 19859864 19833556 20162280 19389174 19916448 20829499 20127795 20641535 20696556 20696381
5953 20696381 21546837 22141782 21911648 21377088 22300358 21954783 22490783 22091545 22845576
$$ packed form
6019E938788Q44776q92829J91762L77367O93979J44059Q37638p7608M59351k90148
6009H227135n35844R90813r92139J017773Q82944l36782j082263J51820m22094
6000G901363J464997R5034j7068O42644P04414q22515J67725J77029M97546j6249
5990A0794920K16930Q0164j51069K85727O24847J126534Q50235L25270m57628
5981A3695930j46175l19476M36888J318030J419755J2899j212062O07952J457283
5972A7271024J006154q53246p15719R31005R65112Q94281k84014O92927p3660
5963A9833864K6000k6308L28724p73106N27274R13051p01704N13740N5021j75
5953B0696381Q50456N94945k30134n34560R23270l45575N36000l99238P54031
$$ plain form
5944 22845576 22798622 22278005 21789502 22063233 22569955 21504384 23547557 23704238 23103593
5935 23103593 23489162 22591744 23244572 23448748 23872467 24879863 24642524 25381646 24905130
5926 24905130 24601637 25281943 24950137 24718110 25091059 24270323 24827547 26235154 26238618 25594703
5916 25594703 25653327 26568185 26257545 27101353 26641700 26773229 26191118 26600662 27855097
5907 27855097 28512281 27962257 26524697 26956674 27743877 28531511 28495982 28468795 28343737 28886863
5897 28886863 29697113 30190788 31423987 31269557 31682393 32773038 33983787 34766212 35749474
5888 35749474 37089899 38249842 39898690 42697015 45118881 48394343 50819314 53189690
5880 53189690 56176809 59181008 62140991 65195083 66447697 67200818 68853075 67865194
$$ packed form
5944B2845576m6954n20617m88503K73731N06722j065571K043173J56681o00645
5935B3103593L85569q97418O52828K04176M23719J007396k37339P39122m76516
5926B4905130l03493O80306l31806k32027L72949q20736N57224J407607L464o43915
5916B5594703N8624R14858l10640Q43808m59653J31529n82111M09544J254435
5907B7855097O57184n50024j437560M31977P87203P87634l5529k7187j25058N43126
5897B8886863Q10250M93675J233199j54430M12836J090645J210749P82425R83262
5888C5749474J340425J159943J648848K798325K421866L275462K424971K370376
5880E3189690K987119L004199K959983L054092J252614P53121J652257r87881
$$ plain form
5872 67865194 67538333 65708641 64136077 61742754 59291853 57532665 54974709 53411007
5864 53411007 52242820 50745877 50146806 49727108 49728696 49402284 50401124 50070799 49546120
5855 49546120 48371907 48331753 48418310 47776156 46598403 44406869 43104028 41278945 40123051
5846 40123051 38587080 36189942 34204892 32112375 31065657 29547875 27520633 27455947
5838 27455947 26774395 25170275 24729811 23849747 23189887 23090929 22538252 21864033 22272403
5829 22272403 22235189 21879598 21452079 20555806 19920935 18313834 18350670 17903237 18632500 18934965
5819 18934965 18927140 19189276 18933890 18769277 17700278 16684190 17234113 16795899 16884337 16048772
5809 16048772 16629709 16494273 16291971 16683388 16360754 16527861 16387377 16769287 17097868
$$ packed form
5872F7865194l26861j829692j572564k393323k450901j759188k557956j563702
5864E3411007j168187j496943n99071m19698J588l26412R98840l30325n24679
5855D9546120j174213m0154Q6557o42154j177753k191534j302841j825083j155894
5846D0123051j535971k397138j985050k092517j046718j517782k027242o4686
5838B7455947o81552j604120m40464q80064o59860r8958n52677o74219M08370
5829B2272403l7214l55591m27519q96273o34871j607101L6836m47433P29263L02465
5819A8934965p825K62136k55386j64613j068999j016088N49923m38214Q8438q35565
5809A6048772N80937j35436k02302L91417l22634J67107j40484L81910L28581
$$ plain form
5800 17097868 17159403 17332182 17437694 17089907 17002087 16787818 17065372 16777675 17208263 16817021
5790 16817021 16284679 16420140 16245951 17070055 17198469 16732193 16020378 15989012 17269066
5781 17269066 16790112 15982961 17131852 18115575 18485773 18836021 17891154 17408477 17473325
5772 17473325 18138412 17470655 17346354 16230751 17179703 18728748 20010744 18689671 18536278
5763 18536278 19122694 17916094 18226504 17910056 17152569 17390379 17850366 18617500 19029404
5754 19029404 19021313 19748485 21397191 20597149 20726495 20556154 21087386 21084034 20309080 20513235
5744 20513235 20716219 21935592 21523125 22057394 21983765 22618979 22805785 22285171 22743107
5735 22743107 23063492 22748347 23644274 24384360 24178675 24513816 25163877 25062988 25448303
$$ packed form
5800A7097868O1535J72779J05512l47787q7820k14269K77554k87697M30588l91242
5790A6817021n32342J35461j74189Q24104J28414m66276p11815l1366J280054
5781A7269066m78954q07151J148891R83723L70198L50248r44867m82677O4848
5772A7473325O65087o67757j24301j115603R48952J549045J281996j321073j53393
5763A8536278N86416j206600L10410l16448p57487K37810M59987P67134M11904
5754A9029404q091P27172J648706q00042J29346j70341N31232l352p74954K04155
5744B0513235K02984J219373m12467N34269p3629O35214J86806n20614M57936
5735B2743107L20385l15145Q95927P40086k05685L35141O50061j00889L85315
$$ plain form
5726 25448303 25849917 26083791 26030064 26300432 26389193 27054532 27259850 28304869 28868461 28643494
5716 28643494 28635636 28777344 29917337 30872811 30402640 30983698 32054556 32177180 31931443
5707 31931443 32584074 32929737 33626209 33834200 33414474 34222670 34124605 34602763 36027070
5698 36027070 36530059 36544550 37073180 37521139 38154890 38918499 40240487 41886426 42213548
5689 42213548 42554132 42899858 44313154 44394196 44650116 45056376 46321166 47238337 47564960
5680 47564960 47802772 49042449 50109190 50119272 50363524 51186435 52691718 54064843 54845444
5671 54845444 55104496 55974265 56700914 57635196 58322141 58897059 60212860 61303728 61523375
5662 61523375 62505340 63426692 64148610 64815787 66436592 67011285 67646741 68450230 69630993
$$ packed form
5726B5448303M01614K33874n3727K70368Q8761O65339K05318J045019N63592k24967
5716B8643494p858J41708J139993R55474m70171N81058J070858J22624k45737
5707C1931443O52631L45663O96472K07991m19726Q08196r8065M78158J424307
5698C6027070N02989J4491N28630M47959O33751P63609J321988J645939L27122
5689D2213548L40584L45726J413296Q1042K55920M06260J264790R17171L26623
5680D7564960K37812J239677J066741J0082K44252Q22911J505283J373125P80601
5671E4845444K59052Q69769P26649R34282O86945N74918J315801J090868K19647
5662F1523375R81965R21352P21918O67177J620805N74693O35456Q03489J180763
$$ plain form
5653 69630993 70777271 71722348 72710075 74253888 75328577 75703504 75628965 76660580 77066042
5644 77066042 76971181 78110769 79745256 80577130 81143268 82625723 83820635 84295790 85422623
5635 85422623 86514789 87596953 87579820 87980104 88053754 87957277 88661767 88879262 89173800 89376788
5625 89376788 89846964 90201352 90590439 91060768 91988709 93374549 93472086 93447891 92727864 92864113
5615 92864113 94821318 93547692 93882604 93826218 93695242 94566782 94375769 94287579 95268735
5606 95268735 96962551 96314974 95264328 95770293 96774547 96510942 95651946 96541471 96832471
5597 96832471 97012879 97381623 97787623 96961636 97359603 97566742 97771650 97749015 97495887 98527253
5587 98527253 98685454 99573541 100811750 100063694 100110699 100079683 100668376 100827467 100919449 101484008
$$ packed form
5653F9630993J146278R45077R87727J543813J074689L74927p4539J031615M05462
5644G7066042r4861J139588J634487Q31874N66138J482455J194912M75155J126833
5635H5422623J092166J082164j7133M00284P3650r6477P04490K17495K94538K02988
5625H9376788M70176L54388L89087M70329R27941J385840R7537k4195p20027J36249
5615I2864113J957205j273626L34912n6386j30976Q71540j91013q8190R81156
5606I5268735J693816o47577j050646N05965J004254k63605q58996Q89525K91000
5597I6832471J80408L68744M06000q25987L97967K07139K04908k2635k53128J031366
5587I8527253J58201Q88087J238209p48056M7005l1016N88693J59091R1982N64559
$$ plain form
5577 101484008 101843649 102350653 102795486 103177702 102994547 103069777 102862876 103704282 104623969
5568 104623969 105748315 105541779 105008359 104912557 105064867 105025680 105636555 106570818 106919048
5559 106919048 108013553 108553359 107807631 107741980 107522055 108352720 109081137 108376742 108851368
5550 108851368 110292165 111148571 112013964 111655045 112928928 112375498 112998480 114490291 115813974
5541 115813974 116317711 117276903 117079040 117992876 119466182 119996962 121335314 121476730 121235421
5532 121235421 121990607 123280057 123666311 124430988 125795916 127510430 127989666 128726298 129101364
5523 129101364 130301829 130794547 130754579 131749163 133081179 133741582 134077082 136680257 137036514
5514 137036514 136497338 136292321 136778653 138680031 139706365 139774899 139784288 141605950 143207958
$$ packed form
5577A01484008L59641N07004M44833L82216j83155P5230k06901Q41406R19687
5568A04623969J124346k06536n33420r5802J52310l9187O10875R34263L48230
5559A06919048J094505N39806p45728o5651k19925Q30665P28417p04395M74626
5550A08851368J440797Q56406Q65393l58919J273883n53430O22982J491811J323683
5541A15813974N03737R59192j97863R13836J473306N30780J338352J41416k41309
5532A21235421P55186J289450L86254P64677J364928J714514M79236P36632L75066
5523A29101364J200465M92718l9968R94584J332016O60403L35500K603175L56257
5514A37036514n39176k05017M86332J901378J026334O8534R389J821662J602008
$$ plain form
5505 143207958 143486420 144140470 145004499 145291532 145647271 146932044 147547313 148435282 149649039
5496 149649039 149680660 150175579 151196284 152110079 151975376 152331136 153571534 156102682 157264979
5487 157264979 159071971 159096786 160578148 161986069 161306039 161557209 162359600 164006389 165415907
5478 165415907 166290214 167715222 168589201 168351345 169297875 169994625 170767189 172968742 173716408
5469 173716408 174024217 174563552 175198602 176858614 177818534 177613248 178725941 179348892 180376254
5460 180376254 181497772 182105747 181631721 182184093 183592930 185219694 186014484 186086798 186867022
5451 186867022 187351138 187052567 187382387 189072472 190046564 190407937 190225478 190987878 191739861
5442 191739861 190743014 191239664 191436652 191813740 192679758 193660597 193740884 194684193 195525714
$$ packed form
5505A43207958K78462O54050Q64029K87033L55739J284773O15269Q87969J213757
5496A49649039L1621M94919J020705R13795j34703L55760J240398K531148J162297
5487A57264979J806992K4815J481362J407921o80030K51170Q02391J646789J409518
5478A65415907Q74307J425008Q73979k37856R46530O96750P72564K201553P47666
5469A73716408L07809N39335O35050J660012R59920k05286J112693O22951J027362
5460A80376254J121518O07975m74026N52372J408837J626764P94790P2314P80224
5451A86867022M84116k98571L29820J690085R74092L61373j82459P62400P51983
5442A91739861r96847M96650J96988L77088Q66018R80839Q0287R43309Q41521
$$ plain form
5433 195525714 195859965 196003061 196260032 196456565 196644411 197339050 197975504 198271692 199087315
5424 199087315 199872048 199584792 198687641 199625331 200562010 200300072 202100714 202697964 203640673
5415 203640673 203575061 204809135 204152817 205323834 206246731 207041191 207478657 207308324 209071675
5406 209071675 210446905 210680961 210238478 210996033 212346337 212490426 214004407 215244782 214564480
5397 214564480 214749417 215957340 216455847 216255270 217984287 219682738 220081199 220068118 219824599
5388 219824599 220973975 221309808 222255248 222848734 223122306 223771930 225145221 225548237 226208227
5379 226208227 227008380 227791494 228990982 228857901 229367198 229925637 230656487 231882332 233107071
5370 233107071 234140502 234949980 235801720 237176655 238801800 238298682 238597821 240682736 242151507
$$ packed form
5433A95525714L34251J43096K56971J96533J87846O94639O36454K96188Q15623
5424A99087315P84733k87256q97151R37690R36679k61938J800642N97250R42709
5415B03640673o5612J234074o56318J171017R22897P94460M37466j70333J763351
5406B09071675J375230K34056m42483P57555J350304J44089J513981J240375o80302
5397B14564480J84937J207923M98507k00577J729017J698451L98461j3081k43519
5388B19824599J149376L35833R45440N93486K73572O49624J373291M03016O59990
5379B26208227Q00153P83114J199488j33081N09297N58439P30850J225845J224739
5370B33107071J033431Q09478Q51740J374935J625145n03118K99139K084915J468771
$$ plain form
5361 242151507 242124393 243353754 245145035 246068010 245702950 246157023 246141517 245973662 246638748
5352 246638748 246284748 246063017 245732124 244121345 242877465 242119251 240624706 239645172 237993602
5343 237993602 236473024 234905920 232514723 229665199 226778843 224517792 222152860 217544884
5335 217544884 215134863 211563038 207134273 203264847 200452647 196065838 191198077 187764825
5327 187764825 183258311 179101912 174864144 169878605 165629369 161802266 157444419 152965793
5319 152965793 149514317 146288846 142147466 138486156 134191813 130499174 127550875 123829925
5311 123829925 120496536 116680938 114654707 112221237 108729139 105536479 103117261 100642749
5303 100642749 98706892 96106668 94694831 91784834 90081190 87753075 85209795 84112556
$$ packed form
5361B42151507k7114J229361J791281R22975l65060M54073j5506j67855O65086
5352B46638748l54000k21731l30893j610779j243880p58214j494545r79534j651570
5343B37993602j520578j567104k391197k849524k886356k261051k364932m607976
5335B17544884k410021l571825m428765l869426k812200m386809m867761l433252
5327A87764825m506514m156399m237768m985539m249236l827103m357847m478626
5319A52965793l451476l225471m141380l661310m294343l692639k948299l720950
5311A23829925l333389l815598k026231k433470l492098l192660k419218k474512
5303A00642749j935857k600224j411837k909997j703644k328115k543280j097239
$$ plain form
5295 84112556 82003963 80006197 78061811 75897237 74623904 73312608 71216850 70217265
5287 70217265 69950723 67556604 65674440 64437508 62918309 61856687 60813907 60021778
5279 60021778 58814084 57693464 55708204 54673503 54133326 53295926 51526386 51345123 49879263
5270 49879263 48662432 47870703 47308367 46221108 45170882 43669224 43058832 42544069 41586340
5261 41586340 41590288 40790039 39374280 38291654 36631844 35922696 34670451 35169959 34643993
5252 34643993 33845965 34151350 33212667 32738083 31942925 32231182 30551109 29617717 29612193 29503981
5242 29503981 28939846 27404085 27091538 26516024 26109147 25983164 25287002 24998689 24280747
5233 24280747 24321422 23576614 22568501 22652978 22498181 22172219 21156940 20054518 20435451
$$ packed form
5295H4112556k108593j997766j944386k164574j273333j311296k095758r99585
5287G0217265k66542k394119j882164j236932j519199j061622j042780p92129
5279F0021778j207694j120620j985260j034701n40177q37400j769540j81263j465860
5270D9879263j216831p91729n62336j087259j050226j501658o10392n14763r57729
5261D1586340L948q00249j415759j082626j659810p09148j252245M99508n25966
5252C4643993p98028L05385r38683m74584p95158K88257j680073r33392n524j08212
5242B9503981n64135j535761l12547n75514m06877j25983o96162k88313p17942
5233B4280747M0675p44808j008113Q4477j54797l25962j015279j102422L80933
$$ plain form
5224 20435451 20787253 20315208 20564461 20740120 20407529 20074442 19935531 20093388 19450687
5215 19450687 18223940 17615871 17792151 17312706 16490830 16172962 16314863 15834035 16142024
5206 16142024 16575042 15914708 16259056 15854151 15556479 14216887 14533354 15356971 15587103
5197 15587103 15053608 14551815 13612677 13696495 13930398 13690125 13130436 12977474 12381889 12130758
5187 12130758 12713257 13054760 13347209 13562163 13380435 12012356 12627362 12293065 11553394
5178 11553394 11596551 11475958 11915516 11347236 11279295 11074432 10228715 10037588 10201493 10997163
5168 10997163 11352481 11267454 11514402 11032708 10475546 10346018 9445606 9822838 9491494 9081589
5158 9081589 9764833 8984412 8090646 8131438 8943482 9603930 8980976 8943184 8758903 8998446
$$ packed form
5224B0435451L51802m72045K49253J75659l32591l33087j38911J57857o42701
5215A9450687j226747o08069J76280m79445q21876l17868J41901m80828L07989
5206A6142024M33018o60334L44348m04905k97672j339592L16467Q23617K30132
5197A5587103n33495n01793r39138Q3818K33903k40273n59689j52962n95585k51131
5187A2130758N82499L41503K92449K14954j81728j368079O15006l34297p39671
5178A1553394M3157j20593M39558n68280o7941k04863q45717j91127J63905P95670
5168A0997163L55318q5027K46948m81694n57162j29528r00412L77232l31344m09905
5158I081589O83244p80421q93766M0792Q12044O60448o22954l7792j84281K39543
$$ plain form
5148 8998446 8230307 8585790 8542955 7499127 8322232 8641337 8597827 7828860 7510496 7588502
5138 7588502 7543757 8506994 7371581 7440063 7909205 7467789 6552375 6332539 6289245 5896738
5128 5896738 6036055 6304797 6080404 6377976 7560928 7858991 7389470 8112485 7572009
5119 7572009 7154312 6807067 6282655 6327209 6520495 7067556 6835689 6616012 6791721 6572387
5109 6572387 6166775 7286424 8817657 8782088 7417366 6643606 7098736 6027634 5644670
5100 5644670 6039028 6164114 6464575 5003764 5332262 5716100 6198322 5938154 6047423
5091 6047423 6932703 6976561 6018781 5426641 6393796 5950559 5359333 5367620 5811533 5174104
5081 5174104 5208066 5407519 5788320 6236608 5695542 5175452 4904261 5559613 4111268 3455426
$$ packed form
5148H998446p68139L55483m2835j043828Q23105L19105m3510p68967l18364P8006
5138G588502m4745R63237j135413O8482M69142m41416r15414k19836m3294l92507
5128E896738J39317K68742k24393K97572J182952K98063m69521P23015n40476
5119G572009m17697l47245n24412M4554J93286N47061k31867k19677J75709k19334
5109F572387m05612J119649J531233l5569j364722p73760M55130j071102l82964
5100E644670L94358J25086L00461j460811L28498L83838M82222k60168J09269
5091F047423Q85280M3858r57780n92140R67155m43237n91226Q287M43913o37429
5081E174104L3962J99453L80801M48288n41066n20090k71191O55352j448345o55842
$$ plain form
5071 3455426 3594922 4260396 5145002 5464916 5573277 6467635 5346369 5421046 4900003 5194213
5061 5194213 4991456 4812523 5528500 5597205 5162181 4518352 4247442 4470901 5125333 5586129
5051 5586129 6153826 6211416 6588107 5442364 4453394 4349854 5256358 4685360 4100368 4698759
5041 4698759 5240989 4773389 4376129 4838991 5553076 6683409 6552608 5103900 5417718
5032 5417718 6475054 6663477 5975613 5749145 6352774 6741191 6034708 6095007 6378289 6605123
5022 6605123 7052610 6952384 7604211 6380046 6179992 6609276 7500024 8102495 6402618
5013 6402618 6005891 6795207 7397401 7177856 7211101 6554332 6530889 6882902 7622300 9208695
5003 9208695 9535578 9255351 8985139 8854830 9558526 8903666 9192552 10329579 10004574
$$ packed form
5071C455426J39496O65474Q84606L19914J08361Q94358j121266P4677n21043K94210
5061E194213k02757j78933P15977O8705m35024o43829k70910K23459O54432M60796
5051E586129N67697N7590L76691j145743r88970j03540R06504n70998n84992N98391
5041D698759N42230m67600l97260M62862P14085J130333j30801j448708L13818
5032E417718J057336J88423o87864k26468O03629L88417p06483O0299K83282K26834
5022F605123M47487j00226O51827j224165k00054M29284Q90748O02471j699877
5013F402618l96727P89316O02194k19545L3245o56769k3443L52013P39398J586395
5003I208695L26883k80227k70212j30309P03696o54860K88886J137027l25005
$$ plain form
4994 10004574 9892269 10369776 10318515 10077654 9650504 9750759 9491103 9363093 10859190
4985 10859190 11039227 10379221 9901717 9683060 9375962 10024851 10695190 11471527 11396173 11222956
4975 11222956 11676139 11168367 11202585 11335306 11088467 11682256 11485039 11371335 11255698 11084767
4965 11084767 11278861 11712476 11623133 12587585 13123916 13353655 13570120 13801009 13908398 14137643
4955 14137643 13695126 12880221 13640507 15295361 16697362 15554319 15051552 15811396 15790692
4946 15790692 14929192 15439676 15364497 15182031 15188891 16220952 15037935 15521056 14704517 13516963
4936 13516963 13876186 14648627 14622072 13898609 13604737 13170352 13978404 13066407 13305611 13908254
4926 13908254 13303758 13160592 12794904 12465353 12203964 12988550 13634202 12432794 12158015
$$ packed form
4994A0004574j12305M77507n1261k40861m27150J00255k59656j28010J496097
4985A0859190J80037o60006m77504k18657l07098O48889O70339P76337p5354j73217
4975A1222956M53183n07772L4218J32721k46839N93789j97217j13704j15637j70931
4965A1084767J94094M33615q9343R64452N36331K29739K16465K30889J07389K29245
4955A4137643m42517q14905P60286J654854J402001j143043n02767P59844k0704
4946A5790692q61500N10484p5179j82466O860J032061j183017M83121q16539j187554
4936A3516963L59223P72441k6555p23463k93872m34385Q08052r11997K39204O02643
4926A3908254o04496j43166l65688l29551k61389P84586O45652j201408k74779
$$ plain form
4917 12158015 12230560 12298201 11662975 11875330 12560880 12281171 11881831 11157518 12204506 12291431
4907 12291431 11900871 12385562 12336296 12521555 12391639 12019032 11345731 11784695 12109684 12772621
4897 12772621 12816698 12381846 11737606 12285211 12700298 11506605 10529618 9409771 8744337
4888 8744337 9279545 9193204 9039320 8663033 8695489 9272026 9633885 8845547 8590760 8674561
4878 8674561 7733870 7478397 7288391 6354243 5288176 4653497 5106059 5788334 5467128
4869 5467128 5515820 5710525 5219710 5154050 5028063 5124295 5239952 4213267 5479903 5686154
4859 5686154 4603128 4270690 4732841 4378280 3750713 4754934 4282541 4389409 4148859
4850 4148859 4467345 4091934 4605428 4772255 3861793 2970110 4123408 4293752 3671026
$$ packed form
4917A2158015P2545O7641o35226K12355O85550k79709l99340p24313J046988Q6925
4907A2291431l90560M84691m9266J85259j29916l72607o73301M38964L24989O62937
4897A2772621M4077m34852o44240N47605M15087j193693r76987j119847o65434
4888H744337N35208q6341j53884l76287L2456N76537L61859p88338k54787Q3801
4878H674561r40691k55473j90006r34148j066067o34679M52562O82275l21206
4869E467128M8692J94705m90815o5660j25987R6232J15657j026685J266636K06251
4859E686154j083026l32438M62151l54561o27567J004221m72393J06868k40550
4850D148859L18486l75411N13494J66827r10462q91683J153298J70344o22726
$$ plain form
4841 3671026 3986950 3079943 2788557 3424620 2973659 2857030 3233102 3387287 4506634
4832 4506634 3823794 4227665 3024304 3683099 4583593 4070058 3656207 3649687 3353925 3793292
4822 3793292 4344424 4420906 3210684 2931075 2612272 2581813 3374415 3487903 3966576 4868577
4812 4868577 5350154 3961651 4321014 5067416 3846411 3700785 3464531 2571716 4066630
4803 4066630 3655287 4166051 5599245 4703106 4595087 4509781 4507021 4666757 4467408 5757491
4793 5757491 5303481 4864013 5081151 5611455 5742609 5848170 6288004 6086646 5367718 5747635
4783 5747635 5561685 5614691 6763433 7598881 7477236 6941103 7023963 7653448 7641046 7585768
4773 7585768 7291823 6574292 7279892 7461500 8492714 8004015 8705506 8340828 8826622
$$ packed form
4841C671026L15924r07007k91386O36063m50961j16629L76072J54185J119347
4832D506634o82840M03871j203361O58795R00494n13535m13851o520k95762M39367
4822C793292N51132P6482j210222k79609l18803l0459P92602J13488M78673R02001
4812D868577M81577j388503L59363P46402j221005j45626k36254q92815J494914
4803D066630m11343N10764J433194q96139j08019q5306k760J59736j99349J290083
4793E757491m54010m39468K17138N30304J31154J05561M39834k01358p18928L79917
4783E747635j85950N3006J148742Q35448j21645n36133Q2860O29485j2402n5278
4773G585768k93945p17531P05600J81608J031214m88699P01491l64678M85794
$$ plain form
4764 8826622 8748948 8630878 9095905 8799265 8865552 8705065 8325012 8295965 8203448 8964199
4754 8964199 8732057 8472213 9346714 9481756 9605044 9882847 10678307 9202802 9882373
4745 9882373 10798358 11478747 11196422 9871316 10045690 10748681 11856368 11726531 11841288
4736 11841288 11760337 11392646 12319454 13566734 13328787 12419987 13936588 14788491 13768076
4727 13768076 13500072 13125656 13241040 13426563 13087880 13556574 13830585 13411925 13180488
4718 13180488 12416000 12657180 12924481 11440149 12330040 11790615 11672188 11784866 11624258
4709 11624258 10887944 10504415 11105592 11199752 11126675 10759979 11273828 11402369 10234305 11119087
4699 11119087 11893430 11984528 12811070 12356963 12007621 11276575 11286456 12477953 12719272 12999445
$$ packed form
4764H826622p7674j18070M65027k96640O6287j60487l80053k9047r2517P60751
4754H964199k32142k59844Q74501J35042J23288K77803P95460j475505O79571
4745I882373R15985O80389k82325j325106J74374P02991J107687j29837J14757
4736A1841288q0951l67691R26808J247280k37947r08800J516601Q51903j020415
4727A3768076k68004l74416J15384J85523l38683M68694K74011m18660k31437
4718A3180488p64488K41180K67301j484332Q89891n39425j18427J12678j60608
4709A1624258p36314l83529O01177R4160p3077l66696N13849J28541j168064Q84782
4699A1119087P74343R1098Q26542m54107l49342p31046R881J191497K41319K80173
$$ plain form
4689 12999445 13252114 13064295 13001420 12594693 12448900 12973725 13028390 13613629 13244790 12516417
4679 12516417 12761949 12488447 11870734 11490568 11705558 11989927 11195424 10598768 10744150
4670 10744150 10932457 10549854 10469824 10161311 10286538 9580395 8116117 9096111 8563011
4661 8563011 8514529 9146616 8392612 7662372 7050440 7390018 6906461 6691958 7080205 6722259
4651 6722259 7662114 6587747 6167557 5521959 4953170 5289478 5130290 5897919 5720897
4642 5720897 5117562 5376112 5601132 6098000 5858809 5409957 5242489 6258239 5191109
4633 5191109 4913428 5406349 5633822 5833809 6004494 5445480 5847268 6412040 5790429 5727936
4623 5727936 5492571 4772187 4987880 5162940 5079830 3789857 3533845 3832643 3455475 4484530
$$ packed form
4689A2999445K52669j87819o2875m06727j45793N24825N4665N85239l68839p28373
4679A2516417K45532k73502o17713l80166K14990K84369p94503n96656J45382
4670A0744150J88307l82603q0030l08513J25227p06143j464278R79994n33100
4661H563011m8482O32087p54004p30240o11932L39578m83557k14503L88247l57946
4651F722259R39855j074367m20190o45598n68789L36308j59188P67629j77022
4642E720897o03335K58550K25020M96868k39191m48852j67468J015750j067130
4633E191109k77681M92921K27473J99987J70685n59014M01788N64772o21611o2493
4623E727936k35365p20384K15693J75060q3110j289973k56012K98798l77168J029055
$$ plain form
4613 4484530 4097947 3463803 3275221 3358369 3641850 2751910 2410742 2589806 2765774 2526215
4603 2526215 3003091 3798822 4258060 4183773 4407426 4081840 3108460 2457285 2306077 2333694
4593 2333694 1896239 3091765 2939558 2890670 2249885 2611526 2633508 2901013 2867460 2468908
4583 2468908 2274224 2108172 1163597 1198910 1876427 3144634 2866564 2742717 2472773 2376361
4573 2376361 3486181 3238058 3235497 2845428 1954110 1697757 1399687 1350856 1709376 2432978
4563 2432978 2533983 1702795 1245922 1815250 2214776 3109391 1551345 378860 2028095
4554 2028095 2300724 2293557 2538425 3381098 2200886 958638 1462582 1953554 1721047 1744179
4544 1744179 2318855 1490773 1305352 1979559 2253694 3141702 2846965 1883627 2015265 2763572
$$ packed form
4613D484530l86583o34144j88582Q3148K83481q89940l41168J79064J75968k39559
4603B526215M76876P95731M59238p4287K23653l25586r73380o51175j51208K7617
4593B333694m37455J195526j52207m8888o40785L61641K1982K67505l3553l98552
4583B468908j94684j66052r44575L5313O77517J268207k78070j23847k69944r6412
4573B376361J109820k48123k561l90069q91318k56353k98070m8831L58520P23602
4563B432978J01005q31188m56873N69328L99526Q94615j558046j172485J649235
4554B028095K72629p167K44868Q42673j180212j242248N03944M90972k32507K3132
4544A744179N74676q28082j85421O74207K74135Q88008k94737r63338J31638P48307
$$ plain form
4534 2763572 1762382 1041357 2022575 1025349 2304324 3129037 3407638 3592221 2621751
4525 2621751 2365231 3337424 3084639 2767219 3311083 2339430 2921836 3126758 2288660 1630391
4515 1630391 2091641 2421427 2988012 3554054 3132346 3901313 3978187 2575793 2310723 2820337
4505 2820337 2268243 1867150 3405129 3486310 3041126 3205440 2952523 3555929 3740693 3517571
4495 3517571 3635117 3322116 4371365 4631565 3945800 2386880 2275587 3696305 5104912
4486 5104912 4082386 3905673 4402622 4327548 4021930 4257172 3714937 3818811 4062321 3588153
4476 3588153 4103623 3966580 4173227 3930114 4361246 4651586 4217848 3434831 4344700 5083481
4466 5083481 4863819 5387485 5725197 5284233 4949343 5824592 6099312 6400375 6983604 6775870
$$ packed form
4534B763572j001190p21025R81218r97226J278975Q24713K78601J84583r70470
4525B621751k56520R72193k52785l17420N43864r71653N82406K04922q38098o58269
4515A630391M61250L29786N66585N66042m21708P68967P6874j402394k65070N09614
4505B820337n52094m01093J537979Q1181m45184J64314k52917O03406J84764k23122
4495C517571J17546l13001J049249K60200o85765j558920j11293J420718J408607
4486E104912j022526j76713M96949p5074l05618K35242n42235J03874K43510m74168
4476C588153N15470j37043K06647k43113M31132K90340m33738p83017R09869P38781
4466E083481k19662N23666L37712m40964l34890Q75249K74720L01063N83229k07734
$$ plain form
4456 6775870 6674289 5984208 6439908 7311767 7995017 7454650 6371238 6989490 6744893
4447 6744893 8002199 8178231 8381742 8448957 7980206 8316367 8843494 9578756 9767176 10891510
4437 10891510 10592173 10018514 11513125 11776512 12165597 12358292 11770328 12537208 13162873
4428 13162873 13777797 13814728 13269490 12920937 14444082 14974130 15312512 15570020 15934809
4419 15934809 17565623 17353585 16932689 17980938 18660088 18644938 19666475 21119904 21593461
4410 21593461 21567472 22273179 23995404 25610322 25737929 25989992 27539343 30515542 31553476
4401 31553476 32670510 34844437 35262774 37114932 38460229 40711378 43301493 45623046
4393 45623046 47936134 52249478 55997614 59344343 64834787 71204011 76434299 82938841
$$ packed form
4456F775870j01581o90081M55700Q71859O83250n40367j083412O18252k44597
4447F744893J257306J76032K03511O7215m68751L36161N27127P35262J88420J124334
4437A0891510k99337n73659J494611K63387L89085J92695n87964P66880O25665
4428A3162873O14924L6931n45238l48553J523145N30048L38382K57508L64789
4419A5934809J630814k12038m20896J048249O79150j5150J021537J453429M73557
4410B1593461k5989P05707J722225J614918J27607K52063J549351K976199J037934
4401C1553476J117034K173927M18337J852158J345297K251149K590115K321553
4393D5623046K313088M313344L748136L346729N490444O369224N230288O504542
$$ plain form
4385 82938841 93350313 104303455 115516788 127549976 137994620 147012834 154518819
4378 154518819 160860798 169094489 180586978 195303172 211230666 225448013 235838588
4371 235838588 239988127 240119856 240851888 244801422 254421941 266623495 278907366 285003321
4363 285003321 280730469 268124540 254038984 241901209 234669568 231456475 230163855 228309445
4355 228309445 220692389 207120942 189339761 173225408 160625898 151831027 144398324
4348 144398324 137689486 130793104 120494131 110073160 98054060 86669976 79164326
4341 79164326 71398812 65136115 60099317 55862897 52638164 49110874 45890522 43110171
4333 43110171 40808285 38460400 36252007 34995337 33943455 32179619 30944128 29588859
$$ packed form
4385H2938841J0411472J0953142J1213333J2033188J0444644R018214P505985
4378A54518819O341979Q233691J1492489J4716194J5927494J4217347J0390575
4371B35838588M149539J31729P32032L949534R620519J2201554J2283871O095955
4363B85003321m272852j2605929j4085556j2137775p231641l213093j292620j854410
4355B28309445p617056j3571447j7781181j6114353j2599510q794871p432703
4348A44398324o708838o896382j0298973j0420971j2019100j1384084p505650
4341G9164326p765514o262697n036798m236420l224733l527290l220352k780351
4333D3110171k301886k347885k208393j256670j051882j763836j235491j355269
$$ plain form
4325 29588859 28126404 26162148 25178547 25120783 24373779 23928691 22807030 22151768 21630495
4316 21630495 21292647 19848195 19794207 18945948 18449605 17401798 17495820 17694421 16495703
4307 16495703 16548769 16285173 15694087 15296920 14609249 13744723 14419908 13680263 13048623 12351488
4297 12351488 11850542 11888414 12063367 12100461 11259002 11792601 12288676 11600364 11771310 11339671
4287 11339671 11480306 10740316 9412012 8943856 9114787 9035309 9355267 9102276 8669598
4278 8669598 8363509 8044457 8799620 8694052 7307855 7527973 7952872 8182605 8539796
4269 8539796 8722547 7378558 6940182 6787526 5899126 6314983 5192854 5287955 5809410
4260 5809410 6003247 5883730 5463672 5472860 6161786 6247465 5558822 5031361 4307719 4846298
$$ packed form
4325B9588859j462455j964256r83601n7764p47004m45088j121661o55262n21273
4316B1630495l37848j444452n3988q48259m96343j047807R4022J98601j198718
4307A6495703N3066k63596n91086l97167o87671q64526O75185p39645o31640o97135
4297A2351488n00946L7872J74953L7094q41459N33599M96075o88312J70946m31639
4287A1339671J40635p39990j328304m68156J70931p9478L19958k52991m32678
4278H669598l06089l19052P55163j05568j386197K20118M24899K29733L57191
4269H539796J82751j343989m38376j52656q88400M15857j122129R5101N21455
4260E809410J93837j19517m20058R188O88926Q5679o88643n27461p23642N38579
$$ plain form
4250 4846298 4123209 4036927 4667804 4609209 4313827 4630053 3846396 5152785 5148889 4788083
4240 4788083 5286048 4553737 4457420 4579587 5530728 5841119 5756038 5478135 5480479 4477864
4230 4477864 5132565 4753977 4110551 4239045 4523172 4562957 4744281 5280192 5890287 5836925
4220 5836925 5356013 4315976 4624186 5388536 5410047 4952423 4315341 4248278 3891871 4980176
4210 4980176 4557619 4175848 3646676 3379285 4121456 4483058 3992227 4068002 4231681 4009746
4200 4009746 3432869 3336088 3538749 3534292 2564055 2312007 2069727 3095391 2666535 2909788
4190 2909788 3742353 2878070 3457765 3452758 3047709 3006285 4032183 3582246 2731348 2985357
4180 2985357 3689886 3771176 4236560 4164643 4004834 3271633 3874832 3990798 3847356 3176062
$$ packed form
4250D846298p23089q6282O30877n8595k95382L16226p83657J306389l896l60806
4240D788083M97965p32311r6317J22167R51141L10391q5081k77903K344j002615
4230D477864O54701l78588o43426J28494K84127L9785J81324N35911O10095n3362
4220E836925m80912j040037L08210P64350K1511m57624o37082o7063l56407J088305
4210D980176m22557l81771n29172k67391P42171L61602m90831P5775J63679k21935
4200D009746n76877r6781K02661m457r70237k52048k42280J025664m28856K43253
4190B909788Q32565q64283N79695n007m05049m1424J025898m49937q50898K54009
4180B985357P04529Q1290M65384p1917j59809p33201O03199J15966j43442o71294
$$ plain form
4170 3176062 2278096 2264536 2030806 3194381 3827518 3211119 3907578 5027773 5788835
4161 5788835 4695594 3572327 4026326 4144488 3231650 3123375 3339687 3158820 3372145
4152 3372145 3853715 3538984 3222442 3212234 3938755 4052718 3997062 3927589 4829387 5315923
4142 5315923 5145377 5209291 5203215 5537385 5977902 5727960 5878957 7032814 6486630 6498260
4132 6498260 6980029 6118523 5288213 5160449 5825289 6332458 7419370 7677578 8117676
4123 8117676 8153099 9190972 9560726 8757862 9701569 9802993 8925473 9367240 10016571 10704014
4113 10704014 11114578 12004817 12705667 13186534 14172367 13878329 15403655 14671990 14851517
4104 14851517 15856592 17549542 18455899 18833362 19528983 20002781 20663503 22654571 23408418
$$ packed form
4170C176062q97966j3560k33730J163575O33137o16399O96459J120195P61062
4161E788835j093241j123267M53999J18162r12838j08275K16312j80867K13325
4152C372145M81570l14731l16542j0208P26521J13963n5656o9473R01798M86536
4142E315923j70546O3914o076L34170M40517k49942J50997J153857n46184J1630
4132F498260M81769q61506q30310j27764O64840N07169J086912K58208M40098
4123H117676L5423J037873L69754q02864R43707J01424q77520M41767O49331O87443
4113A0704014M10564Q90239P00850M80867R85833k94038J525326p31665J79527
4104A4851517J005075J692950R06357L77463O95621M73798O60722J991068P53847
$$ plain form
4095 23408418 24641197 25435896 26471304 28018279 29495988 30319907 31390974 33040558
4087 33040558 33840736 35517751 38127096 39764930 41159809 43551828 45604592 48144998
4079 48144998 50120740 53117794 54883830 57757318 61779506 65976513 69925689 74106994
4071 74106994 80466055 88688930 96971528 105499232 116295473 129195037 144426194 160313607
4063 160313607 178271551 194799791 207228284 209093550 199284519 180340601 160515999
4056 160515999 142137536 124991483 110787694 99819682 90411547 81270435 75778553
4049 75778553 69563075 64489467 60597619 56263663 53485714 50135988 47078553 45010991
4041 45010991 42325821 39705954 37944222 36675617 33899227 33562086 32301742 30977670
$$ packed form
4095B3408418J232779P94699J035408J546975J477709Q23919J071067J649584
4087C3040558Q00178J677015K609345J637834J394879K392019K052764K540406
4079D8144998J975742K997054J766036K873488M022188M197007L949176M181305
4071G4106994O359061Q222875Q282598Q527704J0796241J2899564J5231157J5887413
4063A60313607J7957944J6528240J2428493J865266r809031j8943918j9824602
4056A60515999j8378463j7146053j4203789j0968012r408135r141112n491882
4049G5778553o215478n073608l891848m333956k777949l349726l057435k067562
4041D5010991k685170k619867j761732j268605k776390l37141j260344j324072
$$ plain form
4033 30977670 28332861 27365446 26834049 25699095 24957591 23608544 22577805 21628377 21790426
4024 21790426 21378752 20780055 18507943 17517187 17254434 17168214 17309446 16592949 16233639
4015 16233639 15909344 15218695 15654040 14896943 14016497 14262981 13647258 14098876 14065822 13344065
4005 13344065 12560806 12854540 13556445 13440346 13118981 11954319 11503694 10693954 9084910
3996 9084910 10007378 10238026 10773646 11685516 11662706 11711215 11010441 10530799 10288519 10707860
3986 10707860 10271310 9593547 9130991 9063740 8897427 8016096 7817849 7959022 8828683 8922954
3976 8922954 7774294 6890811 6698497 7228725 7424903 7896885 6541822 5712686 6298735
3967 6298735 5716458 6236554 6622309 6301350 5636628 5242561 5075247 5349510 5822411 4663417
$$ packed form
4033C0977670k644809r67415n31397j134954p41504j349047j030739r49428J62049
4024B1790426m11674n98697k272112r90756k62753q6220J41232p16497l59310
4015A6233639l24295o90649M35345p57097q80446K46484o15723M51618l3054p21757
4005A3344065p83259K93734P01905j16099l21365j164662m50625q09740j609044
3996I084910R22468K30648N35620R11870k2810M8509p00774m79642k42280M19341
3986A0707860m36550o77763m62556o7251j66313q81331j98247J41173Q69661R4271
3976H922954j148660q83483j92314N30228J96178M71982j355063q29136N86049
3967F298735n82277N20096L85755l20959o64722l94067j67314K74263M72901j158994
$$ plain form
3957 4663417 4040123 5015016 3881619 3707400 4209624 3653845 4236057 5185903 5910637
3948 5910637 5820323 5753640 5856850 6570863 6269557 5495242 5038451 3996960 4674674 7054886
3938 7054886 6692004 7276899 7440164 6577104 7421797 8242260 9443054 8961855 7883136
3929 7883136 7108219 6977753 6158660 4946916 4218968 4102611 4378359 4269472 3639707
3920 3639707 3850269 4833896 5644047 5557963 4708180 4592400 4852045 4244562 2643090 2883107
3910 2883107 4168549 3780281 3302089 3897352 3731278 3489671 3861751 3191126 2692878
3901 2692878 2796328 3860749 4040157 2850385 2860792 2662389 3305796 4103669 3011043
3892 3011043 2779097 4457977 4186682 3134546 2935871 3590788 4255257 3260816 2855383
$$ packed form
3957D663417o23294R74893j133397j74219N02224n55779N82212R49846P24734
3948E910637r0314o6683J03210P14013l01306p74315m56791j041491O77714K380212
3938G054886l62882N84895J63265q63060Q44693Q20463J200794m81199j078719
3929G883136p74917j30466q19093j211744p27948j16357K75748j08887o29765
3920C639707K10562R83627Q10151q6084q49783j15780K59645o07483j601472K40017
3910B883107J285442l88268m78192N95263j66074k41607L72080o70625m98248
3901B692878J03450J064421J79408j189772J0407j98403O43407P97873j092626
3892C011043k31946J678880k71295j052136j98675O54917O64469r94441m05433
$$ plain form
3883 2855383 2284589 1773044 2032109 2174949 2274614 2159320 1852221 1827621 1764355 2301943
3873 2301943 3343848 3584863 1849480 1856495 2754247 1995893 2147860 2750381 2006612 1617138
3863 1617138 1638652 1995412 2652410 2650002 2496582 2474057 2867638 2668697 2664116 2781269 3092697
3852 3092697 2713783 3020541 3480906 3451522 2849713 2250819 3274081 2530737 2407309 2202783
3842 2202783 2756879 3405831 2283295 3362528 3428317 2479306 2321533 3066879 2259527
3833 2259527 2663370 2771018 3396269 2986599 2785824 3524763 2350378 2360191 3197624 3403137
3823 3403137 3152823 2212119 1266029 2075304 3517617 3218415 3237286 2736767 3257394 3666429
3813 3666429 3777971 3425154 3447200 3397662 3044095 2710854 3315214 3893722 3902824 4114634
$$ packed form
3883B855383n70794n11545K59065J42840R9665j15294l07099k4600o3266N37588
3873B301943J041905K41015j735383P015Q97752p58354J51967O02521p43769l89474
3863A617138K1514L56760O56998k408j53420k2525L93581j98941m581J17153L11428
3852C092697l78914L06758M60365k9384o01809n98894J023262p43344j23428k04526
3842B202783N54096O48952j122536J079233O5789r49011j57773P45346q07352
3833B259527M03843J07648O25251m09670k00775P38939j174385R813Q37433K05513
3823C403137k50314r40704r46090Q09275J442313k99202J8871n00519N20627M09035
3813C666429J11542l52817K2046m9538l53567l33241O04360N78508R102K11810
$$ plain form
3803 4114634 3647027 4080544 3438116 3562537 3697024 4724896 5522190 4715855 4520829
3794 4520829 4676746 5001679 6482813 5646980 6154055 5185135 5366420 6618960 6253811
3785 6253811 5630760 5896069 6011986 6333360 6982271 6848350 5745824 5999153 6660998
3776 6660998 6904423 6888811 5928591 5573437 5880178 6713131 6977752 6679796 6418129 5933037
3766 5933037 6347474 6139351 5236407 4898367 4445476 4852561 5513380 4581718 4722666 4727977
3756 4727977 5087948 5686375 5086663 5450236 4943182 5280380 5369626 6322651 5829026 6278661
3746 6278661 6515578 5971632 5843843 6106629 7275293 6653159 7605739 8106710 7410085
3737 7410085 8617323 8367192 7330645 6849254 7332550 7595155 8105808 8759740 8501151
$$ packed form
3803D114634m67607M33517o42428J24421J34487J027872P97294q06335j95026
3794D520829J55917L24933J481134q35833N07075r68920J81285J252540l65149
3785F253811o23051K65309J15917L21374O48911j33921j102526K53329O61845
3776F660998K43425j5612r60220l55154L06741Q32953K64621k97956k61667m85092
3766E933037M14437k08123r02944l38040m52891M07085O60819r31662J40948N311
3756D727977L59971N98427n99712L63573n07054L37198Q9246R53025m93625M49635
3746F278661K36917n43946j27789K62786J168664o22134R52580N00971o96625
3737G410085J207238k50131j036547m81391M83296K62605N10653O53932k58589
$$ plain form
3728 8501151 8020382 8125882 8166453 7792383 8443006 8904803 9199223 8360851 7160386 7803407
3718 7803407 8671865 8579221 8535809 9281357 9926213 9819634 10024195 9571436 9872483 9842322
3708 9842322 9382122 8887635 9610255 10390850 10309267 9912114 10106923 11320380 12882641
3699 12882641 12378526 12054517 13049646 13741061 13739547 13345285 13478654 14293352 14911048 15297322
3689 15297322 16944343 17942158 18311169 19592190 19523869 19873533 20868316 20491765 22392744
3680 22392744 22839690 24045463 25832514 27858461 29010317 30059311 31002172 31431992 32439625
3671 32439625 33345147 33277604 34786958 36042468 36293492 38170427 39571155 39906311 41244023
3662 41244023 41170129 40405705 40462219 41021318 41402707 42150014 41543868 41052890 41384161 40962288
$$ packed form
3728H501151m80769J05500M0571l74070O50623M61797K94420q38372j200465O43021
3718G803407Q68458r2644m3412P45548O44856j06579K04561m52759L01047l0161
3708I842322m60200m94487P22620P80595q1583l97153J94809J213457J562261
3699A2882641n04115l24009R95129O91415j514l94262J33369Q14698O17696L86274
3689A5297322J647021R97815L69011J281021o8321L49664R94783l76551J900979
3680B2392744M46946J205773J787051K025947J151856J048994R42861M29820J007633
3671C2439625R05522o7543J509354J255510K51024J876935J400728L35156J337712
3662D1244023p3894p64424N6514N59099L81389P47307o06146m90978L31271m21873
$$ plain form
3652 40962288 40362871 39065720 38649806 38830887 37632421 36684785 36630352 35371785 34952126
3643 34952126 34328290 33451630 31936994 30101466 29386272 29277185 27780569 26933045 25621471
3634 25621471 24600770 23936635 22900400 21358462 20950349 20501199 19854648 18017188 17005084
3625 17005084 16953375 16909744 15806404 15315936 15984848 16051047 14971264 13580961 14151102
3616 14151102 13081184 12889619 12674408 12432225 12415754 12630335 12821996 11658864 11970968
3607 11970968 12318516 11915881 11394248 10678485 11433870 12857614 12851957 12347800 11969625 12551296
3597 12551296 12825600 13233665 13073490 12035881 11658794 11924847 13053842 12496302 12050333
3588 12050333 11472437 11475702 12147892 12863147 11625239 11076184 11729407 11603355 11255357 10613892
$$ packed form
3652D0962288n99417j297151m15914J81081j198466r47636n4433j258567m19659
3643C4952126o23836q76660j514636j835528p15194j09087j496616q47524j311574
3634B5621471j020701o64135j036235j541938m08113m49150o46551j837460j012104
3625A7005084n1709m3631j103340m90468O68912O6199j079783j390303N70141
3616A4151102j069918j91565k15211k42183j6471K14581J91661j163132L12104
3607A1970968L47548m02635n21633p15763P55385J423744n657n04157l78175N81671
3597A2551296K74304M08065j60175j037609l77087K66053J128995n57540m45969
3588A2050333n77896L265O72190P15255j237908n49055O53223j26052l47998o41465
$$ plain form
3578 10613892 10668435 11272768 10885603 11100647 11180901 10929774 11802645 11891049 11781060 11203905
3568 11203905 11078879 10379564 10390741 10106455 10633396 11537468 11144216 10968462 11954315 12236772
3558 12236772 12150492 12713112 12989139 12944645 13663841 13235686 13367310 14442686 14695057 15304209
3548 15304209 16194644 17193195 17256825 16779774 16867763 17948267 16758027 16576361 16573434 16769885
3538 16769885 17696614 17546675 16855744 16872186 17106447 16690895 17228995 17272446 17662012 17898350
3528 17898350 16894134 17586298 17886101 17705078 17388367 18472535 18304405 17727545 17107083
3519 17107083 16958600 19336119 19068839 18951738 19758879 20699967 20404810 20625329 20872696
3510 20872696 22619655 23566079 24017412 23850598 24921775 26870567 28758929 29676023 31114259
$$ packed form
3578A0613892N4543O04333l87165K15044Q0254k51127Q72871Q8404j09989n77155
3568A1203905j25026o99315J1177k84286N26941R04072l93252j75754R85853K82457
3558A2236772q6280N62620K76027m4494P19196m28155J31624J075376K52371O09152
3548A5304209Q90435R98551O3630m77051Q7989J080504j190240j81666k927J96451
3538A6769885R26729j49939o90931J6442K34261m15552N38100M3451L89566K36338
3528A7898350j004216O92164K99803j81023l16711J084168j68130n76860o20462
3519A7107083j48483K377519k67280j17101Q07141R41088k95157K20519K47367
3510B0872696J746959R46424M51333j66814J071177J948792J888362R17094J438236
$$ plain form
3501 31114259 32600904 34167357 34910218 36107776 38604486 41775392 43856948 45167726
3493 45167726 47330993 48317089 50368071 52091209 54373248 56350786 59041217 60724016
3485 60724016 62375292 64104959 65791857 67596378 69055081 70421900 73351032 75484500
3477 75484500 78140578 80450818 82976401 84215131 85238454 86431375 87752875 87516598
3469 87516598 87389183 87513376 87089273 86151836 85547266 84266505 81774972 79675130 77613953
3460 77613953 75036678 73261314 71212117 69441789 67380632 64961359 62345414 58885830
3452 58885830 56959140 54936876 53200116 50176806 47929402 46114188 44727155 42280739
3444 42280739 40511605 38799328 37086415 35513875 34116335 32705785 30703895 29756264
$$ packed form
3501C1114259J486645J566453P42861J197558K496710L170906K081556J310778
3493D5167726K163267R86096K050982J723138K282039J977538K690431J682799
3485F0724016J651276J729667J686898J804521J458703J366819K929132K133468
3477G5484500K656078K310240K525583J238730J023323J192921J321500k36277
3469H7516598j27415J24193m24103r37437o04570j280761k491533k099842k061177
3460G7613953k577275j775364k049197j770328k061157k419273k615945l459584
3452E8885830j926690k022264j736760l023310k247404j815214j387033k446416
3444D2280739j769134j712277j712913j572540j397540j410550k001890r47631
$$ plain form
3436 29756264 29104018 27821684 27217650 26445026 24919781 23621992 22746270 23322733 22292462
3427 22292462 21881200 20785733 19891183 20630199 19680240 19494770 19270972 18249383 17799417
3418 17799417 18368349 18195913 17696725 18226718 18367680 18061398 18504494 17845636 17924463 18273382
3408 18273382 18192935 17541411 17756410 17536245 17718712 17721028 17588730 17058298 15959433 16085226
3398 16085226 16098695 16206143 15861793 15090354 14763152 14968451 14624107 12836199 12905343 13472063
3388 13472063 13354576 12828169 12545044 12125852 12022146 12323183 12221043 10856254 9781358
3379 9781358 9377044 9909158 10309145 11511263 11138563 9212460 8571723 8588196 9471369
3370 9471369 9403630 10063804 11027010 10556572 10601573 10787607 10013261 9833137 9411576 10186858
$$ packed form
3436B9756264o52246j282334o04034p72624j525245j297789q75722N76463j030271
3427B2292462m11262j095467q94550P39016r49959j85470k23798j021589m49966
3418A7799417N68932j72436m99188N29993J40962l06282M43096o58858P8827L48919
3408A8273382q0447o51524K14999k20165J82467K316j32298n30432j098865J25793
3398A6085226J3469J07448l44350p71439l27202K05299l44344j787908O9144N66720
3388A3472063j17487n26407k83125m19192j03706L01037j02140j364789j074896
3379I781358m04314N32114L99987J202118l72700j926103o40737J6473Q83173
3370I471369o7739O60174R63206m70438M5001J86034p74346j80124m21561P75282
$$ plain form
3360 10186858 9166694 8465638 9091976 10256040 9082190 10021604 9815344 9606311 10259955
3351 10259955 9870754 9219652 9325075 9077483 9385070 10082150 10963849 9774728 10374481
3342 10374481 10338719 9651039 9928869 10052536 10789390 11327807 10568480 10543646 11358591 10450119
3332 10450119 11924649 11481885 11828796 11914572 12509378 12269122 11706830 12483613 13238380
3323 13238380 13802406 13989689 13410924 13735351 13754232 14630076 14837662 16167854 16371966
3314 16371966 15717757 15650022 16654762 17736739 18270460 18123436 18536103 18957645 19886623
3305 19886623 21478063 21558185 22692249 23679765 24771560 25955526 27808283 29229394 30395546
3296 30395546 30446928 31233178 33013571 35316457 36880691 39908957 42038618 43439911 45842349
$$ packed form
3360A0186858j020164p01056O26338J164064j173850R39414k06260k09033O53644
3351A0259955l89201o51102J05423k47592L07587O97080Q81699j189121N99753
3342A0374481l5762o87680K77830J23667P36854N38417p59327k4834Q14945r08472
3332A0450119J474530m42764L46911Q5776N94806k40256n62292P76783P54767
3323A3238380N64026J87283n78765L24427J8881Q75844K07586J330192K04112
3314A6371966o54209o7735J004740J081977N33721j47024M12667M21542R28978
3305A9886623J591440Q0122J134064R87516J091795J183966J852757J421111J166152
3296C0395546N1382P86250J780393K302886J564234L028266K129661J401293K402438
$$ plain form
3287 45842349 48941447 51939461 55130052 58685555 61666975 64870511 69122666 73673264
3279 73673264 77619470 82065088 85083412 89564993 92962819 96203661 99168406 101250497
3271 101250497 103193977 105000419 106455755 105727944 105945229 106151955 106271216 105935293 104099511
3262 104099511 104185660 102536711 100939810 99108452 96371018 92506849 89312694 86306389
3254 86306389 82803874 78011673 74449008 71393450 67180660 63720430 59794095 55673900
3246 55673900 52152850 49590417 47019291 44225239 42263577 40780269 38459100 37609937
3238 37609937 36466037 35409412 34220332 33582941 31590907 30071665 29310057 28134014
3230 28134014 26857006 26634243 26629067 25446665 24336524 24316136 23621363 23739892 24068064
$$ packed form
3287D5842349L099098K998014L190591L555503K981420L203536M252155M550598
3279G3673264L946206M445618L018324M481581L397826L240842K964745K082091
3271A01250497J943480J806442J455336p27811K17285K06726J19261l35923j835782
3262A04099511Q6149j648949j596901j831358k737434l864169l194155l006305
3254H6306389l502515m792201l562665l055558m212790l460230l926335m120195
3246E5673900l521050k562433k571126k794052j961662j483308k321169q49163
3238C7609937j143900j056625j189080o37391j992034j519242p61608j176043
3230B8134014j277008k22763n176j182402j110141k0388o94773J18529L28172
$$ plain form
3221 24068064 23270244 21993929 21625668 20734376 20581953 20253740 19826684 20076579 20603477
3212 20603477 19494474 18654670 18839012 18756626 18465933 18403180 18251742 18206109 18127211 18032057
3202 18032057 17471821 16743869 16715826 16487663 16987772 16953281 16931754 16548076 16838992 18260113
3192 18260113 18490356 17948006 18559813 18146600 18537947 18047613 18134031 19422369 19529130
3183 19529130 19169878 18172892 17805139 18149701 17173744 15489219 15736506 16043532 15632739
3174 15632739 15299312 15671931 16191889 15687068 15218578 15321629 14897904 14936667 15496617 15064483
3164 15064483 14421032 13858162 14838223 15595681 15254458 15038849 15829995 15916781 15505344 17024822
3154 17024822 17202007 17334655 17741172 18211068 19448795 19222278 18713370 19508677 20372846
$$ packed form
3221B4068064p97820j276315l68261q91292j52423l28213m27056K49895N26898
3212B0603477j109003q39804J84342q2386k90693o2753j51438m5633p8898r5154
3202A8032057n60236p27952k8043k28163N00109l4491k1527l83678K90916J421121
3192A8260113K30243n42350O11807m13213L91347m90334Q6418J288338J06761
3183A9529130l59252r96986l67753L44562r75957j684525K47287L07026m10793
3174A5632739l33427L72619N19958n04821m68490J03051m23725L8763N59950m32134
3164A5064483o43451n62870R80061P57458l41223k15609P91146Q6786m11437J519478
3154A7024822J77185J32648M06517M69896J237727k26517n08908P95307Q64169
$$ plain form
3145 20372846 20860682 21511860 21855079 24126175 24830521 26699825 28826518 29350353 29843154
3136 29843154 31330068 32732000 35333156 36645570 37640769 39374340 39737257 39804199 40297818
3127 40297818 40842985 40565438 40067531 39971754 40678748 39717221 38033064 36860887 35884107
3118 35884107 34995811 34419244 34754208 34230185 34822038 34862676 34399502 34811474 35613393 36959039
3108 36959039 37587976 37506298 37413151 38062311 37931227 37623630 37297493 37270696 36474229 35581227
3098 35581227 34184554 33005280 32421777 30328844 28748559 27718002 26792406 26416647 24314031
3089 24314031 23185070 22507715 21443957 19020715 18903933 18626422 17905832 17000476 15670624
3080 15670624 15464373 15214523 14514434 14208623 12844555 13126953 12190762 13088159 12958250
$$ packed form
3145B0372846M87836O51178L43219K271096P04346J869304K126693N23835M92801
3136B9843154J486914J401932K601156J312414R95199J733571L62917O6942M93619
3127D0297818N45167k77547m97907r5777P06994r61527j684157j172177r76780
3118C5884107q88296n76567L34964n24023N91853M0638m63174M11972Q01919J345646
3108C6959039O28937q1678r3147O49160j31084l07597l26137k6797p96467q93002
3098C5581227j396673j179274n83503k092933j580285j030557r25596l75759k102616
3089B4314031j128961o77355j063758k423242j16782k77511p20590r05356j329852
3080A5670624k06251k49850p00089l05811j364068K82398r36191Q97397j29909
$$ plain form
3071 12958250 12199473 12892981 11729202 11688066 12032677 12355548 11971709 11548883 10896051
3062 10896051 10929014 10416911 11089658 12234177 12394480 11611549 11057092 10897240 11549428
3053 11549428 11355675 11425769 12106413 12486717 12505032 12501999 11916869 12388785 13475783 13219798
3043 13219798 12968810 12306984 11659615 11412257 9891909 8859310 9257515 9609528 9540010
3034 9540010 9174052 9099812 9155918 8007598 8054113 6824499 5963315 6617320 7196859 7239959
3024 7239959 6791322 6574109 6700754 6550324 6778312 6382935 6960948 7093673 6702807 6502081
3014 6502081 6451434 6332537 6030682 6006530 5640538 5159152 5781444 6515648 6878309 7128308
3004 7128308 6859170 6310432 5763677 5927061 5248584 5574922 5284098 5204618 4983187 5424935
$$ packed form
3071A2958250p58777O93508j163779m1136L44611L22871l83839m22826o52832
3062A0896051L2963n12103O72747J144519J60303p82931n54457j59852O52188
3053A1549428j93753P0094O80644L80304J8315l033n85130M71916J086998k55985
3043A3219798k50988o61826o47369k47358j520348j032599L98205L52013o9518
3034I540010l65958p4240N6106j148320M6515j229614q61184O54005N79539M3100
3024G239959m48637k17213J26645j50430K27988l95377N78013J32725l90866k00726
3014F502081n0647j18897l01855k4152l65992m81386O22292P34204L62661K49999
3004G128308k69138n48738n46755J63384o78477L26338k90824p9480k21431M41748
$$ plain form
2994 5424935 4706710 5186337 6340314 6336629 5725627 5554104 5540943 5590148 6082866 5632968
2984 5632968 4674272 4303681 4810643 6122712 6122787 5487533 5885737 5731809 4611149 5049577
2974 5049577 6361225 6386672 6675090 6286733 5675935 6508968 5914112 5664429 6399530 5325897
2964 5325897 5784574 6755893 7207248 7606618 7182890 7631228 7987698 7456100 7044259 7468066
2954 7468066 7793197 7732944 7357437 7839284 7546420 6982179 7156731 7496086 8092653 8750197
2944 8750197 8903826 8028167 7421073 8613889 9377984 9635080 9848919 10170114 10357445
2935 10357445 10828516 11411855 10324599 11108941 11513947 12456640 12621507 11849130 12291301
2926 12291301 12684310 12799592 13697610 14547836 13364592 13191570 14309493 14932690 15762547
$$ packed form
2994E424935p18225M79627J153977l685o11002j71523j3161M9205M92718m49898
2984E632968r58696l70591N06962J312069P5o35254L98204j53928j120660M38428
2974E049577J311648K5447K88418l88357o10798Q33033n94856k49683P35101j073633
2964E325897M58677R71319M51355L99370m23728M48338L56470n31598m11841M23807
2954G468066L25131o0253l75507M81847k92864n64241J74552L39355N96567O57544
2944H750197J53629q75659o07094J192816P64095K57096K13839L21195J87331
2935A0357445M71071N83339j087256P84342M05006R42693J64867p72377M42171
2926A2291301L93009J15282Q98018Q50226j183244j73022J117923O23197Q29857
$$ plain form
2917 15762547 17651372 18011664 17676556 18268382 18834192 18923656 19221008 20489132 22245074
2908 22245074 22816126 23558279 24186442 25204497 27367772 28749335 29957723 30891714 32742032
2899 32742032 34855181 36294843 37316263 39095638 41769131 44331743 45519428 48830141
2891 48830141 50275671 51882682 56045504 59435761 62686097 67939999 72329794 77548741
2883 77548741 82769885 89441913 96672040 104141928 114342898 125037926 136048625 147668536
2875 147668536 160828106 175166599 191343603 208170497 223005514 237913841 250767288
2868 250767288 257313258 258359345 252899471 241041288 225072510 206730539 189452168
2861 189452168 172595417 156783063 142310392 129965422 120114185 110148131 101724141
$$ packed form
2917A5762547J888825L60292l35108N91826N65810Q9464K97352J268124J755942
2908B2245074N71052P42153O28163J018055K163275J381563J208388R33991J850318
2899C2742032K113149J439662J021420J779375K673493K562612J187685L310713
2891D8830141J445530J607011M162822L390257L250336N253902M389795N218947
2883G7548741N221144O672028P230127P469888J0200970J0695028J1010699J1619911
2875A47668536J3159570J4338493J6177004J6826894J4835017J4908327J2853447
2868B50767288O545970J046087n459874j1858183j5968778j8341971j7278371
2861A89452168j6856751j5812354j4472671j2344970r851237r966054q423990
$$ plain form
2854 101724141 94113196 88204385 81918632 77593430 73287797 68394362 64241014 60602038
2846 60602038 57923810 55369839 53257753 50999364 48192777 46126307 42953725 41534160
2838 41534160 39809390 37877091 36733871 35906781 34359740 32736051 33041790 31782800
2830 31782800 30934712 30656329 28857244 27452958 26611939 25687489 25077289 24231954 23708034
2821 23708034 24491919 23426076 22447890 21896746 21193398 20211932 19821618 18860368 17935881
2812 17935881 18454495 17164018 16862222 16792090 15700287 15716865 15891753 15370353 16060614
2803 16060614 15543964 15105184 13833176 13925813 13487504 13260258 12601717 11767364 11818579 12127317
2793 12127317 11469325 10548027 10639512 10800254 10597236 9968448 11157374 10941546 10456043
$$ packed form
2854A01724141p610945n908811o285753m325202m305633m893435m153348l638976
2846F0602038k678228k553971k112086k258389k806587k066470l172582j419565
2838D1534160j724770j932299j143220q27090j547041j623689L05739j258990
2830C1782800q48088k78383j799085j404286q41019r24450o10200q45335n23920
2821B3708034P83885j065843r78186n51144p03348r81466l90314r61250r24487
2812A7935881N18614j290477l01796p0132j091803J6578J74888n21400O90261
2803A6060614n16650m38780j272008R2637m38309k27246o58541q34353N1215L08738
2793A2127317o57992r21298R1485J60742k03018o28788J188926k15828m85503
$$ plain form
2784 10456043 9725585 10128907 10095520 10180660 9703680 8413466 7869147 7825049 8847259 9194068
2774 9194068 9108209 9610199 8809036 7917209 8203956 7338515 7094217 6731080 7060285 6657985
2764 6657985 6593805 7008861 6422076 6275011 5742396 6287271 5985743 6191011 5748933 6102737
2754 6102737 6892120 5689899 5433830 6060801 5552646 5006924 5206442 5339019 4672732
2745 4672732 4627927 5383430 5003381 4725121 4705370 4651824 5091720 4590404 4977929 4608008
2735 4608008 3971145 3855250 5707550 4957181 4066610 4237511 3905619 4417579 4677485
2726 4677485 5106872 4950257 3907394 3336275 2371402 2326561 3516928 3322733 3725948
2717 3725948 3562820 3250277 3590109 3965492 3246994 3068908 3674452 4000557 3678747 3543665
$$ packed form
2784A0456043p30458M03322l3387Q5140m76980j290214n44319m4098J022210L46809
2774I194068q5859N01990q01163q91827K86747q65441k44298l63137L29205m02300
2764F657985o4180M15056n86785j47065n32615N44875l01528K05268m42078L53804
2754F102737P89383j202221k56069O26971n08155n45722J99518J32577o66287
2745D672732m4805P55503l80049k78260j9751n3546M39896n01316L87525l69921
2735D608008o36863j15895J852300p50369q90571J70901l31892N11960K59906
2726D677485M29387j56615j042863n71119r64873m4841J190367j94195M03215
2717C725948j63128l12543L39832L75383p18498j78086O05544L26105l21810j35082
$$ plain form
2707 3543665 3387081 2592100 2319011 2116029 1739055 1737614 2632817 3117476 2614737 3292384
2697 3292384 2674327 2610497 2630023 3273300 3096431 2657120 1536404 2044146 2341203 3086452
2687 3086452 2412191 2487653 3008106 2588859 1489457 1521622 1784961 2196391 1546415 1154724
2677 1154724 2280726 2119090 2375788 2654996 2980917 1841231 1380412 1829734 1847360
2668 1847360 1365068 1938916 1016778 830356 1715452 2069845 2130109 1984411 2514592 2055670
2658 2055670 1636427 1037104 982133 1314124 875457 664612 1070072 1210772 771124 978314
2648 978314 1626993 2507448 2833232 2390915 1759015 1748183 2106551 2092187 1897528 2378548
2638 2378548 1549237 744583 1136212 2588007 2116560 1350831 1279385 989980 1294033 1628171
$$ packed form
2707C543665j56584p94981k73089k02982l76974j441Q95203M84659n02739O77647
2697C292384o18057o3830J9526O43277j76869m39311j120716N07742K97057P45249
2687C086452o74261P5462N20453m19247j099402L2165K63339M11430o49976l91691
2677A154724J126002j61636K56698K79208L25921j139686m60819M49322J7626
2668A847360m82292N73848r22138j86422Q85096L54393O0264j45698N30181m58922
2658B055670m19243n99323n4971L31991m38667k10845M05460J40700m39648K07190
2648I78314O48679Q80455L25784m42317o31900j0832L58368j4364j94659M81020
2638B378548q29311q04654L91629J451795m71447p65729p1446k89405L04053L34138
$$ plain form
2628 1628171 2240618 1889077 785700 173888 1574327 660726 407110 1897636 1731771
2619 1731771 1081970 1571503 1624290 1227029 1395409 441398 892737 1174448 658307 23702
2609 23702 449264 548423 386166 875742 713633 1060372 508530 -471164 1021560 1885718
2599 1885718 1330529 1194523 1034700 171281 660404 912946 1379365 496241 1125953 1040108
2589 1040108 755858 1074248 1532715 2435406 1254420 1113806 1200951 708618 1134559 1223467
2579 1223467 331396 832869 1179282 833193 882998 791899 1044829 621370 555758 1467960
2569 1467960 2558852 1726929 538974 663753 1820317 1302121 804202 94920 1608583
2560 1608583 1091863 628314 944077 444959 565602 1071166 1128898 882113 315048 350453
$$ packed form
2628A628171O12447l51541j103377o11812J400439r13601k53616J490526j65865
2619A731771o49801M89533N2787l97261J68380r54011M51339K81711n16141o34605
2609B3702M25562R9159j62257M89576j62109L46739n51842r79694J492724Q64158
2599A885718n55189j36006j59823q63419M89123K52542M66419q83124O29712q5845
2589A040108k84250L18390M58467R02691j180986j40614Q7145m92333M25941Q8908
2579A223467q92071N01473L46413l46089M9805r1099K52930m23459o5612R12202
2569A467960J090892q31923j187955J24779J156564n18196m97919p09282J513663
2560A608583n16720m63549L15763m99118J20643N05564N7732k46785n67065L5405
$$ plain form
2550 350453 727951 -395063 1092396 1412443 1521395 1323842 954763 106708 -451340
2541 -451340 60540 701908 981245 520636 369604 1028101 1021962 925103 754991 739749
2531 739749 1144227 1921783 1544703 2342620 1288995 1119236 792283 -186214 -100371 146520
2521 146520 -568012 -71878 726695 967791 272423 218151 649304 1056512 633137 703773
2511 703773 836750 1244855 1419572 712633 318766 64650 -573651 523001 561521 622797
2501 622797 514338 -16355 811815 880081 159872 -473754 -379230 -326458 387257 520031
2491 520031 475544 61251 119736 -664088 -253420 271041 428646 1296357 626669 -32806
2481 -32806 412702 580333 441499 50691 -352713 -814632 -364958 -319417 902021 97695
$$ packed form
2550C50453L77498j123014J487459L20047J08952j97553l69079q48055n58048
2541d51340N11880O41368K79337m60609j51032O58497o139r6859j70112j5242
2531G39749M04478P77556l77080P97917j053625j69759l26953r78497Q5843K46891
2521A46520p14532M96134P98573K41096o95368n4272M31153M07208m23375P0636
2511G03773J32977M08105J74717p06939l93867k54116o38301J096652L8520O1276
2501F22797j08459n30693Q28170O8266p20209o33626R4524N2772P13715J32774
2491E20031m4487m14293N8485p83824M10668N24461J57605Q67711o69688o59475
2481c2806M45508J67631j38834l90808m03404m61919M49674M5541J221438q04326
$$ plain form
2471 97695 690273 128099 -335271 1045875 452585 -880273 -1327092 -494880 271996 972162
2461 972162 710117 -99158 -1326190 -269109 -340266 -710085 22725 288663 751107 355916
2451 355916 333988 567301 -21649 -965384 -745144 -607982 -547649 -885780 -459126 -231474
2441 -231474 92089 364744 -334108 -86602 536009 589214 250995 435513 140017 1117727
2431 1117727 793919 769156 -454541 -1357584 -1422016 -886941 -790233 -707482 -583625 -320689
2421 -320689 -245996 -872047 -80277 369680 846572 897946 614038 104551 84198 250034
2411 250034 342599 114501 180758 -256816 267154 334245 102443 -926774 -1304823 -421550
2401 -421550 588819 626907 89343 504449 745652 -82655 -696452 219648 236409 -563802
$$ packed form
2471I7695N92578n62174m63370J381146n93290j332858m46819Q32212P66876P00166
2461I72162k62045q09275j227032J057081p1157l69819P32810K65938M62444l95191
2451C55916k1928K33313n88950r43735K20240J37162O0333l38131M26654K27652
2441b31474L23563K72655o98852K47506O22611N3205l38219J84518k95496R77710
2431A117727l23808k4763j223697r03043o4432N35075R6708Q2751J23857K62936
2421c20689P4693o26051P91770M49957M76892N1374k83908n09487k0353J65836
2411B50034R2565k28098O6257m37574N23970O7091k31802j029217l78049Q83273
2401d21550J010369L8088n37564M15106K41203q28307o13797R16100J6761q00211
$$ plain form
2391 -563802 -613324 -1231121 -220965 81106 -150256 -215178 -36840 -759700 -356398 890914
2381 890914 920084 488748 1265471 810298 366665 610395 -446737 140078 306514 -613205
2371 -613205 306899 1081620 1504631 1013497 409965 159475 -99190 55117 231458 -124570
2361 -124570 167868 412241 618940 764809 319735 1980682 1053986 -488701 -867294
2352 -867294 -1259445 -460598 488432 804916 770238 197753 -228677 -332566 74847 -611371
2342 -611371 -1722163 -976014 -871706 -692645 487869 -76800 -406143 -462697 -98041 125187
2332 125187 326699 -183259 239894 -124520 824533 823431 443445 608836 -142805 -129957
2322 -129957 -75599 -186461 391149 60018 77341 435747 248784 -354534 26963 374213
$$ packed form
2391e63802m9522o17797J010156L02071k31362o4922J78338p22860M03302J247312
2381H90914K9170m31336P76723m55173m43633K43730j057132N86815J66436r19719
2371f13205R20104P74721M23011m91134o03532k50490k58665J54307J76341l56028
2361a24570K92438K44373K06699J45869m45074J660947r26696j542687l78593
2352h67294l92151P98847R49030L16484l4678n72485m26430j03889M07413o86218
2342f11371j110792P46149J04308J79061J180514n64669l29343n6554L64656K23228
2332A25187K01512n09958M23153l64414R49053j102l79986J65391p51641J2848
2322a29957N4358j10862N77610l31131J7323L58406j86963o03318L81497L47250
$$ plain form
2312 374213 -174767 179196 324881 -327134 -437608 -611359 -91660 -209665 -40715 -138134
2302 -138134 -308300 -20780 -381489 28455 900262 651998 283835 340601 425113 547129
2292 547129 -145765 -656673 -1116003 101079 917543 441536 -82950 -794300 -1356571 -231754
2282 -231754 -698844 -660467 -344529 -346565 139147 838505 468501 -147807 -174983 -150936 -467417
2271 -467417 -396854 -80281 -91460 210870 -897652 -1352530 -10638 -16116 178303 721033
2261 721033 903203 557473 114490 454590 339857 -722443 203241 421638 -656049
2252 -656049 -274037 -239197 -52144 -113549 621904 668579 1496612 262346 -246539 996406
2242 996406 1915249 1194856 827175 698834 -956492 -97174 -86643 1004924 1030555 834847
$$ packed form
2312C74213n48980L53963J45685o52015j10474j73751N19699j18005J68950r7419
2302a38134j70166K87520l60709M09944Q71807k48264l68163N6766Q4512J22016
2292E47129o92894n10908m59330J217082Q16464m76007n24486p11350n62271J124817
2282b31754m67090L8377L15938k036M85712O99358l70004o16308k7176K4047l16481
2271d67417P0563L16573j1179L02330j108522m54878J341892n478J94419N42730
2261G21033J82170l45730m42983L40100j14733j062300R25684K18397j077687
2252f56049L82012L4840J87053o1405P35453M6675Q28033j234266n08885J242945
2242I96406R18843p20393l67681j28341j655326Q59318J0531J091567K5631j95708
$$ plain form
2232 834847 1169318 21657 -705334 350008 409369 621070 372929 93512 -256880 -380107
2222 -380107 -204476 795752 36702 -71354 -818656 -814441 -502160 -540482 -24649 -464779
2212 -464779 -584346 -593656 252322 493100 -161115 -611776 -463365 -177261 186135 416921
2202 416921 402294 -1375787 -1242491 -145481 -91000 -636902 -579096 9362 500744 -142671
2192 -142671 -973235 -499811 1430896 1285108 -100100 -74360 -105677 76716 -325166 -696567
2182 -696567 523698 -224088 175128 91937 856118 743329 258289 227207 -629147 -309534
2172 -309534 -245980 -205259 323286 594975 794869 881621 1176901 946899 1604203 1429443
2162 1429443 1963847 2452718 1344648 1025434 930707 1359661 1628233 2343098 1754453 1941516
$$ packed form
2232H34847L34471j147661p26991J055342N9361K11701k48141k79417l50392j23227
2222c80107J75631J000228p59050j08056p47302M215L12281l8322N15833m40130
2212d64779j19567r310Q45978K40778o54215m50661J48411K86104L63396K30786
2202D16921j4627j778081J33296J097010N4481n45902N7806N88458M91382o43415
2192a42671q30564M73424J930707j45788j385208K5740l1317J82393m01882l71401
2182f96567J220265p47786L99216q3191P64181j12789m85040l1082q56354L19613
2172c09534O3554M0721N28545K71689J99894Q6752K95280k30002O57304j74760
2162A429443N34404M88871j108070l19214r4727M28954K68572P14865n88645J87063
$$ plain form
2152 1941516 2809723 2414026 1558758 1239576 1539105 1466953 1248837 655749 453538 25100
2142 25100 1019139 1679168 1642947 2320551 1316203 1154696 1663317 1317334 1280358 1834331
2132 1834331 1141115 725560 1245257 2008220 1720899 1802193 2737010 2897129 2655474 2522694
2122 2522694 2054285 2818649 3269151 2871796 3651405 3578110 3679644 2446535 3612698
2113 3612698 4416131 4398095 5834130 6049115 5526470 5359627 6502046 6534756 7091600 7623602
2103 7623602 9573326 9708205 10425711 11113823 12557613 14921535 16466254 18104189 21754621
2094 21754621 28425550 34620167 42900170 50407441 59343980 64814776 56685675 44218526
2086 44218526 34147096 27134201 22177677 18631941 15589291 14377480 12697264 11354346
$$ packed form
2152A941516Q68207l95697q55268l19182K99529p2152k18116n93088k02211m28438
2142B5100R94039O60029l6221O77604j004348j61507N08621l45983l6976N53973
2132A834331o93216m15555N19697P62963k87321Q1294R34817J60119k41655j32780
2122B522694m68409P64364M50502l97355P79609p3295J01534j233109J166163
2113C612698Q03433j8036J436035K14985n22645j66843J142419L2710N56844N32002
2103G623602J949724J34879P17506O88112J443790K363922J544719J637935L650432
2094B1754621O670929O194617Q280003P507271Q936539N470796q129101j2467149
2086D4218526j0071430p012895m956524l545736l042650j211811j680216j342918
$$ plain form
2078 11354346 10776855 9921403 10143339 9255582 7889001 7136896 6430100 6317922 6240696
2069 6240696 5239022 4571329 4683441 4756408 4711236 4605831 3985357 4149399 4036956 2520093
2059 2520093 3048195 3315573 3226203 3011475 3096196 2058150 2321770 2874549 2210496 2149681
2049 2149681 1826721 2380859 1373806 49715 23840 -31777 612497 725858 507344 1542329
2039 1542329 1120621 1289177 1175711 1892209 1568833 1228513 679670 1449882 887250 1094393
2029 1094393 1085612 1327069 1269971 1276217 1085859 1033855 839602 3019 561827 1826941
2019 1826941 1609393 686745 1198615 1301507 1236093 632899 1021578 1106068 1740844 1128827
2009 1128827 1430382 81269 821803 1074324 1028929 1722786 926335 782486 1144811 1329271
$$ packed form
2078A1354346n77491q55452K21936q87757j366581p52105p06796j12178p7226
2069F240696j001674o67693J12112P2967m5172j05405o20474J64042j12443j516863
2059B520093N28102K67378q9370k14728Q4721j038046K63620N52779o64053o0815
2049B149681l22960N54138j007053j324091k5875n5617O44274J13361k18514J034985
2039A542329m21708J68556j13466P16498l23376l40320n48843P70212n62632K07143
2029A094393q781K41457n7098O246j90358n2004j94253q36583N58808J265114
2019A826941k17548r22648N11870J02892o5414o03194L88679Q4490O34776o12017
2009A128827L01555j349113P40534K52521m5395O93857p96451j43849L62325J84460
$$ plain form
1999 1329271 1111756 1438703 1008810 115914 -72394 4107 -161781 1080767 487009 -302466
1989 -302466 -284042 169812 664022 36533 618159 811478 448420 806167 929844 720218
1979 720218 1048691 -585307 -1017910 326749 -550947 -720092 -187450 -38004 -892910
1970 -892910 -774931 373172 775826 706775 144924 73697 590942 -241880 -240717 -170405
1960 -170405 37054 708035 920566 396687 1363903 920418 213098 184547 244844 107938
1950 107938 664505 1180540 1208060 693879 553936 -14746 113957 209933 96790 -300370
1940 -300370 406436 909768 -133851 157104 -24079 379796 -682929 -798459 -465246
1931 -465246 -874196 -95459 -363625 -86137 79270 -103379 97939 -453372 -567139 -1035491
$$ packed form
1999A329271k17515L26947m29893q92896j88308P6501j65888J242548n93758p89475
1989c02466J8424M53854M94210o27489N81626J93319l63058L57747J23677k09626
1979G20218L28473j633998m32603J344659q77696j69145N32642J49446q54906
1970h92910J17979J148103M02654o9051n61851p1227N17245q32822J163P0312
1960a70405K07459O70981K12531n23879R67216m43485p07320k8551O0297j36906
1950A07938N56567N16035K7520n14181j39943n68682J28703R5976j13143l97160
1940c00370P06806N03332j043619K90955j81183M03875j062725j15530L33213
1931d65246m08950P78737k68166K77488J65407j82649K01318n51311j13767m68352
$$ plain form
1921 -1035491 -473651 325922 223535 -427592 35213 116249 119016 201491 1573644 -269019
1911 -269019 -607618 -690069 -422379 352412 229008 707277 1181209 529756 11103 -459450
1901 -459450 -776406 -723945 127926 221912 351403 1083585 793650 445679 1106290 973008
1891 973008 9862 662148 745878 554487 -212744 401349 376625 776548 830720 922474
1881 922474 20346 -200144 273433 -391410 -390490 -1654979 -660273 -425011 -361066 344101
1871 344101 -861270 -594265 -182404 53559 -190005 -677149 -679581 -1096606 295821 597002
1861 597002 618090 -327186 -283264 761943 1101319 503461 -263387 -276263 260958 1078382
1851 1078382 1036086 396511 387399 -246034 -893075 -498896 -911585 -813449 -932546 -692433
$$ packed form
1921a035491N61840P99573j02387o51127M62805Q1036K767Q2475J372153j842663
1911b69019l38599q2451K67690P74791j23404M78269M73932o51453n18653m70553
1901d59450l16956N2461Q51871R3986J29491P32182k89935l47971O60611j33282
1891I73008r63146O52286Q3730j91391p67231O14093k4724L99923N4172R1754
1881I22474r02128k20490M73577o64843R20j264489R94706K35262O3945P05167
1871C44101j205371K67005M11861K35963k43564m87144k432m17025J392427L01181
1861E97002K1088r45276M3922J045207L39376n97858p66848j2876N37221Q17424
1851A078382m2296o39575r112o33433o47041L94179m12689R8136j19097K40113
$$ plain form
1841 -692433 -70248 -481326 -714723 -598904 -428351 44764 -408682 -366660 -531350 -521715
1831 -521715 -735096 -352323 -120086 123725 -209602 -355115 -560153 -489961 -782000 523083
1821 523083 924745 1145816 151573 877242 1386008 93080 -760056 -1066084 -230022 96575
1811 96575 -400867 99087 772141 248651 764321 823351 686251 1026105 519726 -62635
1801 -62635 564319 -351596 -476389 -182518 -738450 -701947 -266364 267098 -646482 114358
1791 114358 444815 -548236 -783733 -801895 -133401 21869 -455002 -285327 381518 836781
1781 836781 521286 -505756 -625580 -307235 -789405 -579575 -202607 -198104 -796677 -898783
1771 -898783 231154 -9721 196356 -116993 -993059 -482926 -756870 -1077511 159590
$$ packed form
1841f92433O22185m11078k33397J15819J70553M73115m53446M2022j64690R635
1831e21715k13381L82773K32237K43811l33327j45513k05038P0192k92039J305083
1821E23083M01662K21071r94243P25669N08766j292928q53136l06028Q36062L26597
1811I6575m97442M99954O73054n23490N15670N9030j37100L39854n06379n82361
1801f2635O26954r15915j24793K93871n55932L6503M35583N33462r13580P60840
1791A14358L30457r93051k35497j8162O68494J55270m76871J69675O66845M55263
1781H36781l15495j027042j19824L18345m82170K09830L76968M503n98573j02106
1771h98783J129937k40875K06077l13349q76066N10133k73944l20641J237101
$$ plain form
1762 159590 -418024 -183280 264072 261846 -248815 -180858 285991 -33192 -168336 -367136
1752 -367136 617525 -582522 -654741 358880 131762 720413 433508 408495 471589 433905
1742 433905 1122608 96232 -46155 407630 -637640 -221341 156733 469374 855163
1733 855163 1184722 199704 -329591 -70221 74447 201167 221240 35880 457104 725775
1723 725775 445142 426123 349116 238814 -2250 -150561 -581613 -376169 -297921 -613607
1713 -613607 184057 -198876 -350564 11325 -179436 -238826 -182362 18873 382877 385562
1703 385562 554729 -461556 -868724 -960717 -97152 22558 -672473 -1132383 -204981 -108745
1693 -108745 -425572 173512 -241463 75536 482849 5676 -764958 -1067150 -1077211 -991001
$$ packed form
1762A59590n77614K34744M47352k226n10661O7957M66849l19183j35144j98800
1752c67136R84661j200047p2219J013621k27118N88651k86905k5013O3094l7684
1742D33905O88703j026376j42387M53785j045270M16299L78074L12641L85789
1733H55163L29559r85018n29295K59370J44668J26720K0073j85360M21224K68671
1723G25775k80633j9019p7007j10302k41064j48311m31052K05444P8248l15686
1713f13607P97664l82933j51688L61889j90761n9390N6464K01235L64004K685
1703C85562J69167j016285m07168r1993Q63565J19710o95031m59910R27402R6236
1693a08745l16827N99084m14975L16999M07313m77173p70634l02192j0061Q6210
$$ plain form
1683 -991001 -1188905 -707917 -1191273 -577887 -228845 -450121 -1230135 93500 -65559 170970
1673 170970 872004 -602367 -1121672 -1166084 -1050135 -1009759 -863552 -239603 -483203 -1002215
1663 -1002215 -984090 -963981 -599468 -156190 -637864 28120 -439185 -162635 -647661 -480719
1653 -480719 179893 -720020 441569 417638 -107426 -124067 -868983 -747525 -524707 -339785
1643 -339785 424808 840370 600618 202823 816334 693273 -739849 -1178507 -444532 -955378
1633 -955378 -88761 -498752 -1157187 -548859 -169499 -56687 410317 6950 296290 52875
1623 52875 -200018 -201774 245414 270401 -657311 -435073 116811 611751 -100249 -559610
1613 -559610 394932 2597 -105183 634628 -303651 -572509 -28847 -448556 -614553 -275806
$$ packed form
1683i91001j97904M80988m83356O13386L49042k21276p80014J323635j59059K36529
1673A70970P01034j474371n19305m4412J15949M0376J46207O23949k43600n19012
1663a002215J8125K0109L64513M43278m81674O65984m67305K76550m85026J66942
1653d80719O60612q99913J161589k3931n25064j6641p44916J21458K22818J84922
1643c39785P64593M15562k39752l97795O13511j23061j433122m38658P33975n10846
1633i55378Q66617m09991o58435O08328L79360J12812M67004m03367K89340k43415
1623E2875k52893j756M47188K4987r27712K22238N51884M94940p12000m59361
1613e59610R54542l92335j07780P39811r38279k68858N43662m19709j65997L38747
$$ [...]
##END NTUPLES=NMR SPECTRUM
##END=
