##TITLE=1H_TG-2362
 CDCl3
 8 sc, 
 17.10.2022
##JCAMPDX= 6.0         $$ Bruker NMR JCAMP-DX V2.0
##DATA TYPE= NMR SPECTRUM
##DATA CLASS= NTUPLES
##ORIGIN= UXNMR, Bruker Analytische Messtechnik GmbH
##OWNER= root
$$ XWIN-NMR		Version 3.5
$$ Mon Oct 17 15:40:55 2022 Russian Standard Time (UT+4h)  she@DPX200
##.OBSERVE FREQUENCY= 200.1313499994
##.OBSERVE NUCLEUS= ^1H
##.ACQUISITION MODE= SIMULTANEOUS
##.ACQUISITION SCHEME= undefined
##.AVERAGES= 8
##.DIGITISER RES= 18
##SPECTROMETER/DATA SYSTEM= spect
##.PULSE SEQUENCE= zg30
##.SOLVENT NAME= CDCl3
##.SHIFT REFERENCE= (INTERNAL, CDCl3, 0, 15.8846)
##AUDIT TRAIL= $$ (NUMBER, WHEN, WHO, WHERE, WHAT)
$$ ##TITLE= Audit trail, XWIN-NMR		Version 3.5
$$ ##JCAMPDX= 5.01
$$ ##ORIGIN= Bruker BioSpin GmbH
$$ ##OWNER= she
$$ F:/spectra/data/she/nmr/H-F/1/pdata/1/auditp.txt
$$ ##AUDIT TRAIL=  $$ (NUMBER, WHEN, WHO, WHERE, WHAT)
(   1,<2022-10-17 15:39:58.06 +0400>,<she>,<DPX200>,
      <created by zg, POWCHK disabled, PULCHK disabled
       configuration hash MD5:
       00 E9 B6 7A A2 85 ED C7 34 08 36 98 17 FE 4E 26
       data hash MD5: 16K
       9D 56 C5 1C 5A F1 D8 00 17 5E A2 36 99 28 6B 95>)
(   2,<2022-10-17 15:40:00.51 +0400>,<she>,<DPX200>,
      <Start of raw data processing
       efp BC_mod = 2 LB = 0.24 FT_mod = 6 PKNL = 1 PHC0 = -18195.08 PHC1 = 13.00069 SI = 16K 
       data hash MD5: 16K
       9F BA 4E 30 25 9E C2 B3 11 B7 3B 0C B9 24 AB A4>)
(   3,<2022-10-17 15:40:15.79 +0400>,<she>,<DPX200>,
      <pk PHC0 = 0.3811266 PHC1 = 0.7999998 
       data hash MD5: 16K
       DF 87 D2 35 21 36 51 A4 8E 6C DC 6F CC C9 14 F7>)
(   4,<2022-10-17 15:40:18.81 +0400>,<she>,<DPX200>,
      <abs ABSG = 5 
       data hash MD5: 16K
       0D 0E 3E 24 9E 69 9D E5 AE 92 27 6F 2D 13 01 AC>)
$$ ##END=
$$ 
$$ hash MD5
$$ 65 EC 36 F7 53 F9 81 35 28 28 D7 18 0C 50 93 42
##$RELAX= 
##$RELAX= 
##$RELAX= 
##$RELAX= 
##$RELAX= 
##$RELAX= 
$$ Bruker specific parameters
$$ --------------------------
##$DU= <F:/spectra>
##$EXPNO= 1
##$NAME= <H-F>
##$PROCNO= 1
##$TYPE= <nmr>
##$USER= <she>
##$AMP= (0..31)
100 100 100 100 100 100 100 100 100 100 100 100 100 100 100 100 100 100 
100 100 100 100 100 100 100 100 100 100 100 100 100 100 
##$AQSEQ= 0
##$AQ_mod= 1
##$AUNM= <au_zg>
##$AUTOPOS= <>
##$BF1= 200.13
##$BF2= 200.13
##$BF3= 200.13
##$BF4= 200.13
##$BF5= 200.13
##$BF6= 200.13
##$BF7= 200.13
##$BF8= 200.13
##$BYTORDA= 1
##$CFDGTYP= 0
##$CFRGTYP= 5
##$CHEMSTR= <none>
##$CNST= (0..31)
1 1 145 1 1 1 1 1 1 1 1 1 1 1 1 1 1 1 1 1 1 1 1 1 1 1 1 1 1 1 1 1 
##$CPDPRG= <>
##$CPDPRG1= <>
##$CPDPRG2= <>
##$CPDPRG3= <>
##$CPDPRG4= <mlev>
##$CPDPRG5= <mlev>
##$CPDPRG6= <mlev>
##$CPDPRG7= <mlev>
##$CPDPRG8= <mlev>
##$CPDPRGB= <>
##$CPDPRGT= <>
##$D= (0..31)
0 1.2 0 0 0 0 0 0 0 0.06 0 0.03 0 0 0 0 0.0002 0 0 0 0 0 0 0 0 0 0 0 0 
0 0 0 
##$DATE= 1666006797
##$DBL= (0..7)
120 120 120 120 120 120 120 120 
##$DBP= (0..7)
150 150 150 150 150 150 150 150 
##$DBP07= 0
##$DBPNAM0= <>
##$DBPNAM1= <>
##$DBPNAM2= <>
##$DBPNAM3= <>
##$DBPNAM4= <>
$$ [...]
##$SUBNAM3= <"">
##$SUBNAM4= <"">
##$SUBNAM5= <"">
##$SUBNAM6= <"">
##$SUBNAM7= <"">
##$SUBNAM8= <"">
##$SUBNAM9= <"">
##$SW= 18.0517283424941
##$SWIBOX= (0..15)
0 0 2 0 0 0 0 0 0 0 0 0 0 0 0 0 
##$SW_h= 3612.71676300578
##$TD= 16384
##$TD0= 1
##$TE= 0
##$TE2= 300
##$TE3= 300
##$TEG= 300
##$TL= (0..7)
0 120 120 120 120 120 120 120 
##$TP= (0..7)
150 150 150 150 150 150 150 150 
##$TP07= 0
##$TPNAME0= <>
##$TPNAME1= <>
##$TPNAME2= <>
##$TPNAME3= <>
##$TPNAME4= <>
##$TPNAME5= <>
##$TPNAME6= <>
##$TPNAME7= <>
##$TPOAL= (0..7)
0.5 0.5 0.5 0.5 0.5 0.5 0.5 0.5 
##$TPOFFS= (0..7)
0 0 0 0 0 0 0 0 
##$TUNHIN= 0
##$TUNHOUT= 0
##$TUNXOUT= 0
##$USERA1= <user>
##$USERA2= <user>
##$USERA3= <user>
##$USERA4= <user>
##$USERA5= <user>
##$V9= 5
##$VALIST= <valist>
##$VCLIST= <CCCCCCCCCCCCCCC>
##$VD= 0
##$VDLIST= <DDDDDDDDDDDDDDD>
##$VPLIST= <PPPPPPPPPPPPPPP>
##$VTLIST= <TTTTTTTTTTTTTTT>
##$WBST= 1024
##$WBSW= 4
##$XGAIN= (0..3)
0 0 0 0 
##$XL= 0
##$YL= 0
##$YMAX_a= 378537
##$YMIN_a= -230591
##$ZGOPTNS= <>
##$ZL1= 120
##$ZL2= 120
##$ZL3= 120
##$ZL4= 120
##$ABSF1= 15.88462
##$ABSF2= -2.167232
##$ABSG= 5
##$ABSL= 3
##$ALPHA= 0
##$AQORDER= 0
##$ASSFAC= 0
##$ASSFACI= 0
##$ASSFACX= 0
##$ASSWID= 0
##$AUNMP= <proc_1d>
##$AZFE= 0.1
##$AZFW= 0.1
##$BCFW= 0
##$BC_mod= 2
##$BYTORDP= 0
##$COROFFS= 0
##$CY= -3
##$DATMOD= 1
##$DC= 0
##$DFILT= <>
##$DTYPP= 0
##$F1P= 0
##$F2P= 0
##$FCOR= 1
##$FTSIZE= 16384
##$FT_mod= 6
##$GAMMA= 0
##$GB= 0
##$INTBC= 1
##$INTSCL= 3.70164e-10
##$ISEN= 128
##$LB= 0.24
##$LEV0= 0
##$LPBIN= 0
##$MAXI= 10000
##$MC2= 0
##$MEAN= 0
##$ME_mod= 0
##$MI= 1.114404
##$NCOEF= 0
##$NC_proc= -6
##$NLEV= 6
##$NOISF1= 3.799351
##$NOISF2= 2.8
##$NSP= 0
##$NTH_PI= 0
##$NZP= 0
##$OFFSET= 15.88462
##$PC= 1
##$PHC0= -18194.7
##$PHC1= 13.80069
##$PH_mod= 1
##$PKNL= yes
##$PPARMOD= 0
##$PSCAL= 0
##$PSIGN= 0
##$REVERSE= no
##$SF= 200.129977369913
##$SI= 16384
##$SIGF1= 3
##$SIGF2= 2
##$SINO= 5.538805
##$SIOLD= 16384
##$SREGLST= <1H.CDCl3>
##$SSB= 0
##$STSI= 16384
##$STSR= 0
##$SW_p= 3612.71676300578
##$SYMM= 0
##$S_DEV= 0
##$TDeff= 16384
##$TDoff= 0
##$TI= <>
##$TILT= no
##$TM1= 0
##$TM2= 0
##$TOPLEV= 0
##$USERP1= <user>
##$USERP2= <user>
##$USERP3= <user>
##$USERP4= <user>
##$USERP5= <user>
##$WDW= 1
##$XDIM= 16384
##$YMAX_p= 325560196
##$YMIN_p= -351737
$$ End of Bruker specific parameters
$$ ---------------------------------
##NTUPLES= NMR SPECTRUM
##VAR_NAME=  FREQUENCY,     SPECTRUM/REAL,   SPECTRUM/IMAG
##SYMBOL=    X,             R,               I
##VAR_TYPE=  INDEPENDENT,   DEPENDENT,       DEPENDENT
##VAR_FORM=  AFFN,          ASDF,            ASDF
##VAR_DIM=   16384,         16384,           16384
##UNITS=     HZ,            ARBITRARY UNITS, ARBITRARY UNITS
##FACTOR=    0.220516191357247, 1,           1
##FIRST=     3178.98858365826, 0,            0
##LAST=      -433.72817934752, 0,            0
##MIN=       -433.72817934752, -351737,      0
##MAX=       3178.98858365826, 325560196,    0
$$ Real data points
##PAGE= N=1
##DATA TABLE= (X++(R..R)), XYDATA
$$ [...]
$$ plain form
6140 1089249 1125004 1158762 1195435 1237716 1296790 1330090 1339410 1395270 1453711 1497367 1536927 1582869
6128 1582869 1619729 1650527 1708483 1784536 1829466 1880280 1935560 2001386 2026107 2065799 2112450
6117 2112450 2168872 2226923 2284812 2365332 2421808 2490504 2534217 2651736 2771769 2847124 2923117
6106 2923117 2992259 3051346 3114834 3201293 3289696 3402752 3462837 3555991 3648526 3764106 3836318
6095 3836318 3914690 4057295 4176404 4287027 4419101 4584879 4706194 4757813 4834831 4869791
6085 4869791 4892207 4861159 4882023 4864353 4773414 4715356 4692945 4645492 4568567 4567506 4592391 4552625
6073 4552625 4563357 4606002 4642118 4690996 4719992 4727628 4741452 4734414 4705528 4627847 4542926 4472721
6061 4472721 4410870 4325594 4219042 4148327 4040479 3878632 3782466 3676740 3549387 3450319
$$ packed form
6140A089249L5755L3758L6673M2281N9074L3300R320N5860N8441M3656L9560M5942
6128A582869L6860L0798N7956P6053M4930N0814N5280O5826K4721L9692M6651
6117B112450N6422N8051N7889Q0520N6476O8696M3713J17519J20033P5355P5993
6106B923117O9142N9087O3488Q6459Q8403J13056O0085R3154R2535J15580P2212
6095C836318P8372J42605J19109J10623J32074J65778J21315N1619P7018L4960
6085D869791K2416l1048K0864j7670r0939n8058k2411m7453p6925j061K4885l9766
6073D552625J0732M2645L6116M8878K8996P636J3824p038k8886p7681q4921p0205
6061D472721o1851q5276j06552p0715j07848j61847r6166j05726j27353r9068
$$ plain form
6051 3450319 3305675 3197223 3109087 3033112 3009520 2932340 2867071 2788417 2767029 2717243 2636417
6040 2636417 2598440 2582400 2561674 2574514 2569870 2538653 2503624 2511110 2459134 2401094 2356797 2296016
6028 2296016 2278745 2196969 2126762 2040859 1977720 1936872 1907083 1862664 1835383 1801160 1818134
6017 1818134 1821345 1797024 1795834 1814218 1768695 1751903 1812009 1833686 1834784 1867297 1871079 1874634
6005 1874634 1844523 1813575 1794074 1737226 1720030 1721583 1684902 1648089 1617720 1634071 1618974 1633145
5993 1633145 1656839 1666159 1654653 1655070 1677203 1659529 1683672 1720992 1740002 1750703 1776934 1824174
5981 1824174 1890103 1969764 2009503 2087370 2153088 2194967 2231115 2278567 2317896 2328063 2343953
5970 2343953 2387625 2408748 2452024 2470450 2500690 2530565 2593171 2638545 2655177 2710586 2757403
$$ packed form
6051C450319j44644j08452q8136p5975k3592p7180o5269p8654k1388m9786q0826
6040B636417l7977j6040k0726J2840m644l1217l5029P486n1976n8040m4297o0781
6028B296016j7271q1776p0207q5903o3139m0848k9789m4419k7281l4223J6974
6017A818134L211k4321j190J8384m5523j6792O0106K1677J098L2513L782L555
6005A874634l0111l0948j9501n6848j7196J553l6681l6813l0369J6351j5097J4171
5993A633145K3694R320j1506M17K2133j7674K4143L7320J9010J0701K6231M7240
5981A824174O5929P9661L9739P7867O5718M1879L6148M7452L9329J0167J5890
5970B343953M3672K1123M3276J8426L0240K9875O2606M5374J6632N5409M6817
$$ plain form
5959 2757403 2817045 2877648 2907090 2942201 3022475 3087067 3127520 3200098 3287006 3390537 3463221
5948 3463221 3569769 3652775 3751704 3875544 3950579 4052608 4163441 4271133 4357834 4532146
5938 4532146 4676342 4818936 5021336 5255043 5525301 5874969 6279575 6743776 7316025 8013211
5928 8013211 8778518 9586217 10587467 11868410 13427046 15011726 16139689 16169240 15032496
5919 15032496 13487102 11971393 10718307 9859697 9347443 9029726 8823406 8709781 8684729
5910 8684729 8737759 8821259 8968585 9208127 9469460 9780028 10152428 10603413 11195522 11933238
5900 11933238 12930920 14161432 15589950 17295279 19235432 21348015 23958868 27364570
5892 27364570 31601443 36292999 40061049 40856155 37651644 32462437 27300705 22892682
$$ packed form
5959B757403N9642O0603K9442L5111Q0274O4592M0453P2578Q6908J03531P2684
5948C463221J06548Q3006R8929J23840P5035J02029J10833J07692Q6701J74312
5938D532146J44196J42594K02400K33707K70258L49668M04606M64201N72249O97186
5928H013211P65307Q07699J001250J280943J558636J584680J127963K9551j136744
5919A5032496j545394j515709j253086q58610n12254l17717k06320j13625k5052
5910H684729N3030Q3500J47326K39542K61333L10568L72400M50985N92109P37716
5900A1933238R97682J230512J428518J705329J940153K112583K610853L405702
5892B7364570M236873M691556L768050P95106l204511n189207n161732m408023
$$ plain form
5884 22892682 19648680 17377786 15790514 14662861 13821870 13174799 12688361 12338249 12081256
5875 12081256 11915429 11868079 11914446 12048027 12326274 12778001 13371516 14179991 15237826 16522512
5865 16522512 18115074 19929606 21937330 24360664 27523854 31576393 36211412 40251064
5857 40251064 41690085 39037549 33736243 28197513 23322340 19567646 16939768 15027117
5849 15027117 13600366 12540087 11673700 10960495 10357717 9891942 9453969 9123287 8875917
5840 8875917 8689565 8605141 8591047 8646846 8830940 9055627 9380680 9839294 10349179 10941360
5830 10941360 11641053 12568364 13803342 15296267 16649450 17234308 16482072 14794561 12924221
5821 12924221 11187296 9843211 8894664 8196541 7720396 7342969 7050708 6774729 6466726
$$ packed form
5884B2892682l244002k270894j587272j127653q40991o47071m86438l50112k56993
5875A2081256j65827m7350M6367J33581K78247M51727N93515Q08475J057835J284686
5865A6522512J592562J814532K007724K423334L163190M052539M635019M039652
5857D0251064J439021k652536n301306n538730m875173l754694k627878j912651
5849A5027117j426751j060279q66387p13205o02778m65775m37973l30682k47370
5840H875917j86352q4424j4094N5799J84094K24687L25053M58614N09885N92181
5830A0941360O99693R27311J234978J492925J353183N84858p52236j687511j870340
5821A2924221j736925j344085r48547o98123m76145l77427k92261k75979l08003
$$ plain form
5812 6466726 6222056 5951227 5673893 5490131 5338081 5159633 5059952 4972432 4866011 4814514
5802 4814514 4788034 4744145 4695882 4646699 4602076 4597535 4577005 4574543 4560916 4530017 4472096 4404733
5790 4404733 4347137 4316037 4267594 4168704 4185041 4197730 4219617 4252710 4257008 4322036 4373860 4506040
5778 4506040 4637198 4733267 4889184 5034121 5256055 5472847 5704274 5908150 6101168 6208688
5768 6208688 6288058 6306501 6237524 6137282 6010570 5913349 5789522 5692970 5641830 5671826 5683453
5757 5683453 5743096 5865753 6010403 6159636 6345907 6585891 6840028 7096059 7343925 7579779
5747 7579779 7737569 7880235 7950118 7971111 7877101 7738574 7600486 7358691 7137482 6919349
5737 6919349 6670033 6413007 6189050 6012176 5893589 5817176 5776165 5765080 5788469 5846535
$$ packed form
5812F466726k44670k70829k77334j83762j52050j78448r9681q7520j06421n1497
5802D814514k6480m3889m8263m9183m4623m541k0530k462j3627l0899n7921o7363
5790D404733n7596l1100m8443r8890J6337J2689K1887L3093M298O5028N1824J32180
5778D506040J31158R6069J55917J44937K21934K16792K31427K03876J93018J07520
5768F208688P9370J8443o8977j00242j26712r7221j23827r6552n1140K9996J1627
5757E683453N9643J22657J44650J49233J86271K39984K54137K56031K47866K35854
5747G579779J57790J42666O9883K0993r4010j38527j38088k41795k21209k18133
5737F919349k49316k57026k23957j76874j18587p6413m1011j1085K3389N8066
$$ plain form
5727 5846535 5938607 6050245 6169318 6304420 6503757 6682923 6897654 7102793 7279742 7364749
5717 7364749 7448990 7520523 7528509 7459959 7284466 7041676 6762489 6487362 6207533 5988024
5707 5988024 5795817 5656519 5528561 5439357 5337344 5287052 5270251 5248236 5268698 5282352 5282452
5696 5282452 5295376 5273608 5243876 5212372 5167479 5114115 5108726 5102262 5072417 5053628 5054548 5034454
5684 5034454 5052617 5048375 5037841 4982733 4874692 4713720 4465805 4212527 4014686 3867441
5674 3867441 3729666 3629959 3511305 3356527 3203612 3088937 2970841 2849953 2727942 2645145
5664 2645145 2540287 2455848 2366365 2274463 2237491 2175111 2085129 2026766 1952069 1883242 1872097
5653 1872097 1874568 1845592 1865451 1882692 1871320 1827713 1764438 1708397 1650835 1557929 1461116 1445999
$$ packed form
5727E846535R2072J11638J19073J35102J99337J79166K14731K05139J76949Q5007
5717G364749Q4241P1533P986o8550j75493k42790k79187k75127k79829k19509
5707E988024j92207j39298j27958q9204j02013n0292j6801k2015K0462J3654J00
5696E282452J2924k1768k9732l1504m4893n3364n389o464k9845j8789R20k0094
5684E034454J8163m242j0534n5108j08041j60972k47915k53278j97841j47245
5674C867441j37775r9707j18654j54778j52915j14675j18096j20888j22011q2797
5664B645145j04858q4439q9483r1902l6972o2380q9982n8363p4697o8827j1145
5653A872097K471k8976J9859J7241j1372m3607o3275n6041n7562r2906r6813j5117
$$ plain form
5641 1445999 1425137 1381406 1337848 1325388 1294302 1251375 1216918 1173464 1171691 1141930 1105962 1072785
5629 1072785 1052669 1053445 1060098 1031347 1008136 1016797 995160 970345 956460 945447 933872 931064
5617 931064 934955 922030 924061 920719 896887 890380 871780 878419 893283 895275 857510 858643 831737
5604 831737 834034 817768 789981 806042 814877 827212 847744 825552 826228 835860 799215 784345 773084
5591 773084 771550 773928 804859 827594 810948 790074 836967 835803 834342 831341 853228 852448 862206
5578 862206 830566 851746 869985 850377 848095 827408 816077 816896 844515 824207 831227 827903 826751
5565 826751 807580 784783 803505 832825 833252 839640 881642 896803 888390 909279 902828 919043 977701
5552 977701 987283 1002184 961412 979087 1008161 1036194 1081336 1074591 1020840 968874 928795 884290
$$ packed form
5641A445999k0862m3731m3558j2460l1086m2927l4457m3454j773k9761l5968l3177
5629A072785k0116P76O653k8751k3211Q661k1637k4815j3885j1013j1575k808
5617I31064L891j2925K031l342k3832o507j8600O639J4864J992l7765J133k6906
5604H31737K297j6266k7787J6061Q835J2335K0532k2192O76R632l6645j4870j1261
5591G73084j534K378L0931K2735j6646k0874M6893j164j461l001K1887p80R758
5578H62206l1640K1180J8239j9608k282k0687j1331Q19K7619k0308P020l324j152
5565H26751j9171k2797J8722K9320M27O388M2002J5161q413K0889o451J6215N8658
5552I77701R582J4901m0772J7675K9074K8033M5142o745n3751n1966m0079m4505
$$ plain form
5540 884290 906975 905004 916477 948055 945544 949945 951627 952109 955182 942688 967464 962622 955675
5527 955675 981449 977896 934808 970751 1012389 1006415 1019632 996273 964736 934783 970243 998806
5515 998806 1009311 1046080 1010838 978584 955373 927535 924961 921513 893276 872052 887787 898332
5503 898332 905217 915561 928182 931808 949662 961604 951355 940866 954133 975834 977143 961155
5491 961155 938256 938542 965233 976764 967615 978286 981054 1016527 1052444 1074262 1039092 1037787 1055675
5478 1055675 1109956 1127645 1125020 1130006 1180371 1220652 1222887 1227129 1211830 1215030 1242005 1230986
5466 1230986 1192088 1139445 1098635 1079027 1089871 1072798 1077131 1076397 1088168 1081493 1100192 1095350
5454 1095350 1080445 1103092 1124724 1133083 1164125 1200781 1261432 1306069 1302623 1300899 1253403 1297773
$$ packed form
5540H84290K2685j971J1473L1578k511M401J682M82L073j2494K4776m842o947
5527I55675K5774l553m3088L5943M1638n974J3217k3359l1537k9953L5460K8563
5515I98806J0505L6769l5242l2254k3211k7838k574l448k8237k1224J5735J0545
5503H98332O885J0344J2621L626J7854J1942j0249j0489J3267K1701J309j5988
5491I61155k2899K86K6691J1531r149J0671K768L5473L5917K1818l5170j305J7888
5478A055675N4281J7689k625M986N0365M0281K235M242j5299L200K6975j1019
5466A230986l8898n2643m0810j9608J0844j7073M333p34J1771o675J8699m842
5454A095350j4905K2647K1632Q359L1042L6656O0651M4637l446j724m7496M4370
$$ plain form
5442 1297773 1274436 1241948 1212956 1203593 1194193 1196014 1177918 1187013 1215778 1201506 1153069 1184895
5430 1184895 1203983 1216890 1234724 1232246 1254056 1250907 1260297 1296410 1294152 1316728 1355232 1371531
5418 1371531 1367422 1402046 1420031 1476116 1470956 1487589 1534980 1545620 1591299 1644127 1642069 1673678
5406 1673678 1731338 1772183 1822221 1851168 1905668 1935084 1980914 2054736 2115465 2152244 2230931
5395 2230931 2329598 2384652 2444320 2548916 2618951 2734528 2874047 2991878 3167783 3341528
5385 3341528 3467399 3645408 3885338 4129863 4413745 4720036 5078548 5482783 5986531 6550858
5375 6550858 7138176 7725260 8120268 8242941 8035937 7585423 7095255 6658986 6283083 6006284
5365 6006284 5817834 5731231 5730897 5754448 5826795 5970421 6142763 6350618 6603026 6901586 7269237
$$ packed form
5442A297773k3337l2488k8992r363r400J821j8096R095K8765j4272m8437L1826
5430A184895J9088J2907J7834k478K1810l149R390L6113k258K2576L8504J6299
5418A371531m109L4624J7985N6085n160J6633M7391J0640M5679N2828k058L1609
5406A673678N7660M0845N0038K8947N4500K9416M5830P3822O0729L6779P8687
5395B230931R8667N5054N9668J04596P0035J15577J39519J17831J75905J73745
5385C341528J25871J78009K39930K44525K83882L06291L58512M04235N03748N64327
5375F550858N87318N87084L95008J22673k07004m50514m90168m36269l75903k76799
5365F006284j88450q6603l34K3551P2347J43626J72342K07855K52408K98560L67651
$$ plain form
5354 7269237 7718277 8230325 8892138 9646133 10499623 11457910 12503387 13391940 13894006
5345 13894006 13767754 13018833 11914579 10672478 9568297 8640603 7923866 7384652 6987500
5336 6987500 6731755 6526393 6380391 6249938 6199657 6199458 6196384 6253210 6400824 6614892 6856776
5325 6856776 7144892 7490450 7894203 8402648 8911670 9325863 9510764 9336964 8852136 8165619
5315 8165619 7461778 6824276 6299286 5866654 5538547 5269299 5080237 4959862 4846367 4764762
5305 4764762 4687498 4582357 4481240 4342783 4188128 4043325 3940182 3803875 3658983 3561765
5295 3561765 3433001 3332880 3258409 3207473 3153280 3073748 3007851 2958158 2872889 2843214 2870297
5284 2870297 2870584 2886653 2885720 2908025 2903452 2951570 2971624 2969801 3017258 3060872 3057085 3051031 3037620
$$ packed form
5354G269237M49040N12048O61813P53995Q53490R58287J045477Q88553N02066
5345A3894006j26252p48921j104254j242101j104181r27694p16737n39214l97152
5336F987500k55745k05362j46002j30453n0281j99l074N6826J47614K14068K41884
5325F856776K88116L45558M03753N08445N09022M14193J84901j73800m84828o86517
5315H165619p03841o37502n24990m32632l28107k69248j89062j20375j13495q1605
5305D764762p7264j05141j01117j38457j54655j44803j03143j36307j44892r7218
5295C561765j28764j00121p4471n0936n4193p9532o5897m9693q5269k9675K7083
5284B870297K87J6069r33K2305m573M8118K0054j823M7457M3614l787o054j3411
$$ plain form
5271 3037620 3040252 3027989 2983309 2953837 2941243 2909030 2881080 2909323 2910789 2904838 2898910 2892988
5259 2892988 2893432 2870403 2873003 2881701 2853923 2894158 2971419 2979538 2996583 3072886 3125107 3188940
5247 3188940 3245098 3299869 3350398 3401597 3471898 3552266 3623868 3680666 3730368 3808779 3923897
5236 3923897 4048134 4138516 4208205 4208051 4170655 4165145 4173832 4218026 4257082 4301630 4368664 4478441
5224 4478441 4667453 4869337 5121966 5409207 5772552 6246618 6729466 7281530 8037726 8742404
5214 8742404 9292365 9383431 9001078 8382582 7748479 7256300 6901191 6702180 6549397 6386700
5204 6386700 6134956 5954325 5831537 5752095 5739523 5791493 5925612 6079153 6270968 6521115
5194 6521115 6838957 7216288 7647862 8207494 8883625 9602190 10471582 11602341 12986634
$$ packed form
5271C037620K632j2263m4680k9472j2594l2213k7950K8243J466n951n928n922
5259B892988M44k3029K600Q698k7778M0235P7261Q119J7045P6303N2221O3833
5247C188940N6158N4771N0529N1199P0301Q0368P1602N6798M9702P8411J15118
5236C923897J24237R0382O9689j54l7396n510Q687M4194L9056M4548O7034J09777
5224D478441J89012K01884K52629K87241L63345M74066M82848N52064P56196P04678
5214H742404N49961R1066l82353o18496o34103m92179l55109j99011j52783j62697
5204F386700k51744j80631j22788p9442j2572N1970J34119J53541J91815K50147
5194F521115L17842L77331M31574N59632O76131P18565Q69392J130759J384293
$$ plain form
5185 12986634 14432108 15490944 15616081 14697843 13157846 11514051 10041139 8902018
5177 8902018 8033455 7354495 6829154 6416083 6111295 5863898 5701668 5544636 5468809 5386926
5167 5386926 5356689 5408014 5530146 5684119 5919404 6179642 6429765 6693804 6933147 7259132
5157 7259132 7726431 8357955 8976472 9442631 9456857 8921439 8065604 7124724 6332738 5681004
5147 5681004 5152994 4778406 4546436 4321886 4121777 4021750 3908367 3804170 3722262 3666396
5137 3666396 3630351 3591005 3558228 3540679 3523692 3522463 3547324 3557860 3548837 3543048 3555991 3513080
5125 3513080 3434104 3362228 3318053 3265942 3233710 3200574 3184545 3172011 3141711 3137349 3168668 3187004
5113 3187004 3155813 3090700 3099115 3106177 3099493 3106360 3054607 3028536 3021443 3011934 2994327 2978087 2981561
$$ packed form
5185A2986634J445474J058836J25137r18238j539997j643795j472912j139121
5177H902018q68563o78960n25341m13071l04788k47397j62230j57032p5827q1883
5167E386926l0237N1325J22132J53973K35285K60238K50123K64039K39343L25985
5157G259132M67299O31524O18517M66159J4226n35418q55835r40880p91986o51734
5147E681004n28010l74588k31970k24550k00109j00027j13383j04197q1908n5866
5137C666396l6045l9346l2777j7549j6987j229K4861J0536r023n789J2943m2911
5125C513080p8976p1876m4175n2111l2232l3136j6029j2534l0300m362L1319J8336
5113C187004l1191o5113Q415P062o684O867n1753k6071p093r509j7607j6240L474
$$ plain form
5100 2981561 3018829 3029633 3049901 3089383 3115146 3158562 3176624 3200354 3185188 3177935 3172665 3159071
5088 3159071 3161649 3121697 3052906 3031288 3034228 3011576 3009101 2993456 2959610 2954918 2935702 2913645
5076 2913645 2927107 2945441 2932437 2898404 2914567 2954984 2981341 3026886 3023725 3060921 3079847 3051705
5064 3051705 3050810 3017620 3024475 3021117 2972636 2956474 2950737 2924459 2915361 2874943 2833399 2838158 2823888
5051 2823888 2811138 2832173 2794094 2778926 2775761 2766710 2787172 2780342 2791758 2806760 2846367 2898955
5039 2898955 2941782 2986899 3023915 3038982 3059095 3135781 3164000 3191551 3251784 3342635 3419724
5028 3419724 3512235 3599171 3648710 3610165 3503237 3368833 3263052 3217039 3162126 3133464 3119523
5017 3119523 3075143 3098851 3086729 3099192 3099495 3122863 3171400 3192117 3216103 3273062 3302385 3330001
$$ packed form
5100B981561L7268J0804K0268L9482K5763M3416J8062K3730j5166p253n270j3594
5088C159071K578l9952o8791k1618K940k2652k475j5645l3846m692j9216k2057
5076B913645J3462J8334j3004l4033J6163M0417K6357M5545l161L7196J8926k8142
5064C051705q95l3190O855l358m8481j6162n737k6278r098m0418m1544M759j4270
5051B823888j2750K1035l8079j5168l165r051K0462o830J1416J5002L9607N2588
5039B898955M2827M5117L7016J5067K0113P6686K8219K7551O0233R0851P7089
5028C419724R2511Q6936M9539l8545j06928j34404j05781m6013n4913k8662j3941
5017C119523m4380K3708j2122J2463L03K3368M8537K0717K3986N6959K9323K7616
$$ plain form
5005 3330001 3384344 3439376 3517173 3582709 3623794 3684621 3775362 3835728 3911752 3996120 4086873
4994 4086873 4125718 4201646 4310425 4395568 4497748 4601470 4703352 4856846 5075940 5277381
4984 5277381 5426400 5577754 5694535 5818347 5921367 5972726 6056518 6098060 6105632 6106487 6116614
4973 6116614 6157475 6123088 6098401 6082275 6120027 6159950 6169197 6238665 6291367 6364453 6431755 6463632
4961 6463632 6585298 6729992 6837471 6996095 7174899 7320570 7510428 7785789 7983497 8173962
4951 8173962 8348044 8461471 8509127 8474269 8444767 8367287 8254205 8142508 8085192 8031984 8008008
4940 8008008 7994941 7952436 7998434 8018741 8052303 8159803 8261798 8421155 8571330 8761513
4930 8761513 8940848 9108371 9284892 9471305 9740748 9982306 10214342 10467649 10791921 11127492
$$ packed form
5005C330001N4343N5032P7797O5536M1085O0827R0741O0366P6024Q4368R0753
4994D086873L8845P5928J08779Q5143J02180J03722J01882J53494K19094K01441
4984E277381J49019J51354J16781J23812J03020N1359Q3792M1542P572Q55J0127
4973F116614M0861l4387k4687j6126L7752L9923R247O9468N2702P3086O7302L1877
4961F463632J21666J44694J07479J58624J78804J45671J89858K75361J97708J90465
4951H173962J74082J13427M7656l4858k9502p7480j13082j11697n7316n3208k3976
4940H008008j3067m2505M5998K0307L3562J07500J01995J59357J50175J90183
4930H761513J79335J67523J76521J86413K69443K41558K32036K53307L24272L35571
$$ plain form
4920 11127492 11501536 11851653 12212662 12549173 12888558 13219303 13557858 13975836 14462309
4911 14462309 14978801 15549148 16232991 16983125 17866343 18756385 19765053 20858896 21964884
4902 21964884 22979642 23737308 24135735 24200898 23976894 23660105 23384915 23285790 23352178 23556552
4892 23556552 23880414 24356996 24962466 25667136 26486219 27474342 28629858 29986337 31546326
4883 31546326 33321067 35341938 37656548 40201782 43073808 46303339 49871541 53513837
4875 53513837 56717395 58885593 59478192 58368440 55994168 53009696 50077024 47531897
4867 47531897 45598079 44267332 43472012 43107620 43016841 43025791 43067288 43323767 43848288 44691793
4857 44691793 45839208 47363955 49265032 51638268 54506468 58002665 62218881 67171358
$$ packed form
4920A1127492L74044L50117L61009L36511L39385L30745L38555M17978M86473
4911A4462309N16492N70347O83843P50134Q83218Q90042J008668J093843J105988
4902B1964884J014758P57666L98427O5163k24004l16789k75190r9125O6388K04374
4892B3556552L23862M76582O05470P04670Q19083R88123J155516J356479J559989
4883C1546326J774741K020871K314610K545234K872026L229531L568202L642296
4875E3513837L203558K168198N92599j109752k374272k984472k932672k545127
4867D7531897j933818j330747p95320l64392r0779Q950M1497K56479N24521Q43505
4857D4691793J147415J524747J901077K373236K868200L496197M216216M952477
$$ plain form
4849 67171358 72897514 79499267 86912601 95158315 104375181 114729636 125831699 136454565
4841 136454565 144557494 147609862 144033101 134801147 122564862 109923682 98586317 89219109
4833 89219109 81844392 76066788 71571099 68015689 65204153 63050085 61447967 60347764
4825 60347764 59703121 59514507 59739290 60475539 61727296 63574076 66052226 69282051 73356013
4816 73356013 78231117 83935945 90536261 98047581 106496233 116088677 126705919 137286659
4808 137286659 145849950 149817214 147123914 138019406 125049940 111032059 98028416 87009834
4800 87009834 78041976 70900868 65193004 60499949 56611691 53409996 50871106 48705923
4792 48705923 47016345 45769764 44920470 44501557 44382445 44525298 44780622 45007857 45340214
$$ packed form
4849F7171358N726156O601753P413334Q245714R216866J0354455J1102063J0622866
4841A36454565Q102929L052368l576761r231954j2236285j2641180j1337365r367208
4833H9219109p374717n777604m495689l555410k811536k154068j602118j100203
4825F0347764o44643j88614K24783P36249J251757J846780K478150L229825M073962
4816G3356013M875104N704828O600316P511320Q448652R592444J0617242J0580740
4808A37286659Q563291L967264k693300r104508j2969466j4017881j3003643j1018582
4800H7009834q967858p141108n707864m693055l888258l201695k538890k165183
4792D8705923j689578j246581q49294m18913j19112J42853K55324K27235L32357
$$ plain form
4783 45340214 45927592 46896443 48225278 49977909 52143955 54749208 57613582 60417226
4775 60417226 62610698 63429487 62329883 59430269 55253420 50536312 45970302 41929482
4767 41929482 38488902 35619084 33176258 31112570 29367017 27821334 26512978 25410356
4759 25410356 24453288 23647217 23001666 22483416 22046747 21725063 21479287 21239229 21108096
4750 21108096 21019002 20942059 20842092 20805000 20843801 20879322 20998983 21144203 21369902 21706695
4740 21706695 22068573 22512248 23096181 23649538 24243934 24924271 25746383 26640685 27631654
4731 27631654 28736124 30030040 31389634 33014706 34953449 37320504 40369452 44227403
4723 44227403 48854043 54371603 61164484 69038179 77660039 87875108 101746070 119660181
$$ packed form
4783D5340214N87378R68851J328835J752631K166046K605253K864374K803644
4775F0417226K193472Q18789j099604k899614m176849m717108m566010m040820
4767D1929482l440580k869818k442826k063688j745553j545683j308356j102622
4759B5410356r57068q06071o45551n18250m36669l21684k45776k40058j31133
4750B1108096q9094p6943r9967l7092L8801L5521J19661J45220K25699L36793
4740B1706695L61878M43675N83933N53357N94396O80337Q22112Q94302R90969
4731B7631654J104470J293916J359594J625072J938743K367055L048948L857951
4723D4227403M626640N517560O792881P873695Q621860J0215069J3870962J7914111
$$ plain form
4715 119660181 140304019 158433318 164754888 152093424 128967349 105335997 84616515
4708 84616515 69084157 58166910 50327587 44539399 40097832 36481748 33511890 30993765
4700 30993765 28881535 26961789 25234779 23755528 22562605 21543105 20689510 19955697
4692 19955697 19292285 18673530 18113878 17496393 16936111 16460171 16030540 15607554 15235500
4683 15235500 14856453 14448692 14064463 13650376 13257350 12894383 12568299 12269238 11987473
4674 11987473 11726771 11512623 11326411 11120948 10911078 10661171 10338042 9891012 9470736
4665 9470736 9084479 8774889 8467804 8252894 8077448 7971652 7853973 7771949 7695312 7588717
4655 7588717 7423090 7188607 6908040 6709158 6451905 6291680 6172562 6001299 5887397 5816647
$$ packed form
4715A19660181K0643838J8129299O321570j2661464k3126075k3631352k0719482
4708H4616515j5532358j0917247p839323n788188m441567l616084k969858k518125
4700C0993765k112230j919746j727010j479251j192923j019500q53595p33813
4692A9955697o63412o18755n59652o17485n60282m75940m29631m22986l72054
4683A5235500l79047m07761l84229m14087l93026l62967l26084k99061k81765
4674A1987473k60702k14148j86212k05463k09870k49907l23129m47030m20276
4665I470736l86257l09590l07085k14910j75446j05796j17679q2024p6637j06595
4655G588717j65627k34483k80567j98882k57253j60225j19118j71263j13902p0750
$$ plain form
4645 5816647 5758604 5753833 5731242 5711552 5647047 5544403 5459270 5367726 5249262 5155379 5025349
4634 5025349 4900554 4798046 4756900 4735156 4701234 4690646 4691061 4619942 4530618 4478048 4448196
4623 4448196 4433309 4407811 4378785 4380093 4371238 4334822 4322917 4266975 4070658 3924111 3759443
4612 3759443 3594991 3475185 3355437 3286333 3204992 3128062 3103392 3060538 3005852 2983121 2986545
4601 2986545 2988441 2984634 2986913 3018883 3041486 3016234 3007972 2981974 2970870 2981617 2943442 2900991
4589 2900991 2914417 2932933 2927201 2930797 2924636 2917357 2921863 2919389 2950769 2980116 2977430 2966814 3003443
4576 3003443 3025340 3083215 3074753 3091492 3089361 3067136 3069885 3081810 3055322 3072702 3083637 3106647
4564 3106647 3146138 3198496 3271401 3303533 3344707 3459658 3522628 3625826 3761127 3880473 3961106
$$ packed form
4645E816647n8043m771k2591j9690o4505j02644q5133r1544j18464r3883j30030
4634E025349j24795j02508m1146k1744l3922j0588M15p1119q9324n2570k9852
4623D448196j4887k5498k9026J308q855l6416j1905n5942j96317j46547j64668
4612C759443j64452j19806j19748o9104q1341p6930k4670m2854n4686k2731L424
4601B986545J896l807K279L1970K2603k5252q262k5998j1104J0747l8175m2451
4589B900991J3426J8516n732L596o161p279M506k474L1380K9347k686j0616L6629
4576C003443K1897N7875q462J6739k131k2225K749J1925k6488J7380J0935K3010
4564C106647L9491N2358P2905L2132M1174J14951O2970J03198J35301J19346Q0633
$$ plain form
4553 3961106 4014972 4123529 4248306 4426479 4593156 4753152 4903401 5039545 5187501 5325623
4543 5325623 5459508 5689394 6026277 6357094 6769472 7203826 7499901 7646238 7676449 7538513
4533 7538513 7247957 6935868 6671806 6484275 6339730 6267344 6260957 6301876 6382967 6497082
4523 6497082 6614245 6722943 6881245 7062154 7237514 7395330 7551803 7714633 7870010 7940584
4513 7940584 8007414 8104749 8193175 8284773 8451976 8653078 8858401 9115153 9394334 9707994
4503 9707994 10036089 10329678 10650334 11040893 11416501 11814332 12292101 12773627 13287664 13915334
4493 13915334 14589502 15307930 16081964 16894280 17751174 18681228 19693962 20850100 22117472
4484 22117472 23518549 25090031 26846092 28860198 31188392 34055353 37568869 41862296
$$ packed form
4553C961106N3866J08557J24777J78173J66677J59996J50249J36144J47956J38122
4543E325623J33885K29886L36883L30817M12378M34354K96075J46337L0211j37936
4533G538513k90556l12089k64062j87531j44545p2386o387M0919Q1091J14115
4523F497082J17163J08698J58302J80909J75360J57816J56473J62830J55377P0574
4513G940584O6830R7335Q8426R1598J67203K01102K05323K56752K79181L13660
4503I707994L28095K93589L20656L90559L75608L97831M77769M81526N14037O27670
4493A3915334O74168P18428P74034Q12316Q56894R30054J012734J156138J267372
4484B2117472J401077J571482J756061K014106K328194K866961L513516M293427
$$ plain form
4476 41862296 46982242 53091383 60262014 68287362 77344652 88381276 102206670 118396174
4468 118396174 134507031 145444687 145260291 133061834 114627401 95399343 78383173
4461 78383173 65014323 54978799 47434459 41753284 37291599 33627668 30564466 27972039
4453 27972039 25720328 23744784 21963567 20409483 19130565 17986606 17038937 16145045
4445 16145045 15298014 14525277 13877241 13254952 12688814 12147228 11653413 11215145 10818509
4436 10818509 10437640 10021510 9624901 9262809 8886726 8532927 8219016 7870246 7531610
4427 7531610 7222502 6945538 6686599 6418831 6144663 5907481 5680477 5454516 5235024 5067567
4417 5067567 4907065 4770589 4626986 4541164 4412846 4285392 4150803 4054360 4016154 3939516
$$ packed form
4476D1862296N119946O109141P170631Q025348R057290J1036624J3825394J6189504
4468A18396174J6110857J0937656j84396j2198457j8434433j9228058j7016170
4461G8383173j3368850j0035524p544340n681175m461685l663931l063202k592427
4453B7972039k251711j975544j781217j554084j278918j143959r47669q93892
4445A6145045q47031p72737o48036o22289n66138n41586m93815m38268l96636
4436A0818509l80869m16130l96609l62092l76083l53799l13911l48770l38636
4427G531610l09108k76964k58939k67768k74168k37182k27004k25961k19492j67457
4417E067567j60502j36476j43603q5822j28318j27454j34589r6443l8206p6638
$$ plain form
4407 3939516 3853344 3745629 3670631 3633691 3576165 3523549 3499130 3503154 3502312 3552172 3555344 3504100
4395 3504100 3389986 3214187 3069393 2896972 2749983 2629954 2497444 2424201 2326237 2273122
4385 2273122 2196779 2093498 2065769 2026608 1985756 1938339 1913534 1917077 1917165 1918222 1910142 1921338
4373 1921338 1891357 1887136 1898329 1887327 1828218 1822647 1797833 1728078 1671020 1632865 1603077 1540550
4361 1540550 1524411 1515044 1512640 1500356 1508634 1536385 1591477 1650678 1753444 1835085 1906507 1904693
4349 1904693 1861733 1756616 1686683 1635466 1594665 1538543 1499788 1502105 1460242 1428992 1388921
4338 1388921 1401754 1385685 1351088 1337606 1307377 1282432 1286546 1289022 1262789 1256390 1259831 1233277
4326 1233277 1275074 1257045 1209387 1253336 1250101 1220123 1214300 1241514 1209735 1193042 1194961 1144405
$$ packed form
4407C939516q6172j07715p4998l6940n7526n2616k4419M024q42M9860L172n1244
4395C504100j14114j75799j44794j72421j46989j20029j32510p3243r7964n3115
4385B273122p6343j03281k7729l9161m0852m7417k4805L543Q8J057q080J1196
4373A921338k9981m221J1193j1002n9109n571k4814o9755n7058l8155k9788o2527
4361A540550j6139r367k404j2284Q278K7751N5092N9201J02766Q1641P1422j814
4349A904693m2960j05117o9933n1217m0801n6122l8755K317m1863l1250m0071
4338A388921J2833j6069l4597j3482l0229k4945M114K476k6233o399L441k6554
4326A233277M1797j8029m7658M3949l235k9978n823K7214l1779j6693J919n0556
$$ plain form
4314 1144405 1150302 1150775 1149013 1133621 1119084 1161301 1150237 1175865 1166799 1144348 1133330 1166594
4302 1166594 1215843 1248757 1259445 1227697 1249047 1248735 1205973 1193122 1143402 1114659 1076891 1035660
4290 1035660 1050411 1005873 983581 977460 979254 1020718 1032580 1038220 1056456 1038241 1036195 1047116
4278 1047116 1073443 1081598 1060971 1034924 996022 929281 920927 943042 912411 906809 908444 901017
4266 901017 891841 893597 904599 922785 942641 929797 901397 885932 866884 876115 870886 872979 883562
4253 883562 878906 887542 869860 890407 889340 884600 885994 895921 906854 898245 889807 863744 893466
4240 893466 882016 878862 850968 847509 830273 815202 814966 867458 910170 881565 883111 909982 908880
4227 908880 927512 953835 937509 960741 970606 975968 969067 927958 893841 921401 916411 932794
$$ packed form
4314A144405N897M73j762j5392j4537M2217j1064K5628r066k2451j1018L3264
4302A166594M9249L2914J0688l1748K1350l12m2762j2851m9720k8743l7768m1231
4290A035660J4751m4538k2292o121J794M1464J1862N640J8236j8215k046J0921
4278A047116K6327Q155k0627k6047l8902o6741q354K2115l0631n602J635p427
4266I01017r176J756J1002J8186J9856j2844k8400j5465j9048R231n229K093J0583
4253H83562m656Q636j7682K0547j067m740J394R927J0933q609q438k6063K9722
4240H93466j1450l154k7894l459j7236j5071k36N2492M2712k8605J546K6871j102
4227I08880J8632K6323j6326K3232R865N362o901m1109l4117K7560m990J6383
$$ plain form
4215 932794 986781 993973 998197 1012320 1031157 1001250 936888 921388 915876 935144 987354 982113
4203 982113 965849 988561 969142 947603 921745 954446 949350 977448 988298 962316 1007778 1056553
4191 1056553 1057600 1029468 1022354 1028737 1067834 1063927 1082591 1078470 1043123 1111764 1110414 1092320 1122232
4178 1122232 1115808 1125139 1101424 1160018 1208787 1206242 1247099 1283840 1301632 1329443 1350312 1402533
4166 1402533 1471788 1563186 1584055 1612697 1715790 1780839 1802783 1798504 1767831 1691808 1621075
4155 1621075 1548561 1467473 1399676 1346503 1341056 1334722 1284985 1293952 1311766 1303486 1272171 1286413
4143 1286413 1254099 1256871 1255757 1297586 1312346 1298330 1317535 1382646 1393819 1418442 1442852 1474160
4131 1474160 1506502 1537672 1584250 1599840 1568336 1515344 1505274 1500943 1521455 1501134 1518690 1526445
$$ packed form
4215I32794N3987P192M224J4123J8837k9907o4362j5500n512J9268N2210n241
4203I82113j6264K2712j9419k1539k5858L2701n096K8098J0850k5982M5462M8775
4191A056553J047k8132p114O383L9097l907J8664m121l5347O8641j350j8094K9912
4178A122232o424R331k3715N8594M8769k545M0857L6741J7792K7811K0869N2221
4166A402533O9255R1398K0869K8642J03093O5049K1944m279l0673p6023p0733
4155A621075p2514q1088o7797n3173n447o334m9737Q967J7814q280l1315J4242
4143A286413l2314K772j114M1829J4760j4016J9205O5111J1173K4623K4410L1308
4131A474160L2342L1170M6578J5590l1504n2992j0070m331K0512k0321J7556P755
$$ plain form
4119 1526445 1535334 1547305 1579295 1546707 1579844 1656885 1668300 1678353 1686745 1733269 1750722 1811465
4107 1811465 1891216 1955250 2046022 2123333 2170819 2252757 2331814 2359768 2356183 2370856 2371051 2359047
4095 2359047 2375965 2363475 2405423 2460489 2501460 2556641 2627878 2678330 2709268 2741824 2838125
4084 2838125 2898253 2991628 3089799 3227488 3329299 3418631 3518666 3612999 3684225 3729158 3814014
4073 3814014 3853177 3924189 4022459 4038716 4107235 4187437 4233600 4295008 4392647 4502679 4588915
4062 4588915 4685201 4773501 4868493 4991585 5152969 5255080 5391820 5510207 5647251 5859787
4052 5859787 6037126 6246864 6503082 6775554 7068206 7329763 7624032 7978910 8353340 8698435
4042 8698435 9108596 9522296 10019380 10590791 11248178 11943089 12714408 13622688 14628307
$$ packed form
4119A526445Q889J1971L1990l2588L3137P7041J1415J0053Q392M6524J7453O0743
4107A811465P9751O4034R0772P7311M7486Q1938P9057K7954l585J4673J95j2004
4095B359047J6918j2490M1948N5066M0971N5181P1237N0452L0938L2556R6301
4084B838125O0128R3375R8171J37689J01811Q9332J00035R4333P1226M4933Q4856
4073C814014L9163P1012R8270J6257O8519Q0202M6163O1408R7639J10032Q6236
4062D588915R6286Q8300R4992J23092J61384J02111J36740J18387J37044K12536
4052E859787J77339K09738K56218K72472K92652K61557K94269L54878L74430L45095
4042H698435M10161M13700M97084N71411O57387O94911P71319R08280J005619
$$ plain form
4033 14628307 15779402 17041578 18495638 20186619 22104092 24242531 26530848 28703007
4025 28703007 30424114 31494963 32007745 32320585 32918770 34105745 35882133 38278071 41256657
4016 41256657 44899403 49039000 53233109 56771395 58472033 57753528 54600324 49759914
4008 49759914 44276538 39014611 34446815 30704911 27660482 25269565 23338979 21746902
4000 21746902 20411075 19281345 18343000 17507504 16744380 16060569 15494352 15008141 14566640
3991 14566640 14220742 13874005 13563798 13271782 13025693 12763321 12556988 12385200 12150659
3982 12150659 11913586 11708650 11495228 11237279 10988835 10759038 10589327 10380165 10155528
3973 10155528 9947915 9715984 9454898 9251803 9066272 8852027 8629286 8398309 8154685
$$ packed form
4033A4628307J151095J262176J454060J690981J917473K138439K288317K172159
4025B8703007J721107J070849N12782L12840N98185J186975J776388K395938K978586
4016D1256657L642746M139597M194109L538286J700638p18505l153204m840410
4008D9759914n483376n261927m567796l741904l044429k390917j930586j592077
4000B1746902j335827j129730r38345q35496p63124o83811n66217m86211m41501
3991A4566640l45898l46737l10207k92016k46089k62372k06333j71788k34541
3982A2150659k37073k04936k13422k57949k48444k29797j69711k09162k24637
3973A0155528k07613k31931k61086k03095j85531k14245k22741k30977k43624
$$ plain form
3964 8154685 7927922 7711226 7507821 7313264 7168916 7028725 6912717 6788662 6661215 6546864
3954 6546864 6453415 6320243 6249491 6181351 6090558 6040753 6005104 6013929 6036578 6079304 6164988
3943 6164988 6273639 6432089 6717966 7099625 7522822 7915033 7955105 7515374 6909499 6316035
3933 6316035 5810502 5432903 5205826 5070297 4939538 4859019 4775322 4727080 4714603 4702763
3923 4702763 4695350 4679098 4664050 4655804 4639731 4720420 4809524 4857855 4952989 5085871 5157060 5278240
3911 5278240 5378515 5512647 5704317 5854434 5962712 6040686 6008435 5918372 5828335 5707038
3901 5707038 5637389 5551964 5524246 5526716 5503399 5460808 5436864 5462372 5467432 5517393 5574527 5643672
3889 5643672 5793782 5977522 6149699 6382898 6644485 6989085 7395239 7819555 8235650 8583891
$$ packed form
3964H154685k26763k16696k03405j94557j44348j40191j16008j24055j27447j14351
3954F546864r3449j33172p0752o8140r0793m9805l5649Q825K2649M2726Q5684
3943F164988J08651J58450K85877L81659M23197L92211M0072m39731o05875n93464
3933F316035n05533l77599k27077j35529j30759q0519q3697m8242j2477j1840
3923D702763p413j6252j5048q246j6073Q0689Q9104M8331R5134J32882P1189J21180
3911E278240J00275J34132J91670J50117J08278P7974l2251r0063r0037j21297
3901E707038o9649q5425k7718K470k3317m2591k3944K5508N060M9961N7134O9145
3889E643672J50110J83740J72177K33199K61587L44600M06154M24316M16095L48241
$$ plain form
3879 8583891 8854630 8966164 8862667 8613183 8221698 7813337 7354822 6886269 6558900 6287251
3869 6287251 6057554 5943584 5877059 5787690 5762842 5787838 5865361 5966091 6092293 6290052
3859 6290052 6552423 6893073 7316430 7752804 8264925 8808445 9411272 9973490 10427069 10698917
3849 10698917 10706766 10402723 9846391 9191075 8562736 7943249 7442517 7004679 6692000 6434333
3839 6434333 6297048 6218068 6182833 6199555 6272450 6393106 6515743 6605781 6690615 6826510 7027402
3828 7027402 7315424 7734220 8202383 8737822 9418233 10106932 10829811 11374590 11591092 11245242
3818 11245242 10299495 9159304 8016106 7012178 6267172 5698712 5312117 4972429 4706217
3809 4706217 4513885 4342536 4199564 4064224 3995715 3968085 3945884 3937652 3958665 3970272 3999521
$$ packed form
3879H583891K70739J11534j03497k49484l91485m08361m58515m68553l27369k71649
3869F287251k29697j13970o6525q9369k4848K4996P7523J00730J26202J97759
3859F290052K62371L40650M23357M36374N12121N43520O02827N62218M53579K71848
3849A0698917P849l04043n56332o55316o28339o19487n00732m37838l12679k57667
3839F434333j37285p8980l5235J6722P2895J20656J22637R0038Q4834J35895K00892
3828G027402K88022M18796M68163N35439O80411O88699P22879N44779K16502l45850
3818A1245242r45747j140191j143198j003928p45006n68460l86595l39688k66212
3809D706217j92332j71349j42972j35340o8509k7630k2201q232K1013J1607K9249
$$ plain form
3798 3999521 4033254 4096099 4174005 4317296 4442092 4562451 4595232 4472590 4256360 3968406
3788 3968406 3649866 3370241 3149451 2996680 2843286 2773523 2731415 2670051 2620657 2549747
3778 2549747 2528158 2498852 2480603 2453313 2409876 2386347 2388403 2379856 2346294 2289154 2242191 2215572
3766 2215572 2205889 2180340 2199451 2228687 2247197 2258664 2292839 2295707 2293389 2307085 2300562 2250435
3754 2250435 2226412 2190333 2173008 2146018 2124465 2113601 2128850 2137735 2128709 2110012 2099270 2098409
3742 2098409 2101560 2063717 2006681 2024298 2057077 2043376 2018644 2018748 2030783 2046695 2068294 2118321
3730 2118321 2177878 2165345 2175135 2214437 2258361 2340502 2396758 2464230 2527317 2557565 2566745 2549953
3718 2549953 2565788 2602036 2623172 2653918 2695956 2724947 2730858 2758284 2817668 2908765 2929326 2951645
$$ packed form
3798C999521L3733O2845P7906J43291J24796J20359L2781j22642k16230k87954
3788C968406l18540k79625k20790j52771j53394o9763m2108o1364m9394p0910
3778B549747k1589k9306j8249k7290m3437k3529K056q547l3562n7140m6963k6619
3766B215572r683k5549J9111K9236J8510J1467L4175K868k318J3696o523n0127
3754B250435k4023l6079j7325k6990k1553j0864J5249Q885r026j8697j0742q61
3742B098409L151l7843n7036J7617L2779j3701k4732J04J2035J5912K1599N0027
3730B118321N9557j2533R790L9302M3924Q2141N6256O7472O3087L0248R180j6792
3718B549953J5835L6248K1136L0746M2038K8991N911K7426N9384R1097K0561K2319
$$ plain form
3706 2951645 3025759 3069778 3134433 3183710 3200023 3248631 3293502 3329739 3331759 3351668 3384694 3345335
3694 3345335 3367286 3383464 3434532 3451907 3429287 3412866 3468127 3513870 3520016 3570244 3578672 3625769
3682 3625769 3654054 3693324 3749804 3821375 3872186 3952675 4004281 4088448 4196860 4331589 4484067
3671 4484067 4632727 4772450 4924032 5099652 5298398 5526969 5742961 5957733 6191753 6406377
3661 6406377 6667677 6940391 7139951 7367246 7620230 7874076 8061005 8262298 8424190 8602433
3651 8602433 8728299 8875250 8987199 9099417 9199750 9274210 9346706 9399102 9458313 9488506
3641 9488506 9492015 9484854 9423424 9431337 9453307 9396273 9319701 9298556 9250704 9151907 9052368 8981472
3629 8981472 8889108 8775688 8697107 8575806 8446710 8314022 8191014 8059575 7926648 7761313
$$ packed form
3706B951645P4114M4019O4655M9277J6313M8608M4871L6237K020J9909L3026l9359
3694C345335K1951J6178N1068J7375k2620j6421N5261M5743O146N0228Q428M7097
3682C625769K8285L9270N6480P1571N0811Q0489N1606Q4167J08412J34729J52478
3671D484067J48660J39723J51582J75620J98746K28571K15992K14772K34020K14624
3661F406377K61300K72714J99560K27295K52984K53846J86929K01293J61892J78243
3651H602433J25866J46951J11949J12218J00333P4460P2496N2396N9211L0193
3641I488506L509p161o1430P913K1970n7034p6572k1145m7852r8797r9539p0896
3629H981472r2364j13420p8581j21301j29096j32688j23008j31439j32927j65335
$$ plain form
3619 7761313 7630595 7490481 7383119 7265207 7128373 6987355 6871345 6720282 6587138 6456868
3609 6456868 6321171 6139973 5968977 5782951 5636924 5473908 5283155 5127734 4954004 4812006
3599 4812006 4710752 4579058 4473835 4357127 4255998 4159264 4102080 4086233 3988697 3921661
3589 3921661 3876531 3858243 3848847 3825599 3790961 3783943 3785698 3745937 3766944 3809102 3881834 3916796
3577 3916796 3952297 3981032 3988674 4042895 4029800 3998883 3998950 3958554 3943372 3959124 3921877 3940541
3565 3940541 3966984 3960195 3945121 3911182 3957674 3990551 3990857 4003677 4009672 3994577 3972453 3954005
3553 3954005 3986525 3996465 3986831 3989854 4017694 4051338 4088258 4211926 4289358 4350659 4438609 4474370
3541 4474370 4466511 4460231 4529098 4579979 4633064 4700018 4800053 4891704 4984035 5105598 5166034
$$ packed form
3619G761313j30718j40114j07362j17912j36834j41018j16010j51063j33144j30270
3609F456868j35697j81198j70996j86026j46027j63016j90753j55421j73730j41998
3599D812006j01254j31694j05223j16708j01129r6734n7184j5847r7536o7036
3589C921661m5130j8288r396k3248l4638p018J755l9761K1007M2158P2732L4962
3577C916796L5501K8735P642N4221j3095l0917O7m0396j5182J5752l7247J8664
3565C940541K6443o789j5074l3939M6492L2877L06J2820N995j5095k2124j8448
3553C954005L2520R940r634L023K7840L3644L6920J23668P7432O1301Q7950L5761
3541D474370p859o280O8867N0881N3085O6954J00035R1651R2331J21563O0436
$$ plain form
3530 5166034 5139985 5130158 5132622 5105095 5122512 5121561 5190430 5251681 5280410 5365714 5462324 5575893
3518 5575893 5736649 5869795 6003577 6149433 6308725 6453096 6580271 6726182 6784840 6858306
3508 6858306 6953406 7012561 7016874 7108075 7190847 7240430 7345929 7457070 7611444 7715504 7775888
3497 7775888 7748420 7666734 7500805 7363044 7260080 7229175 7174865 7197172 7222885 7283137 7348975
3486 7348975 7440104 7525644 7619360 7743906 7888358 8062177 8227912 8414710 8590187 8822319
3476 8822319 9066762 9371703 9673835 9959546 10331434 10690217 11030621 11403670 11837506 12253359
3466 12253359 12684390 13046868 13430148 13694006 13927908 14174590 14410789 14609306 14799881
3457 14799881 14967306 15072961 15190718 15215106 15246541 15219663 15175733 15124123 15076134 14979808 14876713
$$ packed form
3530E166034k6049r827K464k7527J7417r51O8869O1251K8729Q5304R6610J13569
3518E575893J60756J33146J33782J45856J59292J44371J27175J45911N8658P3466
3508F858306R5100N9155M313R1201Q2772M9583J05499J11141J54374J04060O0384
3497G775888k7468q1686j65929j37761j02964l0905n4310K2307K5713O0252O5838
3486G348975R1129Q5540R3716J24546J44452J73819J65735J86798J75477K32132
3476H822319K44443L04941L02132K85711L71888L58783L40404L73049M33836M15853
3466A2253359M31031L62478L83280K63858K33902K46682K36199J98517J90575
3457A4799881J67425J05655J17757K4388L1435k6878m3930n1610m7989r6326j03095
$$ plain form
3446 14876713 14814029 14758997 14754034 14793990 14844788 14900624 15024422 15150439 15292348 15510301 15719259
3435 15719259 15902894 16138603 16381824 16636430 16905168 17157965 17385626 17616835 17812961
3426 17812961 17977161 18099606 18123270 18083257 17955748 17730831 17419373 17080616 16683282 16236724
3416 16236724 15755589 15282594 14768147 14309529 13902673 13535025 13178675 12829745 12535606
3407 12535606 12280958 12050289 11867239 11722683 11623570 11538015 11449013 11399428 11309915 11283747
3397 11283747 11322584 11329106 11330639 11315919 11332308 11315843 11353990 11351898 11324916 11306340 11280053 11230969
3385 11230969 11147237 11054276 10965248 10830460 10671719 10541672 10459602 10322447 10169394 10016505
3375 10016505 9897572 9769218 9706573 9664088 9634552 9560527 9511678 9486480 9454602 9417180 9431513
$$ packed form
3446A4876713o2684n5032m963L9956N0798N5836J23798J26017J41909K17953K08958
3435A5719259J83635K35709K43221K54606K68738K52797K27661K31209J96126
3426A7812961J64200J22445K3664m0013j27509k24917l11458l38757l97334m46558
3416A6236724m81135m72995n14447m58618m06856l67648l56350l48930k94139
3407A2535606k54648k30669j83050j44556r9113q5555q9002m9585q9513k6168
3397A1283747L8837O522J533j4720J6389j6465L8147k092k6982j8576k6287m9084
3385A1230969q3732r2961q9028j34788j58741j30047q2070j37155j53053j52889
3375A0016505j18933j28354o2645m2485k9536p4025m8849k5198l1878l7422J4333
$$ plain form
3364 9431513 9411042 9374628 9368263 9395219 9400561 9402878 9436757 9513914 9600783 9676821 9799204 9894355
3352 9894355 10016010 10143765 10222918 10313040 10429587 10546389 10683328 10799999 10957473 11090225
3342 11090225 11226730 11394005 11583787 11765138 11973852 12242882 12476215 12648291 12834515
3333 12834515 13065571 13246712 13428201 13688881 13920974 14141284 14352844 14608819 14897284
3324 14897284 15189457 15538572 15842918 16160679 16500527 16846508 17190555 17540434 17846409
3315 17846409 18142191 18469867 18796225 19156642 19551203 19936595 20313026 20702478 21105122
3306 21105122 21559689 22088534 22640215 23238870 23846973 24536829 25340351 26267596 27409554
3297 27409554 28720791 30236911 31945465 34005713 36326649 38869360 41794173 45570247
$$ packed form
3364I431513k0471l6414o365K6956N342K317L3879P7157Q6869P6038J22383R5151
3352I894355J21655J27755P9153R0122J16547J16802J36939J16671J57474J32752
3342A1090225J36505J67275J89782J81351K08714K69030K33333J72076J86224
3333A2834515K31056J81141J81489K60680K32093K20310K11560K55975K88465
3324A4897284K92173L49115L04346L17761L39848L45981L44047L49879L05975
3315A7846409K95782L27676L26358L60417L94561L85392L76431L89452M02644
3306B1105122M54567N28845N51681N98655O08103O89856Q03522R27245J141958
3297B7409554J311237J516120J708554K060248K320936K542711K924813L776074
$$ plain form
3289 45570247 50289877 55764238 60846903 63365695 61600269 57029065 52050359 47707987
3281 47707987 44567252 42703801 41714272 41297965 41296539 41566082 41969707 42563694 43350364
3272 43350364 44318693 45429409 46748329 48316411 50189771 52343825 54929860 57952822
3264 57952822 61441289 65442696 70113172 75360439 81094876 87588012 95783070 106097450
3256 106097450 118309548 130679352 139383053 140384013 135544269 130177310 126626906 126254362
3248 126254362 129274061 135105321 143526613 154454750 167090453 179622733 188817715 191309601
3240 191309601 185658801 173765591 159202034 144988707 132911111 123589867 116822101
3233 116822101 112205568 109284790 107745506 107329402 107925088 109363763 111742868 115327167
$$ packed form
3289D5570247M719630N474361N082665K518792j765426m571204m978706m342372
3281D7707987l140735j863451r89529m16307j426K69543M03625N93987P86670
3272D3350364R68329J110716J318920J568082J873360K154054K586035L022962
3264E7952822L488467M001407M670476N247267N734437O493136Q195058J0314380
3256A06097450J2212098J2369804Q703701J000960m839744n366959l550404l72544
3248A26254362L019699N831260Q421292J0928137J2635703J2532280R194982K491886
3240A91309601n650800j1893210j4563557j4213327j2077596r321244o767766
3233A16822101m616533k920778j539284m16104N95686J438675K379105L584299
$$ plain form
3225 115327167 120396137 127017064 134584364 141423473 145755013 147864282 150273657 154611857
3217 154611857 161639330 171780487 184692248 200182934 218973801 241907726 268619483
3210 268619483 296104762 317892092 325560196 314810093 289831199 258803668 228004996
3203 228004996 201217463 179797024 163222431 150457387 140566411 132773049 126430238
3196 126430238 121169435 116897967 113326629 110473885 108236619 106643313 105680494 105362151
3188 105362151 105692152 106710470 108465552 110989613 114343738 118587541 123731812 129791264
3180 129791264 136994206 145593765 155603195 165955277 174415210 177939036 174065686 163054363
3172 163054363 147864879 131762120 116892826 104353532 94142691 85941399 79251978
$$ packed form
3225A15327167N068970O620927P567300O839109M331540K109269K409375M338200
3217A54611857P027473J0141157J2911761J5490686J8790867K2933925K6711757
3210B68619483K7485279K1787330P668104j0750103k4978894l1027531l0798672
3203B28004996k6787533k1420439j6574593j2765044r890976p793362o342811
3196A26430238n260803m271468l571338k852744k237266j593306r62819l18343
3188A05362151L30001J018318J755082K524061L354125M243803N144271O059452
3180A29791264P202942Q599559J0009430J0352082Q459933L523826l873350j1011323
3172A63054363j5189484j6102759j4869294j2539294j0210841q201292o689421
$$ plain form
3165 79251978 73615943 68820236 64665140 60986751 57764983 54866646 52305781 50093500
3157 50093500 48159937 46473540 45010180 43799611 42752419 41821020 40989471 40320141 39723195
3148 39723195 39215249 38795727 38409383 38119683 37909314 37769580 37727930 37697237 37704452 37623392
3138 37623392 37569562 37560416 37580550 37592136 37618630 37658798 37609394 37415279 37218073 37002517 36755834
3127 36755834 36535029 36396120 36227037 36132054 36137373 36163301 36219262 36318275 36411751 36478707 36525190
3116 36525190 36481746 36373005 36218295 36024804 35863389 35717863 35621030 35484694 35213615 34636481
3106 34636481 33779031 32782417 31711426 30613915 29562932 28591823 27652831 26720901 25872304
3097 25872304 25120674 24401204 23663300 22952958 22354347 21736399 21107807 20535770 20043756
$$ packed form
3165G9251978n636035m795707m155096l678389l221768k898337k560865k212281
3157E0093500j933563j686397j463360j210569j047192r31399q31549o69330n96946
3148C9723195n07946m19522l86344k89700k10369j39734m1650l0693P215q1060
3138C7623392n3830r146K0134J1586K6494M0168m9404j94115j97206k15556k46683
3127C6755834k20805j38909j69083r4983N319K5928N5961R9013R3476O6956M6483
3116C6525190m3444j08741j54710j93491j61415j45526r6833j36336k71079n77134
3106C4636481q57450r96614j070991j097511j050983r71109r38992r31930q48597
3097B5872304p51630p19470p37904p10342n98611o17948o28592n72037m92014
$$ plain form
3088 20043756 19628976 19204222 18891848 18650163 18428791 18235352 18096940 18006100 17887372 17849099
3078 17849099 17827995 17872785 17869588 17770336 17563041 17304677 17054232 16834580 16692487 16585555
3068 16585555 16588676 16655209 16745355 16827015 16899490 16897305 16802475 16649284 16454890 16213145 16013395
3057 16013395 15872968 15732718 15682222 15684495 15735971 15849201 15972502 16171691 16423801 16693094
3047 16693094 17000050 17387342 17809437 18260694 18773546 19316360 19864921 20437425 21011639
3038 21011639 21591382 22137690 22637063 23090203 23474320 23765851 23876097 23802646 23580606 23205064
3028 23205064 22666806 22061290 21316478 20527608 19726414 18955930 18178607 17429229 16729850
3019 16729850 16024156 15364943 14755506 14176532 13649541 13130507 12685183 12270935 11890725
$$ packed form
3088B0043756m14780m24754l12374k41685k21372j93439j38412r0840j18728l8273
3078A7849099k1104M4790l197r9252k07295k58364k50445k19652j42093j06932
3068A6585555L121O6533R0146Q1660P2475k185r4830j53191j94394k41745j99750
3057A6013395j40427j40250n0496K273N1476J13230J23301J99189K52110K69293
3047A6693094L06956L87292M22095M51257N12852N42814N48561N72504N74214
3038B1011639N79743N46308M99373M53140L84117K91531J10246p3451k22040l75542
3028B3205064n38258o05516p44812p88870q01194p70484p77323p49378o99379
3019A6729850p05694o59213o09437n78974n26991n19034m45324m14248l80210
$$ plain form
3010 11890725 11536725 11170746 10880378 10601665 10357142 10148412 9953048 9752278 9567927
3001 9567927 9406560 9277664 9140538 9028309 8949334 8882136 8852630 8804684 8725155 8651744 8606400
2990 8606400 8558675 8503426 8467886 8440183 8397851 8391191 8379711 8357289 8392419 8375655 8413609 8515820
2978 8515820 8615061 8737849 8833831 8923008 9061508 9179810 9234611 9284816 9316853 9356106 9363792
2967 9363792 9342615 9284019 9273202 9250109 9166878 9075151 9001943 8874200 8734956 8553193 8386612
2956 8386612 8230508 8070942 7877967 7656735 7452241 7267959 7105388 6934265 6762249 6546538
2946 6546538 6304304 6083999 5883825 5673124 5488475 5369555 5195848 5055992 4969215 4907163
2936 4907163 4871059 4802737 4758451 4731476 4700735 4704675 4701046 4694344 4660357 4605446 4578271 4555182
$$ packed form
3010A1890725l54000l65979k90368k78713k44523k08730j95364k00770j84351
3001I567927j61367j28896j37126j12229p8975o7198k9506m7946p9529p3411m5344
2990H606400m7725n5249l5540k7703m2332o660j1480k2422L5130j6764L7954J02211
2978H515820R9241J22788R5982Q9177J38500J18302N4801N0205L2037L9253P686
2967I363792k1177n8596j0817k3093q3231r1727p3208j27743j39244j81763j66581
2956H386612j56104j59566j92975k21232k04494j84282j62571j71123j72016k15711
2946F546538k42234k20305k00174k10701j84649j18920j73707j39856q6777o2052
2936D907163l6104o8322m4286k6975l0741L940l629o702l3987n4911k7175k3089
$$ plain form
2924 4555182 4567331 4590683 4624686 4673942 4739529 4876034 5011182 5098276 5202277 5240379 5208287
2913 5208287 5057013 4923695 4780756 4630464 4498979 4405423 4314060 4249063 4221215 4178346
2903 4178346 4163664 4158995 4111589 4110783 4134409 4121868 4093571 4048965 4006946 3991619 3966562 3962594
2891 3962594 3951799 3950806 3940375 3917778 3957940 4008437 4063384 4108910 4171158 4190800 4174111 4121963
2879 4121963 4064893 4001283 3923068 3859285 3853638 3878203 3845699 3825764 3880672 3885655 3876622 3858983
2867 3858983 3888047 3895917 3932969 4018624 4034218 4085194 4144176 4199635 4232251 4289954 4344994 4434606
2855 4434606 4522231 4623023 4700783 4784096 4800967 4821592 4896226 4958773 4964605 5022735 5096391
2844 5096391 5163833 5264974 5346325 5446858 5508665 5604939 5694526 5789566 5871024 5948527 6046329
$$ packed form
2924D555182J2149K3352L4003M9256O5587J36505J35148Q7094J04001L8102l2092
2913E208287j51274j33318j42939j50292j31485r3556r1363o4997k7848m2869
2903D178346j4682m669m7406q06K3626j2541k8297m4606m2019j5327k5057l968
2891C962594j0795r93j0431k2597M0162N0497N4947M5526O2248J9642j6689n2148
2879D121963n7070o3610p8215o3783n647K4565l2504j9935N4908M983r033j7639
2867C858983K9064P870L7052Q5655J5594N0976N8982N5459L2616N7703N5040Q9612
2855D434606Q7625J00792P7760Q3313J6871K0625P4634O2547N832N8130P3656
2844E096391O7442J01141Q1351J00533O1807R6274Q9587R5040Q1458P7503R7802
$$ plain form
2833 6046329 6145115 6288587 6401413 6465471 6573560 6678868 6792203 6922745 7033957 7177504
2823 7177504 7377465 7589484 7799391 8008329 8190993 8373329 8459048 8564702 8707774 8846841
2813 8846841 9005771 9220991 9440495 9632219 9898641 10153415 10422116 10662754 10978737 11262589
2803 11262589 11605828 12012475 12390357 12839748 13296927 13750393 14256104 14785646 15321327
2794 15321327 15910283 16516129 17186055 17909659 18726504 19613950 20496535 21464118 22542026
2785 22542026 23719835 24998399 26404425 27974493 29735067 31701841 33896373 36349358
2777 36349358 38999549 41926187 45099241 48462601 51973786 55519210 58955029 62071642
2769 62071642 64563169 66104941 66479181 65620888 63661065 60909876 57645318 54271848
$$ packed form
2833F046329R8786J43472J12826O4058J08089J05308J13335J30542J11212J43547
2823G177504J99961K12019K09907K08938J82664J82336Q5719J05654J43072J39067
2813H846841J58930K15220K19504J91724K66422K54774K68701K40638L15983K83852
2803A1262589L43239M06647L77882M49391M57179M53466N05711N29542N35681
2794A5321327N88956O05846O69926P23604Q16845Q87446Q82585R67583J077908
2785B2542026J177809J278564J406026J570068J760574J966774K194532K452985
2777C6349358K650191K926638L173054L363360L511185L545424L435819L116613
2769F2071642K491527J541772L74240q58293j959823k751189l264558l373470
$$ plain form
2761 54271848 51014621 47973621 45250057 42866888 40759407 38784859 36933206 35132331
2753 35132331 33415665 31824765 30358023 29068513 27947043 26955596 26120487 25444301 24873253
2744 24873253 24453798 24100664 23845307 23695872 23614811 23612492 23693237 23904305 24176751 24594186
2734 24594186 25148988 25783405 26458586 27125376 27632785 27959399 28235876 28537424 28945774
2725 28945774 29604732 30453115 31479934 32369764 32701765 32266218 30932444 28941854 26648674
2716 26648674 24300157 22124870 20250796 18660425 17268284 16084830 15059441 14184060
2708 14184060 13396988 12651656 11994018 11437675 10865299 10383428 9971368 9573623 9202648
2699 9202648 8908621 8627853 8391011 8136968 7893294 7681134 7467324 7312750 7085729 6870582
$$ packed form
2761E4271848l257227l041000k723564k383169k107481j974548j851653j800875
2753C5132331j716666j590900j466742j289510j121470r91447q35109o76186n71048
2744B4873253m19455l53134k55357j49435q1061k319Q0745K11068K72446M17435
2734B4594186N54802O34417O75181O66790N07409L26614K76477L01548M08350
2725B8945774O58958Q48383J026819Q89830L32001m35547j333774j990590k293180
2716B6648674k348517k175287j874074j590371j392141j183454j025389q75381
2708A4184060p87072p45332o57638n56343n72376m81871m12060l97745l70975
2699I202648k94027k80768k36842k54043k43674k12160k13810j54574k27021k15147
$$ plain form
2689 6870582 6682032 6513575 6357731 6156298 5971748 5808772 5693909 5541973 5365536 5219628
2679 5219628 5105202 4985556 4841140 4744415 4651438 4566012 4495319 4398633 4276943 4216500 4128217
2668 4128217 4044598 3971087 3876768 3784940 3703848 3613241 3500707 3424450 3360373 3243677 3195736
2657 3195736 3153716 3075190 3020976 3008488 2985307 2910509 2846466 2814179 2761508 2703556 2692202
2646 2692202 2656727 2582538 2525976 2460893 2412710 2418176 2411122 2354634 2322560 2272232 2250404 2240962
2634 2240962 2231640 2218908 2192890 2178773 2186735 2163925 2150963 2138064 2091413 2047345 2038747 2034152
2622 2034152 1981278 1920663 1869974 1822477 1786113 1739666 1685438 1619512 1605480 1570978 1542288
2611 1542288 1488873 1481344 1432571 1424909 1418544 1407047 1391448 1374713 1335813 1320995 1319797 1300100
$$ packed form
2689F870582j88550j68457j55844k01433j84550j62976j14863j51936j76437j45908
2679E219628j14426j19646j44416r6725r2977q5426p0693r6686j21690o0443q8283
2668D128217q3619p3511r4319r1828q1092r0607j12534p6257o4077j16696m7941
2657C195736m2020p8526n4214j2488k3181p4798o4043l2287n2671n7952j1354
2646B692202l5475p4189n6562o5083m8183N466p054n6488l2074n0328k1828r442
2634B240962r322j2732k6018j4117P962k2810j2962j2899m6651m4068q598m595
2622B034152n2874o0615n0689m7497l6364m6447n4228o5926j4032l4502k8690
2611A542288n3415p529m8773p662o365j1497j5599j6735l8900j4818j198j9697
$$ plain form
2599 1300100 1283002 1288865 1257486 1260209 1247618 1229590 1214442 1170476 1140303 1113021 1113914 1094232
2587 1094232 1106546 1061736 1086161 1046347 1015653 1060757 1057528 1008071 1026631 982024 975688 955385
2575 955385 929354 924160 916436 916053 905891 891765 886593 890458 870025 838720 830603 840354 809458
2562 809458 772840 777024 758300 733390 772939 787356 723763 720705 770092 767275 743332 740391
2550 740391 731236 718615 686051 686474 683234 668098 638349 637850 639884 678991 677156 650107 650920 655533
2536 655533 642526 631458 585476 603335 594464 573409 607326 630264 607342 581910 579780 540485
2524 540485 582720 569405 577990 560375 571311 577330 562744 569198 524320 521067 555605 540460
2512 540460 502901 529816 520508 550292 540135 540724 556057 565913 536230 504381 503236 496352 515010
$$ packed form
2599A300100j7098N863l1379K723j2591j8028j5148m3966l0173k7282Q93j9682
2587A094232J2314m4810K4425l9814l0694M5104l229m9457J8560m4607o336k0303
2575I55385k6031n194p724l83j0162j4126n172L865k0433l1305q117R751l0896
2562H09458l6618M184j8724k4910L9549J4417o3593l058M9387k817k3943k941
2550G40391r155j2621l2564M23l240j5136k9749m99K034L9107j835k7049Q13M613
2536F55533j3007j1068m5982J7859q871k1055L3917K2938k2922k5432k130l9295
2524E40485M2235j3315Q585j7615J0936O019j4586O454m4878l253L4538j5145
2512E40460l7559K6915r308K9784j0157N89J5333R856k9683l1849j145o884J8658
$$ plain form
2499 515010 509395 537624 562550 564830 553845 598838 585678 585401 602727 616844 602365 641054
2487 641054 644216 631024 649043 692507 677822 660805 661429 613447 605795 592719 602608 585881 575080
2474 575080 536298 486023 484938 509916 530805 497090 458163 429872 444902 453824 425110 404278
2462 404278 430875 458048 442009 449580 422012 414161 406714 419390 421906 432596 421626 407003
2450 407003 401697 369972 376749 388855 398436 398022 372990 364701 372329 360377 367917 389083 386482
2437 386482 356358 359306 383940 369674 353055 324827 341266 358352 336462 321755 330238 345120
2425 345120 322464 306231 283910 277435 296137 294737 303710 254612 245902 265319 251117 257990 219149
2412 219149 208593 227580 245518 241209 277818 274339 251858 215927 206865 225751 231967 226502 211987
$$ packed form
2499E15010n615K8229K4926K280j0985M4993j3160k77J7326J4117j4479L8689
2487F41054L162j3192J8019M3464j4685j7017O24m7982p652j3076R889j6727j0801
2474E75080l8782n0275j085K4978K0889l3715l8927k8291J5030Q922k8714k0832
2462D04278K6597K7173j6039P571k7568p851p447J2676K516J0690j0970j4623
2450D07003n306l1725O777J2106R581m14k5032q289P628j1952P540K1166k601
2437C86482l0124K948K4634j4266j6619k8228J6439J7086k1890j4707Q483J4882
2425C45120k2656j6233k2321o475J8702j400Q973m9098q710J9417j4202O873l8841
2412B19149j0556J8987J7938m309L6609l479k2481l5931r062J8886O216n465j4515
$$ plain form
2399 211987 214185 222240 230325 212386 221916 225203 216019 228256 213200 205819 203493 200441 178302
2386 178302 184450 185192 220071 190671 154522 181244 203160 191419 160180 139701 160691 157212
2374 157212 140770 136355 169313 176050 167736 149798 119866 102199 123751 150702 149747 150639 139222
2361 139222 164300 158565 162082 166428 193105 157793 152582 151743 135202 141493 143085 157133 145495
2348 145495 118758 129775 161652 156202 133377 132489 122712 150002 165945 156073 155452 135888 139215
2335 139215 142204 104091 110153 116879 112617 109406 114181 124650 141969 122323 133364 112467 127719
2322 127719 126389 132848 134824 121157 119295 123150 110320 87979 103943 113837 130657 111363 102796
2309 102796 95392 123898 132384 124256 115091 107434 96828 110602 111432 97093 84370 101643 165688
$$ packed form
2399B11987K198Q055Q085j7939R530L287r184J2237j5056p381k326l052k2139
2386A78302O148P42L4879k9400l6149K6722K1916j1741l1239k0479K0990l479
2374A57212j6442m415L2958O737q314j7938k9932j7667K1552K6951r55Q92j1417
2361A39222K5078n735L517M346K6677l5312n211q39j6541O291J592J4048j1638
2348A45495k6737J1017L1877n450k2825q88r777K7290J5943r872o21j9564L327
2335A39215K989l8113O062O726m262l211M775J0469J7319j9646J1041k0897J5252
2322A27719j330O459J976j3667j862L855j2830k2341J5964R894J6820j9294q567
2309A02796p404K8506Q486q128r165p657j0606J3774Q30j4339j2723J7273O4045
$$ plain form
2296 165688 135080 104571 112833 68980 73302 102947 93903 118658 121581 112678 94756 87907 91997
2283 91997 98633 124427 139063 100006 85387 100266 92339 92467 57089 85576 80524 47842 82499
2270 82499 86478 101322 127846 64764 47275 61193 75949 52119 63644 82618 107680 85358
2258 85358 58945 52503 58882 88938 51759 38780 54179 56625 58302 105346 76331 61072 85934
2245 85934 75281 86313 104629 85404 70624 79696 73350 85441 121196 103502 97704 134329
2233 134329 137444 122015 112600 108832 110592 113401 89875 55487 68753 115928 93498 54531 45018
2220 45018 41021 73856 52913 102703 80978 60530 67276 82603 66990 80772 81384 86310 86092
2207 86092 90852 89759 39368 32737 40457 49331 29177 46086 57593 48963 36398 38945 74859
$$ packed form
2296A65688l0608l0509Q262m3853M322K9645r044K4755K923q903j7922o849M090
2283I1997O636K5794J4636l9057j4619J4879p927J28l5378K8487n052l2682L4657
2270H2499L979J4844K6524o3082j7489J3918J4756k3830J1525J8974K5062k2322
2258H5358k6413o442O379L0056l7179j2979J5399K446J677M7044k9015j5259K4862
2245H5934j0653J1032J8316j9225j4780R072o346J2091L5755j7694n798L6625
2233A34329L115j5429r415l768J760K809k3526l4388J3266M7175k2430l8967r513
2220D5018l997L2835k0943M9790k1725k0448O746J5327j5613J3782O12M926k18
2207H6092M760j093n0391o631P720Q874k0154J6909J1507q630j2565K547L5914
$$ plain form
2194 74859 113901 108541 82833 22035 38640 48300 70559 71980 59418 34586 38302 61228 53839
2181 53839 22761 51789 40518 41561 55668 90399 87383 74755 101264 70832 71603 60442 59898
2168 59898 78326 58234 54685 40987 21516 7737 48641 58656 34835 53863 61221 63833
2156 63833 57728 52693 84670 100355 87413 50587 75456 98615 62355 46584 63284 82185
2144 82185 102529 93029 63125 69953 79372 69732 82826 84118 57525 55867 59028 86471 102138
2131 102138 95533 80323 76084 61259 78339 77900 68047 78480 73745 62270 67377 56250 35313
2118 35313 29887 28724 34170 60996 64263 56772 61541 55828 65865 87352 102130 83536 58724
2105 58724 93807 94379 62762 41687 71079 75980 84382 84172 89872 96253 58048 78708 44353
$$ packed form
2194G4859L9042n360k5708o0798J6605R660K2259J421j2562k4832L716K2926p389
2181E3839l1078K9028j1271J043J4107L4731l016j2628K6509l0432P71j1161n44
2168E9898J8428k0092l549j3698j9471j3779M0904J0015k3821J9028P358K612
2156F3833o105n035L1977J5685j2942l6826K4869K3159l6260j5771J6700J8901
2144H2185K0344r500k9904O828R419r640J3094J292k6593j658L161K7443J5667
2131A02138o605j5210m239j4825J7080m39r853J0433m735j1475N107j1127k0937
2118C5313n426j163N446K6826L267p491M769n713J0037K1487J4778j8594k4812
2105E8724L5083N72l1617k1075K9392M901Q402k10N700O381l8205K0660l4355
$$ plain form
2092 44353 38569 60153 30429 16757 37797 51273 52046 76536 66726 68855 63955 78111 96720
2079 96720 80240 110006 106363 76554 114050 116876 97549 85153 88803 75070 109601 94574
2067 94574 100315 105758 132387 116585 119328 115109 126036 173773 145468 144508 134342 131672 127916
2054 127916 143303 169638 151069 130682 118774 123854 129641 130772 159639 155075 153129 178543 161795
2041 161795 175012 186790 190615 198696 214443 206066 208315 218679 232135 242910 231469 226253 237073
2028 237073 284374 283673 297032 292629 294393 310445 320269 313962 331383 332407 339678 343269 352548 372501
2014 372501 381346 386113 419904 392533 396921 435118 443973 446774 486540 495562 534236 564585 591160
2001 591160 589610 593740 631390 706130 731840 750784 776243 780930 831094 871386 906035 981398
$$ packed form
2092D4353n784K1584k9724j3672K1040J3476P73K4490r810K129m900J4156J8609
2079I6720j6480K9766l643k9809L7496K826j9327j2396L650j3733L4531j5027
2067I4574N741N443K6629j5802K743m219J0927M7737k8305r60j0166k670l756
2054A27916J5387K6335j8569k0387j1908N080N787J131K8867m564j946K5414j6748
2041A61795J3217J1778L825Q081J5747q377K249J0364J3456J0775j1441n216J0820
2028B37073M7301p01J3359m403J764J6052R824o307J7421J024P271L591R279J9953
2014C72501Q845M767L3791k7371M388L8197Q855K801L9766R022L8674L0349K6575
2001E91160j550M130L7650P4740K5710J8944K5459M687N0164M0292L4649P5363
$$ plain form
1989 981398 1084379 1141378 1220368 1295029 1368635 1513674 1631457 1756574 1922752 2032233
1979 2032233 2140491 2312778 2532135 2819838 3229168 3721871 4249526 4815001 5508052 6491140
1969 6491140 7784165 9218037 10424204 10601936 9484077 7865944 6325203 5037846
1961 5037846 4148139 3490254 2963417 2611319 2380314 2228722 2042439 1892663 1803471 1685995
1951 1685995 1598289 1459312 1349019 1277515 1208261 1095472 1023620 943959 888913 824788 775025
1940 775025 727864 695925 674354 669055 668944 614667 606545 584323 570755 521941 482877 485734 466732
1927 466732 442222 446865 412185 385302 360311 334708 354018 391074 369134 297521 279388 270340
1915 270340 272544 235068 243726 248802 241756 234940 195355 198009 224740 229670 225527 216468 196883
$$ packed form
1989I81398J02981N6999P8990P4661P3606J45039J17783J25117J66178J09481
1979B032233J08258J72287K19357K87703M09330M92703N27655N65475O93051R83088
1969F491140J293025J433872J206167J77732j117859j618133j540741j287357
1961E037846q89707o57885n26837l52098k31005j51592j86283j49776q9192j17476
1951A685995q7706j38977j10293p1504o9254j12789p1852p9661n5046o4125m9763
1940G75025m7161l1939k1571n299j11n4277q122k2222j3568m8814l9064K857j9002
1927D66732k4510M643l4680k6883k4991k5603J9310L7056k1940p1613j8133r048
1915B70340K204l7476Q658N076p046o816l9585K654K6731M930m143r059j9585
$$ plain form
1902 196883 171777 154050 151937 145217 131543 141767 157300 144137 139007 159783 165376 125226
1890 125226 131113 131558 111898 66107 62690 127173 114889 83556 95035 107927 110342 77541 65330
1877 65330 80607 106263 108644 99410 96054 82021 102594 107443 58704 88832 105696 110971 87098
1864 87098 68797 61006 51732 93337 72665 45192 74279 65114 32580 34173 7133 31661 37358
1851 37358 58226 50975 25735 51057 74371 56723 54987 74536 92545 82182 54547 36441
1839 36441 31235 41749 6217 -153 32110 24780 54844 55993 30344 28637 44995 20907 -17629
1826 -17629 27541 21396 12432 2372 9503 31855 7617 6491 23369 41726 35273 52391 64081
1813 64081 37012 60659 69106 43261 8878 -10284 9554 7163 35195 37526 45429 43803 39501
$$ packed form
1902A96883k5106j7727k113o720j3674J0224J5533j3163n130K0776N593m0150
1890A25226N887M45j9660m5791l417O4483j2284l1333J1479J2892K415l2801j2211
1877F5330J5277K5656K381r234l356j4033K0573M849m8739L0128J6864N275k3873
1864H7098j8301p791r274M1605k0672k7473K9087r165l2534J593k7040K4528N697
1851C7358K0868p251k5240K5322K3314j7648j736J9549J8009j0363k7635j8106
1839C6441n206J0514l5532o370L2263p330L0064J149k5649j707J6358k4088l8536
1826a7629M5170o145q964j0060P131K2352k4238j126J6878J8357o453J7118J1690
1813F4081k7069K3647Q447k5845l4383j9162J9838k391K8032K331P903j626m302
$$ plain form
1800 39501 20491 12807 36802 4598 13657 18476 26198 20299 547 -6534 12402 5753 16334
1787 16334 6819 30251 27506 27508 16229 5598 40535 27555 -6548 13283 -10119 -5694 -15944
1774 -15944 -14861 16630 27448 36875 12040 19181 26875 13056 -33205 -4766 -5395 -3233 -5013
1761 -5013 3094 9341 2303 -1188 16593 6298 11601 29965 44415 5096 -16329 -6687 -30609
1748 -30609 -30122 -10323 19393 4013 6212 4984 32971 72523 44857 -1017 -24383 -15533 570
1735 570 300 -3220 13103 33331 40995 45789 39851 18411 15143 -14966 7982 13057 25350 51538
1721 51538 30590 -7337 -2710 6586 24137 -16800 -16778 5513 -19909 -6281 -11356 42094 18948
1708 18948 -11925 17167 49402 16541 2640 -3730 -4779 11185 33198 36626 69936 60271 66916
$$ packed form
1800C9501j9010p684K3995l2204R059M819P722n899j9752p081J8936o649J0581
1787A6334r515K3432k745Kj1279j0631L4937j2980l4103J9831k3402M425j0250
1774a5944J083L1491J0818R427k4835P141P694j3819m6261K8439o29K162j780
1761e013Q107O247p038l491J7781j0295N303J8364J4450l9319k1425R642k3922
1748c0609M87J9799K9716j5380K199j228K7987L9552k7666m5874k3366Q850J6103
1735E70k70l520J6323K0228P664M794n938k1440l268l0109K2948N075J2293K6188
1721E1538k0948l7927M627R296J7551m0937K2K2291k5422J3628n075N3450k3146
1708A8948l0873K9092L2235l2861j3901o370j049J5964K2013L428L3310r665O645
$$ plain form
1695 66916 19372 28594 23031 -2807 38634 45910 -7905 11668 53787 38988 59170 -3691
1683 -3691 20052 14328 163 10642 4692 -12790 -28397 -4367 -23966 -5683 25729 52276
1671 52276 26018 4138 -15693 -12557 539 -171 7635 -12568 -19127 5710 -2679 -8030 -10549
1658 -10549 -15957 16227 -18488 -16091 -36777 -1302 -28402 -29601 -21661 5547 6343 31983 45623
1645 45623 22966 15713 -13693 -11345 -11983 -37182 -37436 7419 16589 -29793 -22736 18046 8323 4697
1631 4697 -7352 2094 -5022 -21307 7356 19214 9881 -14785 -4055 8655 3485 22428 12714
1618 12714 17387 6016 -402 -2135 2449 9949 304 7645 33669 16474 41693 35986 12674
1605 12674 20547 6789 -37781 -17968 -10793 -36955 -17989 25177 -10733 -35720 -29042 -33150 -46049
$$ packed form
1695F6916m7544R222n563k5838M1441P276n3815J9573M2119j4799K0182o2861
1683c691K3743n724j4165J0479n950j7482j5607K4030j9599J8283L1412K6547
1671E2276k6258k1880j9831L136J3096p10P806k0203o559K4837q389n351k519
1658a0549n408L2184l4715K397k0686L5475k7100j199P940K7208P96K5640J3640
1645D5623k2657p253k9406K348o38k5199k54M4855R170m6382P057M0782r723l626
1631D697j2049R446p116j6285K8663J1858r333k4666J0730J2710n170J8943r714
1618A2714M673j1371o418j733M584P500r645P341K6024j7195K5219n707k3312
1605A2674P873j3758m4570J9813P175k6162J8966M3166l5910k4987O678m108j2899
$$ plain form
1592 -46049 -57001 -13804 -2070 -28817 1569 -28311 -32794 -14449 -40445 -6375 20053 -4991
1580 -4991 801 12981 -14120 -16171 11883 -5963 -42864 -25258 -41083 -60611 -54036 -73044 -73822
1567 -73822 -39773 -47540 -58100 -30170 -24751 -25079 -23506 -19527 -5889 -28738 -33872 -36531 -29354 -34311
1553 -34311 -56530 -32037 -43088 -37037 4337 -26679 -11769 14530 12659 -1058 9798 -1294
1541 -1294 -8167 2888 18868 -34171 -19293 1486 38623 11058 -40676 -60045 -73837 -64570
1529 -64570 -59253 -32312 4379 1278 -51411 -54064 -59846 -18238 3742 -12665 -51239 -28785 -5765
1516 -5765 4369 -35802 -45481 -9578 -27902 1595 7674 -30124 -28747 9475 18079 4763 -18430
1503 -18430 11929 21266 -5296 -26106 -33931 -36924 -27543 -32321 -6632 -3299 16215 28701 11494
$$ packed form
1592d6049j0952M3197J1734k6747L0386k9880m483J8345k5996L4070K6428k5044
1580d991N792J2180k7101k051K8054j7846l6901J7606j5825j9528O575j9008p78
1567g3822L4049p767j0560K7930N419l28J573L979J3638k2849n134k659P177m957
1553c4311k2219K4493j1051O051M1374l1016J4910K6299j871j3717J0856j1092
1541a294o873J1055J5980n3039J4878K0779L7137k7565n1734j9369j3792R267
1529f4570N317K6941L6691l101n2689k653n782M1608K1980j6407l8574K2454K3020
1516e765J0134m0171r679L5903j8324K9497O079l7798J377L8222Q604j3316k3193
1503a8430L0359R337k6562k0810p825k993R381m778K5689L333J9514J2486j7207
$$ plain form
1490 11494 -19587 -51612 -1192 -36880 -20061 -31140 -20462 -5977 -19350 -13885 2934 22368
1478 22368 24220 24246 17873 -2885 -9263 -3918 -32073 -44338 -15014 -2616 6686 4994 -33640 -32708
1464 -32708 -28074 -5620 -21775 -25476 -12980 -23802 -24388 -26304 -10182 -55915 -65803 -49208 -12840
1451 -12840 -38373 -58197 -57779 -63865 -56816 -71977 -59127 -62303 -48594 -12128 4491 -7713 -15571
1438 -15571 -31158 -40082 -31008 -59779 -21263 -20423 -35304 -25733 13476 -14610 -44552 -42423 -2222
1425 -2222 -21447 -606 73353 38543 6508 15513 -3485 -2808 6273 -14292 17026 -5374 -12191
1412 -12191 -6304 -6924 -2569 22104 16117 -18756 -65044 -52579 -46680 -49119 -55305 -40857 -39153 -8964
1398 -8964 -45803 -52463 -27876 -22352 -51701 -55593 -52671 -43307 -38933 -56184 -33610 -27255 4551
$$ packed form
1490A1494l1081l2025N0420l5688J6819j1079J0678J4485j3373N465J6819J9434
1478B2368J852K6o373k0758o378N345k8155j2265K9324J2398R302j692l8634R32
1464c2708M634K2454j6155l701J2496j0822n86j916J6122m5733r888J6595L6368
1451a2840k5533j9824M18o086P049j5161J2850l176J3709L6466J6619j2204p858
1438a5571j5587q924R074k8771L8516Q40j4881R571L9209k8086k9942K129M0201
1425b222j9225K0841P3959l4810l2035R005j8998O77R081k0565L1318k2400o817
1412a2191N887o20M355K4673n987l4873m6288J2465N899k439o186J4448J704L0189
1398h964l6839o660K4587N524k9349l892K922R364M374j7251K2574O355L1806
$$ plain form
1385 4551 17207 -12965 6512 -1356 -21336 -23745 -15470 10589 -30855 -38111 -8762 -28553 -30217
1372 -30217 -21473 -23342 -16457 -24736 -47847 -28319 -57512 -56949 -28119 -33613 -34831 -38023 -32448 -55736
1358 -55736 -31017 -54775 -43981 -32935 -70489 -73669 -43728 -28350 -30583 -13456 2613 -4185
1346 -4185 -30637 -28091 -15834 -23121 -15750 -36136 -36192 -14572 -10803 -52311 -51542 -46064 -60470 -14284
1332 -14284 -4242 -5303 -8695 -13812 -24930 -58114 -49285 -56017 -44961 -40750 -30869 -893 -46943
1319 -46943 -28412 641 21344 -11593 -12439 13529 -19903 -625 687 -24746 13046 13902 -15229
1306 -15229 -7308 -3597 17946 -11156 -8163 -20064 -34083 -38255 -1855 -5919 -53841 -31594 -29457
1293 -29457 -40940 -62848 -63547 -35176 -61906 -17952 -33120 -33959 -28973 -36274 -19607 -17233 12257
$$ packed form
1385D551J2656l0172J9477p868j9980k409Q275K6059m1444p256K9349j9791j664
1372c0217Q744j869O885q279k3111J9528k9193N63K8830n494j218l192N575k3288
1358e5736K4719k3758J0794J1046l7554l180K9941J5378k233J7127J6069o798
1346d185k6452K546J2257p287P371k0386n6K1620L769m1508P69N478j4406M6186
1332a4284J0042j061l392n117j1118l3184Q829o732J1056M211R881K9976m6050
1319d6943J8531K9053K0703l2937q46K5968l3432J9278J312k5433L7792Q56k9131
1306a5229P921L711K1543k9102K993j1901j4019m172L6400m064m7922K2247K137
1293b9457j1483k1908o99K8371k6730M3954j5168q39M986p301J6667K374K9490
$$ plain form
1280 12257 -10219 -13388 -19509 -15515 -42387 -16451 -9058 6978 -10142 12393 24125 14391 -16444
1267 -16444 2833 -9519 -11957 -3123 -3317 8592 3766 -7687 -18220 -6914 -54996 -35671 -44895
1254 -44895 -31451 -17568 -52738 -71238 -35748 -43956 -47183 -35541 -14015 -8679 -6851 -32492 -23419
1241 -23419 -15819 -38966 -23889 -20936 -27351 -43632 -44289 -36180 -41486 -10176 -19784 -13481 -26754 -2661
1227 -2661 14769 -20194 -19301 4408 18890 3332 -245 -3393 -12960 -28716 -69275 -63389 -36833
1214 -36833 -34804 -27015 -58748 -65806 -50764 -11432 -25731 -37531 -19747 -30628 -25267 -22508 -6518
1201 -6518 -49205 -31126 29753 -4736 -10098 -13824 -27126 -6550 -12524 -18586 -37038 -27044 1041
1188 1041 -13602 -4906 -6263 -33048 -39659 -21096 -14534 -34170 -39625 -23092 -28837 4780 -6599
$$ packed form
1280A2257k2476l169o121L994k6872K5936P393J6036j7120K2535J1732r734l0835
1267a6444J9277j2352k438Q834j94J1909m826j1453j0533J1306m8082J9325r224
1254d4895J3444J3883l5170j8500L5490q208l227J1642K1526N336J828k5641R073
1241b3419P600k3147J5077K953o415j6281o57Q109n306L1310r608O303j3273K4093
1227b661J7430l4963Q93K3709J4482j5558l577l148r567j5756m0559N886K6556
1214c6833K029P789l1733p058J5042L9332j4299j1800J7784j0881N361K759J5990
1201f518m2687J8079O0879l4489n362l726j3302K0576n974o062j8452R994K8085
1188A041j4643Q696j357k6785o611J8563O562j9636n455J6533n745L3617j1379
$$ plain form
1175 -6599 -28349 -27240 -3026 26430 27785 -20512 -24582 -9743 -3796 -27763 -55416 -42410 -13319
1162 -13319 -19454 -18878 -42397 -854 -1483 -38423 -30096 -1868 10962 1400 12901 27218 26365 -14737
1148 -14737 -26603 -53035 -60722 -79562 -52197 -3547 26176 21499 17250 836 -1605 11010 -8145
1135 -8145 -24986 13419 -243 -18211 -8019 11477 -8456 -22742 -20393 942 4677 -7358
1123 -7358 9602 16347 1843 -47209 -74892 -48738 9639 -534 1858 -12374 -40007 -27756
1111 -27756 3550 -2075 -34155 -40458 -34682 -16402 -3806 -13054 -7869 -7702 -43174 -39865 19266
1098 19266 15780 -73 8303 -23418 -63144 -19383 14175 15715 -22341 -39720 -45491 -20478 20229
1085 20229 32945 -10457 -26324 -34149 -35538 -26902 -21311 14476 -23063 -49299 -43002 -13485 1634
$$ packed form
1175f599k1750J109K4214K9456J355m8297m070J4839N947k3967k7653J3006K9091
1162a3319o135N76k3519M1543o29l6940Q327K8228J2830r562J1501J4317q53m1102
1148a4737j1866k6432p687j8840K7365M8650K9723m677m249j6414k441J2615j9155
1135h145j6841L8405j3662j7968J0192J9496j9933j4286K349K1335L735j2035
1123g358J6960O745j4504m9052k7683K6154N8377j0173K392j4232k7633J2251
1111b7756L1306n625l2080o303N776J8280J2596r248N185J67l5472L309N9131
1098A9266l486j5853Q376l1721l9726M3761L3558J540l8056j7379n771K5013M0707
1085B0229J2716m3402j5867p825j389Q636N591L5787l7539k6236O297K9517J5119
$$ plain form
1072 1634 -27071 -19118 -2416 -37449 -36683 -47879 -33995 -45571 -56146 -60131 -52619 -22178 9667
1059 9667 -18907 -32263 -51796 -27459 -68607 -71391 -34308 -18538 -53220 -87985 -78008 -63061
1047 -63061 -42628 -44315 -21025 -39153 -43541 -41166 -20857 -40412 -26669 -40763 -43700 -19632 -8262
1034 -8262 21629 49528 21374 -5241 -3325 -718 14737 -19225 -48135 -26353 -12344 -27285
1022 -27285 -39565 -30138 -22561 -21013 -23915 -21998 -36870 -56391 -68522 -49057 -46475 -46791 -53549 -50492
1008 -50492 -53110 -30963 -37029 -31478 -38498 -30682 -12385 -3837 -1664 -25494 -41941 -53942 -35143
995 -35143 -24344 -17901 -3675 2464 501 -1394 -27233 -35359 -32659 -27236 -32300 -36997 -20680 -1145
981 -1145 -15409 -22263 -13382 7069 -14786 -30595 -19088 -12097 -2757 28446 17063 17225 -4966
$$ packed form
1072A634k8705P953J6702l5033P66j1196J3884j1576j0575l985P512L0441L1845
1059I667k8574j3356j9533K4337m1148k784L7083J5770l4682l4765R977J4947
1047f3061K0433j687K3290j8128m388K375K0309j9555J3743j4094k937K4068J1370
1034h262K9891K7899k8154k6615J916K607J5455l3962k8910K1782J4009j4941
1022b7285j2280R427P577J548k902J917j4872j9521j2131J9465K582l16o758L057
1008e0492k618K2147o066N551p020P816J8297Q548K173k3830j6447j2001J8799
995c5143J0799O443J4226O139j963j895k5839q126K700N423n064m697J6317J9535
981a145j4264o854Q881K0451k1855j5809J1507O991R340L1203j1383J62k2191
$$ plain form
968 -4966 -2031 -5574 -23686 -31688 -21280 -38203 -37891 -42665 -42600 -6179 43153 43329 31041 -2212
954 -2212 -30755 -54968 -60104 -41947 -50822 -41736 -31600 -49664 -37525 -36869 -11450 7268 -24140
941 -24140 -53746 -104204 -92278 -56388 -16686 -47074 -28462 22393 9338 -45715 -41913 -39023
929 -39023 -13272 -17697 -28355 -9567 -1674 -8568 -15778 -21388 -25580 -27840 -26380 -17563 -34446 -29482
915 -29482 4591 -25968 -49577 -47608 -35139 -35923 -21315 -42640 -36968 -32694 -62318 -62735 -45191
902 -45191 -23758 -22037 -2158 -35842 -67358 -37657 -23767 -40803 -45427 -30170 -44291 -50024 -5262
889 -5262 2646 -598 -12073 -52920 -39743 -24046 -44971 -32400 -41959 -59829 -34931 -45004 -47533
876 -47533 -58944 -52719 -34483 -48926 -75378 -64928 -76008 -43095 -33072 -28716 -31602 -68266 -35894
$$ packed form
968d966K935l543j8112q002J0408j6923L12m774O5L6421M9332J76j2288l3253
954b212k8543k4213n136J8157q875R086J0136j8064J2139O56K5419J8718l1408
941b4140k9606n0458J1926L5890L9702l0388J8612N0855j3055n5053L802K890
929c9023K5751m425j0658J8788P893o894p210n610m192k260J460Q817j6883M964
915b9482L4073l0559k3609J969J2469p84J4608k1325N672M274k9624m17J7544
902d5191K1433J721J9879l3684l1516K9701J3890j7036m624J5257j4121n733M4762
889e262P908l244j1475m0847J3177J5697k0925J2571r559j7870K4898j0073k529
876d7533j1411O225J8236j4443k6452J0450j1080L2913J0023M356k886l6664L2372
$$ plain form
863 -35894 -46328 -37471 2946 -171 -30296 -45581 -55932 -19786 -52171 -17512 -14116 -21936 17841
850 17841 1578 4049 -2505 5456 -15510 -43933 -46703 -38106 -34194 19821 4358 2304 25805
837 25805 -1302 -5509 -25542 -21406 -13834 -31244 -50710 -62645 -40323 -18064 -16055 -15438 -18496
824 -18496 -22470 -61182 -49972 -11132 -14701 -7952 -19329 -7192 -14796 -25052 -23499 -47952 -54242
811 -54242 -60700 -52432 -46449 -27455 -12566 -22540 -55985 -56533 -39166 -8875 681 -37364 -46837 -8997
797 -8997 -1324 -19307 -20044 -1096 -25461 -26978 -41077 -36469 -48916 -56372 -41459 -24870 -28368 -40058
783 -40058 -13597 -20654 -41163 -60650 -33279 -25411 -29714 -25175 -36184 -12030 -1244 -8497 -31014
770 -31014 -36966 -26645 -60540 -27473 -22009 -34178 -9367 -8911 -41345 -17947 20156 -3215 -3974
$$ packed form
863c5894j0434Q857M0417l117l0125j5285j0351L6146l2385L4659L396p820L9777
850A7841j6263K471o554P961k0966k8423k770Q597L912N4015j5463k054K3501
837B5805k7107m207k0033M136P572j7410j9466j1935K2322K2259K009O17l058
824a8496l974l8712J1210L8840l569O749j1377J2137p604j0256J553k4453o290
811e4242o458Q268N983J8994J4889r974l3445n48J7367L0291R556l8045r473L7840
797h997P673j7983p37J8948k4365j517j4099M608j2447p456J4913J6589l498j1690
783d0058K6461p057k0509j9487K7371P868m303M539j1009K4154J0786p253k2517
770c1014n952J0321l3895L3067N464j2169K4811M56l2434K3398L8103k3371p59
$$ plain form
757 -3974 -17617 20782 19665 -17189 -38262 -19993 -17477 -2912 9137 10579 1582 -21217 -20044
744 -20044 -14492 -21458 -49601 -23489 -10503 -45618 -53840 -21937 -26714 -37964 -46566 -42272 14892
731 14892 -44178 -47380 -30804 -43569 7320 2662 1150 3441 -12826 -40395 -33090 -31759 -31149 -26225
717 -26225 -37940 -53971 -74531 -52925 -52426 -37135 -34606 -45028 7866 -14858 -22631 -8184 -27039
704 -27039 -15821 -28316 -36464 -30319 -27627 -11169 -2803 -28124 -55361 -27530 -4380 -29955 -23789
691 -23789 9309 17459 -35733 -21325 12044 447 -29259 -53621 -52118 -62708 -36604 -34350 -11788
678 -11788 -21236 -3024 -46857 -17144 -16951 -22812 -46330 -20396 -30170 -39506 -9439 -40795 -75030
665 -75030 -40132 -37580 -10038 -6204 -2363 -16192 -29343 -19493 -61904 -58636 -36852 -46476 -24448
$$ packed form
757c974j3643L8399j117l6854k1073J8269K516J4565J2049J442q997k2799J173
744b0044N552o966k8143K6112J2986l5115q222L1903m777j1250q602M294N7164
731A4892n9070l202J6576j2765N0889m658j512K291j6267k7569P305J331O10M924
717b6225j1715j6031k0560K1606M99J5291K529j0422N2894k2724p773J4447j8855
704b7039J1218j2495q148O145K692J6458Q366k5321k7237K7831K3150k5575O166
691b3789L3098Q150n3192J4408L3369j1597k9706k4362J503j0590K6104K254K2562
678a1788r448J8212m3833K9713J93n861k3518K5934r774r336L0067l1356l4235
665g5030L4898K552K7542L834L841j3829j3151R850m2411L268K1784r624K2028
$$ plain form
652 -24448 -16524 -25287 6212 6440 -6428 -24256 -49600 -33015 -48026 -36371 -16206 -8712 -3554
639 -3554 -1254 5757 -15807 -11270 -28118 -50109 -58293 -21285 -33665 -53335 -90088 -59675 -37419
626 -37419 -30928 -30091 14307 761 -28916 -46508 -13839 -10442 -34826 -54658 -77965 -66393 -33284
613 -33284 -26749 6553 -7629 -19659 2261 -2217 -11234 -14911 -13918 -6895 -13129 -20722 -16726 -25834
599 -25834 -33224 -36262 -48450 -5289 -1414 5775 6067 -7248 8590 9456 10094 1508 -7697 -18388
585 -18388 -22962 -41318 -45676 -28990 -42576 -32526 -34051 -46537 -60000 -22601 7985 -27453 -39324
572 -39324 -38506 -46351 -9942 -7384 -24172 -19395 -31900 -20203 -42864 -49800 -10844 -22475 -2858
559 -2858 -10594 -35343 -57264 -28009 24000 25265 48991 16012 -26353 -5581 -14803 -31333 -22718
$$ packed form
652b4448P924q763L1499K28j2868j7828k5344J6585j5011J1655K0165P494N158
639c554K300P011k1564M537j6848k1991q184L7008j2380j9670l6753L0413K2256
626c7419O491Q37M4398j3546k9677j7592L2669L397k4384j9832k3307J1572L3109
613c3284O535L3302j4182j2030K1920m478r017l677R93P023o234p593L996r108
599b5834p390l038j2188M3161L875P189K92j3315J5838Q66O38q586r205j0691
585a8388m574j8356m358J6686j3586J0050j525j2486j3463L7399L0586l5438j1871
572c9324Q18p845L6409K558j6788M777j2505J1697k2661o936L8956j1631J9617
559b858p736k4749k1921K9255N2009J265K3726l2979m2365K0772r222j6530Q615
$$ plain form
546 -22718 20511 27302 27065 24212 4838 201 -23649 -18232 -37085 20755 2011 -44867 -56851
533 -56851 -48464 -33839 -36633 -1617 -21761 -41364 -52984 -19334 -8602 -43576 11379 36689
521 36689 29858 -25280 -33961 -67035 -64610 -56460 -18343 -31332 -67732 -68541 -78158 -38196 -16586
508 -16586 -49392 -46661 1908 15277 -40167 -10618 -10305 -7562 3778 14446 3131 -32069 -49089
495 -49089 -28274 9374 2373 6058 25113 1488 -19861 5622 -23442 -28615 -36741 -52175 -41259
482 -41259 -36464 -31865 -1318 21675 10414 -18339 -19365 -14627 -37690 -54179 -29001 -35282 -35424
469 -35424 15252 11006 -16240 -12941 -22288 -23743 -45640 -37559 -11364 13166 -25829 831 29533
456 29533 -16941 -1266 -8569 -18335 -34435 -51051 -26120 -39958 -32577 -16677 -38227 -27453 -14270
$$ packed form
546b2718M3229O791k37k853j9374m637k3850N417j8853N7840j8744m6878j1984
533e6851Q387J4625k794L5016k0144j9603j1620L3650J0732l4974N4955K5310
521C6689o831n5138q681l3074K425Q150L8117j2989l6400q09r617L9962K1610
508a6586l2806K731M8569J3369n5444K9549L13K743J1340J0668j1315l5200j7020
495d9089K0815L7648p001L685J9055k3625k1349K5483k9064n173q126j5434J0916
482d1259M795M599L0547K2993j1261k8753j026M738k3063j6489K5178o281j42
469c5424N0676m246k7246L299r347j455k1897Q081K6195K4530l8995K6660K8702
456B9533m6474J5675p303r766j6100j6616K4931j3838P381J5900k1550J0774J3183
$$ plain form
443 -14270 -49227 -33237 -6958 -23355 -67073 -41130 -9396 -2721 3074 -12651 -32771 -35914 -25979
430 -25979 -21719 -18061 1439 7548 -3446 -16868 -48573 -31429 -45325 16171 37701 -5713 -38731
417 -38731 -25826 -8291 -14190 -16633 -16976 4517 -367 -14432 -354 14637 -160 -57242 -42769
404 -42769 -55328 -58815 -40625 -51521 -42170 -37238 -56182 -70209 -45230 -16924 -18172 -36828 -54904
391 -54904 -80266 -46091 -14942 -24714 -64189 -70830 -46057 -62202 -58422 -35726 -43919 -17727 -35350
378 -35350 34143 28294 -1089 -15836 6915 13852 -12527 -23511 -25989 -36497 -22418 -14017 -7359
365 -7359 -26419 -13083 -9181 -41154 -45540 -49882 -25549 7726 9708 3217 -48329 -72234 -56743
352 -56743 -34931 -52789 -56876 -49355 -57556 -43931 -29631 -30621 -26713 -37147 -20676 -42893 -65695
$$ packed form
443a4270l4957J5990K6279j6397m3718K5943L1734O675N795j5725k0120l143R935
430b5979M260L658J9500O109j0994j3422l1705J7144j3896O1496K1530m3414l3018
417c8731J2905J7535n899k443l43K1493m884j4065J4078J4991j4797n7082J4473
404d2769j2559l487J8190j0896R351M932j8944j4027K4979K8306j248j8656j8076
391e4904k5362L4175L1149r772l9475o641K4773j6145L780K2696q193K6192j7623
378c5350O9493n849k9383j4747K2751O937k6379j0984k478j0508J4079Q401O658
365g359j9060J3336L902l1973m386m342K4333L3275J982o491n1546k3905J5491
352e6743K1812j7858m087P521q201J3625J4300r90L908j0434J6471k2217k2802
$$ plain form
339 -65695 -28277 -49562 -41306 -24367 -7980 -25504 -38885 -19694 -22644 -36055 -30827 -57379 -48451
326 -48451 -39840 -33729 -54537 -53083 -51422 -35616 -49970 -50512 -46072 -9953 -14106 -12308 -44683 -32813
312 -32813 -36240 -35552 -51226 -26716 -48791 -53022 -41635 -51941 -36065 -71401 -50160 -42261 -45580
299 -45580 -39240 -22947 -19177 -30835 -18616 -22695 -36185 -38942 -61903 -70655 -67316 -33936 -9730
286 -9730 -38044 -44676 -48087 -81160 -50884 -40753 -22881 -11740 -26792 -28824 -4151 17843 1655
273 1655 -22624 -22532 -17224 -9450 -18505 -16183 -2766 -31588 -21185 -13086 -10487 21406 -2936 -23759
259 -23759 -25707 -41697 -54719 -47083 -31474 1008 31166 12588 11756 -2321 -16910 -35840 -30253
246 -30253 -9663 -160 -3492 -24949 -34054 -45828 -39094 -72687 -44357 -63852 -40516 -23250 -8051
$$ packed form
339f5695L7418k1285Q256J6939J6387j7524j3381J9191k950j3411N228k6552Q928
326d8451Q611O111k0808J454J661J5806j4354n42M440L6119m153J798l2375J1870
312c2813l427O88j5674K4510k2075m231J1387j0306J5876l5336K1241P899l319
299d5580O340J6293L770j1658J2219m079j3490k757k2961q752L339L3380K4206
286i730k8314o632l411l3073L0276J0131J7872J1141j5052k032K4673K1994j6188
273A655k4279R2N308P774r055K322J3417k8822J0403Q099K599L1893k4342k0823
259b3759j948j5990j3022P636J5609L2482L0158j8578q32j4077j4589j8930N587
246c0253K0590R503l332k1457r105j1774O734l3593K8330j9495K3336J7266J5199
$$ plain form
233 -8051 -4110 -41073 -58128 -74080 -68276 -97375 -68875 -42374 -34692 -22794 -28765 -3752 -1931
220 -1931 -338 -24554 -17690 -41852 -57845 -44154 -35483 -27053 -54921 -65934 -71071 -58659 -7717
207 -7717 6477 -15348 -12611 1909 -13246 2914 -20716 -48796 -29457 -32568 -38516 -63569 -33842
194 -33842 -43523 -53920 -55775 -48596 -44095 -49740 -38540 3512 -8620 -26154 -27919 -21345 -35814
181 -35814 -26548 -30298 -7825 -18516 -53483 -29854 -11970 -10349 -11935 -53471 -26649 5505 -4195
168 -4195 -23909 -39879 -39629 -32717 -426 -8203 19314 -9002 12867 22817 -17201 -27826 -27981 -36796
154 -36796 -23504 -36182 -36064 -27105 -43070 -55395 -66134 -72037 -54216 -46705 -43127 -50444 -43094 -20010
140 -20010 5089 -29818 -49950 -61939 -77868 -71911 -60652 -22546 -11568 -20300 -10621 -13269 -15213
$$ packed form
233h051L941l6963j7055j5952N804k9099K8500K6501P682J1898n971K5013J821
220a931J593k4216O864k4162j5993J3691Q671Q430k7868j1013n137J2412N0942
207g717J4194k1825K737J4520j5155J6160k3630k8080J9339l111n948k5053K9727
194c3842r681j0397j855P179M501n645J1200M2052j2132j7534j765O574j4469
181c5814R266l750K2473j0691l4967K3629J7884J621j586m1536K6822L2154r700
168d195j9714j5970K50O912L2291p777K7517k8316K1869R950m0018j0625j55q815
154c6796J3292j2678J18Q959j5965j2325j0739n903J7821P511L578p317P350K3084
140b0010K5099l4907k0132j1989j5929N957J1259L8106J0978q732R679k648j944
$$ plain form
127 -15213 -500 5355 10003 -12636 -39799 -62154 -27741 -28244 -47578 -40076 -31881 -23503 -7446
114 -7446 -18797 -26580 -48991 -52058 -32830 -17624 -24995 -34010 -13237 6159 -1183 -35193 -52244
101 -52244 -47553 -55201 -44938 -14135 -15857 -16303 -30518 -35209 -12451 -12588 1950 -14984 -34341 -27634
87 -27634 -17518 -18197 -9597 -23346 -14322 -6927 -10471 -27855 -44032 -58839 -47523 -12338 -38928
74 -38928 -28508 -15882 -9196 -12654 -9589 -34183 -26107 -43889 -56838 -27240 -37765 -37068 -43812 -55410
60 -55410 -33764 -29468 -47582 -21466 -20324 -38125 -45013 -52271 -36204 -16612 -7665 -24525 -48913
47 -48913 -34505 -30649 -22010 -10057 -2495 -8817 4669 -9320 -2182 440 -23251 -1207 -15189
34 -15189 -14232 -37749 -23531 -4508 -14836 -33221 -47211 -52332 -48286 -20808 -3266 11057 18598
$$ packed form
127a5213J4713N855M648k2639k7163k2355L4413n03j9334P502Q195Q378J6057
114g446j1351p783k2411l067J9228J5206p371r015K0773J9396p342l4010j7051
101e2244M691p648J0263L0803j722m46j4215m691K2758j37J4538j6934j9357O707
87b7634J0116o79Q600j3749R024P395l544j7384j6177j4807J1316L5185k6590
74c8928J0420J2626O686l458L065k4594Q076j7782j2949K9598j0525O97o744j1598
60e5410K1646M296j8114K6116J142j7801o888p258J6067J9592Q947j6860k4388
47d8913J4408L856Q639J1953P562o322J3486j3989P138K622k3691K2044j3982
34a5189R57k3517J4218J9023j0328j8385j3990n121M046K7478J7542J4323P541
$$ plain form
21 18598 -27235 -17129 -15848 -38741 -37697 -43069 -25624 3047 10172 -11636 -26948 -28506 -23937
8 -23937 -12800 -31408 -36140 -49045 -62426 -40894 -38927 -31396
0 -31396
$$ packed form
21A8598m5833J0106J281k2893J044n372J7445K8671P125k1808j5312j558M569
8b3937J1137j8608m732j2905j3381K1532J967P531
0c1396
$$ Imaginary data points
##PAGE= N=2
##DATA TABLE= (X++(I..I)), XYDATA
$$ plain form
16383 -1478656 -1460784 -1432819 -1412810 -1414236 -1393497 -1351393 -1319624 -1297748 -1275833 -1240634 -1225575
16372 -1225575 -1220421 -1224165 -1201612 -1169797 -1142576 -1106094 -1083816 -1079276 -1071293 -1025439 -1005439 -987099
16360 -987099 -950497 -938416 -939386 -905886 -891968 -892408 -850180 -822187 -801691 -790909 -781897 -755502
16348 -755502 -719426 -725998 -694254 -655926 -634735 -623608 -608210 -582848 -557424 -544612 -506944 -488352
16336 -488352 -479456 -469872 -458293 -397297 -377514 -377939 -379555 -370913 -351637 -324720 -292843 -280074 -279684
16323 -279684 -236842 -222520 -217652 -163743 -142883 -161362 -132514 -111641 -91281 -86321 -67054 -24011
16311 -24011 -1703 -3592 101 29912 63393 66269 67751 74069 93953 121263 148478 173566 186914
16298 186914 197589 204057 240948 241405 250294 265230 279471 299787 300479 325695 354731 366935 385799
$$ packed form
16383a478656J7872K7965K0009j426K0739M2104L1769K1876K1915L5199J5059
16372a225575N154l744K2553L1815K7221L6482K2278M540P983M5854K0000J8340
16360i87099L6602J2081r70L3500J3918m40M2228K7993K0496J0782R012K6395
16348g55502L6076o572L1744L8328K1191J1127J5398K5362K5424J2812L7668J8592
16336d88352Q896R584J1579O0996J9783m25j616Q642J9276K6917L1877J2769L90
16323b79684M2842J4322M868N3909K0860j8479K8848K0873K0360M960J9267M3043
16311b4011K2308j889L693K9811L3481K876J482O318J9884K7310K7215K5088J3348
16298A86914J0675O468L6891M57Q889J4936J4241K0316O92K5216K9036J2204J8864
$$ plain form
16285 385799 393242 434838 462698 464536 484971 481542 502395 518261 532912 543238 536944 541410
16273 541410 551446 576833 607385 612355 642795 649053 674613 694597 708087 702000 731619 772093
16261 772093 758203 768719 756743 781243 793032 816878 834521 829399 873523 912774 899543 902958
16249 902958 909066 906509 933241 962792 968871 987162 997042 1007902 1039453 1033709 1036639 1025855 1040369
16236 1040369 1062361 1053266 1067779 1074701 1080325 1093102 1105053 1167633 1160460 1139810 1148004 1168802
16224 1168802 1182031 1207433 1205987 1196055 1240044 1220283 1227828 1251493 1251674 1283395 1291583 1286748 1273655
16211 1273655 1303504 1308741 1329016 1320659 1326950 1329517 1358476 1367180 1351107 1368456 1339554 1365736
16199 1365736 1396244 1409719 1381417 1395076 1407347 1417600 1443275 1454947 1430727 1424510 1442602
$$ packed form
16285C85799P443M1596K7860J838K0435l429K0853J5866J4651J0326o294M466
16273E41410J0036K5387L0552M970L0440O258K5560J9984J3490o087K9619M0474
16261G72093j3890J0516j1976K4500J1789K3846J7643n122M4124L9251j3231L415
16249I02958O108k557K6732K9551O079J8291R880J0860L1551n744K930j0784J4514
16236A040369K1992r095J4513O922N624J2777J1951O2580p173k0650Q194K0798
16224A168802J3229K5402j446r932M3989j9761P545K3665J81L1721Q188m835j3093
16211A273655K9849N237K0275q357O291K567K8959Q704j6073J7349k8902K6182
16199A365736L0508J3475k8302J3659J2271J0253K5675J1672k4220o217J8092
$$ [...]
##END NTUPLES=NMR SPECTRUM
##END=
