##TITLE=1H_TG-2362-OY
 DMSO
 8 sc, 
 17.10.2022
##JCAMPDX= 6.0         $$ Bruker NMR JCAMP-DX V2.0
##DATA TYPE= NMR SPECTRUM
##DATA CLASS= NTUPLES
##ORIGIN= UXNMR, Bruker Analytische Messtechnik GmbH
##OWNER= root
$$ XWIN-NMR		Version 3.5
$$ Mon Oct 17 14:55:48 2022 Russian Standard Time (UT+4h)  she@DPX200
##.OBSERVE FREQUENCY= 200.1313499994
##.OBSERVE NUCLEUS= ^1H
##.ACQUISITION MODE= SIMULTANEOUS
##.ACQUISITION SCHEME= undefined
##.AVERAGES= 8
##.DIGITISER RES= 18
##SPECTROMETER/DATA SYSTEM= spect
##.PULSE SEQUENCE= zg30
##.SOLVENT NAME= DMSO
##.SHIFT REFERENCE= (INTERNAL, DMSO, 0, 15.7888)
##AUDIT TRAIL= $$ (NUMBER, WHEN, WHO, WHERE, WHAT)
$$ ##TITLE= Audit trail, XWIN-NMR		Version 3.5
$$ ##JCAMPDX= 5.01
$$ ##ORIGIN= Bruker BioSpin GmbH
$$ ##OWNER= she
$$ F:/spectra/data/she/nmr/H-F/1/pdata/1/auditp.txt
$$ ##AUDIT TRAIL=  $$ (NUMBER, WHEN, WHO, WHERE, WHAT)
(   1,<2022-10-17 14:54:35.53 +0400>,<she>,<DPX200>,
      <created by zg, POWCHK disabled, PULCHK disabled
       configuration hash MD5:
       00 E9 B6 7A A2 85 ED C7 34 08 36 98 17 FE 4E 26
       data hash MD5: 16K
       80 45 89 53 6C D2 CC 59 0D 6A 88 16 63 5D EC F2>)
(   2,<2022-10-17 14:54:38.68 +0400>,<she>,<DPX200>,
      <Start of raw data processing
       efp BC_mod = 2 LB = 0.24 FT_mod = 6 PKNL = 1 PHC0 = -18191.36 PHC1 = 7.400691 SI = 16K 
       data hash MD5: 16K
       C4 1F 24 BD 8D FD DA EF C5 41 50 C7 4B 1A 08 F5>)
(   3,<2022-10-17 14:54:56.12 +0400>,<she>,<DPX200>,
      <pk PHC0 = -2.164449 PHC1 = 3.6 
       data hash MD5: 16K
       3F 39 EE 0F FD F3 68 47 C1 9C EC 01 7B A6 12 23>)
(   4,<2022-10-17 14:54:59.75 +0400>,<she>,<DPX200>,
      <abs ABSG = 5 
       data hash MD5: 16K
       13 99 53 62 EB 68 AB 5A B6 EA 89 E8 BA A4 FA 1D>)
$$ ##END=
$$ 
$$ hash MD5
$$ B0 99 A0 DD 73 4F BC 6C 21 BA 71 35 23 5E 1F 14
##$RELAX= 
##$RELAX= 
##$RELAX= 
##$RELAX= 
##$RELAX= 
##$RELAX= 
$$ Bruker specific parameters
$$ --------------------------
##$DU= <F:/spectra>
##$EXPNO= 1
##$NAME= <H-F>
##$PROCNO= 1
##$TYPE= <nmr>
##$USER= <she>
##$AMP= (0..31)
100 100 100 100 100 100 100 100 100 100 100 100 100 100 100 100 100 100 
100 100 100 100 100 100 100 100 100 100 100 100 100 100 
##$AQSEQ= 0
##$AQ_mod= 1
##$AUNM= <au_zg>
##$AUTOPOS= <>
##$BF1= 200.13
##$BF2= 200.13
##$BF3= 200.13
##$BF4= 200.13
##$BF5= 200.13
##$BF6= 200.13
##$BF7= 200.13
##$BF8= 200.13
##$BYTORDA= 1
##$CFDGTYP= 0
##$CFRGTYP= 5
##$CHEMSTR= <none>
##$CNST= (0..31)
1 1 145 1 1 1 1 1 1 1 1 1 1 1 1 1 1 1 1 1 1 1 1 1 1 1 1 1 1 1 1 1 
##$CPDPRG= <>
##$CPDPRG1= <>
##$CPDPRG2= <>
##$CPDPRG3= <>
##$CPDPRG4= <mlev>
##$CPDPRG5= <mlev>
##$CPDPRG6= <mlev>
##$CPDPRG7= <mlev>
##$CPDPRG8= <mlev>
##$CPDPRGB= <>
##$CPDPRGT= <>
##$D= (0..31)
0 1.2 0 0 0 0 0 0 0 0.06 0 0.03 0 0 0 0 0.0002 0 0 0 0 0 0 0 0 0 0 0 0 
0 0 0 
##$DATE= 1666004074
##$DBL= (0..7)
120 120 120 120 120 120 120 120 
##$DBP= (0..7)
150 150 150 150 150 150 150 150 
##$DBP07= 0
##$DBPNAM0= <>
##$DBPNAM1= <>
##$DBPNAM2= <>
##$DBPNAM3= <>
##$DBPNAM4= <>
$$ [...]
##$SUBNAM3= <"">
##$SUBNAM4= <"">
##$SUBNAM5= <"">
##$SUBNAM6= <"">
##$SUBNAM7= <"">
##$SUBNAM8= <"">
##$SUBNAM9= <"">
##$SW= 18.0517283424941
##$SWIBOX= (0..15)
0 0 2 0 0 0 0 0 0 0 0 0 0 0 0 0 
##$SW_h= 3612.71676300578
##$TD= 16384
##$TD0= 1
##$TE= 0
##$TE2= 300
##$TE3= 300
##$TEG= 300
##$TL= (0..7)
0 120 120 120 120 120 120 120 
##$TP= (0..7)
150 150 150 150 150 150 150 150 
##$TP07= 0
##$TPNAME0= <>
##$TPNAME1= <>
##$TPNAME2= <>
##$TPNAME3= <>
##$TPNAME4= <>
##$TPNAME5= <>
##$TPNAME6= <>
##$TPNAME7= <>
##$TPOAL= (0..7)
0.5 0.5 0.5 0.5 0.5 0.5 0.5 0.5 
##$TPOFFS= (0..7)
0 0 0 0 0 0 0 0 
##$TUNHIN= 0
##$TUNHOUT= 0
##$TUNXOUT= 0
##$USERA1= <user>
##$USERA2= <user>
##$USERA3= <user>
##$USERA4= <user>
##$USERA5= <user>
##$V9= 5
##$VALIST= <valist>
##$VCLIST= <CCCCCCCCCCCCCCC>
##$VD= 0
##$VDLIST= <DDDDDDDDDDDDDDD>
##$VPLIST= <PPPPPPPPPPPPPPP>
##$VTLIST= <TTTTTTTTTTTTTTT>
##$WBST= 1024
##$WBSW= 4
##$XGAIN= (0..3)
0 0 0 0 
##$XL= 0
##$YL= 0
##$YMAX_a= 135355
##$YMIN_a= -206543
##$ZGOPTNS= <>
##$ZL1= 120
##$ZL2= 120
##$ZL3= 120
##$ZL4= 120
##$ABSF1= 15.7546
##$ABSF2= -2.29725
##$ABSG= 5
##$ABSL= 3
##$ALPHA= 0
##$AQORDER= 0
##$ASSFAC= 0
##$ASSFACI= 0
##$ASSFACX= 0
##$ASSWID= 0
##$AUNMP= <proc_1d>
##$AZFE= 0.1
##$AZFW= 0.1
##$BCFW= 0
##$BC_mod= 2
##$BYTORDP= 0
##$COROFFS= 0
##$CY= -3
##$DATMOD= 1
##$DC= 0
##$DFILT= <>
##$DTYPP= 0
##$F1P= 0
##$F2P= 0
##$FCOR= 1
##$FTSIZE= 16384
##$FT_mod= 6
##$GAMMA= 0
##$GB= 0
##$INTBC= 1
##$INTSCL= 3.70164e-10
##$ISEN= 128
##$LB= 0.24
##$LEV0= 0
##$LPBIN= 0
##$MAXI= 10000
##$MC2= 0
##$MEAN= 0
##$ME_mod= 0
##$MI= 1.114404
##$NCOEF= 0
##$NC_proc= -8
##$NLEV= 6
##$NOISF1= 3.799351
##$NOISF2= 2.8
##$NSP= 0
##$NTH_PI= 0
##$NZP= 0
##$OFFSET= 15.78876
##$PC= 1
##$PHC0= -18193.52
##$PHC1= 11.00069
##$PH_mod= 1
##$PKNL= yes
##$PPARMOD= 0
##$PSCAL= 0
##$PSIGN= 0
##$REVERSE= no
##$SF= 200.129996553281
##$SI= 16384
##$SIGF1= 3
##$SIGF2= 2
##$SINO= 5.538805
##$SIOLD= 16384
##$SREGLST= <1H.CDCl3>
##$SSB= 0
##$STSI= 16384
##$STSR= 0
##$SW_p= 3612.71676300578
##$SYMM= 0
##$S_DEV= 0
##$TDeff= 16384
##$TDoff= 0
##$TI= <>
##$TILT= no
##$TM1= 0
##$TM2= 0
##$TOPLEV= 0
##$USERP1= <user>
##$USERP2= <user>
##$USERP3= <user>
##$USERP4= <user>
##$USERP5= <user>
##$WDW= 1
##$XDIM= 16384
##$YMAX_p= 352650709
##$YMIN_p= -675549
$$ End of Bruker specific parameters
$$ ---------------------------------
##NTUPLES= NMR SPECTRUM
##VAR_NAME=  FREQUENCY,     SPECTRUM/REAL,   SPECTRUM/IMAG
##SYMBOL=    X,             R,               I
##VAR_TYPE=  INDEPENDENT,   DEPENDENT,       DEPENDENT
##VAR_FORM=  AFFN,          ASDF,            ASDF
##VAR_DIM=   16384,         16384,           16384
##UNITS=     HZ,            ARBITRARY UNITS, ARBITRARY UNITS
##FACTOR=    0.220516191357247, 1,           1
##FIRST=     3159.804521453, 0,              0
##LAST=      -452.912241552779, 0,           0
##MIN=       -452.912241552779, -675549,     0
##MAX=       3159.804521453, 352650709,      0
$$ Real data points
##PAGE= N=1
##DATA TABLE= (X++(R..R)), XYDATA
$$ [...]
$$ plain form
6206 85164 -260475 -101362 1026 103228 -69557 -40172 170247 71418 44887 237513
6196 237513 461666 468300 373703 110278 -36342 12947 -145681 -229159 -290404 -51806 33643
6185 33643 -55964 -61132 94755 221101 81914 157225 6554 30728 143110 51110 126821
6174 126821 179136 -11788 -38891 -156575 182153 361032 23252 22963 418234 312287 255341
6163 255341 201765 -21518 -338132 -369220 -345683 -283659 -216193 -27399 -64652 -53105 -130472
6152 -130472 -240750 -239335 -155112 -51934 -199171 -71460 133392 235923 -184198 -206288
6142 -206288 -97978 137152 14317 98951 33753 5247 -142416 109989 172214 -80506
6132 -80506 -69713 -45218 -205099 -217512 72789 -26638 -67965 -18025 -195924 -273171 -74595
$$ packed form
6206H5164l45639J59113J02388J02202j72785K9385K10419r8829k6531J92626
6196B37513K24153O634r4597k63425j46620M9289j58628q3478o1245K38598Q5449
6185C3643q9607n168J55887J26346j39187P5311j50671K4174J12382r2000P5711
6174A26821N2315j90924k7103j17684L38728J78879l37780k89L95271j05947n6946
6163B55341n3576k23283l16614l1088K3537O2024O7466J88794l7253J1547p7367
6152a30472j10278J415Q4223J03178j47237J27711K04852J02531m20121k2090
6142b06288J08310K35130j22835Q4634o5198k8506j47663K52405O2225k52720
6132h0506J0793K4495j59881j2413K90301r9427m1327M9940j77899p7247J98576
$$ plain form
6121 -74595 1742 256080 149527 262364 42352 91262 59314 39754 57044 6799 32212
6110 32212 -27967 -75987 1499 -124688 -87173 -89538 -120638 -156247 -34089 -8741 -399476
6099 -399476 -290400 -72827 -3265 201597 214114 184286 157887 32560 38498 2710 180279
6088 180279 107133 3237 9759 -9569 -47715 35043 148522 320798 9367 -9029 73529
6077 73529 43478 70974 106364 332849 298373 220671 142203 212319 -113613 -27207 200784
6066 200784 49166 7172 12230 271496 138622 -232549 -179368 264391 60130 -80811
6056 -80811 -103523 -260650 -40012 -40898 -103241 158801 119438 -52333 -141868 40337 166152
6045 166152 198661 157567 166802 -51566 -150777 141795 150010 211354 274269 249862 109281
$$ packed form
6121g4595P6337K54338j06553J12837k20012M8910l1948j9560J7290n0245K5413
6110C2212o0179m8020P7486j26187L7515k365l1100l5609J22158K5348l90735
6099c99476J09076K17573O9562K04862J2517k9828k6399j25327N938l5788J77569
6088A80279p3146j03896O522j9328l8146Q2758J13479J72276l11431j8396Q2558
6077G3529l0051K7496L5390K26485l4476p7702p8468P0116l25932Q6406K27991
6066B00784j51618m1994N058K59266j32874l71171N3181M43759k04261j40941
6056h0811k2712j57127K20638q86o2343K62042l9363j71771q9535J82205J25815
6045A66152L2509m1094R235k18368r9211K92572Q215O1344O2915k4407j40581
$$ plain form
6034 109281 125629 -156507 -248668 293510 322749 -296077 -20908 332927 354397 273144 176044
6023 176044 270756 -22860 -276264 -267098 -31990 -9987 -9690 -35409 -118314 -139264 52364
6012 52364 -138830 -218620 -147560 220319 48457 -20836 135478 -86771 -196580 -161881 -45993
6001 -45993 -141466 -69607 -51626 79877 121365 253976 242202 282254 172400 406273 412104
5990 412104 210178 172647 151758 13326 50237 -91436 200282 329938 302009 142420
5980 142420 233028 316906 214430 37398 146948 -154798 -515976 -116482 -129798 -291
5970 -291 143540 104144 -33648 184147 276426 277159 597521 570862 540200 133530 220607 218532
5958 218532 178569 139613 -174705 -41169 -303549 -68048 82623 202756 -162606 72891
$$ packed form
6034A09281J6348k82136r2161N42178K9239o18826K75169L53835K1470q1253r7100
6023A76044R4712k93616k53404R166K35108K2003K97k5719q2905k0950J91628
6012E2364j91194p9790P1060L67879j71862o9293J56314k22249j09809L4699J15888
6001d5993r5473P1859J7981J31503M1488J32611j1774M0052j09854K33873N831
5990D12104k01926l7531k0889j38432L6911j41673K91718J29656k7929j59589
5980A42420R0608Q3878j02476j77032J09550l01746l61178L99494j3316J29507
5970b91J43831l9396j37792K17795R2279P33L20362k6659l0662m06670Q7077k075
5958B18532l9963l8956l14318J33536k62380K35501J50671J20133l65362K35497
$$ plain form
5948 72891 58328 146094 176216 398090 541750 181825 102640 176880 202419 247943 456308
5937 456308 416958 222624 292772 369019 114707 43840 32327 -128069 -86109 20721 205128
5926 205128 52066 111379 237612 -86679 29219 56332 295377 271161 387267 129151
5916 129151 -37064 -3256 -13858 45958 -114930 127289 238540 23291 -38882 152763
5906 152763 248160 166376 -71964 -212719 -71511 45892 44763 220419 76121 7699 233285
5895 233285 318269 265061 122709 86335 -188741 -50364 221309 277977 282549 94600 135286
5884 135286 -26260 -53962 146074 361290 157600 195963 24835 58042 207106 84756
5874 84756 211663 48897 125649 483857 424791 266741 85058 -109759 -54216 150502
$$ packed form
5948G2891j4563Q7766L0122K21874J43660l59925p9185P4240K5539M5524K08365
5937D56308l9350j94334P0148P6247k54312p0867j1513j60396M1960J06830J84407
5926B05128j53062N9313J26233l24291J15898K7113K39045k4216J16106k58116
5916A29151j66215L3808j0602N9816j60888K42219J11251k15249o2173J91645
5906A52763R5397q1784k38340j40755J41208J17403j129J75656j44298o8422K25586
5895B33285Q4984n3208j42352l6374k75076J38377K71673N6668M572j87949M0686
5884A35286j61546k7702K00036K15216k03690L8363j71128L3207J49064j22350
5874H4756J26907j62766P6752L58208n9066j58050j81683j94817N5543K04718
$$ plain form
5864 150502 167947 176820 116412 -23319 148205 499568 428086 288254 431617 343312 306495
5853 306495 182647 81018 266901 224332 260584 -30407 78796 201628 2311 140528
5843 140528 195777 219544 58255 -54471 -117261 146479 -84498 234306 107694 48448
5833 48448 191916 46527 -81309 -24099 -18767 85170 11673 78228 -13001 204959 255983
5822 255983 169743 127169 -57965 -51810 -59136 135423 177717 -46455 -105852 -81299 4871
5811 4871 -118278 -118986 121693 -102616 -333992 -295806 -104513 -131795 -214600 26382 -18301
5800 -18301 -50307 41435 -25989 289439 283301 25229 -147100 -23271 165225 42580 -281667
5789 -281667 -203580 -276935 -89169 70230 -147262 -322304 -257506 -157714 -148253 -119602 6638
$$ packed form
5864A50502J7445Q873o0408j39731J71524L51363p1482j39832J43363q8305l6817
5853C06495j23848j01629J85883m2569L6252k90991J09203J22832j99317J38217
5843A40528N5249K3767j61289j12726o2790K63740k30977L18804j26612n9246
5833D8448J43468j45389j27836N7210N332J03937p3497O6555r1229K17960N1024
5822B55983q6240m2574j85134O155p326J94559M2294k24172n9397K4553Q6170
5811D871j23149p08K40679k24309k31376L8186J91293k7282q2805K40982m4683
5800a8301l2006R1742o7424L15428o138k58072j72329J23829J88496j22645l24247
5789b81667P8087p3355J87766J59399k17492j75042O4798R9792R461K8651J26240
$$ plain form
5778 6638 38077 -157064 -6812 165165 -101196 74246 189097 103525 -76641 -163718 -327526
5767 -327526 -370597 -107160 -63656 71219 67079 -36911 -105682 49903 76808 97743 71949
5756 71949 -59503 31940 15132 81460 194640 125952 -175325 146639 -98900 -130326 -106532
5745 -106532 -235202 -323721 -42594 1109 -204174 -215164 -289910 50368 291466 50328
5735 50328 -250568 -462428 -304006 -260920 -286363 -133058 138338 220237 -259197 -148973
5725 -148973 -337337 -202005 -86827 50000 -19460 15977 107363 111181 127773 -80436 -73433
5714 -73433 60513 138147 39277 89760 -59079 -271066 84702 199183 -74341 -104776 -136813
5703 -136813 -118217 79185 186078 63750 -124977 -98728 -38656 174322 -22839 -392971
$$ packed form
5778F638L1439j95141J50252J71977k66361J75442J14851q5572j80166q7077j63808
5767c27526m3071K63437M3504J34875m140j03990o8771J55585K6905K0935k5794
5756G1949j31452R1443j6808O6328J13180o8688l01277L21964k45539l1426K3794
5745a06532j28670q8519K81127M3703k05283j0990p4746L40278K41098k41138
5735E0328l00896k11860J58422M3086k5443J53305K71396Q1899m79434J10224
5725a48973j88364J35332J15178J36827o9460L5437R1386L818J6592k08209P003
5714g3433J33946P7634r8870N0483j48839k11987L55768J14481k73524l0435l2037
5703a36813J8596J97402J06893j22328j88727K6249O0072K12978j97161l70132
$$ plain form
5693 -392971 -87566 3139 206506 228852 43409 62483 357600 103953 -195899 -87308
5683 -87308 11527 150355 177185 -108733 -403351 -165585 -170306 -183478 -322715 -246148 -36107
5672 -36107 -108054 -345477 -255243 -153599 182236 63672 -20613 368253 243970 208017 193102
5661 193102 218855 50230 -156481 -163497 -133515 -243664 18361 27735 207375 54712 84583
5650 84583 45744 41792 285187 110300 3156 -65248 28042 -111925 -10174 8894 -17782
5639 -17782 -108443 -8835 -80009 33845 70371 161397 134240 -185636 -160401 -59152 -271749
5628 -271749 -226032 -85128 105988 -157284 47528 21624 -10328 -163065 -43209 -124936
5618 -124936 -210298 128447 49870 102878 -77827 -171421 -112444 -170193 -16926 94152 213866
$$ packed form
5693c92971L05405R0705K03367K2346j85443J9074K95117k53647k99852J08591
5683h7308R8835J38828K6830k85918k94618K37766m721j3172j39237P6567K10041
5672c6107p1947k37423R0234J01644L35835j18564q4285L88866j24283l5953j4915
5661A93102K5753j68625k06711p016K9982j10149K62025R374J79640j52663K9871
5650H4583l8839l952K43395j74887j07144o8404R3290j39967J01751J9068k6676
5639a7782r0661R9608p1174J13854L6526R1026k7157l19876K5235J01249k12597
5628b71749M5717J40904J91116k63272K04812k5904l1952j52737J19856q1727
5618a24936q5362L38745p8577N3008j80705r3594N8977n7749J53267J11078J19714
$$ plain form
5607 213866 376242 141937 237210 134016 71217 -67662 -236591 -290674 -352168 -68039
5597 -68039 69246 -116289 55068 117455 -221695 -247394 -286473 -82453 99599 -119848
5587 -119848 -54824 -87812 -233906 -31825 -50869 -374328 -132778 82980 52163 -297901
5577 -297901 -233879 -160228 43879 -113014 -39 89881 62822 158445 60684 -10388 35846
5566 35846 -118956 25831 146768 220147 262998 308222 -53751 -50401 248228 44561 20019
5555 20019 9218 310950 175692 -13783 125694 -91711 -96187 201716 234312 141185 88571
5544 88571 207924 192682 76528 100305 -46399 -216886 -189279 79053 155194 121179 -120557
5533 -120557 -403405 -61494 160095 82133 51067 47299 -24440 6400 -59346 8742 163820
$$ packed form
5607B13866J62376k34305R5273j03194o2799j38879j68929n4083o1494K84129
5597f8039J37285j85535J71357O2387l39150k5699l9079K04020J82052k19447
5587a19848O5024l2988j46094K02081j9044l23459K41550K15758l0817l50064
5577b97901O4022P3651K04107j56893J12975Q9920k7059R5623r7761p1072M6234
5566C5846j54802J44787J20937P3379M2851M5224l61973L350K98629k03667k4542
5555B0019j0801L01732j35258j89475J39477k17405m476K97903L2596r3127n2614
5544H8571J19353j5242j16154K3777j46704j70487K7607K68332P6141l4015k41736
5533a20557k82848L41911K21589p7962l1066l768p1739L0840o5746O8088J55078
$$ plain form
5522 163820 93157 31733 33317 115193 41204 -121558 187400 4394 -110470 281955 -57685
5511 -57685 -200527 -143126 32172 159364 53556 -28361 -109882 -22373 -17373 -27833 48757
5500 48757 177275 146401 -192820 -366766 -392804 -271554 2876 24687 10529 128038 194357
5489 194357 63436 151940 198285 -7654 -333357 -141071 140438 144054 -147442 157901
5479 157901 100952 205716 141263 60792 -67892 -98510 -9356 107912 84960 -25700 -1571
5468 -1571 -184299 -151495 -55605 121457 190321 42394 12761 -63138 -185552 -891 -8397
5457 -8397 39695 -61456 -239018 112043 69675 -161037 -33429 116221 -42423 -194672
5447 -194672 -216800 -22893 -77209 -43835 170191 214703 23684 -230284 -15365 41451 75228
$$ packed form
5522A63820p0663o1424J584Q1876p3989j62762L08958j83006j14864L92425l39640
5511e7685j42842N7401J75298J27192j05808q1917q1521Q7509N000j0460P6590
5500D8757J28518l0874l39221j73946k6038J21250K74430K1811j4158J17509O6319
5489A94357j30921Q8504M6345k05939l25703J92286K81509L616k91496L05343
5479A57901n6949J04764o4453q0471j28684l0618Q9154J17268k2952j10660K4129
5468a571j82728L2804R5890J77062O8864j47927k9633p5899j22414J84661p506
5457h397M8092j01151j77562L51061m2368k30712J27608J49650j58644j52249
5447a94672k2128J93907n4316L3374K14026M4512j91019k53968K14919N6816L3777
$$ plain form
5436 75228 101722 286525 406611 204650 -91495 -132526 -85808 -32789 29172 180618 294393
5425 294393 483588 290772 264084 161451 45825 148702 17909 129552 317881 -394
5415 -394 79766 -46716 115103 383406 318157 203067 96223 -13078 115521 -169819 -263273
5404 -263273 -178001 -238348 -235697 64997 40702 103668 44631 -124425 21235 160611 -11511
5393 -11511 -173034 -170674 -175193 -221070 -198341 4536 -71506 -71170 15870 -74147 -231934 -59650
5381 -59650 18458 300807 79118 -46797 34109 165484 23856 9518 -23336 -572027 -507681
5370 -507681 -80671 -151422 135240 -120825 -119633 188915 148046 23193 136524 -34692
5360 -34692 54103 74174 194995 320838 106857 239006 52582 -155418 -64902 40819
$$ packed form
5436G5228K6494J84803J20086k01961k96145m1031M6718N3019O1961J51446J13775
5425B94393J89195j92816k6688j02633j15626J02877j30793J11643J88329l18275
5415c94Q0160j26482J61819K68303o5249j15090j06844j09301J28599k85340r3454
5404b63273Q5272o0347K651L00694k4295O2966n9037j69056J45660J39376j72122
5393a1511j61523K360m519m5877K2729K02877p6042L36Q7040r0017j57787J72284
5381e9650P8108K82349k21689j25915Q0906J31375j41628j4338l2854n48691O4346
5370e07681M27010p0751K86662k56065J192L08548m0869j24853J13331j71216
5360c4692Q8795K0071J20821J25843k13981J32149j86424k08000R0516J05721
$$ plain form
5350 40819 76136 108078 -28332 187659 119459 34493 272206 273763 -26182 -14661 -82039
5339 -82039 -26478 -111186 -83705 231938 303889 193234 54823 -271502 -91287 170015 -34409
5328 -34409 -13493 69365 266911 152299 -86454 174659 -9672 -68689 40183 124320 145985
5317 145985 -25245 103243 342854 226017 71003 85798 58765 -33757 207278 175900
5307 175900 30927 313453 315543 418341 380185 321670 350027 517979 352546 121297 188913
5296 188913 278629 259952 245401 229522 276890 315674 590820 594525 498875 574296 621761 294381
5284 294381 265048 231752 192900 49589 345908 434613 654010 408501 189419 235905 123318
5273 123318 -160055 11079 78786 -836 329829 378595 516050 317643 300942 225503 359210
$$ packed form
5350D0819L5317L1942j36410K15991o8200q4966K37713J557k99945J1521o7378
5339h2039N5561q4708K7481L15643P1951j10655j38411l26325J80215K61302k04424
5328c4409K0916Q2858J97546j14612k38753K61113j84331n9017J08872Q4137K1665
5317A45985j71230J28488K39611j16837j55014J4795k7033r2522K41035l1378
5307A75900j44973K82526K090J02798l8156n8515K8357J67952j65433k31249O7616
5296A88913Q9716j8677j4551j5879M7368L8784K75146L705r5650P5421M7465l27380
5284B94381k9333l3296l8852j43311K96319Q8705K19397k45509k19082M6486j12587
5273A23318k83373J71134O7707p9622L30665M8766J37455j98407j6701p5439J33707
$$ plain form
5262 359210 359948 418654 527821 432262 432458 301187 17741 257187 255031 -50711 4422 103173
5250 103173 239426 424964 481769 562839 411709 228220 304785 564298 385239 459410
5240 459410 283805 206501 257610 79899 213209 598464 576447 463817 446319 418463 402826
5229 402826 709143 740265 573335 410994 815055 602736 650417 986049 934998 943669 744801
5218 744801 634266 659079 468960 363101 383831 382375 373526 346423 454971 351865 430163
5207 430163 626836 686051 611542 668078 651090 849592 944705 1138356 1038072 886233 804398
5196 804398 588442 506478 478512 522843 694456 913243 1114204 1088268 941405 1048185
5186 1048185 1014483 888581 1076467 1105552 891072 868384 684091 695076 701830 590999 765967
$$ packed form
5262C59210P38N8706J09167r5559J96j31271k83446K39446k156l05742N5133R8751
5250A03173J36253J85538N6805Q1070j51130j83489P6565K59513j79059P4171
5240D59410j75605p7304N1109j77711J33310L85255k2017j12630j7498k7856j5637
5229D02826L06317L1122j66930j62341M04061k12319M7681L35632n1051Q671j98868
5218G44801j10535K4813j90119j05859K0730j456q849k7103J08548j03106P8298
5207D30163J96673N9215p4509N6536j6988J98502R5113J93651j00284j51839q1835
5196H04398k15956q1964k7966M4331J71613K18787K00961k5936j46863J06780
5186A048185l3702j25902J87886K9085k14480k2688j84293J0985O754j10831J74968
$$ plain form
5175 765967 463205 650681 884476 930920 762989 758383 695442 748517 891716 764242 746858
5164 746858 770591 819893 681441 855656 900436 715073 444525 613124 1048950 1136020
5154 1136020 1057351 1034803 836258 755202 808608 756385 436941 507401 789981 589765 622899
5143 622899 656669 538531 605796 641110 636676 593397 445657 429204 770385 1056875 789108
5132 789108 642440 705315 773854 781993 648047 420379 597468 669114 669336 801653 773869
5121 773869 501459 728702 791487 696151 766697 795261 897028 727371 493652 561198 722775
5110 722775 556497 644344 622783 616588 521081 715203 952199 673430 815674 978238 919180
5099 919180 871395 879235 758367 785225 705940 922671 639550 735000 1098235 1149833 1141102
$$ packed form
5175G65967l02762J87476K33795M6444j67931m606o2941N3075J43199j27474j7384
5164G46858K3733M9302j38452J74215M4780j85363k70548J68599M35826Q7070
5154A136020p8669k2548j98545q1056N3406n2223l19444P0460K82580k00216L3134
5143F22899L3770j18138O7265L5314m434m3279j47740j6453L41181K86490k67767
5132G89108j46668O2875O8539Q139j33946k27668J77089P1646K22J32317k7784
5121G73869k72410K27243O2785r5336P0546K8564J01767j69657k33719O7546J61577
5110G22775j66278Q7847k1561o195r5507J94122K36996k78769J42244J62564n9058
5099I19180m7785P840j20868K6858p9285K16731k83121R5450L63235N1598q731
$$ plain form
5088 1141102 1089749 929418 836084 759259 817867 899387 938050 1032633 942197 864605 868327
5077 868327 1058550 1011635 971401 1083316 1415111 1251490 1160192 1158993 1134460 1169507 1142558
5066 1142558 1301338 1291709 1194058 1183141 1156519 1265012 1353483 1461245 1131884 1115710 893914
5055 893914 1100118 1204121 1459731 1408960 1440090 1698851 1705975 1707551 1415069 1544623 1650809
5044 1650809 1609231 1428466 1377824 1414756 1398434 1770320 1900263 1970323 1973382 1840747 1891568
5033 1891568 1895031 1910251 1996217 1976335 1987709 2210482 2334686 2136306 1856894 1906861 2145075
5022 2145075 2491419 2810785 2788711 2784301 2745873 2713185 2928472 2779689 2685906 2574142 2637535
5011 2637535 2739130 2681325 2922805 3257600 3250253 3287056 3376843 3382101 3316314 3519649 3480462
$$ packed form
5088A141102n1353j60331r3334p6825N8608Q1520L8663R4583r0436p7592L722
5077H68327J90223m6915m0234J11915L31795j63621r1298j199k4533L5047k6949
5066A142558J58780r629r7651j0917k6622J08493Q8471J07762l29361j6174k21796
5055H93914K06204J04003K55610n0771L1130K58761P124J576k92482J29554J06186
5044A650809m1578j80765n0642L6932j6322L71886J29943P0060L059j32635N0821
5033A891568L463J5220Q5966j9882J1374K22773J24204j98380k79412M9967K38214
5022B145075L46344L19366k2074m410l8428l2688K15287j48783r3783j11764O3393
5011B637535J01595n7805K41480L34795p347L6803Q9787N258o5787K03335l9187
$$ plain form
5000 3480462 3398902 3354701 3462655 3801254 3571984 3524149 3614907 3635715 4081141 4252135
4990 4252135 4463513 4661877 4793840 4832768 4900947 4858471 4873950 5149633 5187431 5339471
4980 5339471 5654908 6237751 6246491 6056556 6010968 6339345 6635279 6843287 7082778 7285190
4970 7285190 7211480 7380485 7752006 7962154 8136052 8262527 8682819 8970898 9324361 9752637
4960 9752637 10010883 10200579 10236401 10685848 11094980 11494442 11851413 12311998 12624392 13042868
4950 13042868 13588326 13967650 14831616 15443802 15954059 16644883 17307695 18114215 19557290
4941 19557290 20659412 21921321 23604543 25631053 27868882 30247619 33220961 36662048
4933 36662048 39958194 42531019 43816085 43606133 42098798 40120889 38411811 36892565
$$ packed form
5000C480462q1560m4201J07954L38599k29270m7835R0758K0808M45426J70994
4990D252135K11378J98364J31963L8928O8179m2476J5479K75683L7798J52040
4980E339471L15437N82843Q740j89935m5588L28377K95934K08008K39491K02412
4970G285190p3710J69005L71521K10148J73898J26475M20292K88079L53463M28276
4960I752637K58246J89696L5822M49447M09132L99462L56971M60585L12394M18476
4950A3042868N45458L79324Q63966O12186N10257O90824O62812Q06520J443075
4941A9557290J102122J261909J683222K026510K237829K378737K973342L441087
4933C6662048L296146K572825J285066k09952j507335j977909j709078j519246
$$ plain form
4925 36892565 35921834 35722845 35508235 35635889 36036789 36830892 38041346 39586213 41088333
4916 41088333 43204464 45537530 48508912 52278820 56174964 60027240 63800780 66342850
4908 66342850 68074660 69582999 71035677 73153398 76710545 81995217 88764645 97310454
4900 97310454 106097051 113505170 116432136 113558011 106095185 97109482 88519353 81646774
4892 81646774 76470854 73146259 70801200 69499645 69210813 69907529 71267449 73474886
4884 73474886 76647510 80339095 85333324 91458263 99715225 109315541 119099792 126637828
4876 126637828 129987296 128345127 122698903 116221179 111562551 109538861 109969185 112867205
4868 112867205 118357972 125007922 130268661 131601897 127313169 118515749 107898554 97698015
$$ packed form
4925C6892565r70731j98989k14610J27654M00900P94103J210454J544867J502120
4916D1088333K116131K333066K971382L769908L896144L852276L773540K542070
4908F6342850J731810J508339J452678K117721L557147N284672O769428Q545809
4900I7310454Q786597P408119K926966k874125p462826q985703q590129o872579
4892H1646774n175920l324595k345059j301555k88832O96716J359920K207437
4884G3474886L172624L691585M994229O124939Q256962R600316R784251P538036
4876A26637828L349468j642169n646224o477724m658628k023690M30324K898020
4868A12867205N490767O649950N260739J333236m288728q797420j0617195j0200539
$$ plain form
4860 97698015 89270634 82552269 77536526 74056541 71701669 70196196 69444589 70120944
4852 70120944 71486327 73363507 76201400 80080213 85541761 92860395 101199910 109794234
4844 109794234 116227976 118123728 114265622 105840667 95968714 87247683 79975286 75315754
4836 75315754 72418615 70591276 69710957 68691181 67118033 63961942 59672057 55222992
4828 55222992 50950369 47155228 44087767 41239321 39168581 37833642 36614847 35726600
4820 35726600 35320757 35164374 35217876 35729463 36370236 37664608 39251652 41203405 43110876
4811 43110876 44504373 44352854 42238650 39017615 35432386 31741996 28414525 25844770
4803 25844770 23708128 22069824 20238791 19023857 17877245 16869255 16012975 15289116
$$ packed form
4860I7698015q427381o718365n015743l479985k354872j505473p51607O76355
4852G0120944J365383J877180K837893L878813N461548P318634Q339515Q594324
4844A09794234O433742J895752l858106q424955r871953q721031p272397m659532
4836G5315754k897139j827339q80319j019776j573148l156091m289885m449065
4828E5222992m272623l795141l067461k848446k070740j334939j218795q88247
4820C5726600m05843j56383N3502N11587O40773J294372J587044J951753J907471
4811D3110876J393497j51519k114204l221035l585229l690390l327471k569755
4803B5844770k136642j638304j831033j214934j146612j007990q56280p23859
$$ plain form
4795 15289116 14524199 13783060 13242783 12777784 12188556 11593941 11252140 10521365 10014619
4786 10014619 9934236 9952958 9665402 9126477 8728603 8737340 8556400 8254431 7805886 7449348
4776 7449348 7440218 7351824 6959641 6582789 6771081 6418589 6119827 5846187 5611235 5678851
4766 5678851 5729777 5511137 5174264 5183464 5180042 4935584 4864364 4640904 4759050 4826399 4640350
4755 4640350 4637342 4415328 4206356 4480241 4338359 3849279 3856518 3751942 3868485 3895447
4745 3895447 3763153 3451144 3347120 3413623 3433632 2975303 2944391 2849675 2705546 2970261
4735 2970261 2924353 2956284 2924550 2804208 3042156 2955302 2955369 3248040 3022302 2910137 2928773
4724 2928773 2848979 2548701 2706233 2523761 2355506 2397344 2390192 2528232 2198330 1997307
$$ packed form
4795A5289116p64917p41139n40277m64999n89228n94615l41801p30775n06746
4786A0014619q0383J8722k87556n38925l97874Q737j80940l01969m48545l56538
4776G449348r130q8394l92183l76852J88292l52492k98762k73640k34952O7616
4766E678851N0926k18640l36873R200l422k44458p1220k23460J18146O7349j86049
4755D640350l008k22014k08972K73885j41882m89080P239j04576J16543K6962
4745C895447j32294l12009j04024O6503K0009m58329l0912r4716j44129K64715
4735B970261m5908L1931l1734j20342K37948q6854O7K92671k25738j12165J8636
4724B928773p9794l00278J57532j82472j68255M1838p152J38040l29902k01023
$$ plain form
4714 1997307 2068395 2029885 1882616 1695709 1862284 2039736 1981148 1947739 1861551 1784301 1599958
4703 1599958 1652138 1824830 1804934 1818974 1829749 1529690 1626969 1534678 1656776 1632628 1577366
4692 1577366 1689025 1709883 1755200 1708067 1942638 1761259 1788309 1730399 1711925 1461912 1414172
4681 1414172 1599828 1528325 1617437 1658707 1421574 1683809 1619330 1595893 1539658 1384835 1457543
4670 1457543 1518735 1568260 1306016 1061964 1119336 1371591 1435449 1360320 1570377 1540760 1415600
4659 1415600 1131790 1319483 1429862 1396457 1234902 1065691 1191826 1163782 1266308 1333420
4649 1333420 1066046 945020 1075601 838554 901860 1056955 930820 1041080 968601 823686
4639 823686 1198835 1182429 1369322 1200235 1096553 1315948 1145054 1038206 1176943 1194806
$$ packed form
4714A997307P1088l8510j47269j86907J66575J77452n8588l3409q6188p7250j84343
4703A599958N2180J72692j9896J4040J0775l00059R7279r2291J22098k4148n5262
4692A577366J11659K0858M5317m7133K34571j81379K7050n7910j8474k50013m7740
4681A414172J85656p1503Q9112M1270k37133K62235o4479k3437n6235j54823P2708
4670A457543O1192M9525k62244k44052N7372K52255O3858p5129K10057k9617j25160
4659A415600k83810J87693J10379l3405j61555j69211J26135k8044J02526O7112
4649A333420k67374j21026J30581k37047O3306J55095j26135J10260p2479j44915
4639H23686L75149j6406J86893j69087j03682K19395j70894j06848J38737J7863
$$ plain form
4629 1194806 1169844 1367202 1405891 1198655 1396891 1252871 1296794 1334373 1496200 1520040
4619 1520040 1379694 1289411 1244783 1104058 1168305 1139600 1105870 1271549 1131844 1259628
4609 1259628 1259303 1151361 1104559 1017855 1109853 1056018 1196276 1154814 885903 815822 1084786
4598 1084786 1274442 1178467 1082668 1164612 1203673 906398 963272 1168239 1124146 1074650 1057932
4587 1057932 898175 1297610 1465692 988685 1082267 1194447 985674 955813 1079418 969201
4577 969201 977068 1170107 1169199 1061815 1146112 1504888 1426932 1384220 1230751 1342516 1504542
4566 1504542 1280552 1187568 1046500 1020119 1353050 1389252 960808 890533 1342423 1282010
4556 1282010 1197512 1083562 1226002 1279722 1070483 1335755 1690541 1686991 1485974 1201694
$$ packed form
4629A194806k4962J97358L8689k07236J98236j44020M3923L7579J61827K3840
4619A520040j40346r0283m4628j40725O4247k8705l3730J65679j39705J27784
4609A259628l25j07942m6802q6704R1998n3835J40258m1462k68911p0081K68964
4598A084786J89656r5975r5799Q1944L9061k97275N6874K04967m4093m9496j6718
4587A057932j59757L99435J68082m77007R3582J12180k08773k9861J23605j10217
4577I69201P867J93039r08j07384Q4297L58776p7956m2712j53469J11765J62026
4566A504542k23990r2984j41068k6381L32931L6202m28444p0275M51890o0413
4556A282010q4498j13950J42440N3720k09239K65272L54786l550k01017k84280
$$ plain form
4546 1201694 1386258 1479264 1504556 1566527 1377211 1319381 1532020 1757227 1628021 1633341 1477553
4535 1477553 1438280 1299023 1416097 1400870 1536495 1549333 1503691 1358822 1044238 1259790
4525 1259790 1425388 1651993 1149163 1062037 1105140 1336734 1533212 1410613 1550850 1518485
4515 1518485 1369809 1423326 1517673 1135644 1354763 1554719 1662347 1755421 1715221 1592659
4505 1592659 1519086 1320376 1125219 1408371 1325218 1271963 1503003 1315659 1332252 1330734 1543534
4494 1543534 1710976 1765118 1395394 1512416 1585722 1549412 1706805 1599170 1606903 1669561 1683917
4483 1683917 1670386 1531483 1363851 1726359 1388403 1611370 1549192 1579925 1822928 1867525
4473 1867525 1957413 1810393 1882399 1950983 1946319 1767813 1757129 1704915 1845516 2070086 2004713
$$ packed form
4546A201694J84564R3006K5292O1971j89316n7830K12639K25207j29206N320j55788
4535A477553l9273j39257J17074j5227J35625J2838m5642j44869l14584K15552
4525A259790J65598K26605n02830q7126M3103K31594J96478j22599J40237l2365
4515A518485j48676N3517R4347l82029K19119J99956J07628R3074m0200j22562
4505A592659p3573j98710j95157K83152q3153n3255K31040j87344J6593j518K12800
4494A543534J67442N4142l69724J17022P3306l6310J57393j07635P733O2658J4356
4483A683917j3531j38903j67632L62508l37956K22967o2178L0733K43003M4597
4473A867525Q9888j47020P2006O8584m664j78506j0684n2214J40601K24570o5373
$$ plain form
4462 2004713 1988644 1922144 2059176 2166825 2357345 2444988 2504807 2160980 2337694 2642862
4452 2642862 2704788 2691199 2797280 2778876 2934232 3027939 2927946 3137174 3027683 3061445 3379268
4441 3379268 3426094 3457170 3559971 3669576 3848886 3847746 3988895 4263157 4192517 4270120 4453302
4430 4453302 4316599 4381739 4618125 4624492 4712739 5105650 5326794 5474054 5742462 5844698
4420 5844698 5853084 6021971 6035297 6211997 6207082 6459215 6791150 6937241 7064969 7246294
4410 7246294 7761972 7868441 7835188 8209088 8830521 9249151 9398717 9891353 9999535 10511182
4400 10511182 11199815 11617120 12103734 12670484 12930341 13875007 14705992 15680273 16894448
4391 16894448 17866264 18670179 20325155 21997958 23618160 25759465 28231628 31130229
$$ packed form
4462B004713j6069o6500J37032J07649J90520Q7643N9819l43827J76714L05168
4452B642862O1926j3589J06081j8404J55356R3707r9993K09228j09491L3762L17823
4441C379268M6826L1076J02801J09605J79310j140J41149K74262p0640P7603J83182
4430D453302j36703O5140K36386O367Q8247L92911K21144J47260K68408J02236
4420E844698Q386J68887J3326J76700m915K52133L31935J46091J27728J81325
4410G246294N15678J06469l3253L73900O21433M18630J49566M92636J08182N11647
4400A0511182O88633M17305M86614N66750K59857R44666Q30985R74281J214175
4391A6894448R71816Q03915J654976J672803J620202K141305K472163K898601
$$ plain form
4383 31130229 34151521 36883146 39444754 41630934 43518911 45518258 48380271 52045854
4375 52045854 56169529 60211273 63411009 65321588 65836770 66093466 66913274 68990193 72075012
4366 72075012 75410480 77926617 78411500 76740240 73877792 70662592 68441456 67349226
4358 67349226 66883114 66810769 66059385 63792253 60608716 56873645 53705726 51312739 49748774
4349 49748774 48618655 47359671 45826465 44224616 41990962 40412427 39402257 38292680
4341 38292680 37787948 38307131 39081192 40517985 42667145 45449201 48564674 51879210 55856460
4332 55856460 61133247 68099561 76413130 86734389 98766216 108698672 110556876 106003480
4324 106003480 99038095 92605356 89415752 84902202 77791575 70088847 62120538 53593218
$$ packed form
4383C1130229L021292K731625K561608K186180J887977J999347K862013L665583
4375E2045854M123675M041744L199736J910579N15182K56696Q19808K076919L084819
4366G2075012L335468K516137M84883j671260k862448l215200k221136j092230
4358F7349226m66112p2345p51384k267132l183537l735071l167919k392987j563965
4349D9748774j130119j258984j533206j601849k233654j578535j010170j109577
4341C8292680n04732N19183P74061J436793K149160K782056L115473L314536L977250
4332E5856460N276787O966314Q313569J0321259J2031827R932456J858204m553396
4324A06003480o965385o432739l189604m513550p110627p702728p968309q527320
$$ plain form
4316 53593218 45822445 40130836 35633482 32138065 29073967 26618708 24880756 23280077
4308 23280077 21878583 20382128 19163518 18246450 17195122 16230635 15401021 14638181 13914309
4299 13914309 13222421 12789118 12396993 11693774 11312750 11040676 10508198 9868132 9398221
4290 9398221 9332842 8891182 8351011 8064672 7785940 7667495 7502862 7251040 6896438 6747416
4280 6747416 6598067 6414247 6245147 6154388 5986618 5923473 5695952 5480936 5308221 5188182
4270 5188182 5162994 4936912 4567566 4626768 4376127 4266309 4210063 4114676 4069979 4021108 4007309
4259 4007309 3603417 3449188 3332303 3203887 3314077 3265762 3052800 2671156 2567053 2812366
4249 2812366 2586396 2813232 2598684 2459080 2633588 2536901 2560307 2270445 2186208 2160216
$$ packed form
4316E3593218p770773n691609m497354l495417l064098k455259j737952j600679
4308B3280077j401494j496455j218610r17068j051328r64487q29614p62840p23872
4299A3914309o91888m33303l92125p03219l81024k72074n32478o40066m69911
4290I398221o5379m41660n40171k86339k78732j18445j64633k51822l54602j49022
4280F747416j49349j83820j69100r0759j67770o3145k27521k15016j72715j20039
4270E188182k5188k26082l69346N9202k50641j09818n6246r5387m4697m8871j3799
4259D007309m03892j54229j16885j28416J10190m8315k12962l81644j04103K45313
4249B812366k25970K26836k14548j39604J74508r6687K3406k89862q4237k5992
$$ plain form
4239 2160216 2172561 2122997 2188773 1997508 1879855 1913140 1791773 1762723 1780814 1914804 1573182
4228 1573182 1659935 1753250 1842224 2026042 1977229 1525379 1470672 1480358 1436877 1460446 1420520
4217 1420520 1356399 1352055 1231657 1088924 1220980 1308384 1364459 1352082 1351651 1293823 1214306
4206 1214306 888603 1010093 1214041 1336311 1341442 1255564 1269573 1339787 1168106 1150679 1220048
4195 1220048 1319838 1241628 1014272 896926 896125 609474 806143 926783 779528 1044536
4185 1044536 1013435 1016075 1266774 921862 958021 1077088 1074138 1078118 671375 714182 844308
4174 844308 724507 666332 681634 533532 550596 668417 590904 678543 572994 571266 587529
4163 587529 639935 502058 518436 766945 652048 811170 867187 724505 857461 792660
$$ packed form
4239B160216J2345m9564O5776j91265j17653L3285j21367k9050J8091J33990l41622
4228A573182Q6753R3315Q8974J83818m8813m51850n4707R686m3481K3569l9926
4217A420520o4121m344j20398j42733J32056Q7404N6075j2377m31n7828p9517
4206A214306l25703J21490K03948J22270N131q5878J4009P0214j71681j7427O9369
4195A220048R9790p8210k27356j17346q01k86651J96669J20640j47255K65008
4185A044536l1101K640K50699l44912L6159J19067k950L980m06743M2807J30126
4174H44308j19801n8175J5302j48102J7064J17821p7513Q7639j05549j728J6263
4163E87529N2406j37877J6378K48509j14897J59122N6017j42682J32956o4801
$$ plain form
4153 792660 471630 262960 609911 763418 597933 554073 881991 761839 453488 428872
4143 428872 498590 685272 581051 644893 752012 526213 166708 535484 484133 595583
4133 595583 497427 315715 228176 281918 287608 362466 248163 479050 1030077 933269 554333
4122 554333 298590 408195 683055 506588 536343 609378 444526 563999 526202 298509
4112 298509 286028 123567 -29433 184452 304291 278183 174373 131548 138089 280009 356268
4101 356268 206610 320474 150513 -106311 97448 410379 389622 374833 272605 360637
4091 360637 554980 521812 275031 448206 433536 305639 556280 760901 630375 414182
4081 414182 452803 550370 822807 774739 766532 800986 787382 721865 825477 516356 659397
$$ packed form
4153G92660l21030k08670L46951J53507j65485m3860L27918j20152l08351k4616
4143D28872O9718J86682j04221O3842J07119k25799l59505L68776n1351J11450
4133E95583r8156j81712q7539N3742N690P4858j14303K30887N51027r6808l78936
4122E54333k55743J09605K74860j76467K9755P3035j64852J19473l7797k27693
4112B98509j2481j62461j53000K13885J19839k6108j03810m2825O541J41920P6259
4101C56268j49658J13864j69961k56824K03759L12931k0757j4789j02228Q8032
4091C60637J94343l3168k46781J73175j4670j27897K50641K04621j30526k16193
4081D14182L8621R7567K72437m8068q207L4454j3604o5517J03612l09121J43041
$$ plain form
4070 659397 733990 624693 625569 746114 823782 739731 842571 733212 851357 1114672 1085188
4059 1085188 1202782 1379913 1305277 1607058 1484790 1390839 1472182 1288587 1259318 1296612
4049 1296612 1397549 1222190 1118916 1176768 987907 837432 624564 475033 786533 744293
4039 744293 624416 642210 488588 501221 738994 842713 891126 607797 476080 475998 706809
4028 706809 787774 946816 852800 820961 869895 1037985 1020977 1006120 990172 1064933 984832
4017 984832 876671 780966 679011 754029 710925 673838 604384 440659 505691 609966 674437
4006 674437 836034 528720 482520 532251 383182 346223 140212 170632 116027 138394 401605
3995 401605 431448 632193 254355 403079 592055 668049 537927 451286 503615 320910
$$ packed form
4070F59397P4593j09297Q76J20545P7668q4051J02840j09359J18145K63315k9484
4059A085188J17594J77131p4636L01781j22268r3951Q1343j83595k9269L7294
4049A296612J00937j75359j03274N7852j88861j50475k12868j49531L11500m2240
4039G44293j19877J7794j53622J2633K37773J03719M8413k83329j31717q2K30811
4028G06809Q0965J59042r4016l1839M8934J68090j7008j4857j5948P4761q0101
4017I84832j08161r5705j01955P5018m3104l7087o9454j63725O5032J04275O4471
4006F74437J61597l07314m6200M9731j49069l6959k06011L0420n4605K2367K63211
3995D01605K9843K00745l77838J48724J88976P5994j30122q6641N2329j82705
$$ plain form
3985 320910 341422 505010 596242 736122 611687 428672 594033 714250 512328 449764
3975 449764 599887 510049 573055 470425 335011 340902 372393 641887 685454 861683 608987
3964 608987 728610 1167396 1511180 1727194 1690518 2211224 2569714 2346669 2218240 2047464
3954 2047464 1579349 1232249 1080858 1054827 794203 856362 916112 762643 962937 707964
3944 707964 642307 620176 512961 308131 406658 369482 368288 409450 605076 612890 377147
3933 377147 236855 109628 518821 316566 375493 426286 440714 410429 439934 509129 360096
3922 360096 238551 336529 293369 91950 79147 181659 68648 -13483 119106 145993 186380
3911 186380 203418 243191 75752 30316 219924 -157440 -232741 -151564 -7011 28572 -61528
$$ packed form
3985C20910K0512J63588R1232J39880j24435j83015J65361J20217k01922o2564
3975D49764J50123q9838O3006j02630j35414N891L1491K69494M3567J76229k52696
3964F08987J19623M38786L43784K16014l6676N20706L58490k23045j28429j70776
3954B047464m68115l47100j51391k6031k60624O2159N9750j53469K00294k54973
3944G07964o5657k2131j07215k04830R8527l7176j194M1162J95626P814k35743
3933C77147j40292j27227M09193k02255N8927N0793J4428l0285K9505O9195j49033
3922C60096j21545R7978m3160k01419j2803J02512j13011q2131J32589K6887M0387
3911A86380J7038L9773j67439m5436J89608l77364p5301Q1177J44553L5583r0100
$$ plain form
3900 -61528 -10032 73437 303571 686177 548182 360477 305381 139133 452324 225904
3890 225904 108944 42125 350862 350288 344111 293262 282811 361468 381660 464650 231102 75015
3878 75015 87400 248166 247398 203787 268450 178723 142814 138814 93955 367171 319203 194736
3866 194736 452409 437582 387079 448485 107007 -1099 -48273 44825 208914 27492 12419
3855 12419 -165411 -279752 60402 170776 60970 -183362 -2429 352227 281620 90541
3845 90541 215639 145658 -13325 -27768 -46730 8335 60057 39637 74302 198152 73342
3834 73342 78682 229014 14043 -25193 65262 225429 386853 257089 61920 108675 94538
3823 94538 118895 326723 230087 -24046 402559 497749 302332 198414 248870 -176962 -77691
$$ packed form
3900f1528N1496Q3469K30134L82606j37995j87705n5096j66248L13191k26420
3890B25904j16960o6819L08737n74o177n0849j0451P8657K0192Q2990k33548j56087
3878G5015J2385J60766p68m3611O4663q9727l5909m000m4859K73216m7968j24467
3866A94736K57673j4827n0503O1406l41478j08106m7174R3098J64089j81422j5073
3855A2419j77830j14341L40154J10374j09806k44332J80933L54656p0607j91079
3845I0541J25098o9981j58983j4443j8962N5065N1722k0420L4665J23850j24810
3834G3342N340J50332k14971l9236R0455J60167J61424j29764j95169M6755j4137
3823I4538K4357K07828r6636k54133M26605R5190j95417j03918N0456m25832R9271
$$ plain form
3812 -77691 189107 122885 176844 139349 297094 352255 337146 492453 586922 701586 928377
3801 928377 736177 449172 586203 677121 334535 366540 331037 368724 571130 506127 170537
3790 170537 47426 -80783 -38811 -100042 12917 -23843 78394 332908 416551 188472
3780 188472 301977 66796 -129040 -167665 -103417 186520 -203527 -310230 -123137 97279
3770 97279 -57424 24664 211600 14524 188499 380064 374792 334411 195314 -149738 -58886
3759 -58886 46665 152799 197358 198539 254316 -81925 282282 153632 -36413 85007 73804
3748 73804 -116744 -196418 96933 182182 114695 118796 71958 191567 311551 129046 118845
3737 118845 56651 113445 144028 329933 279149 245579 306920 469309 247083 -202528 -167522
$$ packed form
3812g7691K66798o6222N3959l7495J57745N5161j5109J55307R4469J14664K26791
3801I28377j92200k87005J37031R0918l42586L2005l5503L7687K02406o5003l35590
3790A70537j23111j28209M1972o1231J12959l6760J02237K54514Q3643k28079
3780A88472J13505k35181j95836l8625O4248K89937l90047j06703J87093K20416
3770I7279j54703Q2088J86936j97076J73975J91565n272m0381j39097l45052R0852
3759e8886J05551J06134M4559J181N5777l36241L64207j28650j90045J21420j1203
3748G3804j90548p9674K93351Q5249o7487M101m6838J19609J19984j82505j0201
3737A18845o2194N6794L0583J85905n0784l3570O1341J62389k22226m49611L5006
$$ plain form
3726 -167522 -210372 -330204 -156219 8155 136376 40978 34362 -75097 86642 73055 -69214
3715 -69214 -114004 -317545 -157573 -114023 137381 268336 382216 62899 -134965 -1312
3705 -1312 128703 235971 212176 289366 39179 -259979 -240879 -202019 30300 -323514 -295633
3694 -295633 -166051 -9208 61049 -75662 -388274 -161353 235406 309136 85278 78827
3684 78827 128415 22945 115203 137946 296712 313342 287466 222398 275355 145626 37947
3673 37947 -117619 4342 127288 111190 149673 354915 270816 201367 -53708 141500 389134
3662 389134 203600 387355 557279 393077 373844 182836 267534 286031 189136 338228
3652 338228 206274 264921 156406 143847 327061 445198 258208 91156 257473 -63899
$$ packed form
3726a67522m2850j19832J73985J64374J28221r5398o616j09459J61739j3587j42269
3715f9214m4790k03541J59972M3550K51404J30955J13880l19317j97864J33653
3705a312J30015J07268k3795P7190k50187k99158J9100L8860K32319l53814K7881
3694b95633J29582J56843P0257j36711l12612K26921L96759P3730k23858o451
3684G8827M9588j05470R2258K2743J58766J6630k5876o5068N2957j29729j07679
3673C7947j55566J21961J22946j6098L8483K05242q4099o9449k55075J95208K47634
3662C89134j85534J83755J69924j64202j9233j91008Q4698J8497r6895J49092
3652C38228j31954N8647j08515j2559J83214J18137j86990j67052J66317l21372
$$ plain form
3642 -63899 80771 358387 281398 -175349 -164178 13875 -44116 -245162 -27209 -176310
3632 -176310 -312201 102052 298621 323132 91142 -66031 -294390 -103148 -319355 -212862
3622 -212862 -364032 -147130 -60526 -32469 25873 369326 460187 294215 254427 2314 26845
3611 26845 202489 439603 469385 571435 466377 441491 580543 337919 226416 397670
3601 397670 401199 202275 22041 -17638 92738 97778 25794 48853 125470 393452 352593
3590 352593 297793 466420 142800 333536 455897 216227 242199 289513 37789 128997
3580 128997 224769 214539 219015 254671 48568 -39771 255381 -86695 -136608 -25389 196181
3569 196181 215210 222526 199408 -66953 89162 242829 246617 377090 215757 91197 -54705
$$ packed form
3642f3899J44670K77616p6989m56747J1171J78053n7991k01046K17953j49101
3632a76310j35891M14253J96569K4511k31990j57173k28359J91242k16207J06493
3622b12862j51170K16902Q6604K8057N8342L43453R0861j65972l9788k52113K4531
3611B6845J75644K37114K9782J02050j05058k4886J39052k42624j11503J71254
3601C97670L529j98924j80234l9679J10376N040p1984K3059P6617K67982m0859
3590C52593n4800J68627l23620J90736J22361k39670K5972M7314k51724R1208
3580A28997R5772j0230M476L5656k06103q8339K95152l42076m9913J11219K21570
3569A96181J9029P316k3118k66361J56115J53667L788J30473j61333j24560j45902
$$ plain form
3558 -54705 -202393 -6813 216212 162594 183715 73615 34215 -107622 55786 57027 265264
3547 265264 228536 100479 295628 108881 259793 305770 11834 297292 543531 499980
3537 499980 312906 256438 236973 145072 287896 426452 513694 473795 321359 366003 362171
3526 362171 394620 509771 542049 456378 500264 508726 200932 442922 706624 624806 541192
3515 541192 410155 282529 362784 291246 268858 329341 345354 413953 350661 579418 500426
3504 500426 176978 314647 469846 594250 479028 331775 328666 392121 273402 339077
3494 339077 588089 565343 610213 618189 773601 1043601 1058999 976075 969798 908477 797115
3483 797115 950492 974151 1153971 1062056 1069212 1437090 1651563 1474580 1429218 1359107 1138691
$$ packed form
3558e4705j47688J95580K23025n3618K1121j10100l9400j41837J63408J241K08237
3547B65264l6728j28057J95149j86747J50912M5977k93936K85458K46239m3551
3537D99980j87074n6468j9465r1901J42824J38556Q7242l9899j52436M4644l832
3526C62171L2449J15151L2278q5671M3886Q462l07794K41990K63702q1818q3614
3515E41192j31037j27626Q0255p1538k2388O0483J6013O8599o3292K28757p8992
3504E00426l23448J37669J55199J24404j15222j47253l109O3455j18719O5675
3494C39077K49012k2746M4870P976J55412K70000J5398q2924o277o1321j11362
3483G97115J53377K3659J79820r1915P156L67878K14473j76983m5362p0111k20416
$$ plain form
3472 1138691 1121233 1237581 1025818 991249 1121819 838966 925471 1080356 956792 924786
3462 924786 1104833 991895 614984 804608 920834 920623 1040029 963507 1082795 1448493
3452 1448493 1465986 1528651 1832059 2017435 2083158 2175528 2237242 2569690 2660435 2382008 2411204
3441 2411204 2427205 2140150 1952670 1865312 1706695 1621374 1548108 1644707 1444918 1258704
3431 1258704 1138345 1173167 1162903 844369 1108462 1151563 858410 893096 1136200 1086867
3421 1086867 1148288 1227020 1181359 1353739 1133691 1367034 1649361 1649742 1447736 1632854 1773293
3410 1773293 1912977 1612370 1484231 1321082 1265935 1447392 1487055 1178600 1205463 1198094
3400 1198094 1087585 1165489 1197063 1301507 1141570 1065657 1135377 1139895 1214037 1153455 1124657
$$ packed form
3472A138691j7458J16348k11763l4569J30570k82853Q6505J54885j23564l2006
3462I24786J80047j12938l76911J89624J16226k11J19406p6522J19288L65698
3452A448493J7493O2665L03408J85376O5723R2370O1714L32448R0745k78427K9196
3441B411204J6001k87055j87480q7358j58617q5321p3266R6599j99789j86214
3431A258704j20359L4822j0264l18534K64093M3101k93153L4686K43104m9333
3421A086867O1421P8732m5661J72380k20048K33343K82327L81k02006J85118J40439
3410A773293J39684l00607j28139j63149n5147J81457L9663l08455K6863p369
3400A198094j10509P7904L1574J04444j59937p5913O9720M518P4142o0582k8798
$$ plain form
3389 1124657 965594 1157428 1394361 1154022 1006549 1139117 1218205 1230191 1183362 1093574
3379 1093574 1084985 1096035 1376942 1264990 1165137 965972 952995 1098539 1401769 1200937
3369 1200937 1185006 1164834 1383830 1438278 1503788 1516347 1428342 1536266 1346450 1258619 1018741
3358 1018741 1091492 1433058 1538610 1503092 1609131 1543241 1460393 1540994 1612516 1511244 1493148
3347 1493148 1499419 1687642 1797345 1727348 1710515 1705738 1728962 1727180 1908763 1773110 1771972
3336 1771972 1726175 1876151 2251395 2387894 2270034 1990746 1884515 2000519 1906468 2125039
3326 2125039 2185994 2331481 2285951 2437234 2273740 2301730 2384329 2596106 2842850 2990321
3316 2990321 2984664 2841904 2862663 2932121 2701100 2677269 2952979 3428372 3375030 3329232 3775380
$$ packed form
3389A124657j59063J91834K36933k40339j47473J32568P9088J1986m6829q9788
3379A093574q589J1050K80907j11952r9853j99165j2977J45544L03230k00832
3369A200937j5931k0172K18996N4448O5510J2559q8005J07924j89816q7831k39878
3358A018741P2751L41566J05552l5518J06039o5890q2848Q0601P1522j01272j8096
3347A493148O271J88223J09703o9997j6833m777K3224j782J81583j35653j138
3336A771972m5797J49976L75244J36499j17860k79288j06231J16004r4051K18571
3326B125039O0955J45487m5530J51283j63494K7990Q2599K11777K46744J47471
3316B990321n657j42760K0759O9458k31021k3831K75710M75393n3342m5798M46148
$$ plain form
3305 3775380 3888279 3660336 3306514 3400623 3734987 3806599 3413322 3575170 3723023 3841199
3295 3841199 3631520 3793922 4082653 4194184 4268799 4456747 4430275 4555342 4724867 5026969
3285 5026969 5183714 5305260 5442201 5338516 5323365 5705544 5475446 5313726 5585313 5780680
3275 5780680 6002775 6315728 6223969 6487580 6802073 7155328 7148937 7105193 7474159 7588110
3265 7588110 7804816 8184974 8414180 8588548 8953027 9012447 8798557 9162001 9686411 9935049
3255 9935049 10008888 10192428 10428522 10919849 11340653 11637167 11870767 11961292 12199464 12521027
3245 12521027 12554063 13131593 13537837 13716311 14416548 14495314 14739145 15167696 15532400 16057750
3235 16057750 16534113 16947438 17231352 17416237 17956545 18761257 19480575 20063604 20636872
$$ packed form
3305C775380J12899k27943l53822R4109L34364P1612l93277J61848J47853J18176
3295C841199k09679J62402K88731J11531P4615J87948k6472J25067J69525L02102
3285E026969J56745J21546J36941j03685j5151L82179k30098j61720K71587J95367
3275E780680K22095L12953r1759K63611L14493L53255o391m3744L68966J13951
3265G588110K16706L80158K29206J74368L64479N9420k13890L63444N24410K48638
3255I935049P3839J83540K36094M91327M20804K96514K33600R0525K38172L21563
3245A2521027L3036N77530M06244J78474P00237P8766K43831M28551L64704N25350
3235A6057750M76363M13325K83914J84885N40308Q04712P19318N83029N73268
$$ plain form
3226 20636872 21169764 21526735 22045697 22839927 23671072 24410419 25113437 26039365 27037892
3217 27037892 28013211 29187940 30573494 31890920 33054936 34028444 35378592 36534987
3209 36534987 37913545 39485882 41080196 42720265 44536810 46637821 49089534 51944431
3201 51944431 55451881 59434529 63898296 69434695 76016870 83515923 92478078 103601854
3193 103601854 116731030 131919560 149223877 166850074 181551047 191463068 195918547
3186 195918547 194315399 186218262 172625378 156542703 140710356 128081557 118351172
3179 118351172 110731401 104587221 100152559 97160685 95115024 93970572 93366025 93649977
3171 93649977 94515252 96260920 98935498 102916677 108274435 114940217 123264889 133435211
$$ packed form
3226B0636872N32892L56971N18962P94230Q31145P39347P03018R25928R98527
3217B7037892R75319J174729J385554J317426J164016R73508J350148J156395
3209C6534987J378558J572337J594314J640069J816545K101011K451713K854897
3201E1944431L507450L982648M463767N536399O582175P499053Q962155J1123776
3193A03601854J3129176J5188530J7304317J7626197J4700973R912021M455479
3186A95918547j603148q097137j3592884j6082675j5832347j2628799r730385
3179A18351172p619771o144180m434662k991874k045661j144452o04547K83952
3171I3649977Q65275J745668K674578L981179N357758O665782Q324672J0170322
$$ plain form
3163 133435211 145968343 161488819 180521554 203679169 232602844 266073629 300057077
3156 300057077 328218162 346400056 352650709 346225117 326569663 295004812 257540346
3149 257540346 222637511 194112639 171330635 153446823 139331823 127662479 118028084
3142 118028084 110641704 104312006 99246624 95468216 92361824 90232422 88748344 87941198
3134 87941198 88189880 89095260 91258886 94343827 98585522 104382462 111975113 121094954
3126 121094954 132414865 145982497 159881055 171302215 178337519 180058070 176170797
3119 176170797 166598285 151753650 134071213 116883773 102099155 90185183 80357676
3112 80357676 72341072 65562992 60011187 55338701 51563620 48349886 45010420 42268322
$$ packed form
3163A33435211J2533132J5520476J9032735K3157615K8923675L3470785L3983448
3156C00057077K8161085J8181894O250653o425592j9655454l1564851l7464466
3149B57540346l4902835k8524872k2782004j7883812j4115000j1669344r634395
3142A18028084p386380o329698n065382l778408l106392k129402j484078q07146
3134H7941198K48682R05380K163626L084941M241695N796940P592651R119841
3126A21094954J1319911J3567632J3898558J1421160P035304J720551l887273
3119A76170797r572512j4844635j7682437j7187440j4784618j1913972r827507
3112H0357676q016604o778080n551805m672486l775081l213734l339466k742098
$$ plain form
3104 42268322 39999201 37778560 35577928 33921742 32402639 30882469 29486361 28375505
3096 28375505 27302201 25950587 25242206 24375320 23249764 22305807 21596935 20628308 20125332
3087 20125332 19381386 18481114 18086064 17694943 16966254 16503229 16005594 15383486 14817069
3078 14817069 14225899 14166430 13824778 13519090 13061337 12789701 12399937 11913851 11566622 11097443
3068 11097443 10834611 10616619 10394444 10117994 9894992 9797192 9487736 9064940 8927784 8812975
3058 8812975 8491140 8372027 8211504 8157261 7738822 7303441 6979018 7052958 7039079 7048111
3048 7048111 7029857 6816213 6510374 6156286 6341459 6286014 6270872 5957783 5886576 6003769
3038 6003769 5849343 5522837 5494336 5496229 5331698 5260428 5172003 5109119 4923891 4966691 4843774
$$ packed form
3104D2268322k269121k220641k200632j656186j519103j520170j396108j110856
3096B8375505j073304j351614p08381q66886j125556r43957p08872r68627n02976
3087B0125332p43946r00272l95050l91121p28689m63025m97635o22108n66417
3078A4817069n91170n9469l41652l05688m57753k71636l89764m86086l47229m69179
3068A1097443k62832k17992k22175k76450k23002r7800l09456m22796j37156j14809
3058H812975l21835j19113j60523n4243m18439m35381l24423P3940j3879R032
3048G048111j8254k13644l05839l54088J85173n5445j5142l13089p1207J17193
3038F003769j54426l26506k8501J893j64531p1270q8425o2884j85228M2800j22917
$$ plain form
3027 4843774 4483734 4416342 4511687 4311805 4405732 4305829 4123842 4028080 3998462 3874888 3672792
3016 3672792 3595896 3609434 3797521 3753264 3566320 3608908 3593737 3422941 3400655 3475383 3443138
3005 3443138 3405422 3405296 3120326 3089920 3199119 3053250 3193251 3080140 2801895 2761075 2740687
2994 2740687 2802286 2602558 2569443 2818111 2867978 2605752 2568865 2512025 2477220 2561191 2467663
2983 2467663 2231586 2006996 2187468 2143008 2190458 1956491 1707125 2228868 2152987 2021586
2973 2021586 2069917 2134322 2089911 2158357 1938906 2037370 2209246 2035486 2068525 1937001 1690058
2962 1690058 1575786 1684097 1640804 1310365 1498869 1594275 1860228 1829950 1608125 1547987
2952 1547987 1680895 1704684 1650402 1957969 2015374 1727741 1452075 1689547 1578393 1481353
$$ packed form
3027D843774l60040o7392R5345j99882R3927r9903j81987r5762k9618j23574k02096
3016C672792p6896J3538J88087m4257j86944M2588j5171j70796k2286P4728l2245
3005C443138l7716j26k84970l0406J09199j45869J40001j13111k78245m0820k0388
2994B740687O1599j99728l3115K48668M9867k62226l6887n6840l4805Q3971r3528
2983B467663k36077k24590J80472m4460M7450k33967k49366N21743p5881j31401
2973B021586M8331O4405m4411O8446k19451R8464J71876j73760L3039j31524k46943
2962A690058j14272J08311m3293l30439J88504R5406K65953l0278k21825o0138
2952A547987J32908K3789n4282L07567N7405k87633k75666K37472j11154r7040
$$ plain form
2942 1481353 1197889 1302350 1350985 1405664 1446331 1450164 1410567 1248337 1331766 1259680 1396083
2931 1396083 1426407 1272141 1394617 1353162 1328392 1283138 1294925 1235695 1058848 1053930 1357498
2920 1357498 1538655 1300536 1352693 1408154 1291674 1410315 1167091 904364 967017 1330700
2910 1330700 998317 1011146 1295207 1304210 1268628 1089696 936057 1087664 1378886 1578692
2900 1578692 1628527 1726023 2150137 2308073 1962770 2084108 1932338 1929040 1862844 1797391 1595354
2889 1595354 1481438 1661375 1426624 1231238 1422305 1349751 1175312 1365231 1322382 1617504
2879 1617504 1531752 1377410 1406689 1473596 1660892 1511843 1516001 1679001 1983152 2035276 1811065
2868 1811065 1954973 2244725 2506544 2664071 3156337 3061950 2859096 2592373 2570973 2537311
$$ packed form
2942A481353k83464J04461M8635N4679M0667L833l9597j62230Q3429p2086J36403
2931A396083L0324j54266J22476m1455k4770m5254J1787n9230j76847m918L03568
2920A357498J81157k38119N2157N5461j16480J18641k43224k62727O2653L63683
2910A330700l32383J2829K84061R003l5582j78932j53639J51607K91222J99806
2900A578692M9835R7496M24114J57936l45303J21338j51770l298o6196o5453k02037
2889A595354j13916J79937k34751j95386J91067p2554j74439J89919m2849K95122
2879A617504q5752j54342K9279O6907J87296j49049M158J63000L04151N2124k24211
2868A811065J43908K89752K61819J57527M92266r4387k02854k66723k1400l3662
$$ plain form
2858 2537311 2392360 2267010 2206780 2013892 2062129 1922592 1854880 1613913 1724451 1820144
2848 1820144 1650448 1703325 1842801 2074078 1952808 1603284 1647709 1551755 1804181 1823161
2838 1823161 1511825 1450373 1571513 1791209 1530360 1624030 1773998 2032705 2344835 2287025
2828 2287025 2013374 1818893 1885231 1805448 1671122 1746411 1752985 1443556 1151009 1079738 1193531
2817 1193531 1090139 1070843 912639 931356 1076425 933193 1028872 1052233 965412 1016824 948660
2806 948660 841550 836698 794084 691727 741011 841228 1167913 1142823 921482 794615 497716
2795 497716 569052 566360 665099 840652 861522 682068 475435 550822 621986 331906 615198
2784 615198 629524 617482 500705 523159 632005 530880 649154 590365 685609 509557 413958
$$ packed form
2858B537311j44951j25350o0230j92888M8237j39537o7712k40967J10538R5693
2848A820144j69696N2877J39476K31277j21270l49524M4425r5954K52426J8980
2838A823161l11336o1452J21140K19696k60849R3670J49968K58707L12130n7810
2828B287025k73651j94481O6338p9783j34326P5289O574l09429k92547p1271J13793
2817A193531j03392j9296j58204J8717J45069j43232R5679K3361q6821N1412o8164
2806I48660j07110m852m2614j02357M9284J00217L26685k5090k21341j26867k96899
2795D97716P1336k692R8739J75553K0870j79454k06633P5387P1164k90080K83292
2784F15198J4326j2042j16777K2454J08846j01125J18274n8789R5244j76052r5599
$$ plain form
2773 413958 426556 410380 331025 118061 361665 718726 912000 635658 297003 411284
2763 411284 387324 272275 273578 119540 59511 -27698 116613 388161 340762 252284 248039
2752 248039 123610 100975 73483 66315 127006 320761 356950 367321 399497 435009 523007
2741 523007 627166 312106 75113 139632 131718 273654 351385 322330 373302 393710 332285
2730 332285 237049 86678 137259 216200 288797 252965 -168887 -109507 77494 151627 41701
2719 41701 22540 -226860 -87728 58313 94888 205627 77137 -86859 10564 292185
2709 292185 292624 225638 359583 242583 53843 115614 -73002 -34553 24840 267692 93717
2698 93717 -168176 15863 203754 -185812 -145684 74427 143842 -122797 51396 40710
$$ packed form
2773D13958J2598j6176p9355k12964K43604L57061J93274k76342l38655J14281
2763D11284k3960j15049J303j54038o0029q7209J44311K71548m7399q8478m245
2752B48039j24429k2635k7492p168O0691J93755L6189J0371L2176L5512Q7998
2741E23007J04159l15060k36993O4519p914J41936P7731k9055N0972K0408o1425
2730C32285r5236j50371N0581P8941P2597l5832m21852N9380J87001P4133j09926
2719D1701j9161k49400J39132J46041L6575J10739j28490j63996R7423K81621
2709B92185M39o6986J33945j17000j88740O1771j88616L8449N9393K42852j73975
2698I3717k61893J84039J87891l89566M0128K20111O9415k66639J74193j0686
$$ plain form
2688 40710 295066 308548 -100659 204640 184685 73686 -50216 -198772 84565 412588
2678 412588 356289 363576 350237 263851 191066 -38425 -217778 86332 -137194 97571 159786
2667 159786 -11526 60588 149209 355598 123840 -145455 -45323 -49161 -54060 -70283 197608
2656 197608 434006 -3769 -24546 -135828 -176333 57332 82838 73526 66473 122085 267185
2645 267185 157159 -13828 -86663 -12869 154333 402452 327554 340403 137370 -146887
2635 -146887 211378 295882 137909 311092 400285 121446 77685 244176 264245 336551 230442
2624 230442 241357 86775 135471 92866 46240 109729 300558 520215 272394 182297 302291
2613 302291 203265 175393 210033 -10691 -21029 54462 174847 295473 147562 122567 238812
$$ packed form
2688D0710K54356J3482m09207L05299j9955j10999j23902j48556K83337L28023
2678D12588n6299P287j3339q6386p2785k29491j79353L04110k23526K34765O2215
2667A59786j71312P2114Q8621K06389k31758k69295J00132l838m899j6223K67891
2656A97608K36398m37775k0777j11282m0505K33665K5506r312p053N5612J45100
2645B67185j10026j70987p2835P3794J67202K48119p4898J2849k03033k84257
2635a46887L58265Q4504j57973J73183Q9193k78839m3761J66491K0069P2306j06109
2624B30442J0915j54582M8696m2605m6626O3489J90829K19657k47821r0097J19994
2613C02291r9026k7872L4640k20724j0338P5491J20385J20626j47911k4995J16245
$$ plain form
2602 238812 -44576 77878 125491 -133423 -342025 -75882 319024 52964 -99810 61369
2592 61369 338434 461503 266549 104877 117419 57386 -119603 -62607 61437 -6411 -41688
2581 -41688 -211633 -228099 -537866 -60877 37280 -242247 -97892 68036 -40898 -41854 52990
2570 52990 -394031 -284576 -96936 47148 42279 44990 37283 113189 177250 -1955 93800
2559 93800 11674 -147408 -9194 153175 126157 51441 160669 347755 130974 97698 -141683
2548 -141683 -194737 -34701 -23672 197315 245973 224338 -2296 254513 85384 203142
2538 203142 116864 -31955 -59295 16022 67443 71828 137725 53515 -155871 -137628 -67320
2527 -67320 -96970 23897 19021 -116247 -139820 -73418 -198264 -143416 -121710 -345255 -335287
$$ packed form
2602B38812k83388J22454M7613k58914k08602K66143L94906k66060j52774J61179
2592F1369K77065J23069j94954j61672J2542o0033j76989N6996J24044o7848l5277
2581d1688j69945j6466l09767M76989R8157k79527J44355J65928j08934r56R4844
2570E2990m47021J09455J87640J44084m869K711p707P5906O4061j79205R5755
2559I3800q2126j59082J38214J62369k7018p4716J09228J87086k16781l3276k39381
2548a41683n3054J60036J1029K20987M8658k1635k26634K56809j69129J17758
2538B03142q6278j48819k7340P5317N1421M385O5897q4210k09386J8243P0308
2527f7320k9650J20867m876j35268k3573O6402j24846N4848K1706k23545R968
$$ plain form
2516 -335287 -19321 3735 131530 145657 102213 145206 43427 28186 132921 -67045 -64814
2505 -64814 321208 187506 -166008 -265474 -143712 -91997 -154973 -2965 190512 -39965
2495 -39965 -46453 -230300 -324001 -237352 -357634 -251145 -83894 -156151 -195115 -154408 -37694
2484 -37694 -48738 -192606 18129 238421 229040 44619 -47821 -235362 -212122 57769 23082
2473 23082 81522 220670 -171613 -272298 -197351 -82998 93413 131513 54847 -158609 -141840
2462 -141840 28933 162505 -17467 -184317 -227685 161025 222303 124036 -85780 -225851
2452 -225851 -210858 44146 123486 -95629 -107285 -63691 73982 -51693 92322 39909 -202708
2441 -202708 -60539 -33684 22616 -43893 -85288 -74852 -36413 67608 187391 160610 -5022
$$ packed form
2516c35287L15966K3056J27795J4127m3444M2993j01779j5241J04735j99966K231
2505f4814L86022j33702l53514r9466J21762N1715o2976J52008J93477k30477
2495c9965o488j83847r3701Q6649j20282J06489J67251p2257l8964M0707J16714
2484c7694j1044j43868K10735K20292r381j84421r2440j87541K3240K69891l4687
2473B3082N8440J39148l92283j00685P4947J14353J76411L8100p6666k13456J6769
2462a41840J70773J33572j79972j66850m3368L88710O1278r8267k09816j40071
2452b25851J4993K55004P9340k19115j1656M3594J37673j25675J44015n2413k42617
2441b02708J42169K6855N6300o6509m1395J0436L8439J04021J19783k6781j65632
$$ plain form
2430 -5022 -297830 -334029 -226660 -95137 108665 92413 78340 -20044 -201416 -102812 29636
2419 29636 -253075 -204149 -290767 -66850 -164259 -135599 17313 -103714 -76713 -193174 -264156
2408 -264156 157541 5932 -11338 239814 170723 74317 62719 225438 218248 130559 89572
2397 89572 -82141 24769 -143339 -63737 -105819 -179257 -46847 121118 265458 152981
2387 152981 142473 40119 88674 170971 80148 91523 90346 1082 10683 71754 -126117 37620
2375 37620 -98486 -82224 155718 -227758 -93520 -261173 -103401 -17555 -49419 261121
2365 261121 -53706 -64784 -195481 -168754 32982 -176266 -419991 -474190 -109203 -34378
2355 -34378 -40634 -25531 -59601 -60986 -88587 -68335 62498 -3249 -1259 -213670 -295626 -46106
$$ packed form
2430e022k92808l6199J07369J31523K03802j6252j4073r8384j81372R8604J32448
2419B9636k82711M8926q6618K23917r7409K8660J52912j21027K7001j16461p0982
2408b64156M21697j51609j7270K51152o9091r6406j1598J62719p190q7689m0987
2397H9572j71713J06910j68108P9602m2082p3438J32410J67965J44340j12477
2387A52981j0508j02354M8555Q2297r0823J1375j177q9264R601O1071j97871J63737
2375C7620j36106J6262K37942l83476J34238j67653J57772Q5846l1864L10540
2365B61121l14827j1078j30697K6727K01736k09248k43725n4199L64987P4825
2355c4378o256J5103l4070j385k7601K0252J30833o5747J990k12411q1956K49520
$$ plain form
2343 -46106 -124805 24525 194861 126838 165147 153421 182926 228310 17723 68668 103791
2332 103791 -183008 -129268 -135062 -30396 -139460 -14997 256735 214980 -155672 232830
2322 232830 233605 210957 297911 42300 -121118 69557 41996 -74940 24437 96450 116612
2311 116612 186681 123653 -74202 -73914 -125223 -342663 -293832 95992 146 55355 91573
2300 91573 105552 -82476 -27213 -23628 -129740 72119 142105 133113 139151 -16929 -189228
2289 -189228 -289197 -98872 -63639 -178276 -103784 -163906 -101530 168192 -196504 -375877 -125412
2278 -125412 -163094 -200184 -282680 -173829 49098 29225 -54134 185893 284904 156962 56167
2267 56167 235082 323126 224938 67488 96860 -289474 -486461 -351493 -84321 -208147
$$ packed form
2343d6106p8699J49330J70336o8023L8309j1726K9505M5384k10587N0945L5123
2332A03791k86799N3740n794J04666j09064J24463K71732m1755l70652L88502
2322B32830P75k2648Q6954k55611j63418J90675k7561j16936R9377P2013K0162
2311A16612P0069o3028j97855K88n1309k17440M8831L89824r5846N5209L6218
2300I1573J3979j88028N5263L585j06112K01859O9986q992O038j56080j72299
2289a89228r9969J90325L5233j14637P4492o0122O2376K69722l64696j79373K50465
2278a25412l7682l7090q2496J08851K22927j9873q3359K40027R9011j27942j00795
2267E6167J78915Q8044r8188j57450K9372l86334j96987J34968K67172j23826
$$ plain form
2257 -208147 -324374 -245577 -207040 35803 185136 -11678 -94964 -33115 -8005 165876 207668
2246 207668 28625 -55223 73712 39004 -27609 -155543 -269710 24942 27496 -247813 -5075
2235 -5075 -160054 32391 82767 32399 -162871 -190155 51642 -172440 -253584 -180297 -203093
2224 -203093 153175 100302 -175177 -251061 -133899 -228287 22313 29660 -45164 -118255 197539
2213 197539 140405 109111 -10300 -486822 -465430 -192449 -220784 -247432 -195221 -202127 13441
2202 13441 209561 45945 -142709 -162909 -506266 -396839 -75454 23215 -73842 -119465 -1020
2191 -1020 99559 26733 14935 -50731 139897 103706 103383 -58248 196800 330388 191690
2180 191690 216776 276983 126702 158604 132620 -50689 -65725 20853 128944 159248 -44958
$$ packed form
2257b08147j16227P8797L8537K42843J49333j96814q3286O1849K5110J73881M1792
2246B07668j79043q3848J28935l4708o6613j27934j14167K94652K554k75309K42738
2235e075j54979J92445N0376n0368j95270k7284K41797k24082q1144P3287k2796
2224b03093L56268n2873k75479p5884J17162r4388K50600P347p4824p3091L15794
2213A97539n7134l1294j19411m76522K1392K72981k8335k6648N2211o906K15568
2202A3441J96120j63616j88654k0200l43357J09427L21385R8669r7057m5623J18445
2191a020J00579p2826j1798o5666J90628l6191l23j61631K55048J33588j38698
2180A91690K5086O0207j50281L1902k5984j83309j5036Q6578J08091L0304k04206
$$ plain form
2169 -44958 113940 -88216 -50007 90682 46389 202509 101119 159905 38040 90632 145301
2158 145301 224104 -16828 69998 -6870 -43755 108541 171470 187995 -41687 148761 121493
2147 121493 127030 47091 -2889 307758 338999 187125 159460 56366 109017 10974 -56796
2136 -56796 117428 71606 192800 236411 60246 62000 -181226 -187695 145835 310374 333638
2125 333638 513967 273267 -125119 -68969 -99430 306011 162323 46804 40296 102151 412622
2114 412622 497909 252865 372842 175085 13536 117424 244847 133919 89371 95857
2104 95857 34930 299152 369274 530273 323956 117020 479450 903673 633657 579529
2094 579529 785779 843569 694679 470999 501012 506753 659852 813971 722069 763470 680571
$$ packed form
2169d4958J58898k02156L8209J40689m4293J56120j01390N8786j21865N2592N4669
2158A45301P8803k40932Q6826p6868l6885J52296O2929J6525k29682J90448k7268
2147A21493N537p9939m9980L10647L1241j51874k7665j03094N2651r8043o7770
2136e6796J74224m5822J21194M3611j76165J754k43226o469L33530J64539K3264
2125C33638J80329k40700l98386N6150l0461M05441j43688j15519o508O1855L10471
2114D12622Q5287k45044J19977j97757j61549J03888J27423j10928m4548O486
2104I5857o0927K64222P0122J60999k06317k06936L62430M24223k70016n4128
2094E79529K06250N7790j48890k23680L0013N741J53099J54119r1902M1401q2899
$$ plain form
2083 680571 649919 787037 1015586 1319866 1506442 1322180 1563783 1451682 1492135 1481165
2073 1481165 1354325 1792743 1668028 1744417 2247938 2567841 2780241 2926368 3315683 3755979
2063 3755979 4319725 5105138 5867061 6935993 8097145 9686017 11457337 12683864 13391483
2054 13391483 13626218 12861312 12426639 11408917 9021593 7494830 6342375 5575935 4916106
2045 4916106 4144664 3548963 3230253 3153717 2934199 2492505 2348573 2044525 2072885 2107864
2035 2107864 1855079 1553993 1400336 1379589 1173045 1305940 1329721 1257800 1156944 1293963
2025 1293963 1053556 991059 898112 643384 782598 674680 436615 554864 674659 655574
2015 655574 636031 640128 554033 521441 390284 340446 451901 661931 534366 527364 843134
$$ packed form
2083F80571l0652J37118K28549L04280J86576j84262K41603j12101M0453j0970
2073A481165j26840M38418j24715P6389N03521L19903K12400J46127L89315M40296
2063C755979N63746P85413P61923J068932J161152J588872J771320J226527P07619
2054A3391483K34735p64906m34673j017722k387324j526763j152455p66440o59829
2045D916106p71442n95701l18710p6536k19518m41694j43932l04048K8360L4979
2035B107864k52785l01086j53657k0747k06544J32895K3781p1921j00856J37019
2025A293963k40407o2497r2947k54728J39214j07918k38065J18249J19795j9085
2015F55574j9543M097q6095l2592j31157m9838J11455K10030j27565p002L15770
$$ plain form
2004 843134 787345 622907 477690 667933 419417 267465 406891 248974 425155 423866
1994 423866 -14929 -111083 167318 255282 48278 93126 251160 302175 427741 160489
1984 160489 60184 3917 -135493 -1369 -121819 14353 387924 360971 116589 30217
1974 30217 70124 155564 77339 260860 209177 -56094 -198779 -345019 -64462 -91815 154197
1963 154197 145048 -3198 -160721 1956 156120 90525 130764 16718 46014 35460 105697
1952 105697 150934 172885 312643 58419 -153698 -144191 -74948 -250542 -458719 -296602 -284606
1941 -284606 -420550 -542715 -95484 -79423 -83146 -67197 -91976 -160107 26579 60444 -125041
1930 -125041 80340 288299 308979 -20065 -259685 50036 170920 -67445 159859 172444
$$ packed form
2004H43134n5789j64438j45217J90243k48516j51952J39426j57917J76181j289
1994D23866m38795r6154K78401Q7964k07004M4848J58034N1015J25566k67252
1984A60489j00305n6267j39410J34124j20450J36172L73571k6953k44382q6372
1974C0217L9907Q5440p8225J83521n1683k65271j42685j46240K80557k7353K46012
1963A54197r149j48246j57523J62677J54164o5595M0239j14046K9296j0554P0237
1952A05697M5237K1951J39758k54224k12117R507O9243j75594k08177J62117J1996
1941b84606j35944j22165M47231J6061l723J5949k4779o8131J86686L3865j85485
1930a25041K05381K07959K0680l29044k39620L09721J20884k38365K27304J2585
$$ plain form
1920 172444 -106517 -199035 -216886 -97148 151285 109997 -118669 100850 442266 504692
1910 504692 353148 -165682 -280485 -133252 6144 -231601 -68841 217004 198239 104652
1900 104652 -126675 56770 143745 59359 125199 55854 -123350 -134336 75132 -101484 -622116
1889 -622116 -533384 -446659 -317999 -298165 -297677 -198237 -209337 -242976 -269988 -200386 -46169 111198
1877 111198 66529 165917 21322 -68538 126717 -1080 -120672 -76091 -73369 -158284 -191853
1866 -191853 -266036 -186945 -151803 -84760 -35265 -209245 -261900 -56561 -50692 -110365 41938
1855 41938 77514 255668 131037 81069 -60834 -134335 -212313 -252848 -157173 -274180 -427491
1844 -427491 -389464 -201330 -183091 -69478 -220226 -94456 144524 169877 54575 -110441
$$ packed form
1920A72444k78961r2518j7851J19738K48433m1288k28666K19519L41416O2426
1910E04692j51544n18830j14803J47233J39396k37745J62760K85845j8765r3587
1900A04652k31327J83445Q6975q4386O5840o9345j79204j0986K09468j76616n20632
1889f22116Q8732Q6725J28660J9834M88R9440j1100l3639k7012O9602J54217J57367
1877A11198m4669R9388j44595q9860J95255j27797j19592M4581K722q4915l3569
1866a91853p4183P9091L5142O7043M9495j73980n2655K05339N869n9673J52303
1855D1938L5576J78154j24631m9968j41903p3501p7978m0535R5675j17007j53311
1844d27491L8027J88134J8239J13613j50748J25770K38980K5353j15302j65016
$$ plain form
1834 -110441 -61780 -147298 -184763 -50246 -45471 -134594 -194415 7429 -18675 -23839 -59274 19277
1822 19277 184930 154795 -39844 -65837 -82073 -155454 -62909 -139179 -320370 -453302 -531791
1811 -531791 -500329 -303040 -69887 -165169 32511 85810 99019 80474 284005 -16399 -285423
1800 -285423 30682 99013 37148 7902 -9666 93272 -3511 -96687 30048 -104277 -195856
1789 -195856 -378018 -85882 29251 82808 39822 81824 32167 -142998 6731 -162672
1779 -162672 -330673 -32152 172037 93762 -261166 -91509 120363 122926 206613 321061
1769 321061 280298 35625 -39001 285195 185648 171578 -117720 -198493 116337 -252635 3924
1758 3924 131016 -36095 399482 154813 -25713 -67589 -161398 -397632 -293902 -256536 -192456
$$ packed form
1834a10441M8661q5518l7465J34517M775q9123n9821K01844k6104n164l5435P8551
1822A9277J65653l0135j94639k5993j6236p3381R2545p6270j81191j32932p8489
1811e31791L1462J97289K33153r5282J97680N3299J3209j8545K03531l00404k69024
1800b85423L16105O8331o1865k9246j7568J02938r6783r3176J26735j34325r1579
1789a95856j82162K92136J15133N3557m2986M2002m9657j75165J49729j69403
1779a62672j68001K98521K04189p8275l54928J69657K11872K563Q3687J14448
1769C21061m0763k44673p4626L24196r9547j4070k89298q0773L14830l68972K56559
1758C924J27092j67111M35577k44669j80526m1876r3809k36234J03730L7366O4080
$$ plain form
1747 -192456 -142675 -178863 -7276 -58467 11574 422506 250355 251558 86408 -372104 -118562
1736 -118562 47279 -109927 -248795 -204813 -217103 -24608 -144511 -182167 10204 -395886
1726 -395886 -222893 56738 309552 341478 21887 78811 -178549 -273938 -298982 -211873 -97080
1715 -97080 -211712 -422300 -389021 -171322 129475 -166465 -187182 -257031 -303424 -287988 -144822
1704 -144822 -191352 -385845 -137050 -80448 -209862 -170573 -266001 -28671 -84354 -61489 -215189
1693 -215189 -60174 -101227 51369 151804 129711 108316 -337870 -188073 -87617 80772
1683 80772 124421 162467 382378 89910 -25753 -339837 -230340 -40652 -152077 9590
1673 9590 112481 -57990 -189208 -353694 -329534 -47498 -124437 173313 163389 -122066 -167645
$$ packed form
1747a92456M9781l6188J71587n1191P0041M10932j72151J203j65150m58512K53542
1736a18562J65841j57206j38868M3982j2290J92495j19903l7656J92371m06090
1726c95886J72993K79631K52814L1926l19591N6924k57360r5389k5044Q7109J14793
1715i7080j14632k10588L3279K17699L00797k95940k0717o9849m6393J5436J43166
1704a44822m6530j94493K48795N6602j29414L9289r5428K37330n5683K2865j53700
1693b15189J55015m1053J52596J00435k2093k1395m46186J49797J00456J68389
1683H0772M3649L8046K19911k92468j15663l14084J09497J89688j11425J61667
1673I590J02891j70471j31218j64486K4160K82036p6939K97750r924k85455m5579
$$ plain form
1662 -167645 -115327 -162185 -199427 176468 144117 -29561 -23609 60503 -21877 -86217 -93261 10658
1650 10658 17080 47102 329593 94356 74944 -168459 -98357 -185017 -99750 -167023 -125472
1639 -125472 20446 37843 -245036 -357114 -26579 147434 47494 -137009 -303545 -290245
1629 -290245 37952 6162 86972 15080 -118597 57775 88532 365765 14360 90537 -46298
1618 -46298 -226537 -177886 -456319 -349523 -159587 -399318 -125008 -307289 -555765 -344740
1608 -344740 -324110 -132175 -43976 -152263 -162838 -216498 -6324 57618 -105439 49028 107205
1597 107205 13292 -380727 -436309 -195298 -119466 -274320 -68497 74776 90900 286574
1587 286574 200273 -28486 -43502 -53511 -28843 131546 145257 -125733 -115921 -186185 -21424
$$ packed form
1662a67645N2318m6858l7242L75895l2351j73678N952Q4112q2380o4340p044J03919
1650A0658O422L0022K82491k35237j9412k43403P0102q6660Q5267o7273M1551
1639a25472J45918J7397k82879j12078L30535J74013r9940j84503j66536J3300
1629b90245L28197l1790Q0810p1892j33677J76372L0757K77233l51405P6177j36835
1618d6298j80239M8651k78433J06796J89936k39731K74310j82281k48476K11025
1608c44740K0630J91935Q8199j08287j0575n3660K10174O3942j63057J54467N8177
1597A07205r3913l94019n5582K41011P5832j54854K05823J43273J6124J95674
1587B86574q6301k28759j5016j0009K4668J60389J3711k70990R812p0264J64761
$$ plain form
1576 -21424 -74676 -313197 -400491 30247 106857 20133 -50111 -327776 -150577 -134935 -214670
1565 -214670 -198805 -23241 87902 51481 -181481 -234039 -284656 -101204 -28342 -245535 -62288
1554 -62288 -38224 -327256 -170907 -44792 -7247 -10951 -368942 -453853 -397331 -181873 -48229
1543 -48229 102833 119537 -173044 -185253 -89240 -116543 -183346 -358662 -140973 -386496 -332042
1532 -332042 -68186 27971 19009 -248179 -113798 -51648 -101668 111229 64713 100906 25907
1521 25907 -177717 121990 135656 -12110 132953 131358 -98016 -227042 -27193 4179 8348
1510 8348 -176454 -152824 -137945 68553 136746 68645 44531 -219748 -142091 21171 40895
1499 40895 -18951 -130168 -139178 -195782 -112846 88442 -45410 -179519 -225802 -101680 229643
$$ packed form
1576b1424n3252k38521q7294M30738P6610q6724p0244k77665J77199J5642p9735
1565b14670J5865J75564J11143l6421k32962n2558n0617J83452P2862k17193J83247
1554f2288K4064k89032J56349J26115L7545l704l57991q4911N6522K15458J33644
1543d8229J51062J6704k92581j2209R6013k7303o6803j75316K17689k45523N4454
1532c32042K63856R6157q962k67188J34381O2150n0020K12897m6516L6193p4999
1521B5907k03624K99707J3666j47766J45063j595k29374j29026J99849L1372M169
1510H348j84802K3630J4879K06498O8193o8101k4114k64279P7657J63262J9724
1499D0895n9846j11217r010n6604Q2936K01288j33852j34109m6283J24122L31323
$$ plain form
1488 229643 261747 83310 279743 120319 142734 187427 -166048 44726 176491 108510
1478 108510 -166755 -211195 -215164 -147868 86071 22166 -196141 -76383 -117118 184325 86506
1467 86506 -106000 78289 -7037 237262 -281063 -443201 -128641 -307484 -133958 79318
1457 79318 37824 8258 -206 20493 -66820 33046 12143 43748 100639 37322 21721 329558
1445 329558 22707 -41939 -177931 -75546 31935 116399 289872 -62080 -190697 159920
1435 159920 198010 108991 41001 135164 115779 346 -100538 39077 11439 220582 230508
1424 230508 -180333 -74757 62522 -80882 118924 -20991 -57578 -351097 -245006 -117649
1414 -117649 102802 322688 144461 15370 -173485 170299 208471 -203252 -118171 -26932
$$ packed form
1488B29643L2104j78437J96433j59424K2415M4693l53475K10774J31765o7981
1478A08510k75265m4440l969O7296K33939o3905k18307J19758m0735L01443r7819
1467H6506j92506J84289q5326K44299n18325j62138L14560j78843J73526K13276
1457G9318m1494k9566q464K0699q7313R9866k0903L1605N6891o3317j5601L07837
1445C29558l06851o4646j35992J02385J07481Q4464J73473l51952j28617L50617
1435A59920L8090q9019o7990R4163j9385j15433j00884J39615k7638K09143R926
1424B30508m10841J05576J37279j43404J99806j39915l6587k93519J06091J27357
1414a17649K20451K19886j78227j29091j88855L43784L8172m11723Q5081R1239
$$ plain form
1404 -26932 22987 135696 320336 223256 336097 371146 76827 -169951 -95968 15599 -154421
1393 -154421 -88355 -298798 -150120 128173 214367 -144732 -30737 3365 41040 77326 138753
1382 138753 -45887 207041 96408 31971 -133744 -105988 -58422 -24496 20697 119670 207261
1371 207261 131895 183525 110812 138209 87546 -191565 -196624 -139155 -53295 33446 42794 -198955
1359 -198955 -36706 -160769 -284381 -335019 -296586 -9726 -36703 -140857 -15204 -119942
1349 -119942 -6700 36635 -235358 -324567 -305260 -234595 -174165 -358192 -397186 -247462 -226230
1338 -226230 30342 -155123 -195798 -86105 196544 -82283 -217619 -138779 -45981 -122225
1328 -122225 5793 -161983 -112438 -150051 -287473 -288079 -330310 -125715 -224826 -199311 -395615
$$ packed form
1404b6932M9919J12709J84640r7080J12841L5049k94319k46778P3983J11567j70020
1393a54421O6066k10443J48678K78293Q6194l59099J13995L4102L7675L6286O1427
1382A38753j84640K52928j10633o4437j65715K7756M7566L3926M5193R8973Q7591
1371B07261p5366N1630p2713K7397n0663k79111n059N7469Q5860Q6741R348k41749
1359a98955J62249j24063j23612n0638L8433K86860k6977j04154J25653j04738
1349a19942J13242M3335k71993q9209J9307P0665O0430j84027l8994J49724K1232
1338b26230K56572j85465m0675J09693K82649k78827j35336P8840R2798p6244
1328a22225J28018j67776M9545l7613j37422o06m2231K04595r9111K5515j96304
$$ plain form
1317 -395615 -175576 -148274 -294608 -364860 -413860 -94102 131416 165 -166219 20588
1307 20588 -374 -27698 93039 -73339 -116455 -433030 -342357 -48080 -207615 -35814 67667
1296 67667 25707 -178767 -139448 -14054 -218603 -222388 -260632 -73700 -78172 -248727 1249
1285 1249 -152684 125228 202182 -31515 -125280 -267442 -285761 -215034 -174459 -6594 -2592
1274 -2592 82437 142756 111932 168416 -224703 -113663 127951 -93266 -167777 -364660 -424356
1263 -424356 -176230 53117 38394 220896 153111 64823 17993 -22204 7374 -144389 -27652
1252 -27652 -38047 230557 353195 297771 185889 65895 36836 24095 -85161 143125 -24752
1241 -24752 36094 -11500 34400 147694 121722 106662 -88859 -177250 41643 230843 -24431
$$ packed form
1317c95615K20039K7302j46334p0252m9000L19758K25518j31251j66384J86807
1307B0588k0962k7324J20737j66378m3116l16575R0673K94277j59535J71801J03481
1296F7667m1960k04474L9319J25394k04549l785l8244J86932m472j70555K49976
1285A249j53933K77912P6954k33697r3765j42162j8319P0727M0575J67865M002
1274b592Q5029O0319l0824N6484l93119J11040K41614k21217p4511j96883n9696
1263d24356K48126K29347j4723J82502o7785q8288m6830m0197K9578j51763J16737
1252b7652j0395K68604J22638n5424j11882j19994k9059j2741j09256K28286j67877
1241b4752O0846m7594M5900J13294k5972j5060j95521q8391K18893J89200k55274
$$ plain form
1230 -24431 -127543 -21982 -146850 -264857 -16865 26958 45547 195406 90640 89696 285377
1219 285377 26906 174724 158442 66921 -265700 -266378 -134414 -310729 -494151 -85426 111166
1208 111166 273607 199363 146448 52018 144815 345365 102678 12813 247791 -159471 -166785
1197 -166785 -26013 -230042 -278478 -508830 -244848 -383806 -347196 -274576 -107362 -182138
1187 -182138 -240617 97358 121817 -101156 -25606 215221 224897 270125 168497 312775 252152
1176 252152 -132110 -212236 -231754 -133630 -102765 -103906 101079 22105 -30423 -86766 -243294
1165 -243294 -187616 -5227 13206 -82301 -83965 -7081 -101419 -160231 -168866 -54231 28562 -145007
1153 -145007 -358654 -187750 51478 -80914 7997 46476 -51449 170995 38572 -17401
$$ packed form
1230b4431j03112J05561j24868j18007K47992M3823J8589J49859j04766r44J95681
1219B85377k58471J47818j6282r1521l32621o78J31964j76315j83422M08725J96592
1208A11166J62441p4244n2915r4430R2797K00550k42687q9865K34978m07262p314
1197a66785J40772k04029m8436k30352K63982j38958L6610P2620J67214p4776
1187a82138n8479L37975K4459k22973P5550K40827R676M5228j01628J44278o0623
1176B52152l84262q0126j9518R8124L0865j141K04985p8974n2528n6343j56528
1165b43294N5678J82389J8433r5507j664P6884r4338n8812q635J14635Q2793j73569
1153a45007k13647J70904K39228j32392Q8911L8479r7925K22444j32423n5973
$$ plain form
1143 -17401 136064 -61696 41753 75735 253773 321035 387950 2883 26703 -136982 -39612
1132 -39612 -26546 -130170 19069 131119 -48505 116313 -34238 107006 97947 -263916
1122 -263916 -366195 -278228 -75503 -60673 26531 -222422 -484999 -316183 -244718 -102350
1112 -102350 -121130 -245876 -153433 52954 138002 116469 33696 142672 177602 10619 82987
1101 82987 171315 132997 55762 203686 50551 -6618 130489 -81956 -91584 -50446 -264098
1090 -264098 -45955 93717 232063 -62395 -116898 94261 153878 83413 -44911 -36856 -304634
1079 -304634 -322882 -150430 -191449 -115236 -380702 -199821 -311513 -48591 -234112 -164861
1069 -164861 -192890 -294357 -214691 -90643 65624 -93885 -177839 -212408 -317136 -43798
$$ packed form
1143a7401J53465j97760J03449L3982J78038O7262O6915l85067K3820j63685R7370
1132c9612J3066j03624J49239J12050j79624J64818j50551J41244r059l61863
1122b63916j02279Q7967K02725J4830Q7204k48953k62577J68816P1465J42368
1112a02350j8780j24746R2443K06387Q5048k1533q2773J08976L4930j66983P2368
1101H2987Q8328l8318p7235J47924j53135n7169J37107k12445r628M1138k13652
1090b64098K18143J39672J38346k94458n4503K11159N9617p0465j28324Q055k67778
1079c04634j8248J72452m1019P6213k65466J80881j11692K62922j85521O9251
1069a64861k8029j01467P9666J24048J56267j59509q3954l4569j04728K73338
$$ plain form
1059 -43798 224287 -141838 -39239 -39251 11103 152906 48699 188246 55803 -148394 123914
1048 123914 40361 31018 137340 -73584 -123631 -98796 -62372 -283858 -77846 -146554 -120679
1037 -120679 -32137 -421535 -437077 -177136 -121305 -70023 68418 -56477 75946 12910 -185265
1026 -185265 -261326 34015 -128362 -150894 -168021 -132183 -205703 -35418 -145817 -216358 59547
1015 59547 1589 -98324 -120925 -134334 -138819 203478 296573 106762 114668 412850 165721
1004 165721 -274774 -177499 -112238 -169593 50281 411602 251382 -3355 -113578 -147565
994 -147565 -78303 10571 -217266 -201162 -179230 -131722 -13092 33671 -128154 -58241 20877
983 20877 24539 -78567 -184632 140574 42495 -130016 -214076 -96936 -111246 -333887 -269504
$$ packed form
1059d3798K68085l66125J02599j2N0354J41803j04207J39547j32443k04197K72308
1048A23914q3553r343J06322k10924n0047K4835L6424k21486K06012o8708K5875
1037a20679Q8542l89398j5542K59941N5831N1282J38441j24895J32423o3036j98175
1026a85265p6061K95341j62377k2532j7127L5838p3520J70285j10399p0541K75905
1015E9547n7958r9913k2601j3409m485L42297R3095j89811P906K98182k47129
1004A65721m40495R7275O5261n7355K19874L61321j60220k54737j10223l3987
994a47565O9262Q8874k27837J6104K1932M7508J18630M6763j61825O9913P9118
983B0877L662j03106j06065L25206r8079j72511q4060J17140j4310k22641O4383
$$ plain form
972 -269504 -26220 104700 23299 -110868 -13525 -134739 -88930 -104644 -252556 -177739 204467
961 204467 230560 -28459 9642 340366 214477 160853 101462 6106 -77810 -109399 114201
950 114201 232487 56621 78165 229442 130197 44597 256792 349685 170439 237063 3917
939 3917 -163002 112874 321224 277812 338991 207421 103088 -15739 -234750 -288492 -28315
928 -28315 297520 195915 71039 -26367 -16414 -189095 41497 135407 -134039 -293311 -251845
917 -251845 -104005 -211598 -167059 -229889 -210385 -70257 -14913 -84354 -185839 -98358 165669
906 165669 155178 211304 449524 204832 276816 87858 22919 216372 115471 81760 17126
895 17126 111752 -160826 -12782 95309 70876 138184 38714 -76652 65160 176571 -136856
$$ packed form
972b69504K43284J30920q1401j34167R7343j21214M5809j5714j47912P4817L82206
961B04467K6093k59019L8101L30724j25889n3624n9391r5356q3916l1589K23600
950A14201J18286j75866K1544J51277r9245q5600K12195R2893j79246O6624k33146
939C917j66919K75876K08350m3412O1179j31570j04333j18827k19011n3742K60177
928b8315L25835j01605j24876r7406R953j72681K30592R3910k69446j59272M1466
917b51845J47840j07593M4539o2830J9504J40128N5344o9441j01485Q7481K64027
906A65669j0491N6126K38220k44692P1984j88958o4939J93453j00901l3711o4634
895A7126R4626k72578J48044J08091k4433O7308r9470j15366J41812J11411l13427
$$ plain form
884 -136856 -195183 -471813 -385569 -108672 87713 307453 -54536 -69256 -179175 -110800 -2586
873 -2586 138225 74171 75689 -6307 -3667 -38977 113462 211220 35387 182694 269787 394299
861 394299 269020 78254 273407 110059 35454 147719 134459 68794 262711 313295 301642
850 301642 291637 42518 286027 192068 85956 178391 214633 137163 241862 54875 -104754
839 -104754 116448 33522 -25447 -56583 68045 243720 88913 -175903 -245266 -223896 -91208
828 -91208 -298368 -423222 -421788 -170538 -34223 -25362 -101472 -14868 -191676 -27243 168307
817 168307 -387558 -170344 -304095 -80365 45771 28329 -12659 -172043 12017 218333
807 218333 164988 213078 73892 -58616 -216320 -166802 -235837 -296968 -127571 156383 303506
$$ packed form
884a36856n8327k76630Q6244K76897J96385K19740l61989j4720j09919O8375J08214
873b586J40811o4054J518q1996K640l5310J52439R7758j75833J47307Q7093J24512
861C94299j25279j90766J95153j63348p4605J12265j3260o5665J93917N0584j1653
850C01642j0005k49119K43509r3959j06112R2435L6242p7470J04699j86987j59629
839a04754K21202q2926n8969l1136J24628J75675j54807k64816o9363K1370J32688
828i1208k07160j24854J434K51250J36315Q861p6110Q6604j76808J64433J95550
817A68307n55865K17214j33751K23730J26136j7442m0988j59384J84060K06316
807B18333n3345M8090j39186j32508j57704M9518o9035o1131J69397K83954J47123
$$ plain form
796 303506 207757 1426 -239671 -77232 35195 39212 70822 291219 324262 113291 38769
785 38769 212009 160846 -104328 14944 104443 252927 313522 285420 414365 116305 -5780
774 -5780 -16681 178862 355869 144729 9626 -244905 115342 313090 125736 185330 33534
763 33534 -161615 86634 153136 56340 109836 221816 206390 22837 314 -340030 -415960
752 -415960 189586 336584 169145 50687 -18868 37694 221446 173018 -95652 -32542 -147615
741 -147615 39994 -195254 -271412 -109118 -154345 -21743 -105775 -87976 -72977 -200792 -178991
730 -178991 -38746 104797 178079 -10311 -61297 389213 368358 269561 240681 -67675 6237
719 6237 39853 -5140 -62295 -199243 -91001 -223620 -435936 -115055 -127626 227136 148152
$$ packed form
796C03506r5749k06331k41097J62439J12427M017L1610K20397L3043k10971p4522
785C8769J73240n1163k65174J19272Q9499J48484O0595k8102J28945k98060j22085
774e780j0901J95543J77007k11140j35103k54531L60247J97748j87354N9594j51796
763C3534j95149K48249O6502r6796N3496J11980j5426j83553k2523l40344p5930
752d15960O05546J46998j67439j18458o9555N6562J83752m8428k68670O3110j15073
741a47615J87609k35248p6158J62294m5227J32602q4032J7799J4999j27815K1801
730a78991J40245J43543P3282j88390n0986M50510k0855r8797k8880l08356P3912
719F237L3616m4993n7155j36948J08242j32619k12316L20881j2571L54762p8984
$$ plain form
708 148152 162132 336820 224257 184533 -134437 -15380 -36498 82357 299127 277232 293361
697 293361 322378 330536 244320 13183 60989 -36149 128395 66303 144336 91190 -92741
686 -92741 -169343 -311680 106947 -31533 -14443 -179098 -119379 88303 -4687 79144 -5767
675 -5767 -9851 -175756 -196601 -117906 -170783 94221 12117 -79120 38600 191060 81884
664 81884 263410 397494 439215 395202 113006 78620 107868 364505 82763 194372 448691
653 448691 227651 277258 408566 308996 255983 140045 197862 388238 304952 309423 295516
642 295516 449967 185342 -90628 281156 202679 111427 5753 -42610 -126018 -109118 -53244
631 -53244 45525 20658 -77463 -101715 -293181 -195183 -14265 -140999 -296741 -299655 -7838
$$ packed form
708A48152J3980J74688j12563l9724l18970J19057k1118J18855K16770k1895J6129
697B93361K9017Q158q6216k31137M7806r7138J64544o2092P8033n3146j83931
686i2741p6602j42337M18627j38480J7090j64655N9719K07682r2990Q3831q4911
675e767m084j65905k0845P8695n2877K65004q2104r1237J17720J52460j09176
664H1884J81526J34084M1721m4013k82196l4386K9248K56637k81742J11609K54319
653D48691k21040M9607J31308r9570n3013j15938N7817J90376q3286M471j3907
642B95516J54451k64625k75970L71784p8477r1252j05674m8363q3408J6900N5874
631e3244R8769k4867r8121k4252j91466R7998J80918j26734j55742k914K91817
$$ plain form
620 -7838 -54329 37122 -36308 -69501 -90082 66821 -155839 -241496 -189007 -108542 -176642 -275876
608 -275876 -306850 -124510 -12446 -132785 -120060 -108486 55450 -172656 -140917 120508 147054
597 147054 -100200 -17495 -22278 66994 -28260 -231391 -184315 122187 101749 -93880 136416
586 136416 -23321 -47879 210697 93346 150277 318013 287882 -222842 -112052 64790
576 64790 -58772 -44818 -109732 115504 -83586 -255647 -81737 -178330 -178994 -261232 -161697
565 -161697 -259030 -180355 27929 81838 -138203 33170 159080 179813 431033 445405 430527
554 430527 187404 -77580 390560 212377 65632 50525 11972 -91209 -121854 19939
544 19939 -103191 -86137 -212828 224359 40584 28946 153920 73612 28116 104816 336213
$$ packed form
620g838m6491R1451p3430l3193k0581J56903k22660q5657N2489Q0465o8100r9234
608b75876l0974J82340J12064j20339J2725J1574J63936k28106L1739K61425K6546
597A47054k47254Q2705m783Q9272r5254k03131M7076L06502k0438j95629K30296
586A36416j59737k4558K58576j17351N6931J67736l0131n10724J10790J76842
576F4790j23562J3954o4914K25236j99090j72061J73910r6593o64q2238R9535
565a61697r7333P8675K08284N3909k20041J71373J25910K0733K51220J4372j4878
554D30527k43123k64984M68140j78183j46745j5107l8553j03181l0645J41793
544A9939j23130J7054j26691M37187j83775j1638J24974q0308m5496P6700K31397
$$ plain form
533 336213 206173 64314 -31288 154094 -62171 -4122 -47632 36720 242768 81809 -39031
522 -39031 78383 111028 340848 597828 242354 343485 336850 251891 120272 -125342 -62747
511 -62747 45888 -161094 95202 257821 6324 176279 65894 -30016 -183984 -203259
501 -203259 -48777 83041 74605 166596 343998 247686 -2669 -232056 -91589 18665 59708
490 59708 239114 381928 285195 257837 434947 264988 1660 -175789 83030 182539 281609
479 281609 314709 -202101 -252889 -123943 -245828 -329200 -66121 11789 -184 -346141 -478489
468 -478489 -316621 -180535 4735 329288 302365 182240 -32731 44323 -150132 -76273
458 -76273 48309 39570 42424 65612 -96274 -155346 -109572 -124004 147800 415795 445915 377397
$$ packed form
533C36213j30040j41859r5602J85382k16265N8049m3510Q4352K06048j60959j20840
522c9031J17414L2645K29820K56980l55474J01131o635q4959j31619k45614O2595
511f2747J08635k06982K56296J62619k51497J69955j10385r5910j53968j9275
501b03259J54482J31818q436R1991J77402r6312k50355k29387J40467J10254M1043
490E9708J79406J42814r6733k7358J77110j69959k63328j77449K58819R9509R9070
479B81609L3100n16810n0788J28946j21885q3372K63079P7910j1973l45957j32348
468d78489J61868J36086J85270L24553k6923j20125k14971P7054j94455P3859
458g6273J24582q739K854K3188j61886n9072M5774j4432K71804K67995L0120o8518
$$ plain form
446 377397 329364 50110 51826 -68788 72264 160511 14769 198157 149852 271190 344312
435 344312 309632 228401 63044 -82564 -166599 -232688 -367711 -254748 -45416 258941 112729
424 112729 38363 -86869 -144211 -259435 -169883 109338 117089 105293 25423 65391 -250151
413 -250151 -183669 -77752 37569 -112549 -70536 101793 189148 240650 103417 123773 7331
402 7331 -184740 -72644 179993 127766 152499 2020 21834 -142244 -10760 -42839 161174
391 161174 489976 621137 253091 -68954 -3006 56407 128826 70432 8241 216203 424749
380 424749 324984 175435 230256 318206 271790 88387 71856 98440 -336516 -140572 -134030
369 -134030 102512 -57639 -144644 -4431 -153553 -53900 214661 236629 357365 333480 -109496
$$ packed form
446C77397m8033k79254J716j20614J41052Q8247j45742J83388m8305J21338P3122
435C44312l4680q1231j65357j45608q4035o6089j35023J12963K09332L04357j46212
424A12729p4366j25232n7342j15224Q9552K79221P751j1796p9870L9968l15542
413b50151O6482J05917J15321j50118M2013J72329Q7355N1502j37233K0356j16442
402G331j92071J12096K52637n2227K4733j50479J9814j64078J31484l2079K04013
391A61174L28802J31161l68046l22045O5948N9413P2419n8394o2191K07962K08546
380D24749r9765j49549N4821Q7950m6416j83403j6531K6584m34956J95944O542
369a34030K36542j60151q7005J40213j49122R9653K68561K1968J20736k3885m42976
$$ plain form
358 -109496 147888 165741 125088 275651 328254 426319 346223 143977 147294 376721 206044
347 206044 156700 205978 -137452 -283921 -109324 -109554 11157 -41418 -183334 -108043 -157704
336 -157704 252190 274546 315913 208066 134716 61264 6888 -161314 -115036 9863 -244104
325 -244104 -274186 -47415 37980 206959 367979 323015 191831 211313 -59312 15979 -112026
314 -112026 133993 391734 19122 -116467 81734 176621 -101630 -118245 -129386 92601
304 92601 -5300 -29080 88070 -57279 -93813 174183 135746 89492 239763 41738 -207707
293 -207707 -419557 -77285 313521 291483 289653 101423 157351 81980 246673 287907 297527
282 297527 366602 30076 76942 186606 345055 165882 -22712 -255200 -368229 -41490
$$ packed form
358a09496K57384J7853m0653J50563N2603R8065q0096k02246L317K29427j70677
347B06044m9344M9278l43430j46469J74597k30J20711n2575j41916P5291m9661
336a57704M09894K2356M1367j07847p3350p3452n4376j68202M6278J24899k53967
325b44104l0082K26771Q5395J68979J61020m4964j31184J9482k70625P5291j28005
314a12026K46019K57741l72612j35589J98201R4887k78251j6615j1141K21987
304I2601r7901k3780J17150j45349l6534K67996l8437m6254J50271j98025k49445
293b07707k11850L42272L90806k2038j830j88230N5928p5371J64693M1234R620
282B97527O9075l36526M6866J09664J58449j79173j88594k32488j13029L26739
$$ plain form
272 -41490 207520 160888 -32465 -124248 -117413 -177683 64260 266598 -292265 41886 280272
261 280272 236510 -24873 355584 530324 516270 550096 235232 162624 -34969 -39126 78310
250 78310 -106692 -41669 186755 148124 368172 243050 123471 136420 125119 -103914 4719
239 4719 42927 2355 17810 229187 305586 143411 175355 28337 191941 212842 175766
228 175766 -9122 -31054 6518 -99612 16207 174919 201057 173273 73677 251659 612835
217 612835 337160 -65407 -117156 -109534 -2218 -58461 -33347 -48575 -25222 295224 293416
206 293416 32121 243447 444810 240118 258867 449143 327898 134343 -133608 -207484
196 -207484 -1289 185237 54143 -157674 -9477 107198 39331 7168 -148919 -302684
$$ packed form
272d1490K49010m6632j93353r1783O835o0270K41943K02338n58863L34151K38386
261B80272m3762k61383L80457J74740j4054L3826l14864p2608j97593m157J17436
250G8310j85002O5023K28424l8631K20048j25122j19579J2949j1301k29033J08633
239D719L8208m0572J5455K11377P6399j62175L1944j47018J63604K0901l7076
228A75766j84888k1932L7572j06130J15819J58712K6138k7784r9596J77982L61176
217F12835k75675m02567n1749P622J07316n6243K5114j5228K3353L20446j808
206B93416k61295K11326K01363k04692J8749J90276j21245j93555k67951p3876
196b07484K06195J86526j31094k11817J48197J16675o7867l2163j56087j53765
$$ plain form
186 -302684 70935 191976 107525 141067 41323 -206389 -291957 -13004 84164 -31803 -118177
175 -118177 -48211 -88433 97344 99241 -28279 -23951 4774 57495 63289 31625 44130 121075
163 121075 -12898 303901 139832 31550 7774 252546 439714 247237 199193 178547
153 178547 326411 236965 159247 341464 337641 130721 -213473 -220952 38330 199345 157065
142 157065 124130 9713 119195 246200 21957 -5591 54062 -145329 -417083 -134469
132 -134469 22450 26180 70536 39039 60988 108733 26 -71676 91855 40968 138493
121 138493 202859 2884 -45340 30895 63749 3733 77992 198029 -5851 -73474 -194326
110 -194326 20674 51545 78386 165031 29376 391 -28554 -56036 16573 96280 24454
$$ packed form
186c02684L73619J21041q4451L3542r9744k47712q5568K78953R7168j15967q6374
175a18177O9966m0222J85777J897j27520M328K8725N2721N794l1664J2505P6945
163A21075j33973L16799j64069j08282k3776K44772J87168j92477m8044k0646
153A78547J47864q9446p7718J82217l823k06920l44194p479K59282J61015m2280
142A57065l2935j14417J09482J27005k24243k7548N9653j99391k71754K82614
132a34469J56919L730M4356l1497K1949M7745j08707p1702J63531n0887R7525
121A38493O4366j99975m8224P6235L2854o0016P4259J20037k03880o7623j20852
110a94326K15000L0871K6841Q6645j35655k8985k8945k7482P2609P9707p1826
$$ plain form
99 24454 -33656 124573 122293 -21276 -30665 70097 70331 90990 322198 255141 234811 85629
87 85629 51424 130546 178865 -39630 6925 77713 65068 63493 94338 166486 160968 329129
75 329129 398944 273305 136620 123509 74578 208590 325446 151988 147123 40712 56555
64 56555 156062 45443 -141281 -64836 28206 55413 51136 47683 46510 95665 109155 -7774
52 -7774 74091 233727 48187 -15269 -6240 -130058 -37438 -63209 -17517 -107417 -126828 134048
40 134048 251181 210078 96597 73538 52586 122606 122728 -2302 18912 -68417 30081 41576
28 41576 -12653 107186 115194 176880 171611 207308 152620 190546 10363 34696 47205 -30132
16 -30132 110384 -48815 -5611 113203 199933 233862 189537 209030 179753 89422 -124701
$$ packed form
99B4454n8110J58229k280j43569r389J00762K34K0659K31208o7057k0330j49182
87H5629l4205P9122M8319k18495M6555P0788j2645j575L0845P2148n518J68161
75C29129O9815j25639j36685j3111m8931J34012J16856j73458m865j06411J5843
64E6555R9507j10619j86724P6445R3042K7207m277l453j173M9155J3490j16929
52g774Q1865J59636j85540o3456R029j23818R2620k5771M5692q9900j9411K60876
40A34048J17133m1103j13481k3059k0952P0020J22j25030K1214q7329R8498J1495
28D1576n4229J19839Q008O1686n269L5697n4688L7926j80183K4333J2509p7337
16c0132J40516j59199M3204J18814Q6730L3929m4325J9493k9277r0331k14123
$$ plain form
5 -124701 -118395 119484 -15719 -49953 -61227
0 -61227
$$ packed form
5a24701O306K37879j35203l4234j1274
0f1227
$$ Imaginary data points
$$ [...]
##END NTUPLES=NMR SPECTRUM
##END=
