##TITLE=1H_TG-2362-2
 CDCl3
 8 sc, 
 19.10.2022
##JCAMPDX= 6.0         $$ Bruker NMR JCAMP-DX V2.0
##DATA TYPE= NMR SPECTRUM
##DATA CLASS= NTUPLES
##ORIGIN= UXNMR, Bruker Analytische Messtechnik GmbH
##OWNER= root
$$ XWIN-NMR		Version 3.5
$$ Wed Oct 19 13:56:25 2022 Russian Standard Time (UT+4h)  she@DPX200
##.OBSERVE FREQUENCY= 200.1313499994
##.OBSERVE NUCLEUS= ^1H
##.ACQUISITION MODE= SIMULTANEOUS
##.ACQUISITION SCHEME= undefined
##.AVERAGES= 8
##.DIGITISER RES= 18
##SPECTROMETER/DATA SYSTEM= spect
##.PULSE SEQUENCE= zg30
##.SOLVENT NAME= CDCl3
##.SHIFT REFERENCE= (INTERNAL, CDCl3, 0, 15.7943)
##AUDIT TRAIL= $$ (NUMBER, WHEN, WHO, WHERE, WHAT)
$$ ##TITLE= Audit trail, XWIN-NMR		Version 3.5
$$ ##JCAMPDX= 5.01
$$ ##ORIGIN= Bruker BioSpin GmbH
$$ ##OWNER= she
$$ F:/spectra/data/she/nmr/H-F/1/pdata/1/auditp.txt
$$ ##AUDIT TRAIL=  $$ (NUMBER, WHEN, WHO, WHERE, WHAT)
(   1,<2022-10-19 13:54:35.31 +0400>,<she>,<DPX200>,
      <created by zg, POWCHK disabled, PULCHK disabled
       configuration hash MD5:
       00 E9 B6 7A A2 85 ED C7 34 08 36 98 17 FE 4E 26
       data hash MD5: 16K
       35 4A 90 D0 1A 41 6E D5 98 31 67 86 5A 97 8D F9>)
(   2,<2022-10-19 13:54:37.51 +0400>,<she>,<DPX200>,
      <Start of raw data processing
       efp BC_mod = 2 LB = 0.24 FT_mod = 6 PKNL = 1 PHC0 = -18032.68 PHC1 = 6.800703 SI = 16K 
       data hash MD5: 16K
       55 F9 AB D9 1C D0 0C 8D 45 D7 37 C0 EB AF 2B 54>)
(   3,<2022-10-19 13:54:58.84 +0400>,<she>,<DPX200>,
      <pk PHC0 = -0.4422123 PHC1 = 1.2 
       data hash MD5: 16K
       06 3A DF 36 A1 A9 2E C0 B9 61 4C D8 5E 94 13 1A>)
(   4,<2022-10-19 13:55:01.75 +0400>,<she>,<DPX200>,
      <abs ABSG = 5 
       data hash MD5: 16K
       93 5D 21 BE 6F A8 60 15 2B 97 FE CC 44 96 7C 1C>)
$$ ##END=
$$ 
$$ hash MD5
$$ 0E DF 70 04 93 43 DE CB 58 02 31 88 67 AB FB 7A
##$RELAX= 
##$RELAX= 
##$RELAX= 
##$RELAX= 
##$RELAX= 
##$RELAX= 
$$ Bruker specific parameters
$$ --------------------------
##$DU= <F:/spectra>
##$EXPNO= 1
##$NAME= <H-F>
##$PROCNO= 1
##$TYPE= <nmr>
##$USER= <she>
##$AMP= (0..31)
100 100 100 100 100 100 100 100 100 100 100 100 100 100 100 100 100 100 
100 100 100 100 100 100 100 100 100 100 100 100 100 100 
##$AQSEQ= 0
##$AQ_mod= 1
##$AUNM= <au_zg>
##$AUTOPOS= <>
##$BF1= 200.13
##$BF2= 200.13
##$BF3= 200.13
##$BF4= 200.13
##$BF5= 200.13
##$BF6= 200.13
##$BF7= 200.13
##$BF8= 200.13
##$BYTORDA= 1
##$CFDGTYP= 0
##$CFRGTYP= 5
##$CHEMSTR= <none>
##$CNST= (0..31)
1 1 145 1 1 1 1 1 1 1 1 1 1 1 1 1 1 1 1 1 1 1 1 1 1 1 1 1 1 1 1 1 
##$CPDPRG= <>
##$CPDPRG1= <>
##$CPDPRG2= <>
##$CPDPRG3= <>
##$CPDPRG4= <mlev>
##$CPDPRG5= <mlev>
##$CPDPRG6= <mlev>
##$CPDPRG7= <mlev>
##$CPDPRG8= <mlev>
##$CPDPRGB= <>
##$CPDPRGT= <>
##$D= (0..31)
0 1.2 0 0 0 0 0 0 0 0.06 0 0.03 0 0 0 0 0.0002 0 0 0 0 0 0 0 0 0 0 0 0 
0 0 0 
##$DATE= 1666173274
##$DBL= (0..7)
120 120 120 120 120 120 120 120 
##$DBP= (0..7)
150 150 150 150 150 150 150 150 
##$DBP07= 0
##$DBPNAM0= <>
##$DBPNAM1= <>
##$DBPNAM2= <>
##$DBPNAM3= <>
##$DBPNAM4= <>
$$ [...]
##$SUBNAM3= <"">
##$SUBNAM4= <"">
##$SUBNAM5= <"">
##$SUBNAM6= <"">
##$SUBNAM7= <"">
##$SUBNAM8= <"">
##$SUBNAM9= <"">
##$SW= 18.0517283424941
##$SWIBOX= (0..15)
0 0 2 0 0 0 0 0 0 0 0 0 0 0 0 0 
##$SW_h= 3612.71676300578
##$TD= 16384
##$TD0= 1
##$TE= 0
##$TE2= 300
##$TE3= 300
##$TEG= 300
##$TL= (0..7)
0 120 120 120 120 120 120 120 
##$TP= (0..7)
150 150 150 150 150 150 150 150 
##$TP07= 0
##$TPNAME0= <>
##$TPNAME1= <>
##$TPNAME2= <>
##$TPNAME3= <>
##$TPNAME4= <>
##$TPNAME5= <>
##$TPNAME6= <>
##$TPNAME7= <>
##$TPOAL= (0..7)
0.5 0.5 0.5 0.5 0.5 0.5 0.5 0.5 
##$TPOFFS= (0..7)
0 0 0 0 0 0 0 0 
##$TUNHIN= 0
##$TUNHOUT= 0
##$TUNXOUT= 0
##$USERA1= <user>
##$USERA2= <user>
##$USERA3= <user>
##$USERA4= <user>
##$USERA5= <user>
##$V9= 5
##$VALIST= <valist>
##$VCLIST= <CCCCCCCCCCCCCCC>
##$VD= 0
##$VDLIST= <DDDDDDDDDDDDDDD>
##$VPLIST= <PPPPPPPPPPPPPPP>
##$VTLIST= <TTTTTTTTTTTTTTT>
##$WBST= 1024
##$WBSW= 4
##$XGAIN= (0..3)
0 0 0 0 
##$XL= 0
##$YL= 0
##$YMAX_a= 296675
##$YMIN_a= -604720
##$ZGOPTNS= <>
##$ZL1= 120
##$ZL2= 120
##$ZL3= 120
##$ZL4= 120
##$ABSF1= 15.73698
##$ABSF2= -2.314869
##$ABSG= 5
##$ABSL= 3
##$ALPHA= 0
##$AQORDER= 0
##$ASSFAC= 0
##$ASSFACI= 0
##$ASSFACX= 0
##$ASSWID= 0
##$AUNMP= <proc_1d>
##$AZFE= 0.1
##$AZFW= 0.1
##$BCFW= 0
##$BC_mod= 2
##$BYTORDP= 0
##$COROFFS= 0
##$CY= -3
##$DATMOD= 1
##$DC= 0
##$DFILT= <>
##$DTYPP= 0
##$F1P= 0
##$F2P= 0
##$FCOR= 1
##$FTSIZE= 16384
##$FT_mod= 6
##$GAMMA= 0
##$GB= 0
##$INTBC= 1
##$INTSCL= 3.70164e-10
##$ISEN= 128
##$LB= 0.24
##$LEV0= 0
##$LPBIN= 0
##$MAXI= 10000
##$MC2= 0
##$MEAN= 0
##$ME_mod= 0
##$MI= 1.114404
##$NCOEF= 0
##$NC_proc= -6
##$NLEV= 6
##$NOISF1= 3.799351
##$NOISF2= 2.8
##$NSP= 0
##$NTH_PI= 0
##$NZP= 0
##$OFFSET= 15.79427
##$PC= 1
##$PHC0= -18033.12
##$PHC1= 8.000703
##$PH_mod= 1
##$PKNL= yes
##$PPARMOD= 0
##$PSCAL= 0
##$PSIGN= 0
##$REVERSE= no
##$SF= 200.129995452122
##$SI= 16384
##$SIGF1= 3
##$SIGF2= 2
##$SINO= 5.538805
##$SIOLD= 16384
##$SREGLST= <1H.CDCl3>
##$SSB= 0
##$STSI= 16384
##$STSR= 0
##$SW_p= 3612.71676300578
##$SYMM= 0
##$S_DEV= 0
##$TDeff= 16384
##$TDoff= 0
##$TI= <>
##$TILT= no
##$TM1= 0
##$TM2= 0
##$TOPLEV= 0
##$USERP1= <user>
##$USERP2= <user>
##$USERP3= <user>
##$USERP4= <user>
##$USERP5= <user>
##$WDW= 1
##$XDIM= 16384
##$YMAX_p= 354297384
##$YMIN_p= -477201
$$ End of Bruker specific parameters
$$ ---------------------------------
##NTUPLES= NMR SPECTRUM
##VAR_NAME=  FREQUENCY,     SPECTRUM/REAL,   SPECTRUM/IMAG
##SYMBOL=    X,             R,               I
##VAR_TYPE=  INDEPENDENT,   DEPENDENT,       DEPENDENT
##VAR_FORM=  AFFN,          ASDF,            ASDF
##VAR_DIM=   16384,         16384,           16384
##UNITS=     HZ,            ARBITRARY UNITS, ARBITRARY UNITS
##FACTOR=    0.220516191357247, 1,           1
##FIRST=     3160.90709556613, 0,            0
##LAST=      -451.809667439646, 0,           0
##MIN=       -451.809667439646, -477201,     0
##MAX=       3160.90709556613, 354297384,    0
$$ Real data points
##PAGE= N=1
##DATA TABLE= (X++(R..R)), XYDATA
$$ [...]
6132H202443k16344p9123l9628l370m4646N674r5565r6037L3771o5135l9642k4234
6120G538164j02081j71729K2589Q1083j78003J6871j6712M7394M7209J01547j5909
6109G370423k945J53153J47721J7532J01228J35488K26042K7889J06264K52986
6099H535781P9085o8m0637j53045j97495j04645j52314j33828j87873l2547k3827
6088G588587o4877j31860K388M0895n4764n5595J9666p5184k31314j56815k93378
6077F587749l44984k26474k35855j55149j96654j19948k47503L3224j27501j22560
6067D844345l969l9844j3972o8519k8643K8411K4934p895K6354M2472K15254J00234
6055E119162J80398J23535Q8652J34608J93687R4432J49629O0045Q7286J17024
$$ y = [8202443, 7986099, 7906976, 7867348, 7863978, 7819332, 7825006, 7729441, 7633404, 7667175, 7602040, 7562398, 7538164, 7436083, 7264354, 7286943, 7368026, 7190023, 7206894, 7190182, 7237576, 7284785, 7386332, 7370423, 7367478, 7520631, 7668352, 7685884, 7787112, 7922600, 8148642, 8176531, 8282795, 8535781, 8614866, 8614798, 8574161, 8421116, 8223621, 8118976, 7966662, 7832834, 7644961, 7612414, 7588587, 7523710, 7391850, 7394238, 7435133, 7380369, 7324774, 7344440, 7269256, 7037942, 6881127, 6587749, 6242765, 6016291, 5780436, 5625287, 5428633, 5308685, 5061182, 5094406, 4966905, 4844345, 4840376, 4800532, 4786560, 4718041, 4689398, 4717809, 4742743, 4734848, 4761202, 4803674, 5018928, 5119162, 5299560, 5423095, 5511747, 5646355, 5840042, 5934474, 6084103, 6144148, 6231434, 6348458]
6045F348458N8162J41166k6185J7159Q3340N5261L1899O5392J26549J54835P3012
6034G129048Q2587J35517M8828Q1271J55615J83118J4384P3701J51383J62527
6024H217979J67282L11329K07170J38563K69639L88703M85241M23990O12016O32155
6014A1854067O80443R25857R79510J266115J279617O19693J60723P123L2234k20444
6004A7584938p89807j246977j263759q18389o04803l98680j15893m2503P5083
5995A2379210J57190K47544M12382M54146N93315N40949M61975N28579O19766
5986A6395056P01773R64396J331477J676003J912912K274325K875033L624402
5978C1755377L542595J950057L98738j54301M17958o10783k371170l793237m244911
$$ y = [6348458, 6406620, 6547786, 6521601, 6538760, 6622100, 6677361, 6709260, 6774652, 6901201, 7056036, 7129048, 7211635, 7347152, 7395980, 7477251, 7632866, 7815984, 7830368, 7904069, 8055452, 8217979, 8385261, 8696590, 8903760, 9042323, 9311962, 9700665, 10185906, 10609896, 11221912, 11854067, 12534510, 13460367, 14439877, 15705992, 16985609, 17605302, 17766025, 17773148, 17805382, 17584938, 16795131, 15548154, 14284395, 13466006, 12861203, 12462523, 12346630, 12304127, 12379210, 12536400, 12783944, 13196326, 13650472, 14243787, 14784736, 15246711, 15775290, 16395056, 17096829, 18061225, 19392702, 21068705, 22981617, 25255942, 28130975, 31755377, 35297972, 37248029, 37646767, 37492466, 37910424, 37299641, 34928471, 31135234, 26890323]
5969B6890323l572818k519263j719328j248468q32862m66133l00918k19189j25388
5960A5885956l2042M26448L19548L42147L21544N43419M75492P05522J191985
5951B0180019J492267J656973J955133K586045L421835L605517K274016N34505
5943C7706310l94888K12962l42065k414090l844416m549175l997306l078226k222470
5934A7076636j526450j099671r23393p13593m58544m51902l28087r3897j65921
5925A1315178j47191l4794q4116k2778J3288L09830L51562N21232M99515O85437
5915A3407163J005866J221537P97885J34153j53039n100j17502o23656j046828
5906A4620479j624972j527627j090259q12237o13331l64576l08189k83586j31583
$$ y = [26890323, 23317505, 20798242, 19078914, 17830446, 16997584, 16531451, 16230533, 16011344, 15885956, 15853914, 16280362, 16599910, 16942057, 17263601, 17807020, 18282512, 18988034, 20180019, 21672286, 23329259, 25284392, 27870437, 31292272, 34897789, 37171805, 37706310, 37311422, 37524384, 37182319, 34768229, 30923813, 26374638, 22377332, 19299106, 17076636, 15550186, 14450515, 13527122, 12813529, 12354985, 11903083, 11574996, 11481099, 11315178, 11167987, 11133193, 11049077, 11026299, 11039587, 11349417, 11700979, 12222211, 12721726, 13407163, 14413029, 15634566, 16432451, 16566604, 16413565, 16408465, 16290963, 15667307, 14620479, 12995507, 11467880, 10377621, 9565384, 8952053, 8587477, 8279288, 7995702, 7864119]
5897G864119j73630j77170j25823k8950l7601p5795L4149R300J26484m9399J07583
5886G473267J33244M5084P1311J24868R3714J29387J00119O8414n9627j03184
5876H076597j08047n0260j94361j50339O0380j33485k2964J05133l9398r5651
5866G447605J5212N0672J4706R3252K14102J65763L8803n299p467q4523m1044
5855G901782m8750n4129m6390L0863J06193k9363P3919R8244J79546J47342M2209
5844H401466K99042L10275K41550K41995L63099L00037M36157K98709K97953J31535
5834A1321818R0174O7933L0990q9807k82735k40302k89602j18703l1862o3137
5824A0394767k4703L1805O1525J58607J62685J66370J62182J82403J62455J13454
$$ y = [7864119, 7690489, 7513319, 7387496, 7358546, 7320945, 7245150, 7279299, 7288599, 7415083, 7365684, 7473267, 7606511, 7651595, 7722906, 7847774, 7941488, 8070875, 8170994, 8239408, 8179781, 8076597, 7968550, 7918290, 7723929, 7573590, 7633970, 7500485, 7477521, 7582654, 7543256, 7447605, 7462817, 7513489, 7528195, 7621447, 7835549, 8001312, 8040115, 8034816, 8027349, 7942826, 7901782, 7853032, 7798903, 7752513, 7783376, 7889569, 7860206, 7934125, 8032369, 8211915, 8359257, 8401466, 8700508, 9010783, 9252333, 9494328, 9857427, 10157464, 10593621, 10892330, 11190283, 11321818, 11411992, 11479925, 11510915, 11421108, 11138373, 10898071, 10608469, 10489766, 10457904, 10394767, 10370064, 10401869, 10463394, 10622001, 10784686, 10951056, 11113238, 11295641, 11458096, 11571550]
5814A1571550J17797K9409m3822p9703j23094j06833k6588n8315o922J21767J04347
5803A1499593o8034o4309j90021k93946l76848k16162k98879l58494l32130l85484
5793H915286k38370q9401j47954j87270J4473o3123j5720N9102N2291Q3552J41047
5782H523913K44396P1901K4212l472o27r8330l24379k43374l90093l14198k97182
5771G192767l92295l27289k04506q8616j79013k38630q6863J056p9204r824k0678
5760E566905j07053L4126k47p7942j48457j55170k14294k24452j08461q9290j71475
5749D304190j55198j61717r8262q9862k9866L6857J1997k2857j12726M4026P4525
5738C801107m0054M5931L6945K9858r9963k9951K7094j82345j29308k7345j12989
$$ y = [11571550, 11689347, 11718756, 11674934, 11595231, 11472137, 11365304, 11338716, 11280401, 11273479, 11395246, 11499593, 11431559, 11367250, 11177229, 10883283, 10506435, 10290273, 9991394, 9632900, 9300770, 8915286, 8676916, 8587515, 8439561, 8252291, 8266764, 8203641, 8187921, 8247023, 8299314, 8382866, 8523913, 8768309, 8840210, 8864422, 8860950, 8860323, 8761993, 8437614, 8194240, 7804147, 7489949, 7192767, 6800472, 6473183, 6268677, 6180061, 6001048, 5762418, 5675555, 5676611, 5597407, 5587583, 5566905, 5459852, 5493978, 5493731, 5415789, 5267332, 5112162, 4897868, 4673416, 4564955, 4475665, 4304190, 4148992, 3987275, 3889013, 3799151, 3769285, 3806142, 3818139, 3795282, 3682556, 3726582, 3801107, 3761053, 3806984, 3843929, 3873787, 3773824, 3743873, 3770967, 3588622, 3459314, 3431969, 3318980]
5727C318980j88725k51525p7714p1221j33536n7929j38692j16318j18954o4714
5717B099652K8628L3398p28j72261r8080n0345q2408l276N4613l1429k9034k8988
5705A719742O4796q0233o2232J5129P1111l2935j9494Q4494j26909J2955L1655
5694A678079j69210p2224P0947N9522m1861M1980Q8276o1110j6732n7022j5812
5683A504833N2034j24523L7602l1111l5965N4373m2841j362r8709k2423L4181
5672A326089J41163k5416N2454J1538n6259J7242l6411J8542l8145j08260K5965
5661A328502j7419Q3507M4007r8437o3101O1189K2349P3538k287J9689p1701L3617
5649A413453Q7326P939J7447k8006j1066J4175m239l4182K2765J58341K2649j5968
$$ y = [3318980, 3130255, 2878730, 2801016, 2729795, 2596259, 2538330, 2399638, 2283320, 2164366, 2099652, 2128280, 2161678, 2160950, 1988689, 1890609, 1840264, 1757856, 1754580, 1809193, 1777764, 1748730, 1719742, 1784538, 1704305, 1642073, 1657202, 1728313, 1695378, 1675884, 1760378, 1633469, 1646424, 1678079, 1508869, 1436645, 1507592, 1567114, 1525253, 1567233, 1655509, 1594399, 1577667, 1520645, 1504833, 1556867, 1432344, 1469946, 1438835, 1402870, 1457243, 1414402, 1413040, 1314331, 1291908, 1326089, 1467252, 1441836, 1494290, 1505828, 1449569, 1466811, 1430400, 1448942, 1410797, 1302537, 1328502, 1311083, 1394590, 1438597, 1340160, 1277059, 1338248, 1360597, 1434135, 1431848, 1451537, 1379836, 1413453, 1500779, 1508718, 1526165, 1498159, 1487093, 1501268, 1497029, 1462847, 1485612, 1643953, 1666602, 1650634]
5637A650634J7536j06259L9078M6951n2100r049J40115k5311K2563j31027n6377
5626A536754J7786l898n1054m9355N4539j06150m0404O8886N7055n7821m8721
5615A377617j6456L1554N6168M7864j24400J45623M156m0166L8406r0248M612
5604A434730J49727K1933m9477N8041n6732q127o2851N3163k6556j32133L4101
5593A415819K5238n0314l2395p6248Q4452M5354O8905k8614k4017Q4073J0279
5582A522532r2032r5890j2063L0973J07343P8474N165O5931J6525N2689K2058
5571A701705o7207P230N7198j00365p7379l2152M9057O4662q741M6195N5499Q1632
5559A777334l1921m5737J7783L2068K717j771p8107R923M853L8173O6242K1263
$$ y = [1650634, 1668170, 1561911, 1600989, 1647940, 1595840, 1586791, 1726906, 1701595, 1724158, 1593131, 1536754, 1554540, 1550642, 1499588, 1450233, 1504772, 1398622, 1358218, 1427104, 1484159, 1426338, 1377617, 1361161, 1392715, 1448883, 1496747, 1372347, 1517970, 1522126, 1481960, 1520366, 1430118, 1434730, 1584457, 1606390, 1556913, 1614954, 1558222, 1550095, 1487244, 1540407, 1513851, 1381718, 1415819, 1441057, 1390743, 1358348, 1282100, 1366552, 1411906, 1480811, 1452197, 1428180, 1512253, 1522532, 1430500, 1334610, 1322547, 1353520, 1460863, 1539337, 1544502, 1610433, 1626958, 1679647, 1701705, 1634498, 1641728, 1698926, 1598561, 1521182, 1489030, 1538087, 1602749, 1594008, 1640203, 1695702, 1777334, 1745413, 1699676, 1717459, 1749527, 1752244, 1750473, 1672366, 1682289, 1687142, 1725315, 1791557, 1812820]
5547A812820K4722K2313J9313J22430J3243j7682K4100R9459J17350r7130P3372
5536B214310L1223P708J67318J92617R5265Q7860M4659Q8800J78395L966q188
5525C103933l9334j24423M7606q8458M7414N1048J0280Q613Q3591P3493L962O1029
5513C238754J56522M3943K7974J04120J3623K39332K28781K00141J78813J17950
5503D549953L8452J65502L8819J19520M5612J52915O3013K4620K44454J50160
5493E593020J25430L8209K03953J76869K70320K23287L23499L30937K11244M05623
5483G902391K66576L20153L08724K78637K21553J04780N4386K12352J73856R7587
5473I940995J46977n4531j71729j63278n1965j04702l8053o6763R4360J82663
$$ y = [1812820, 1837542, 1859855, 1879168, 2001598, 2014841, 1997159, 2021259, 2120718, 2238068, 2140938, 2214310, 2245533, 2253241, 2420559, 2613176, 2708441, 2796301, 2840960, 2929760, 3108155, 3112121, 3103933, 3064599, 2940176, 2987782, 2899324, 2946738, 2997786, 3008066, 3016679, 3100270, 3173763, 3177725, 3238754, 3395276, 3439219, 3467193, 3571313, 3584936, 3824268, 4053049, 4253190, 4432003, 4549953, 4588405, 4753907, 4792726, 4912246, 4957858, 5110773, 5173786, 5198406, 5442860, 5593020, 5718450, 5756659, 5960612, 6137481, 6407801, 6631088, 6954587, 7285524, 7496768, 7902391, 8168967, 8489120, 8797844, 9076481, 9298034, 9402814, 9457200, 9669552, 9843408, 9940995, 10087972, 10033441, 9861712, 9698434, 9646469, 9541767, 9503714, 9436951, 9531311, 9713974]
5463I713974J53371K44604M35607L73953L51778M55588N56438O24739M63502K75660
5453A3649214J79792J60323p4024l6802P2202M291j55413l75506o29030p99434
5443A1995613p29671o57639o24435l72993k40455k51158k75433r6769O8861l8918
5433H777003K7623J05177J65372K26941R5094J47797P1288q0038N3505K7587j01159
5422I516190q3015p6106k61296l24385k93181m69418n43999n60137l70906l49316
5412F184431l56568k50302j86387j76245j35384j09287j43123n6781j42815k2231
5402D605308k4790j04258l4589o4320N2954k9387K0461Q9344j4082J35234J79988
5391D811863P1133n8368J3347L8023j18601j04773j36985k11736k05483k19602
$$ y = [9713974, 9867345, 10111949, 10547556, 10921509, 11273287, 11728875, 12285313, 12910052, 13373554, 13649214, 13829006, 13989329, 13915305, 13878503, 13950705, 13954996, 13799583, 13424077, 12795047, 11995613, 11265942, 10608303, 9983868, 9610875, 9370420, 9119262, 8843829, 8747060, 8815921, 8777003, 8804626, 8909803, 9075175, 9302116, 9397210, 9545007, 9616295, 9536257, 9589762, 9617349, 9516190, 9433175, 9357069, 9095773, 8771388, 8478207, 8008789, 7464790, 6904653, 6533747, 6184431, 5827863, 5577561, 5391174, 5214929, 5079545, 4970258, 4827135, 4770354, 4627539, 4605308, 4580518, 4476260, 4441671, 4377351, 4430305, 4400918, 4421379, 4510723, 4496641, 4631875, 4811863, 4882996, 4824628, 4837975, 4875998, 4757397, 4652624, 4515639, 4303903, 4098420, 3878818]
5381C878818k25404r5726r0680p9151r5231l6902j1928j8020j8353J6583J22975
5370C346981n2613l6159k4790P7113J2542j6397M8132K0581J15050r307O2966
5359C544099L5798o6117q2732m1499o2852o4139m7721j37059o1283o9432N4559
5348C001622O4539q3814Q981J27173J7222o0186o0879j3975m3922M0769J07589
5337C105119p5716j8339O5413L936N3226R8833K5834M219m2874R6429N9501Q9318
5325C464899J0717N5613J19948J66055L9274m9813J68794J56334P9521J41315
5315D352657J65672J21427J33738p72J96374Q4141J21265J73016J61539J65943
5305E675000P2768J50875K46723K98790M05319M07946N33489P22362N87756L77339
$$ y = [3878818, 3653414, 3557688, 3467008, 3387857, 3292626, 3255724, 3243796, 3225776, 3207423, 3224006, 3346981, 3294368, 3258209, 3233419, 3310532, 3323074, 3306677, 3354809, 3375390, 3490440, 3481133, 3544099, 3579897, 3513780, 3431048, 3389549, 3326697, 3262558, 3214837, 3077778, 3016495, 2947063, 3001622, 3066161, 2982347, 2991328, 3118501, 3135723, 3075537, 3014658, 3000683, 2956761, 2997530, 3105119, 3029403, 3011064, 3076477, 3080413, 3133639, 3232472, 3258306, 3262525, 3219651, 3316080, 3375581, 3464899, 3475616, 3531229, 3651177, 3817232, 3856506, 3806693, 3975487, 4131821, 4211342, 4352657, 4518329, 4639756, 4773494, 4772722, 4969096, 5053237, 5174502, 5347518, 5509057, 5675000, 5747768, 5898643, 6145366, 6444156, 6849475, 7257421, 7790910, 8513272, 9101028, 9478367]
5295I478367L45509J12084P5619o7538k77439l49148o05206n79943l41355k92002
5285G498948l3742q2133J19494J50507J30118K61342J47792J44999L14173O0025
5275H711523J06438K76955M82955O52391O22753Q50082J021034J240222J013016
5266A4977369N77272L31982R8873Q6927k01123p96710j166342j426039j178380
5257A1303829r85539o97625m49002k99552k96703j22521m1083M8682O4949R8077
5247H623512J9514K2928J96504K67129J83954K39854K68931L11206N22816N62987
5237A1219335M83496L06117M4308m3315r9576k82437n08117p58522r17243p39242
5227H704804n16837l96634k70525j91735k90890k18355k24885m8290J7688J0255
$$ y = [9478367, 9823876, 9935960, 10011579, 9944041, 9666602, 9317454, 8712248, 8132305, 7790950, 7498948, 7465206, 7383073, 7502567, 7653074, 7783192, 8044534, 8192326, 8337325, 8651498, 8711523, 8817961, 9094916, 9577871, 10230262, 10853015, 11703097, 12724131, 13964353, 14977369, 15554641, 15886623, 15985496, 16072423, 15871300, 15074590, 13908248, 12482209, 11303829, 10318290, 9620665, 9171663, 8872111, 8575408, 8452887, 8411804, 8460486, 8525435, 8623512, 8643026, 8665954, 8862458, 9129587, 9313541, 9553395, 9822326, 10133532, 10656348, 11219335, 11702831, 12008948, 12053256, 12009941, 11910365, 11627928, 11119811, 10361289, 9444046, 8704804, 8187967, 7791333, 7520808, 7329073, 7038183, 6819828, 6594943, 6546653, 6564341, 6574596]
5217F574596k8340p5136j6339L0577j54282k8170m3494p9487j44709j17423j50521
5206E767272j12076k06265r1985M040j20384m7681m5830j3895m6505j8998j14793
5195D952900M5342M2585m8780l934k1670O4380N3973N6008l236K268J304J5544
5183E156684L7321n5049J63490m828n716K9959k9937N6658P3889j36363N8595
5172E344703r3149j46655r1069m4305l2215m0980j5881N7409n2802M97j9327J7989
5160D884215N8330J3352k286P6912M2618Q5184M5890j9327n6360j34526k1642
5149D972360k9791l7419j69581j35697j23146j60780j68218m501N4414j07027
5139D090614j72218m5754m2411n1386R5616L1446p0496j40620P6970R589r3485
$$ y = [6574596, 6546256, 6471120, 6454781, 6485358, 6331076, 6302906, 6259412, 6179925, 6035216, 5917793, 5767272, 5655196, 5448931, 5356946, 5360986, 5240602, 5192921, 5147091, 5133196, 5086691, 5067693, 4952900, 4998242, 5040827, 4992047, 4988113, 4966443, 5030823, 5084796, 5140804, 5137568, 5139836, 5141140, 5156684, 5194005, 5138956, 5302446, 5297618, 5291902, 5321861, 5291924, 5348582, 5422471, 5286108, 5344703, 5251554, 5104899, 5013830, 4969525, 4937310, 4896330, 4880449, 4937858, 4885056, 4885553, 4866226, 4884215, 4942545, 4955897, 4953611, 5030523, 5073141, 5158325, 5204215, 5184888, 5128528, 4994002, 4972360, 4942569, 4905150, 4735569, 4599872, 4476726, 4315946, 4147728, 4143227, 4197641, 4090614, 3918396, 3872642, 3830231, 3778845, 3874461, 3905907, 3835411, 3694791, 3771761, 3781350, 3687865]
5128C687865L86Q2969K2809p8551J3867P4035P456n6661N0290j2808J03093r945
5116C884805m856J20815K5557q772J3648J81014O585j8523N9583R9481P1713K16482
5104D647532K49680R9687p430J22199J06410Q7774p9632j48025j4120J32098K2564
5093E218737p0988K1931M1140M9195K080K6129l9389P3190n812J21514P3372J82966
5081E694065P8764J7019M33L3621J67100R0478J85804J42746R0395Q6031o4213
5070F522243P9143M7280M7107R5992J3156n8496R4334J6994m0130O3414J9578
5059F900615P4924J12516j494J09424J34972Q9127M1861P0157j1327R1082J67239
5048G779096J77758K16591J63608J42949K37580Q8741L8740J32131K01913J61095
$$ y = [3687865, 3688251, 3771220, 3794029, 3715478, 3729345, 3803380, 3810836, 3754175, 3804465, 3791657, 3894750, 3884805, 3879949, 4000764, 4026321, 4017549, 4031197, 4212211, 4218796, 4200273, 4259856, 4359337, 4431050, 4647532, 4897212, 4996899, 4989469, 5111668, 5218078, 5305852, 5226220, 5078195, 5064075, 5196173, 5218737, 5147749, 5169680, 5210820, 5260015, 5262095, 5288224, 5248835, 5322025, 5316213, 5437727, 5511099, 5694065, 5772829, 5789848, 5790281, 5823902, 5991002, 6081480, 6267284, 6410030, 6500425, 6586456, 6522243, 6601386, 6648666, 6695773, 6791765, 6804921, 6746425, 6840759, 6857753, 6817623, 6881037, 6900615, 6975539, 7088055, 7086561, 7195985, 7330957, 7420084, 7461945, 7532102, 7520775, 7611857, 7779096, 7956854, 8173445, 8337053, 8480002, 8717582, 8806323, 8845063, 8977194, 9179107, 9340202]
5038I340202O8433J30448J7334p2974L633j0057K3016K7758o3749J3479P2981
5027I550504K4988O6948Q9064K25283J47550P7177J47747J95281J61934K20963
5017A0907439K45491K38391K03344L08344K68618L20228L98394L85158L31913
5008A3607320L08477L83411L75982L77363L19604L49564K18378K97525K59603
4999A6497227L13720L76072L96036L13682M66543N01968M97249M20277N64020
4990B0346794N35564N99412O92839P52051N75150O81651O56925P10838Q19597
4981B6370821Q50874Q87450R32328R88073J029538J192157J395225J468925J557856
4972C6673247J669008J726240J943569J940336K224926K459522K570091K762568
$$ y = [9340202, 9408635, 9539083, 9556417, 9483443, 9487076, 9477019, 9500035, 9527793, 9464044, 9477523, 9550504, 9575492, 9642440, 9731504, 9956787, 10104337, 10181514, 10329261, 10524542, 10686476, 10907439, 11152930, 11391321, 11594665, 11903009, 12171627, 12491855, 12890249, 13275407, 13607320, 13915797, 14299208, 14675190, 15052553, 15372157, 15721721, 15940099, 16237624, 16497227, 16810947, 17187019, 17583055, 17896737, 18363280, 18865248, 19362497, 19782774, 20346794, 20882358, 21481770, 22174609, 22926660, 23501810, 24183461, 24840386, 25551224, 26370821, 27221695, 28109145, 29041473, 30029546, 31059084, 32251241, 33646466, 35115391, 36673247, 38342255, 40068495, 42012064, 43952400, 46177326, 48636848, 51206939, 53969507]
4964E3969507K951154L093092K927552K786568K321881J769817J100596M26890
4956G1347057j00648p96589j214387j435076j517217j117890q70164n99255j23067
4947F3572764J41202M95061Q95193J239917J535912J900976K439871K669164K945998
4938G7836058L364211L763625M137898M756360N244001N952472O616072P046247
4930A18716944P322307P338887P020510N765015M050049J802573l26467k516974
4922A49172844m896783o640335p814799q127562p587095o577823n520068m539582
4914I7468797l525274k543455j694819j030347l08149J22422P97065J359281J887892
4905I2533413K294766K935787L544435M222768M901175N572437O141705O452976
$$ y = [53969507, 56920661, 60013753, 62941305, 65727873, 68049754, 69819571, 70920167, 71347057, 71246409, 70449820, 69235433, 67800357, 66283140, 65165250, 64295086, 63695831, 63572764, 63713966, 64209027, 65104220, 66344137, 67880049, 69781025, 72220896, 74890060, 77836058, 81200269, 84963894, 89101792, 93858152, 99102153, 105054625, 111670697, 118716944, 126039251, 133378138, 140398648, 146163663, 150213712, 152016285, 151689818, 149172844, 144276061, 137635726, 129820927, 121693365, 114106270, 107528447, 102008379, 97468797, 93943523, 91400068, 89705249, 88674902, 88366753, 88489175, 89286240, 90645521, 92533413, 94828179, 97763966, 101308401, 105531169, 110432344, 116004781, 122146486, 128599462]
4897A28599462O309080N932821N376377M298211K677439N45077j248755l481161
4889A49008551n800399p712127r177215r570299r252006q498398p486326o344197
4881H5167584n314457m502574l819063l249250k605365k062005j560578j091728
4873F0962564o82772l75176K4485M43036Q75930J115385J122853J343474J345637
4864F6175416J455924J484104J203621M76965j49300q31201j380322j921042k563045
4855F3951120l114183l526761l787965l763881l427525l076352k799681k362217
4847C8092555k041901j847324j447063j241240r99597r46272r17393p13198o05887
4838B7332680m88442m70117l32913k64717k51104j50130m5820j93023j6162K841
$$ y = [128599462, 134908542, 140841363, 146217740, 150515951, 153193390, 153738467, 152489712, 149008551, 143208152, 135496025, 126318810, 116748511, 107496505, 98998107, 91511781, 85167584, 79853127, 75350553, 71531490, 68282240, 65676875, 63614870, 62054292, 60962564, 60279792, 59904616, 59929101, 60372137, 61248067, 62363452, 63486305, 64829779, 66175416, 67631340, 69115444, 70319065, 70796030, 70646730, 69815529, 68435207, 66514165, 63951120, 60836937, 57310176, 53522211, 49758330, 46330805, 43254453, 40454772, 38092555, 36050654, 34203330, 32756267, 31515027, 30515430, 29569158, 28651765, 27938567, 27332680, 26844238, 26374121, 26041208, 25776491, 25525387, 25375257, 25329437, 25136414, 25120252, 25123093]
4828B5123093q483k7758N0526J19203J19739K07026J62965K23289K29184K98053
4818B6496837N05551M98131N42544N76924O27850Q00158Q78532Q56931J137197
4809C2920655J144851J352353J588864J890908K065725K631403L292576L017019
4801D9904354K692402K730028L068727M159706N515167P190158P781002R525158
4793I2566702J2421123J6675121J8329758J1110249M61317o11949J129126j0150213
4785A41931234j8919055k1355441j8954314j4576917j0183611p192477n610426
4778D5138993m245167l334033k838442k509140k021203j659726j423958j341561
4770B5765763j167541q72894q73598q38196p24956p91646m67928n53559o03687
$$ y = [25123093, 25114610, 25086852, 25137378, 25256581, 25376320, 25583346, 25746311, 25969600, 26198784, 26496837, 27002388, 27500519, 28043063, 28619987, 29247837, 30047995, 30926527, 31783458, 32920655, 34065506, 35417859, 37006723, 38897631, 40963356, 43594759, 46887335, 49904354, 52596756, 55326784, 58395511, 62555217, 68070384, 75260542, 83041544, 92566702, 104987825, 121662946, 139992704, 151102953, 151564270, 150952321, 152081447, 141931234, 123012179, 101656738, 82702424, 68125507, 57941896, 50749419, 45138993, 40893826, 37559793, 34721351, 32212211, 30191008, 28531282, 27107324, 25765763, 24598222, 23725328, 22851730, 22013534, 21288578, 20496932, 20029004, 19475445, 18871758]
4761A8871758n29582k86218l87834l19196l34696k12590k18750j62791l58465
4752A6061636k47358j67899k05212k31687j28893p8637n7590j84260n2206j25700
4742A4582194p1964J31369J10678l0434J91498K65078K91310J54327j45804K143
4732A5480395j82264l08934m51460m95540n33935m89726m19404n25783n13235
4723A1560114l59033l59996k95401l13692k78483j72871j90579j90531j28852
4714I270676k22271k15798j34596j5469N4743r1403r2600j04689O513l1500j69829
4703H253777p1288P654j44841L8713O0227N702j31387m1906L9934k111Q0523l0970
4691H064027o9393M1596j13276j1284l6343J6674j59252L0445O0922p7801p1581
$$ y = [18871758, 18342176, 18055958, 17668124, 17348928, 17014232, 16801642, 16582892, 16420101, 16061636, 15814278, 15646379, 15441167, 15209480, 15080587, 15001950, 14944360, 14760100, 14707894, 14582194, 14510230, 14641599, 14752277, 14721843, 14913341, 15178419, 15469729, 15624056, 15478252, 15480395, 15298131, 14989197, 14537737, 14042197, 13508262, 13018536, 12599132, 12073349, 11560114, 11201081, 10841085, 10545684, 10231992, 9953509, 9780638, 9590059, 9399528, 9270676, 9048405, 8832607, 8698011, 8682542, 8737285, 8645882, 8553282, 8448593, 8455106, 8423606, 8253777, 8182489, 8190143, 8045302, 8084015, 8144242, 8149944, 8018557, 7976651, 8016585, 8014474, 8094997, 8064027, 7994634, 8036230, 7922954, 7911670, 7875327, 7892001, 7732749, 7763194, 7824116, 7746315, 7674734]
4680G674734m6636J4039p6356j3155N2406q6008m4408L7613J16797N8018O1239
4669G748283K16588J16110L7746J26361m5348n9091m756Q700j97313j67550j02797
4658G676933m8287k1958M0589m9145J03872J060k2065J56456n9717J73099J94376
4647H145213J75292Q4682J44544J19519K37175J90819J17926J63189J57465K61490
4637I797314K07581K47170K31550K46134K95444J95103L37657L06392M67913L04582
4627A2636840M43093M40673N26624N96889O55620N70695N08653M51196M01829
4618A7232112M25070J09070m8437q6208k08354k33189k66468j17773J54841L07915
4608A7268579K92996M19851M45309M55854O86011N76736O10574O74398N31909
$$ y = [7674734, 7628098, 7642137, 7565781, 7552626, 7605032, 7519024, 7474616, 7512229, 7629026, 7687044, 7748283, 7964871, 8080981, 8118727, 8245088, 8199740, 8140649, 8135893, 8144593, 7947280, 7779730, 7676933, 7628646, 7606688, 7647277, 7598132, 7702004, 7703064, 7680999, 7837455, 7777738, 7950837, 8145213, 8320505, 8405187, 8549731, 8669250, 8906425, 9097244, 9215170, 9378359, 9535824, 9797314, 10004895, 10252065, 10483615, 10729749, 11025193, 11220296, 11557953, 11864345, 12332258, 12636840, 13079933, 13520606, 14047230, 14644119, 15299739, 15870434, 16379087, 16830283, 17232112, 17657182, 17766252, 17717815, 17631607, 17423253, 17190064, 16923596, 16805823, 16960664, 17268579, 17561575, 17981426, 18426735, 18882589, 19568600, 20145336, 20755910, 21430308, 21962217]
4599B1962217N87007O30953N43611N95744O80958O33093P15223Q51013R15006
4590B8114825Q36994Q99281J027887J014306J122311J180727J252032J476837
4582C6925200J399681J556379J744108J670163J913308K296914K532694K725871
4574E2764318L188511L602600M102505M593358M884689M693176M430577M561754
4566H6821488M952961O140948P642594R305704J1143002J2866647J5409009J8785012
4558A73067365K2605034K3632474J7388469Q286456K089908J88926o20376o326170
4550B40312086j5757891k4811176k9974668k8239590k2984979j7603666j3402905
4543H7537211j0474456q322855o853229n804074m801001m054577l539277l116127
$$ y = [21962217, 22549224, 23180177, 23723788, 24319532, 25000490, 25633583, 26348806, 27199819, 28114825, 28951819, 29851100, 30878987, 31893293, 33015604, 34196331, 35448363, 36925200, 38324881, 39881260, 41625368, 43295531, 45208839, 47505753, 50038447, 52764318, 55952829, 59555429, 63657934, 68251292, 73135981, 77829157, 82259734, 86821488, 91774449, 97915397, 105557991, 114863695, 126006697, 138873344, 154282353, 173067365, 195672399, 219304873, 236693342, 244979798, 247069706, 247258632, 246638256, 240312086, 224554195, 199743019, 169768351, 141528761, 118543782, 100940116, 87537211, 77062755, 68739900, 61886671, 56082597, 51281596, 47227019, 43687742, 40571615]
4535D0571615k594828k336149k153982j895487j724625j546880j310559j411831
4527B5597274j197270j051730r79505r54378q36853p43380p47956n56577q36797
4518A7692828o13481o35275o05430n97567n99890n44428n42734n49032m18082
4509A2586909n03114l85590m74506l46705l37454k70420l06699k58649k01661
4500I502111k12670l13549j62401k80680l31045k40979k21742k60774j37945k58241
4490G082085j96307j41273j05851k03156k36949o5353j18854p3659m675J8488
4480E954496j31410j77227N9581j8932n9368J05564M3324j07722q1887j46175
4470E440244j00074j33756j45985q6615k67248j22443j73741O27j77631o2221
$$ y = [40571615, 37976787, 35640638, 33486656, 31591169, 29866544, 28319664, 27009105, 25597274, 24400004, 23348274, 22368769, 21414391, 20577538, 19834158, 19086202, 18529625, 17692828, 17079347, 16444072, 15838642, 15241075, 14641185, 14096757, 13554023, 13004991, 12586909, 12083795, 11698205, 11223699, 10876994, 10539540, 10269120, 9962421, 9703772, 9502111, 9289441, 8975892, 8813491, 8532811, 8201766, 7960787, 7739045, 7478271, 7340326, 7082085, 6885778, 6744505, 6638654, 6435498, 6198549, 6133196, 6014342, 5940683, 5936008, 5954496, 5823086, 5645859, 5705440, 5686508, 5627140, 5732704, 5776028, 5668306, 5586419, 5440244, 5340170, 5206414, 5060429, 4973814, 4706566, 4584123, 4410382, 4411009, 4233378, 4171157]
4460D171157j2893l3290m0094m669r7977j8216n4846r7135m216J47035k5693j00145
4448C829018j34929K7913Q2202p1223p1276o1352N5751n6453k3291o2359p8349
4437C435652K0841l4178o5462O411p7933o4732j08692m5935o3906j4507L9578
4426C027137j09097L3639K0079k3732m6149Q7005k583j41553Q3427O1168j12962
4415B876379l8359j0611J6762L3741n6669k7548p392L3203o9320k2136N3009K8756
4403B809815j08252l2512n7582L563R4521O5090n416r9962N1562j69596K5209
4392B576440N8798l746K4305L6120K5514j27199j46930M1354M8145k1282p0561
4381B440958m3015j34854j76824l146J08900n3042L9642L6448n2791n211p3339
$$ y = [4171157, 4158264, 4124974, 4084880, 4080211, 3982234, 3964018, 3909172, 3812037, 3807821, 3954856, 3929163, 3829018, 3694089, 3722002, 3804204, 3732981, 3661705, 3600353, 3656104, 3599651, 3576360, 3514001, 3435652, 3456493, 3422315, 3356853, 3363264, 3285331, 3220599, 3111907, 3065972, 3002066, 2987559, 3027137, 2918040, 2951679, 2971758, 2948026, 2901877, 2988882, 2986299, 2844746, 2928173, 2989341, 2876379, 2838020, 2827409, 2844171, 2877912, 2821243, 2793695, 2786303, 2819506, 2750186, 2728050, 2781059, 2809815, 2701563, 2669051, 2611469, 2615032, 2709553, 2774643, 2769227, 2669265, 2720827, 2551231, 2576440, 2635238, 2631492, 2655797, 2691917, 2717431, 2590232, 2443302, 2484656, 2532801, 2511519, 2440958, 2397943, 2263089, 2086265, 2083119, 2192019, 2138977, 2178619, 2215067, 2162276, 2157065, 2083726]
4370B083726R82J5635p602M9641R0366J1224l9068k7581k8626m9667Q4686L932
4358B187648p7703j36316J5728M8898L708M4771l6316p763J00934m7756p8208
4347B017625k8667l267K2510m0750L0781L8177j856m4238J4118j763P3429m922
4335B071177o4401J4144j38085l9339N8371P640j3484Q1588N2841K1420K4952
4324B076824p1736p0430L9080l1927K7177p6907R8661N5507o569l189p633L9470
4312B068328j5860M0214N4563n2693j6831K4204k9036n3063J9062Q4537l8823
4301B084602k532l1641j29197P6851J0925k7477J55386n4728J427R3774J7832
4290B195222j56950O1194m7502N9880R4396q6915N3989j5251N0653J9934J5913
$$ y = [2083726, 2084708, 2100343, 2092741, 2142382, 2232748, 2243972, 2204904, 2177323, 2148697, 2099030, 2183716, 2187648, 2109945, 1973629, 1989357, 2038255, 2041963, 2086734, 2050418, 2042655, 2143589, 2095833, 2017625, 1988958, 1985691, 2008201, 1967451, 1998232, 2036409, 2034553, 1990315, 2004433, 2002670, 2076099, 2071177, 2006776, 2020920, 1882835, 1843496, 1901867, 1909507, 1896023, 1977611, 2030452, 2051872, 2076824, 2005088, 1934658, 1973738, 1941811, 1968988, 1892081, 1990742, 2046249, 2039680, 2036491, 2028858, 2068328, 2052468, 2092682, 2147245, 2094552, 2077721, 2101925, 2072889, 2019826, 2038888, 2123425, 2084602, 2082070, 2050429, 1921232, 1998083, 2009008, 1981531, 2136917, 2082189, 2083616, 2177390, 2195222, 2038272, 2099466, 2051964, 2111844, 2206240, 2119325, 2173314, 2158063, 2208716, 2228650, 2244563]
4279B244563K4294N4735O7202k1745p5269J04910N5545j00358R2022J4655l36
4268B460218L6217K592J4656J11724Q3043L3127K41j5688J6134R8733P1708M1081
4256B953786Q33J23314P6278n271J73976J62129K17075J36374J4534J31522P3940
4245D058490o591l0030R356m8145p6714M5172q1847j4438j06236R2703O3293J43940
4233D048953N8430M762J19707N7560J9626P0685N9787n6596j3667L0398l3131
4222D366514j27874k0409q6746j12296J3978p640j31715J3817o2547K611Q2375
4211C930068J3981j25929P4501R4252p9430j02964k6926J42040P2414j7241O7240
4200D042006J9426l4871P1489N9117P9094K6925j1370J25756Q9788L8147P1404
$$ y = [2244563, 2268857, 2323592, 2390794, 2369049, 2293780, 2398690, 2454235, 2353877, 2445899, 2460554, 2460218, 2496435, 2499027, 2513683, 2625407, 2708450, 2741577, 2741818, 2726130, 2742264, 2840997, 2912705, 2953786, 2954619, 3077933, 3154211, 3148940, 3322916, 3485045, 3702120, 3838494, 3853028, 3984550, 4058490, 4051899, 4021869, 4031225, 3983080, 3906366, 3951538, 3869691, 3855253, 3749017, 3841720, 3905013, 4048953, 4107383, 4112145, 4231852, 4289412, 4309038, 4379723, 4439510, 4382914, 4369247, 4399645, 4366514, 4238640, 4218231, 4131485, 4019189, 4033167, 4025527, 3893812, 3907629, 3845082, 3847693, 3930068, 3944049, 3818120, 3892621, 3986873, 3907443, 3804479, 3777553, 3919593, 3992007, 3974766, 4042006, 4061432, 4026561, 4098050, 4157167, 4236261, 4263186, 4251816, 4377572, 4467360, 4505507, 4576911]
4189D576911M2448q593J49591J55943J29527J12038N319J68779J49270k6666n3751
4178E400816J94087J11554J35223J49954J82488Q8423P4995K52047J85645K37314
4168G012546J83796J21765K32328Q8970J54607R9872K52155J94422J91210J15206
4158H646877J04991K72711K42809J32596K08538L05152K52223L52439K02732L91324
4148A1112392L60973K66067L34123K83005L21529M07089L24979L93046L65927
4139A4169130L66102N12527O01885N19054N16514O40913P25801P98190P27202
4130A9577318P59828R54039J051891R03291J195293J307188J179657J451906J705953
4121C0086364J828702J879213K142545K300474K638846K875690L010656L071342
$$ y = [4576911, 4619359, 4610766, 4760357, 4916300, 5045827, 5157865, 5163184, 5331963, 5481233, 5454567, 5400816, 5594903, 5706457, 5841680, 5991634, 6174122, 6262545, 6337540, 6589587, 6775232, 7012546, 7196342, 7318107, 7550435, 7639405, 7794012, 7893884, 8146039, 8340461, 8531671, 8646877, 8751868, 9024579, 9267388, 9399984, 9608522, 9913674, 10165897, 10518336, 10721068, 11112392, 11473365, 11739432, 12073555, 12356560, 12678089, 13085178, 13410157, 13803203, 14169130, 14535232, 15047759, 15649644, 16168698, 16685212, 17326125, 18051926, 18850116, 19577318, 20337146, 21291185, 22343076, 23246367, 24441660, 25748848, 26928505, 28380411, 30086364, 31915066, 33794279, 35936824, 38237298, 40876144, 43751834, 46762490, 49833832]
4113D9833832L353266L376553L550395L666588M143881M433215M671304M997548
4105H2026582N493591N790993N472726M331271K533519P69478q38080k569772
4097A03010308n008432p361646q880645r143595q280544p110946n850494m816656
4089D6557350l919147l039718k536115k214668j874958j514767j377786j086936
4081B8993255r31832q35448o97171m42560n19764o04134m54224l09693l14776
4072B3883653k92229k54437j77561k32695k53670j16014l2665j53449j02868k30360
4062B2037705j21580r3643k51830k57803j78351k86670k73303k08533j83285j31438
4052B0051269k16413j19909l9486j60280k21062j60718j04589l3079k49728k67271
$$ y = [49833832, 53187098, 56563651, 60114046, 63780634, 67924515, 72357730, 77029034, 82026582, 87520173, 93311166, 98783892, 103115163, 105648682, 106418160, 105580080, 103010308, 98001876, 90640230, 81759585, 72615990, 64335446, 57224500, 51374006, 46557350, 42638203, 39598485, 37062370, 34847702, 32972744, 31457977, 30080191, 28993255, 28061423, 27225975, 26528804, 26086244, 25566480, 24962346, 24508122, 24198429, 23883653, 23591424, 23336987, 23159426, 22926731, 22673061, 22557047, 22524382, 22370933, 22268065, 22037705, 21916125, 21822482, 21570652, 21312849, 21134498, 20847828, 20574525, 20365992, 20182707, 20051269, 19834856, 19714947, 19675461, 19515181, 19294119, 19133401, 19028812, 18995733, 18746005, 18478734]
4042A8478734L2662q0793j88208p020K77531J31262Q6692J59287N4083O4331K98431
4031A9306992M92578P59423O87937J002227J537773K202627K605216J221022k00263
4022B9615532m79781L47820p47440k300899k993668l221944k565950j841375j227035
4013A4585260j025078q43265n20955m31133m94876l63935j70236j73347l39683
4004A0222752k20709k47999j17676j77660o7466n757M5188J3466m9417J14583
3994I509305L7801R328P955j03260m1982p4683j62678j13683l08761k49593k9941
3983H479808m8811o8284R2365q791j07408r381Q7931J04554j7028J27265J90366
3972H822586J71202J51851L43965N44790L41012L00863K20333J38646J64435K8663
$$ y = [18478734, 18511396, 18430603, 18242395, 18235375, 18512906, 18644168, 18730860, 18890147, 18944230, 19008561, 19306992, 19799570, 20558993, 21246930, 22249157, 23786930, 25989557, 28594773, 29815795, 29615532, 29135751, 29483571, 28736131, 26435232, 23441564, 20219620, 17653670, 15812295, 14585260, 13560182, 12716917, 12195962, 11764829, 11269953, 10906018, 10735782, 10562435, 10222752, 10002043, 9754044, 9636368, 9458708, 9391242, 9385485, 9430673, 9444139, 9394722, 9509305, 9547106, 9556434, 9564389, 9461129, 9419147, 9344464, 9181786, 9068103, 8759342, 8509749, 8479808, 8430997, 8362713, 8455078, 8446287, 8338879, 8329498, 8417429, 8521983, 8504955, 8632220, 8822586, 8993788, 9145639, 9489604, 10034394, 10375406, 10676269, 10896602, 11035248, 11199683, 11228346]
3962A1228346j08489k01773k51611l42918m75254m60464l76754l95262k31744
3953H384077q4934j47623J2097p0036R5379O7780J90956J50354K19042K90866
3943I107958M09578N47357N82033N99966N62083M50817L11843L57077K11720p3498
3933A3066934j58812l79467n02574o45385p00284o17337o26379m84220k69492
3924H682984k15700j48097j54151J8852L4201K4664M4817M9947J22563J68324
3914H628404O9381J25833K19608R6265J55271R2791R3642k3303m7278l02231k85838
3903H822545l92818n34866m60682m23235m37853l72226k52697k20668j89089p2469
3893E465942o0733k7849r628J1600O8098K6q7465M5826o3384Q9720M2552N2315
$$ y = [11228346, 11119857, 10918084, 10666473, 10323555, 9848301, 9387837, 9011083, 8615821, 8384077, 8299143, 8151520, 8163617, 8093581, 8188960, 8256740, 8447696, 8598050, 8817092, 9107958, 9517536, 10064893, 10646926, 11246892, 11808975, 12259792, 12571635, 12928712, 13140432, 13066934, 12908122, 12528655, 12026081, 11380696, 10680412, 10063075, 9436696, 8952476, 8682984, 8467284, 8319187, 8165036, 8183888, 8218089, 8242753, 8287570, 8337517, 8460080, 8628404, 8697785, 8823618, 9043226, 9139491, 9294762, 9387553, 9481195, 9457892, 9410614, 9108383, 8822545, 8429727, 7894861, 7434179, 7010944, 6573091, 6200865, 5948168, 5727500, 5538411, 5465942, 5405209, 5377360, 5367732, 5379332, 5447430, 5447456, 5359991, 5405817, 5342433, 5432153, 5474705, 5527020]
3881E527020K5317J8721n5997K776N054n2757o9866j58495j11811m9019K9679
3870E110622K519L1957N8835J40231P3552K16470K41615K00033k1440P2831r897
3859F117328j62078j73113k76801j60746k48201k06388j96227j01664q6723j30327
3849D375060j25633p427p3165N2468J10982N2471J3506J8946J55411n3827k0008
3838D498784P3268J27728P0090L5572k5261q3258j9878l7803k72176j7260P1402
3827D421208m2085k24856o1103P9625q9024r7162m8160n5170n2078L5994q3476
3816C783713J2719O5154k1613r547J35395O1726o3370R198J21287n9303o9302
3805C966057l1305l2677o9541l1414N7989P6474r4360n2666J3777r807J53372
$$ y = [5527020, 5552337, 5571058, 5515061, 5517837, 5522891, 5470134, 5400268, 5241773, 5129962, 5080943, 5110622, 5113141, 5145098, 5203933, 5344164, 5417716, 5634186, 5875801, 6075834, 6054394, 6127225, 6117328, 5955250, 5782137, 5505336, 5344590, 5096389, 4890001, 4693774, 4592110, 4505387, 4375060, 4249427, 4242000, 4168835, 4221303, 4332285, 4384756, 4398262, 4417208, 4572619, 4518792, 4498784, 4572052, 4699780, 4769870, 4805442, 4780181, 4696923, 4677045, 4639242, 4367066, 4349806, 4421208, 4379123, 4154267, 4093164, 4172789, 4083765, 3986603, 3938443, 3883273, 3831195, 3867189, 3783713, 3796432, 3861586, 3839973, 3830426, 3965821, 4027547, 3964177, 3973375, 4094662, 4035359, 3966057, 3934752, 3902075, 3832534, 3801120, 3859109, 3935583, 3841223, 3788557, 3802334, 3792527, 3945899]
3794C945899J23697q3495m3424Q3086Q6226N2457P8948J0970l5824J83057J77778
3783D579375R1604R8319J29517Q6067J04041M1044O7503O9852O9651J07968L252
3772E448193Q7062J35981k0191J81432n0204J09006K75981k7103O5108J49913
3762F355178J67285R3207p168J51862Q2817m1648J81575J19046M4933R5226R972
3751G252285P6095O0182P8834N2696P7905P2371M0597Q1099R2403L417J8062J77381
3739H083327O9065J29035J40867M2075J19492N0525K23366J58288J43921K19661
3729I379622K79219J91882K24740K32871K48423L11636K39408K95015L32848M63335
3719A2198999K87215K83702L73063L30301L92274L84229J68800K74783L19359
$$ y = [3945899, 4069596, 3986101, 3942677, 4025763, 4111989, 4164446, 4243394, 4254364, 4218540, 4401597, 4579375, 4670979, 4769298, 4898815, 4984882, 5088923, 5129967, 5197470, 5267322, 5336973, 5444941, 5448193, 5535255, 5671236, 5651045, 5832477, 5782273, 5891279, 6167260, 6140157, 6205265, 6355178, 6522463, 6615670, 6608502, 6760364, 6843181, 6801533, 6983108, 7102154, 7147087, 7242313, 7252285, 7328380, 7388562, 7467396, 7520092, 7597997, 7670368, 7710965, 7792064, 7884467, 7887884, 7905946, 8083327, 8152392, 8281427, 8422294, 8464369, 8583861, 8634386, 8857752, 9016040, 9159961, 9379622, 9658841, 9850723, 10075463, 10308334, 10556757, 10868393, 11107801, 11402816, 11735664, 12198999, 12486214, 12769916, 13142979, 13473280, 13865554, 14249783, 14418583, 14693366, 15012725]
3710A5012725K84645K93628L99079K15869K36649K03721K9450L5676J77887J66089
3700A7055418J54069J14425R9800K389l3137o195J8512k9512j211r367j39906
3689A7225285o5212m8719m4623p9858j3562N8903O2704n0804l7334K8044j5785
3678A7019039m1056k7812j5212r8114n34j74802L3350j16942r4602j37534k11233
3667A6134548j25978j21901k09730k95791n8168l90062l07036l38061j86609k94647
3657A3806565m03824l10010l19943k68695l79963l00733l07427k88539k65330
3648A0962101m70678j90858l08794k61956j68126k14992j37149p1994k33976l0883
3638H872695j14447j51681q462J0894N4426R1056R2512K4973K9697p7430J07473
$$ y = [15012725, 15297370, 15590998, 15990077, 16205946, 16442595, 16646316, 16675766, 16711442, 16889329, 17055418, 17209487, 17323912, 17423712, 17426101, 17392964, 17386769, 17405281, 17375769, 17374558, 17365191, 17225285, 17160073, 17111354, 17066731, 16986873, 16973311, 17032214, 17094918, 17044114, 17006780, 17034824, 17019039, 16977983, 16950171, 16934959, 16836845, 16836311, 16661509, 16694859, 16577917, 16483315, 16345781, 16134548, 16008570, 15886669, 15676939, 15381148, 15322980, 14932918, 14625882, 14287821, 14101212, 13806565, 13402741, 13092731, 12772788, 12504093, 12124130, 11823397, 11515970, 11227431, 10962101, 10491423, 10300565, 9991771, 9729815, 9561689, 9346697, 9209548, 9137554, 8903578, 8872695, 8758248, 8606567, 8598105, 8608999, 8663425, 8754481, 8846993, 8871966, 8901663, 8824233, 8931706]
3627H931706O6931O3494R8535k2235K9752P7957l6567J22646P3567R8551L7796
3616I542133K2141J02588O8088J05370N9693J6484L9378K3038p7416n6665o2721
3605I782111Q961j9897k19489j93877j50815n4363j24193o2672q5602n5930j3364
3594H810870q2525O6076N123m0531J3562r113L1905O2698J78126j3574J08363
3583I130980J83509J43308K38153K17333J60322L45944L12261K23741J92008J68443
3573A1316002L09539R5434J45237J05711J59549Q1547Q1251J10005K03171J62593
3563A2770039J63265J84050K46161L38971K93163K89676J84438J07374K00732
3554A4777869K45572N1235Q7953J10242J22497P6223j47824k4420L7079o3876
$$ y = [8931706, 8998637, 9062131, 9160666, 9138431, 9168183, 9246140, 9209573, 9332219, 9405786, 9504337, 9542133, 9564274, 9666862, 9734950, 9840320, 9900013, 9916497, 9955875, 9978913, 9901497, 9844832, 9782111, 9791072, 9771175, 9551686, 9357809, 9206994, 9152631, 9028438, 8965766, 8880164, 8824234, 8810870, 8728345, 8794421, 8799544, 8759013, 8772575, 8763462, 8795367, 8858065, 9036191, 9022617, 9130980, 9314489, 9457797, 9695950, 9913283, 10073605, 10419549, 10731810, 10955551, 11147559, 11316002, 11625541, 11720975, 11866212, 11971923, 12131472, 12213019, 12294270, 12404275, 12607446, 12770039, 12933304, 13117354, 13363515, 13702486, 13995649, 14285325, 14469763, 14577137, 14777869, 15023441, 15074676, 15162629, 15272871, 15395368, 15471591, 15323767, 15299347, 15336426, 15272550]
3544A5272550n9174j613k0657L4434J9327m6972J41746J15207P0651q3295N1303
3533A5493507K2422J90205K04146J83480L05508K10315L08358L28282L51258M74859
3523A8072340L79785L10765M43652M93493N73847M50061M79281N03400O06943
3514B2313567O04753N01968N85357N29327N74012O12381O54172N72476M36548
3505B7384561N75535M25219M58970N15369L11346K50032L66414K69226K12074
3496C0768746K30682J45445J22353K67995K37153J85082J82057K99554L76788
3487C2815855L45090M14968M09346N18650M79276L00349L10912L82112M33745
3478C6410303K74002K79200L34355K89974K14663J05680K99753K50471L16893
$$ y = [15272550, 15213376, 15211763, 15191106, 15225540, 15244867, 15197895, 15339641, 15454848, 15525499, 15442204, 15493507, 15515929, 15706134, 15910280, 16093760, 16399268, 16609583, 16917941, 17246223, 17597481, 18072340, 18452125, 18762890, 19206542, 19700035, 20273882, 20723943, 21203224, 21706624, 22313567, 22918320, 23420288, 24005645, 24534972, 25108984, 25721365, 26375537, 26948013, 27384561, 27960096, 28385315, 28844285, 29359654, 29671000, 29921032, 30287446, 30556672, 30768746, 30999428, 31144873, 31267226, 31535221, 31772374, 31957456, 32139513, 32439067, 32815855, 33160945, 33575913, 33985259, 34503909, 34983185, 35283534, 35594446, 35976558, 36410303, 36684305, 36963505, 37297860, 37587834, 37802497, 37908177, 38207930, 38458401, 38775294]
3469C8775294L08699K36398K60668J70277J18371j37751j52162k28543o10661
3460C8740590o27090o33959p79058q64629r95162j051619j077220r21279p97144
3451C0993430o76518q10135o65966m57989m56566l68482m59141j77154k11969
3442B6709510r8145j6687j9640K3783J37824R1589O4215J87170J95583K57165
3432B7532367J6192j3438J47555L3720J12527J65556J14618N1694M6417k5823
3422B8181385o9469k709r6480j18808j08190l7302l0333k42358q5790j16707j88854
3411B7084385p8529j14940o9717L8016P7303J23906J14222P1193J25736J26733
3401B7498308K04653J88946K95075L35183K37043M11567M20171M77822O37381
$$ y = [38775294, 39083993, 39320391, 39581059, 39751336, 39869707, 39731956, 39579794, 39351251, 38740590, 38113500, 37479541, 36700483, 35835854, 34840692, 33789073, 32711853, 31790574, 30993430, 30316912, 29506777, 28840811, 28382822, 27926256, 27557774, 27098633, 26921479, 26709510, 26611365, 26594678, 26575038, 26598821, 26736645, 26828234, 26892449, 27079619, 27275202, 27532367, 27548559, 27535121, 27682676, 27716396, 27828923, 27994479, 28109097, 28160791, 28207208, 28181385, 28111916, 28109207, 28012727, 27893919, 27785729, 27748427, 27718094, 27475736, 27389946, 27273239, 27084385, 27005856, 26890916, 26821199, 26859215, 26936518, 27060424, 27174646, 27245839, 27371575, 27498308, 27702961, 27891907, 28186982, 28522165, 28759208, 29170775, 29590946, 30068768, 30706149]
3392C0706149P41193Q57250Q54522J096915J129399J147072J105560J058109J110262
3383C9806431J430571J642440J897850K287895K536452K896003L476283M454618
3375F0428543M382350K772214R32517N19707J091457j58647k211743l438737l843342
3366F0474319k887779j861407r01806m71972M0312M87126P47854R22766J205011
3357E7754424J514012J711550J935855J844850J878138K093863K396953K885862
3349G4015507L848830M340282M785945N616673O997118R135607R515711O262190
3341A24517863K692306J593437L347413J386961k589316n005252n747348m174693
3333A16021371k112893r2759J177955K153059L122079M370523N575392O787103
$$ y = [30706149, 31447342, 32304592, 33159114, 34256029, 35385428, 36532500, 37638060, 38696169, 39806431, 41237002, 42879442, 44777292, 47065187, 49601639, 52497642, 55973925, 60428543, 64810893, 67583107, 68515624, 69035331, 70126788, 69968141, 67756398, 64317661, 60474319, 57586540, 55725133, 54823327, 54351355, 54391667, 54878793, 55626647, 56549413, 57754424, 59268436, 60979986, 62915841, 64760691, 66638829, 68732692, 71129645, 74015507, 77864337, 82204619, 86990564, 92607237, 99604355, 108739962, 118255673, 124517863, 127210169, 128803606, 132151019, 133537980, 130948664, 125943412, 120196064, 116021371, 113908478, 113815719, 114993674, 117146733, 120268812, 124639335, 130214727, 137001830]
3325A37001830Q172887R564755J1129336J2672282J2907477J1128890P785622
3318B10363079M799027L270440K008042m32179m013601p345318q792845q139440
3310A91717205p484786o809311n437729l028790j777192k420809k668940k433513
3302A59656135r61996R90771K412107K969818L614519M589983N955865P813402
3294A87040604R805520J1892088J4271132J6602424J9864173K3375455K5155529
3287C08006925K1614727J3638081O771983L184795J080873l811807j2371059k1271585
3279C16842933k7198003k7673615k3764788j8865293j4422067j1065462q427747
3272A85425958o404560n014505l702583k768066k093412j429923j018121q74438
$$ y = [137001830, 145174717, 154739472, 165868808, 178541090, 191448567, 202577457, 210363079, 215162106, 218432546, 220440588, 220008409, 215994808, 208649490, 199856645, 191717205, 184232419, 177423108, 171985379, 168956589, 167179397, 164758588, 162089648, 159656135, 158694139, 159684910, 162097017, 165066835, 168681354, 173271337, 179227202, 187040604, 196846124, 208738212, 223009344, 239611768, 259475941, 282851396, 308006925, 329621652, 343259733, 350031716, 353216511, 354297384, 350485577, 338114518, 316842933, 289644930, 261971315, 238206527, 219341234, 204919167, 193853705, 185425958, 179021398, 174006893, 170304310, 167536244, 165442832, 164012909, 162994788, 162120350]
3264A62120350m80788J29313Q08209J745153K619745L657401M520605N719392
3256A80839380P155622P867665P081938M462715J106829j392491k740459m654035
3248A99727164p804643j1433568j4277612j5414874j4105487j2086850r814087
3241A14790043p942517o607508n548171m551737l889449l389255k913255k367328
3233G7580823k112701j797509j458829j341943j070813j013261q29260p70779
3225F7185728o35318o10153m82059n02588m41479m72555m45358l98723l42906
3216F2854589j97561j71130n7943J3093N8710K21356L83628M32985L39697N34769
3206F4412193M60165M88797N06924L83421J45872P5799j37679n53142o64268o38448
$$ y = [162120350, 161639562, 161768875, 162577084, 164322237, 166941982, 170599383, 175119988, 180839380, 187995002, 195862667, 202944605, 207407320, 208514149, 207121658, 204381199, 199727164, 191922521, 180488953, 166211341, 150796467, 136690980, 124604130, 114790043, 106847526, 100240018, 94691847, 90140110, 86250661, 82861406, 79948151, 77580823, 75468122, 73670613, 72211784, 70869841, 69799028, 68785767, 67956507, 67185728, 66550410, 65940257, 65458198, 64955610, 64514131, 64041576, 63596218, 63197495, 62854589, 62657028, 62485898, 62427955, 62441048, 62499758, 62721114, 63104742, 63537727, 63877424, 64412193, 64872358, 65361155, 65868079, 66251500, 66397372, 66473171, 66335492, 65782350, 65118082, 64479634]
3196F4479634r70148j063201j057403j226189j111309r84422j165407j142513
3188E5759042j273104j211914j381784j620860j612152j760761j724653j640033
3180D3533781j660899j651146j524693j495898j497424j302794j179165j073800
3172C2147962r65593r12994p84782o64855p99784n93190m56092m28853l28811
3163B6213008m27874k71309l16787l00243j94944l3554q2225j07878l2237J29350
3153B4575307P9742J63334Q6244J574J52605p022j00732k46801k66017n3881m4065
3142B4340288j85351j90169j09385k8588J25004K42086L36198L37778L37132M17773
3132B5622766M70460N28831O15300N00691O63476O01521P09040Q16488Q60272
$$ y = [64479634, 63509486, 62446285, 61388882, 60162693, 59051384, 58066962, 56901555, 55759042, 54485938, 53274024, 51892240, 50271380, 48659228, 46898467, 45173814, 43533781, 41872882, 40221736, 38697043, 37201145, 35703721, 34400927, 33221762, 32147962, 31182369, 30269375, 29484593, 28819738, 28019954, 27426764, 26970672, 26541819, 26213008, 25785134, 25513825, 25197038, 24896795, 24701851, 24668297, 24586072, 24478194, 24445957, 24575307, 24655049, 24818383, 24904627, 24906201, 25058806, 25051784, 24951052, 24704251, 24438234, 24384353, 24340288, 24154937, 23964768, 23855383, 23826795, 23951799, 24193885, 24530083, 24867861, 25204993, 25622766, 26093226, 26622057, 27237357, 27738048, 28401524, 29003045, 29712085, 30528573, 31388845]
3123C1388845R82969Q87925R70924J083062J044890R89270J093420Q77496O84864
3114D0003665N30554M00724K52128K55464N3890j29935k25427l69178l68540m98806
3104C9904539p00711p25043p91815r20519r03504j059522j047053j126209j203911
3095C1426252j156215j212963j126698j165997j089083j027811q88267j022524
3087B2736694q86952o86375p84489n92939o11786n69797l78886n23368n16557
3078A7185545l65987l54857k62386k92981j82837k23507j20414l7313o1462p5073
3068A5208728l376M2450P7980O058r1046j09678K02350M3840j10135j72214j24974
3057A4969983M4702j83882j24051R073k29721k48639l08253k25851k86252l78230
$$ y = [31388845, 32371814, 33259739, 34230663, 35313725, 36358615, 37347885, 38441305, 39318801, 40003665, 40534219, 40934943, 41187071, 41442535, 41496425, 41366490, 41141063, 40771885, 40403345, 39904539, 39203828, 38478785, 37686970, 36766451, 35862947, 34803425, 33756372, 32630163, 31426252, 30270037, 29057074, 27930376, 26764379, 25675296, 24647485, 23759218, 22736694, 21849742, 21163367, 20378878, 19785939, 19174153, 18604356, 18225470, 17702102, 17185545, 16819558, 16464701, 16202315, 15909334, 15726497, 15502990, 15382576, 15345263, 15283801, 15208728, 15205352, 15247802, 15325782, 15331840, 15240794, 15131116, 15333466, 15377306, 15267171, 15094957, 14969983, 15014685, 14830803, 14706752, 14715825, 14486104, 14237465, 13929212, 13703361, 13417109, 13038879]
3047A3038879l94353k17447l17474l85763l37299l23331k90692k46516l56597
3038A0169407k65858k48829j86010q0731j07266j97337j85486q4716n6076P5677
3028H832775m5368Q546j71915J0424p1786j01530l5023n6416j08152l9696r1467
3017H130392j73096r6397j09491o6844n4331j34699M4618J45554j7642p0629o2184
3006G535251l9583J51612m0238j2251N7058N7236N1247O2563J52902J57575K7630
2995H161002K27810K07205J87184O5359N5437j78734m8174L5049j46343k02163
2985H363632k44262m692j54329k55489L3456k222n6507k5149k3429j7696Q769
2974G622082J2615l6613J520J02737K8131M7784j6492R0923M6213j3461J94984
$$ y = [13038879, 12644526, 12427079, 12109605, 11723842, 11386543, 11063212, 10772520, 10526004, 10169407, 9903549, 9654720, 9468710, 9387979, 9280713, 9083376, 8897890, 8813174, 8757098, 8832775, 8787407, 8795953, 8624038, 8634462, 8562676, 8461146, 8426123, 8369707, 8261555, 8221859, 8130392, 7957296, 7860899, 7751408, 7684564, 7630233, 7495534, 7540152, 7685706, 7668064, 7597435, 7535251, 7495668, 7647280, 7607042, 7594791, 7651849, 7709085, 7760332, 7822895, 7975797, 8133372, 8161002, 8388812, 8596017, 8783201, 8848560, 8903997, 8725263, 8677089, 8712138, 8565795, 8363632, 8119370, 8114678, 7960349, 7704860, 7738316, 7736094, 7679587, 7654438, 7631009, 7613313, 7622082, 7634697, 7598084, 7599604, 7702341, 7730472, 7778256, 7761764, 7852687, 7898900, 7885439, 8080423]
2963H080423R5524J56083J6596J61204J10708R2422O8553K9971L926J42957O8375
2952I026742K8964L8315L8170J65749J31706L7238P5792J94322J31006J29153
2942I997157K59093J00556J58230K50480J87653J31886K49787J85289J29680J77886
2932A1827697J40783K29432K57647K01736J61202J56614K61773K72005J86001
2923A3694890J64131J29424L12690L14250K77960L16715L30115L77593K46606
2914A6164374L14198L61880M91718M51991L57036L56804M71894N21458N21313
2905B0012666M49036N39315N73951N98888O77782M85000O32404O09704P51739
2896B5330485P73277P80802P64628Q80250J021626R56623R31727J102754J170973
$$ y = [8080423, 8175947, 8332030, 8348626, 8509830, 8620538, 8712960, 8781513, 8811484, 8815410, 8958367, 9026742, 9055706, 9094021, 9132191, 9297940, 9429646, 9466884, 9542676, 9736998, 9868004, 9997157, 10256250, 10356806, 10515036, 10765516, 10953169, 11085055, 11334842, 11520131, 11649811, 11827697, 11968480, 12197912, 12455559, 12657295, 12818497, 12975111, 13236884, 13508889, 13694890, 13859021, 13988445, 14301135, 14615385, 14893345, 15210060, 15540175, 15917768, 16164374, 16478572, 16840452, 17332170, 17784161, 18141197, 18498001, 18969895, 19491353, 20012666, 20461702, 21001017, 21574968, 22173856, 22851638, 23336638, 23969042, 24578746, 25330485, 26103762, 26884564, 27649192, 28529442, 29551068, 30507691, 31439418, 32542172, 33713145]
2887C3713145J172853J359708J350023J447931J377254J589143J644128J597743
2879D5251928J494589J505355J773452J716627J773728J864586J946739K142269
2871E9469273K350383K562457K815597K949833L036768L377610L654698L809155
2863H4025774M200884M623110M970198N483211N806337O210517O312424O113172
2855A27745627N735755M934508L613691J686192j57947j668768k997331m296848
2847A34594879n289151n594314n487408n115474m511131m193271l981646l887627
2839I6534857m017913m005758l987140m095136l979568l733042l402435l059660
2831F6254205k823942k551599j989787j576288j387374j283089j072403r34504
$$ y = [33713145, 34885998, 36245706, 37595729, 39043660, 40420914, 42010057, 43654185, 45251928, 46746517, 48251872, 50025324, 51741951, 53515679, 55380265, 57327004, 59469273, 61819656, 64382113, 67197710, 70147543, 73184311, 76561921, 80216619, 84025774, 88226658, 92849768, 97819966, 103303177, 109109514, 115320031, 121632455, 127745627, 133481382, 138415890, 142029581, 143715773, 143557826, 141889058, 138891727, 134594879, 129305728, 123711414, 118224006, 113108532, 108597401, 104404130, 100422484, 96534857, 92516944, 88511186, 84524046, 80428910, 76449342, 72716300, 69313865, 66254205, 63430263, 60878664, 58888877, 57312589, 55925215, 54642126, 53569723, 52635219]
2823E2635219q51048q65746q21190r33225q56031r24640r43553p53246o04151
2814D5082389j50715j28354p1711J12420J92278J3792l25425p27141j214737j648016
2804D1134780j870163k318643k374538k378611k179813j790401j851522j549337
2796B4821752j278969j235848j166935r77421q62431q53007q50112o17034o56420
2787A6323575n68607n52284m27306m61928n55759l19002l03077k98296l50830
2778A2486486k42831l03079k96281k55283k37532k98456k10414j05710j34769
2769A0402131k60434k25827k07100j22883q4959j20291j10797l987N1875k2073
2759I295655j7789l8760r9254k9529Q2504P7097J5651J04745K44200n785J14772
$$ y = [52635219, 51784171, 50918425, 50097235, 49164010, 48307979, 47383339, 46439786, 45686540, 45082389, 44931674, 44803320, 44731609, 44844029, 45036307, 45050099, 44724674, 43997533, 42782796, 41134780, 39264617, 36945974, 34571436, 32192825, 30013012, 28222611, 26371089, 24821752, 23542783, 22306935, 21140000, 20162579, 19300148, 18447141, 17597029, 16979995, 16323575, 15754968, 15202684, 14775378, 14313450, 13757691, 13438689, 13135612, 12837316, 12486486, 12243655, 11940576, 11644295, 11389012, 11151480, 10853024, 10642610, 10536900, 10402131, 10141697, 9915870, 9708770, 9585887, 9500928, 9380637, 9269840, 9265853, 9317728, 9295655, 9277866, 9239106, 9139852, 9110323, 9192827, 9269924, 9285575, 9390320, 9634520, 9628735, 9743507]
2748I743507N969m5874J7957p2683j63082j87608l43581k98576l77668l88149
2738G890212l39823k77815k47600k46137j91733l19473k08983p2538j67893j54390
2728E663827j11275l0885j52465k74161k09732j33993q8054o8641m7599p7329
2718D469693j20398j12012p2839L3927j27897r5954J7151n2825o7809j24567J5157
2707C761627j734o5251j37282R0792L5953K7164m2971l4458R3885P4080l5206
2696C766599K6081K7569p9385j04335n4679p6158j29116k48192n2816p9804j3692
2685B982072j36253k37602j19684j9364p3172o3880j36455m4352p8816o9373L5553
2674B038674j45033p745p7239p3503L4012j7978j43021L9750l1249K6100k6555
$$ y = [9743507, 9749476, 9703602, 9721559, 9648876, 9485794, 9298186, 8954605, 8656029, 8278361, 7890212, 7550389, 7272574, 7024974, 6778837, 6587104, 6267631, 6058648, 5986110, 5818217, 5663827, 5552552, 5521667, 5369202, 5095041, 4885309, 4751316, 4663262, 4594621, 4547022, 4469693, 4349295, 4237283, 4164444, 4198371, 4070474, 3974520, 3991671, 3938846, 3871037, 3746470, 3761627, 3759893, 3694642, 3557360, 3648152, 3684105, 3711269, 3668298, 3633840, 3727725, 3801805, 3766599, 3792680, 3820249, 3740864, 3636529, 3581850, 3505692, 3376576, 3128384, 3075568, 2995764, 2982072, 2845819, 2608217, 2488533, 2469169, 2395997, 2332117, 2195662, 2151310, 2072494, 2003121, 2038674, 1893641, 1885896, 1808657, 1735154, 1769166, 1751188, 1608167, 1647917, 1616668, 1642768, 1616213]
2663A616213K3038j05375m5707L1855l5076k5454r9690j44290m251K9195M5307
2652A285765l1216N8639Q9949q2477j08854j40915J46820j1905j0747j2941o8278
2641A113840N3589L0904m8511l5845r5237Q7462L0796l3512n8123o3060O2973
2630A045276j35700M3203N9516l956o6790L5792O621l5963m373j08351L5096J63063
2618A033434m4805j01503M9410P8243L2946j08754n8985M2875Q874j28713K1848
2607H24870K7458N4406l7461m0219l204p6727L0879J29216p069j19048j4352P7762
2595H46511J0519k3167l9286K1039j2517q3626n0900M4568J29281K6700l3206
2584H35916N2480J040m2837m92O0178O1184k4614m8926P0386N5666o0905M7972
$$ y = [1616213, 1639251, 1533876, 1488169, 1520024, 1484948, 1459494, 1359804, 1215514, 1211263, 1240458, 1285765, 1254549, 1313188, 1403137, 1320660, 1211806, 1070891, 1217711, 1205806, 1195059, 1182118, 1113840, 1167429, 1198333, 1149822, 1113977, 1018740, 1106202, 1136998, 1103486, 1045363, 982303, 1045276, 909576, 952779, 1012295, 1008339, 941549, 977341, 983962, 947999, 943626, 835275, 870371, 1033434, 988629, 887126, 936536, 1014779, 1047725, 938971, 879986, 922861, 931735, 803022, 824870, 852328, 906734, 869273, 829054, 825850, 749123, 780002, 909218, 902149, 783101, 768749, 846511, 857030, 833863, 794577, 815616, 803099, 719473, 668573, 713141, 842422, 869122, 835916, 888396, 889436, 846599, 846107, 906285, 967469, 942855, 893929, 964315, 1019981, 959076, 1007048]
2572A007048L5240N3344O5249k3449k1360O5182M2850q805j39616N0865j20148
2561A006400q5808J06876q1231O2667p1655j27959q1983l9483J61423n7900n4719
2550G36628L736l2972o5832K8327l8104L365q992n1169N6013k9892n7786j8558
2538E24764k8320L7042p0788J82902N542q1120m9650k4161m171P2464K5637j9926
2526E70215p1347J3568L6236r0723m4241P0653J2203n3044O997n988N9979O0419
2514E64927n6857j21378N5399j1515p5101o6752M2410J17172n7678o0200Q983
2503C39410j21534r958R6356L4943k85R2410j21016k6999k3513m7761m2721J30773
2491C00105l2503O0584j05569O5411J7483j52223o8260J02369L9883j1756K5388
$$ y = [1007048, 1042288, 1095632, 1160881, 1137432, 1116072, 1181254, 1224104, 1215299, 1075683, 1126548, 1006400, 920592, 1027468, 946237, 1008904, 937249, 809290, 727307, 687824, 849247, 791347, 736628, 740364, 707392, 641560, 669887, 631783, 635148, 626156, 574987, 631000, 601108, 543322, 524764, 496444, 533486, 462698, 645600, 651142, 570022, 520372, 496211, 492040, 564504, 590141, 570215, 498868, 512436, 548672, 457949, 413708, 484361, 496564, 443520, 450517, 444529, 504508, 564927, 508070, 386692, 442091, 430576, 355475, 288723, 331133, 448305, 390627, 330427, 339410, 217876, 207918, 304274, 339217, 338932, 431342, 310326, 283327, 259814, 212053, 169332, 300105, 267602, 328186, 222617, 288028, 305511, 153288, 85028, 187397, 227280, 215524, 240912]
2480B40912j13306J1415n8070M6950j190j25891L6162O4919P0805q3853o402K12391
2468B94842N2999j03965j31436P209J0898m6032o7678N8313O6602M5001j00788
2457H5965M3400J17394j04960n8638O038j304Q2433M9017n2898p5763m8199L8763
2445H1248l0377Q5951K6628q5347O035p4064K122m3162P7495J81263j29886j2128
2433H5778P149l5190M3540j2228m0327J10169q0547n9343l084m0678k5617O2434
2421A2056j296O3831N0425j16622J6779O3027k5431j10726N5048J4813P9861n1316
2409E0449l9487J6693J09858M487n3144K6461L7199r3235K9600l5686o128K1551
2397F8618l1954r687k3170K4350M5004j3687o8947n9557M9258M2517O9394l7858
$$ y = [240912, 127606, 139021, 80951, 127901, 126711, 820, 36982, 101901, 172706, 88853, 82451, 294842, 347841, 243876, 112440, 119649, 130547, 84515, 16837, 75150, 141752, 186753, 85965, 129365, 246759, 141799, 83161, 89199, 87895, 170328, 219345, 166447, 90684, 42485, 81248, 50871, 136822, 163450, 78103, 84138, 10074, 12196, -30966, 46529, 227792, 97906, 85778, 92927, 57737, 101277, 89049, 48722, 158891, 78344, 19001, 15917, -24761, -50378, 12056, 10760, 74591, 125016, 8394, 25173, 88200, 62769, -47957, 7091, 21904, 101765, 50449, 10962, 27655, 137513, 142000, 88856, 115317, 152516, 59281, 88881, 53195, 47067, 68618, 36664, 26977, 3807, 28157, 73161, 59474, -9473, -69030, -19772, 22745, 92139, 54281]
2385E4281L0184O185j9570l4964Q4750o3287O869J2185l5714N4229j11136J6942
2373I54N997P1978k730J4288J2656m1917k7306j28322O5184R7834l5532M11R403
2360D2898k1715r7027K7847J35822K5536k7783N5524j06510K2286n076K8699K5632
2348A06133l4394p3434k4705M7475o5934J0714R6404p9948P9889l3108o1308N0416
2336A8200M4987l2943n7331J31100o2416j01025M2031J31875R283o9370o3889
2325i498L5789J27014k971l8774P9323L3444l8401O065N2948m239O5631n8636
2313B47695m4990J8725m7280J870j65897l5011O2063M5237O382r2528j8536j8134
2301d0404k0878k5714J6357M9230p8975R2181L7826N3444K8527l6661m5389q479
$$ y = [54281, 84465, 90650, 71080, 36116, 120866, 57579, 64448, 76633, 40919, 95148, -15988, 954, 6951, 78929, 76199, 90487, 103143, 61226, 33920, -94402, -29218, 68616, 33084, 33495, 42898, 21183, -75844, -47997, 87825, 113361, 85578, 141102, 34592, 56878, 51802, 80501, 106133, 71739, -1695, -26400, 21075, -44859, -34145, 62259, -17689, 62200, 29092, -32216, 18200, 63187, 30244, -27087, 104013, 41597, -59428, -17397, 114478, 123761, 54391, -9498, 26291, 153305, 150334, 111560, 190883, 224327, 185926, 191991, 244939, 240700, 306331, 247695, 202705, 221430, 174150, 176020, 10123, -24888, 37175, 82412, 88794, -3734, -22270, -40404, -61282, -86996, -70639, -21409, -100384, -8203, 29623, 83067, 111594, 74933, 29544, 21065]
2289B1065J7708m1132j4646O0976M8372K4990l6677k2210r6350j1535K01281p5598
2277G6244k3021P507o6290r9530N5434J29208R5110j4324j23201N523O14k6467
2265A6807L258J6616M9378l76o6870L5681J4478M1271j2045m9017J0748o368p8000
2252b4439Q0749K3921j52720J5752O1256n508o346k9977P0448J50802p2355P6925
2240A88508L2647j17756M902P1208n3379j53445L0878O427J05681p0m7660M9842
2228A17783p796l6611r0245l2541J12933J3361l3636o662M9627p140k0892L2843
2216I1024l5588Q6117k3888j4805n5704N7364j3462Q1094m9361q1326L2101l4649
2204C8917j4250l4882Q0399K7300K6850l8577n1065P0048Q0851K1448k9288N3841
$$ y = [21065, 38773, -2359, -17005, 43971, 92343, 117333, 80656, 58446, -37904, -49439, 151842, 76244, 53223, 60730, -5560, -105090, -49656, 79552, 174662, 160338, 37137, 42660, 43274, 16807, 20065, 36681, 86059, 85683, 18813, 54494, 68972, 110243, 98198, 49181, 59929, 53561, -24439, 56310, 80231, -72489, -56737, 4519, -989, -7335, -37312, 33136, 183938, 111583, 188508, 221155, 103399, 108301, 179509, 126130, -27315, 3563, 9990, 115671, 115601, 67941, 117783, 109987, 73376, -16869, -49410, 63523, 76884, 43248, 36586, 86213, 79073, 58181, 91024, 55436, 141553, 117665, 102860, 47156, 104520, 91058, 172152, 122791, 41465, 73566, 38917, 24667, -10215, 70184, 97484, 124334, 85757, 34692, 104740, 185591, 207039, 177751, 231592]
2192B31592j2433j26628j34907J46405K8414K6904k01m9634J09278j162l6169
2181A81459K0515K8324J3795k5450m2145o3880K7480N2778L471M1228M631J2974
2169B55180M4387P02n1114k0714O752j1820j4696l1827m8834N005J44448Q0653
2157C58122l8115M6567k1815r963M6260n1816j23571J0538O3400l5974K6273J03119
2145C73025P7715M1239k0718j8849p36k5385n2400J16391p3575N3849J4007P9843
2133E64406N1679p5265J094J8124l6428M9084M1569N1432K0263P3215N8044J5187
2121H32404J8632K8168l029j1949N8564O6117P6201J6782K7994R9213r8843O0720
2109A170974J37588J6020q543J07412k5252o3952R6735J93831O2698P828O3423
$$ y = [231592, 219159, 92531, -42376, 104029, 132443, 159347, 159146, 109512, 218790, 217628, 181459, 201974, 230298, 244093, 218643, 176498, 112618, 140098, 192876, 196347, 237575, 242206, 255180, 299567, 300269, 249155, 228441, 235193, 223373, 208677, 176850, 128016, 133021, 277469, 358122, 320007, 366574, 344759, 334796, 381056, 329240, 205669, 216207, 279607, 243633, 269906, 373025, 450740, 491979, 471261, 452412, 451676, 426291, 373891, 490282, 416707, 470556, 484563, 564406, 616085, 540820, 541914, 560038, 523610, 572694, 614263, 665695, 685958, 759173, 817217, 832404, 851036, 879204, 876175, 864226, 922790, 988907, 1065108, 1081890, 1109884, 1209097, 1110254, 1170974, 1308562, 1324582, 1316039, 1423451, 1398199, 1334247, 1430982, 1624813, 1687511, 1695339, 1758762]
2098A758762m399J55097O2499Q2554R1846P5813J10855O4029M8351K35723L4478
2087B715608M7044M9264J55953Q3438J51888J93616M8230K61553K01731J27067
2077D035392N2878L11265L30545K40850L48132K39770L29910L07527M73341M71480
2067G141090O12934O15109P62445P15530O48146N72659M75082O48742J052882
2058A3244619J455233J785672J750986K306114L367014M346975L390141O58674
2050C2305428q90435K60280r72447l405971m428708m615692l535661k631675j774128
2041A0310991j381640r57312q66084p01941m49980l45655m96886k69790l76738
2032D464965l80728l12062l06661k03246k16946j97502j67164r3470j39664j69872
$$ y = [1758762, 1754363, 1909460, 1971959, 2054513, 2146359, 2222172, 2333027, 2397056, 2445407, 2681130, 2715608, 2762652, 2811916, 2967869, 3051307, 3203195, 3396811, 3445041, 3706594, 3908325, 4035392, 4088270, 4399535, 4730080, 4970930, 5319062, 5558832, 5888742, 6196269, 6669610, 7141090, 7754024, 8369133, 9131578, 9847108, 10495254, 11067913, 11542995, 12191737, 13244619, 14699852, 16485524, 18236510, 20542624, 23909638, 28256613, 31646754, 32305428, 31414993, 31675273, 30702826, 27296855, 22868147, 18252455, 14716794, 12085119, 10310991, 8929351, 7972039, 7105955, 6404014, 5954034, 5608379, 5111493, 4841703, 4464965, 4084237, 3772175, 3465514, 3262268, 3045322, 2847820, 2680656, 2587186, 2447522, 2277650]
2022B277650q4551j87926j42094r17p4500j60158p2379j20315j5033K5541k1572
2011A423746k09498l7604l2271m9262p3820R1333R896j44202n8263j20204o0834
2000G39017N0592q054k5891r1525j4793r7805M991M3627k22O8761o5857l7707
1988E65134j7885J0694l1998j19593j01927J7863K0172k571j21767J09843J11476
1977D39441o8595j20802O0231m5570k2778K620J28365j12277q5104P6899J7790
1966B70220m3253K7498K8769j71030O3908O3560J7941o8691N3270q263k3899k1879
1954A88151M3981L2217m2651O1819j4722n5225m0749M8759j61008N1775L0463
1943A42810J9831J45079j18194j3930m1740p7007o0819N4152R2845M6793o1541
$$ y = [2277650, 2193099, 2005173, 1863079, 1862162, 1787662, 1627504, 1555125, 1434810, 1419777, 1445318, 1423746, 1214248, 1176644, 1144373, 1095111, 1021291, 1112624, 1122520, 978318, 920055, 799851, 739017, 789609, 781555, 755664, 664139, 649346, 551541, 556532, 600159, 599937, 668698, 602841, 565134, 547249, 557943, 525945, 406352, 304425, 322288, 342460, 339889, 218122, 327965, 439441, 370846, 250044, 310275, 264705, 241927, 244547, 372912, 260635, 175531, 252430, 270220, 226967, 254465, 283234, 112204, 176112, 239672, 257613, 188922, 242192, 233929, 210030, 188151, 232132, 264349, 221698, 283517, 268795, 213570, 172821, 221580, 60572, 112347, 142810, 162641, 307720, 189526, 175596, 133856, 56849, -3970, 50182, 143027, 189820, 128279]
1932A28279q8927m389J08756l1911j5259K5057L0142P3120k2765o0486P2412k3784
1920A90245q6801j20342M9826L6694p8388N5691N7304j43187K3622k5788L3502
1909g622M6630l5568M469n7016K6726L9807n3975R531K9179j4622m3680p4425
1897a30566J57971r9314k1678O7812M8043J25831k9440p7096J34963k6424j17608
1886C2494r5605J02909M7731j07000N4315K752j08015j5023m0026Q5929Q3802
1875D4263l8242o7356m3712q543P4489q3179K7341O0361N4720o7344M8032n5962
1863e5132N5210J26772n6765K1418n8148l3832j12750l4950J35403J8284j5362
1852i852j4812L6288O346K878r37K4897L2616j02604j2476j1326j852j7227J01659
$$ y = [128279, 39352, 34963, 143719, 111808, 96549, 121606, 151748, 224868, 202103, 141617, 214029, 190245, 103444, -16898, 32928, 69622, -8766, 46925, 104229, -38958, -15336, -41124, -7622, 39008, 3440, 7909, -49107, -22381, 17426, -36549, -27018, 2161, -12461, -56141, -130566, 27405, -71909, -93587, -25775, 22268, 148099, 118659, 41563, 176526, 150102, 32494, -63111, 39798, 87529, -19471, 34844, 37596, -70419, -85442, -125468, -39539, 44263, 6021, -61335, -105047, -113590, -39101, -122280, -94939, -34578, 20142, -47202, 830, -55132, 78, 126850, 70085, 91503, 33355, -477, -113227, -148177, -12774, 5510, -9852, -24664, 11624, 17970, 20848, 19911, 44808, 77424, -25180, -37656, -48982, -50834, -68061, 33598]
1839C3598M8834j1527k7999n5921p4164k555J27411l9400k5890L2086j1724k831
1827a0082K8399r735o7630q769J2444J2888n6264N5126L3783K2034l9384j5889
1815d3079L9472O2922n4048L2432l0542M8430o930m4478R1340n9002r7762K359
1803e8886J4625j3008O5450K7105J1761P0371r0749l9127o7595q672j4856K8104
1791g5477k8856N4790Q6055L3139P2456p4544m2587K371M0100P1092L756m6993
1779I5302k731L2853J3847o7402l0550j3169K8346n8698l2247J2037R104q4472
1767i7780L2028k390P5852L5626l7329R9959l3565m5769j26987K0556j7605K6892
1755g0512M4807N2151o4393l1187l4470J50599M7054j18740o569R2486k4071M803
$$ y = [33598, 82432, 70905, 42906, -13015, -87179, -89734, 37677, -1723, -27613, 4473, -7251, -10082, 18317, 8582, -59048, -67817, -55373, -42485, -98749, -43623, -9840, 12194, -27190, -43079, -3607, 59315, 5267, 37699, 7157, 55587, 48657, 4179, 95519, 36517, -61245, -58886, -44261, -57269, 8181, 35286, 47047, 117418, 26669, -12458, -80053, -88725, -103581, -75477, -104333, -49543, 36512, 69651, 142107, 67563, 24976, 27347, 67447, 138539, 142295, 95302, 92571, 125424, 139271, 71869, 41319, 28150, 56496, -2202, -34449, -22412, -13308, -97780, -65752, -68142, 7710, 43336, 6007, 105966, 72401, 26632, -100355, -79799, -97404, -70512, -25705, 26446, -37947, -69134, -103604, 46995, 94049, -24691, -31260, 61226, 37155, 41958]
1743D1958N5061n5391j32936p3544O9019J1120N9754o9606L1704k628O4618N0406
1731D9535o0720o9063O6363k7316K5479l9560m6730L7544J45354o2226j09243
1720i0583Q2431K0707q5200n7351j1428j4104P030r4498J12806J70557N5080p6390
1708A9057j13990p6949L6408P9485l7676N2656j08497J62091m965R39P8827k01748
1696a14362j4852J35452N7936q4211J8451O4959r4528j6149J8577j171O333n9858
1684h3423J6927N2417k6868N9280l9525j6868K6454p5456Q7638M8553r5426j117
1672d7414J8052K4522p6337L6819K0693J6077k5136K4571q806j28326k7951n6253
1660b29489O7059N3000N4722n3712J3650j710L8304j20564j8091L2897J6508J24604
$$ y = [41958, 97019, 41628, -91308, -164852, -95833, -84713, -24959, -94565, -62861, -65489, -871, 49535, -11185, -80248, -13885, -41201, -15722, -55282, -102012, -64468, 80886, 18660, -90583, -8152, 12555, -72645, -129996, -141424, -155528, -148498, -242996, -130190, 40367, 95447, 19057, -94933, -171882, -135474, -55989, -93665, -41009, -149506, 12585, 7620, 8559, 87386, -114362, -129214, 6238, 64174, -20037, -1586, 63373, -31155, -47304, -28727, -29898, -23565, -83423, -66496, -14079, -40947, 18333, -21192, -38060, -11606, -87062, 576, 49129, -46297, -47414, -29362, -4840, -81177, -44358, -23665, -7588, -32724, -8153, -16959, -145285, -173236, -229489, -162430, -109430, -54708, -108420, -94770, -96480, -58176, -178740, -196831, -163934, -147426, -22822]
1648b2822l8631k9150J6348m3653R8251j3266J3333k2047J11610q725m6443m9185
1636c4380r8921P8163L4254n4424M0215J6292o6719O0956M9083m7644o4031O339
1624h0817M0247k7677q3416L0037j773N4974N4196q6884J3530q670L9282J15737
1612E8766M1488j6072j4534j42321j26016P939k3916J59196n2459k5754K0133
1601a13550k8900N2507j9471J5897J2140k8631j0630N396j0892O4086N5146m1739
1589d8641m7222j659l8870L9535L398j13065J03743J64314m1658j7993M9381k5979
1577B5284p9762o9158K9652k1753L8404L739M6840j6725M7131J3946p3185j1065
1565f6652K3371p5671o4225O8839P280P0494o3545k8013Q5491J1798j4944N2084
$$ y = [-22822, -61453, -90603, -74255, -117908, -19657, -32923, -19590, -41637, 69973, 61248, 14805, -34380, -133301, -55138, -20884, -75308, -35093, -18801, -85520, -24564, 24519, -23125, -87156, -80817, -40570, -68247, -151663, -121626, -123399, -68425, -14229, -101113, -87583, -96253, -56971, 58766, 100254, 84182, 69648, -72673, -198689, -190750, -214666, -55470, -107929, -133683, -113550, -142450, -89943, -109414, -93517, -81377, -110008, -120638, -115242, -126134, -62048, -6902, -48641, -95863, -97522, -136392, -96857, -93459, -206524, -102781, 61533, 19875, 1882, 51263, 25284, -54478, -123636, -93984, -115737, -77333, -73594, -26754, -43479, 3652, 17598, -55587, -66652, -43281, -118952, -183177, -114338, -107058, -36564, -100109, -128122, -42631, -30833, -45777, 6307]
1553F307j04210l1840O1965j5015r8779L5033N5629o7694k8306Q9786L6456l063
1541f3731Q0217p1973J0580k244J0319J0441k3957L2908L6241J5908j05952O584
1529f4659j6158L5864Q2808L6113o6202q3421O2439o3126P4519r787m3872l4319
1517h9801o4510M5519J25139j9790n1807K2080O6850l5983q405P267k6726O811
1505b3356K668K1500J992n3963k5174J04587k2879L3684q3956J4446r2242o7824
1493a90517J27009m955J8836k7479J60858l5163O5171k6934r5145o378o8263l8575
1481a21535M6925m1312j3295Q5815l9693j6170N1844J00073m1327j6649j5363
1470b0687n1323L1572J846K5345J45019n1268l4210j00685p1824J14255j2381
$$ y = [6307, -97903, -129743, -67778, -82793, -181572, -146539, -90910, -158604, -186910, -97124, -60668, -63731, 16486, -55487, -44907, -47151, -36832, -26391, -50348, -17440, 18801, 34709, -71243, -64659, -80817, -44953, 37855, 73968, 7766, -75655, -13216, -76342, -1823, -11610, -55482, -89801, -154311, -108792, 16347, -3443, -55250, -33170, 33680, -2303, -10708, -3441, -30167, -23356, -20688, 812, 2804, -51159, -76333, 28254, 5375, 39059, -44897, -30451, -122693, -190517, -63508, -68463, -49627, -77106, 83752, 48589, 113760, 86826, -8319, -14697, -82960, -121535, -74610, -115922, -129217, -43402, -83095, -99265, -47421, 52652, 11325, -5324, -20687, -72010, -40438, -38592, -13247, 131772, 80504, 46294, -54391, -126215, -11960, -24341]
1459b4341j04469R2355o4855Q049P6856M1180J7817j5168m257k9522j26365J0138
1447a22582P7554k4396N398K8125m3376J5549M0059p248l1822R2566j19141q1351
1435a70665n3978Q7980N2835O1007o0787j00839P7871Q2754j2272n5313K1582
1424f9825m8951P7005L5310m1676O8927l1586n8608J56920J8797j36940j12202
1413a42829J36965K0162p1422k5650M2186K4536k1183j30432R3141K6971k3745
1402g1300L1936K2861k8772n78r6242J27241p2918k6085N8063k7893P2250k307
1390a3744n9669M22q53R5770k8860O577k6544k2864K4418L6898M1771q1241L5247
1377G328R196m881M5178k2264j11910J4856L8468Q5409j60280O9492J03947j14610
$$ y = [-24341, -128810, -36455, -101310, -93261, -16405, 24775, 42592, 27424, 23167, -6355, -132720, -122582, -45028, -69424, -64026, -35901, -79277, -63728, -23669, -30917, -62739, 29827, -89314, -170665, -224643, -136663, -83828, -22821, -83608, -184447, -106576, -23822, -36094, -91407, -69825, -118776, -41771, -6461, -48137, 20790, -10796, -69404, 87516, 106313, -30627, -142829, -5864, 14298, -57124, -82774, -40588, -16052, -37235, -167667, -74526, -47555, -71300, -39364, -16503, -45275, -45853, -142095, -14854, -87772, -113857, -55794, -83687, -11437, -13744, -73413, -72991, -73844, 21926, -6934, -357, -26901, -49765, -25347, 11551, 53322, -27919, 7328, 16524, 11643, 56821, 34557, -77353, -62497, -24029, 61380, -98900, -29408, 74539, -40071]
1365d0071J3969L9496r3666k9226P6152p3361j4398P8503m4222L3451P3266o0670
1353d0777o8154l7206Q7916O9832M1742K7942l1112j7547P980M6294p3224o7675
1341e3989k0623N6726n7959J06133Q9131j05013O8312N6828q7551p7257n1371
1330g6633q3439O6520N2773o3881j6114L7303l7535J02749M5062r6846O1271O1035
1318E2265j15853j7656J12769j081N1092N1574j41691k3446n7406N8371P1590
1307D0528j15369J0561L7369L6255o7997N8624p4680J5239J9352K7003O2276o9973
1295b0812r514p0614N5685J3702j35214M5087J11156K6168K1152K3846K9415M1617
1283A31674j51158p8475J22761N9432p8948M577J9603o4860q0049Q4650J02157
$$ y = [-40071, -26102, 13394, -80272, -109498, -33346, -106707, -121105, -42602, -86824, -53373, 19893, -40777, -108931, -146137, -58221, 11611, 53353, 81295, 50183, 32636, 40616, 86910, 13686, -53989, -74612, -17886, -75845, 30288, 119419, 14406, 82718, 139546, 51995, -25262, -76633, -160072, -93552, -40779, -104660, -120774, -83471, -121006, -18257, 26805, -70041, -8770, 52265, -63588, -81244, 31525, 30444, 81536, 133110, -8581, -32027, -89433, -31062, 40528, -74841, -64280, -26911, 9344, -58653, -29, -74709, -59470, -40118, -13115, 49161, -20812, -30326, -100940, -45255, -31553, -166767, -121680, -10524, 15644, 36796, 60642, 90057, 131674, -19484, -97959, 24802, 84234, 5286, 9863, 29466, -35394, -115443, -30793, 71364]
1272G1364l722L7815q7373N5250n8472j0805K9332j32183O5989p459J01959p168
1260E4527N2559l4620J8608j12929k4731J62654p6001m8679N4522r8148K5229
1249b7009n12j4912o937M065L0982N2250k7477k8991j9183j01358Q5043l1596
1237h5635r998K6060N3057M996m9726Q992j407k2969j7865N1881O4846n8087L6126
1224B71m8928p873o8755m1253N8731N3964j273R6250l7360J8772L15m7015k3386
1211d7540P6749m2228l1251l8359N492J199n3173l182P6530p6925j1877P3631
1199g0934j2521J5634K9031K4326m8923N5652M0179p7078n6275K107k8049J24923
1187a928J7771q6788Q7603K837l1923q3219N3409K6357K4431P3696l9438o9422
$$ y = [71364, 67642, 105457, 18084, 73334, 14862, 4057, 33389, -98794, -32805, -40264, 61695, 54527, 107086, 72466, 91074, -21855, -46586, 116068, 40067, -8612, 45910, -52238, -27009, -27521, -42433, -49370, -45305, -14323, 37927, 10450, -18541, -37724, -139082, -54039, -85635, -95633, -69573, -16516, -11520, -61246, -52254, -53661, -76630, -94495, -42614, 22232, -35855, 271, -48657, -56530, -125285, -166538, -107807, -53843, -55116, 41134, 3774, 22546, 22861, -24154, -47540, 29209, -13019, -44270, -82629, -77137, -75938, -129111, -132293, -55763, -132688, -144565, -70934, -83455, -67821, -38790, -14464, -63387, -7735, 32444, -44634, -100909, -98802, -126851, -1928, 15843, -70945, 16658, 19495, -12428, -95647, -42238, -15881, 8550, 82246, 42808, -26614]
1175b6614l1837r2r963L1690L0202j05619L6663k9793N9197O7718p6137m1625
1163i6210J2298P9971k6155k3893K3818r160r5805l3766m5576j7566N7392P3320
1151a01332J2155l2601p51M8957k0311j6240J4805N9428N2535J02228p2217j77062
1139a30406J15396k5641j14380J03247r5719l1190J09398J24241N9670j7054j36854
1128c9292j0031L1119k1103p7465N1214L6372k7758o592Q9035K281p7787P1918
1116B1911q1058p4697N6268M0812J9947J1054n4577m7949P9350P0424K7517j24089
1104e5087p2269K00401n862o0256K085n0270N3347m6394o9560K7760Q7876M040
1092A5811L0360p6562K2986K0782m7084m7068L4072L3205J9258n2410Q5435l0429
$$ y = [-26614, -58451, -58543, -68506, -36816, -6614, -112233, -75570, -105363, -46166, 21552, -54585, -96210, -83912, -3941, -30096, -53989, -30171, -39331, -135136, -168902, -214478, -232044, -174652, -101332, -89177, -121778, -122529, -73572, -93883, -110123, -95318, -35890, 16645, 118873, 46656, -130406, -15010, -40651, -155031, -51784, -147503, -178693, -69295, 54946, 114616, 97562, -39292, -49323, -18204, -39307, -116772, -65558, -29186, -56944, -63536, 25499, 27780, -50007, 21911, -59147, -133844, -77576, -36764, -16817, -5763, -60340, -108289, -28939, 41485, 69002, -55087, -127356, 73045, 67183, 6927, 9012, -41258, 12089, -34305, -103865, -76105, 11771, 15811, 46171, -30391, -7405, 13377, -33707, -80775, -46703, -13498, 5760, -46650, 38785, 8356]
1080H356l7534n3389N7176R5081j34725O8638J6580j26078Q717J34664p7782p7600
1068a17896P3906N988m6404Q3999o4620N1159P9959r8301M4238j4440k0422k8682
1056e1516Q4781Q095M996o1157R8610j4010p0349N5457j32252N4738k1692m0733
1044h5032l8082M4379j47r109k1914J19262O4051j22681J2124L8280j4088n0621
1032f3578N0911R3790n5955j3076r6048K7452J1422l0803J1186R5553l0813J7388
1020A7429k3504K4683n291m5726j1369J11188n3195m9483j3680j9413L1551k1107
1008e7917Q5701J2297j3852o6742k1606l2516O8029K3554o5037j7919J05662O0354
996H0008j13593L7190q0367Q6630R1338k9441J05m7857o6902r753R7310N1092
$$ y = [8356, -29178, -82567, -25391, 69690, -65035, 3603, 20183, -105895, -97178, 37486, -40296, -117896, -43990, -38002, -84406, -407, -65027, -13868, 66091, -32210, 12028, -2412, -22834, -51516, 33265, 41360, 46356, -14801, 83809, 69799, -550, 54907, -77345, -22607, -44299, -85032, -123114, -78735, -78882, -87991, -109905, 9357, 73408, -49273, -37149, 1131, -12957, -63578, -12667, 81123, 25168, 12092, -83956, -56504, -45082, -75885, -64699, 30854, 41, 17429, -6075, 18608, 13317, -32409, -43778, 67410, 14215, -35268, -48948, -68361, -36810, -57917, 27784, 40081, 26229, -40513, -62119, -94635, -26606, -3052, -68089, -86008, 19654, 80008, -33585, 3605, -76762, 9868, 101206, 71765, 71870, 24013, -42889, -52642, 44668, 95760]
984I5760j9317q0178J2106j4330L7871J7699p9823N0218M6130p744l2741J0215
972C5866k3144J8475j0612P4863j14895m8960k4656K4024M6179m0517L3657R3039
960F3319o4843m0260K5437j34404J0512Q4133J05506j38403j5543n2694Q3176
949g4064k3031K1981J8957J4549N04m521N0689L433N5192p8630q7126K7336J1479
936f3252j1934M032N7198n7193k7041n1620R98J00469l5753L953J39090J669m3637
923A6979l2446N9268L354o5337K6043k5866L2634j6327j4643J5746m9287O7257
911A7375R8930m5692k6331J2235j1282k9158m3236N2952j03209L0283M8700r3076
899i1509N3676P3521l1403p3830K6339O1483n3811p5205K5925q9525k8249L6786
$$ y = [95760, 76443, -3735, 8371, -5959, 31912, 49611, -30212, 20006, 66136, 58392, 25651, 35866, 12722, 31197, 20585, 95448, -19447, -68407, -93063, -69039, -22860, -63377, -29720, 63319, -1524, -41784, -16347, -150751, -140239, -56106, 49400, -89003, -104546, -157240, -74064, -97095, -75114, -56157, -41608, -41104, -45625, 5064, 8497, 63689, -14941, -102067, -74731, -63252, -75186, -71154, -13956, -71149, -98190, -149810, -148812, -48343, -84096, -80143, 58947, 60616, 16979, -15467, 43801, 47155, -18182, 7861, -18005, 14629, -1698, -16341, -595, -49882, 17375, 116305, 70613, 44282, 56517, 45235, 16077, -27159, 25793, -77416, -47133, 1567, -91509, -37833, 35688, 4285, -69545, -43206, 18277, -35534, -110739, -84814, -174339, -202588, -165802]
887a65802N1318J20336K6867J4946p9406N667l8714n8450K8271L0905L6136j2204
875d0130K1963l9832R0303J09456r955L5786r0741j3872P13J2718j3238j28564
863f5393j22398O5291J38910L9477M8282J9405j1824o8374j4761J7465M2827n2854
851C6053q4704p5305Q5754L1270o9182l5383R7072K8250k9250K271j00440J09581
839d013j2942J0440P376J5300R7151j42770m0575N3018O1054K4181j1846K8634
827H5008M4005m1356r5574k7904J708N034j7947J8018M3731L5709J46076r7184
815I9324j33859N0705J05641o307j45566n6755L4480J56888L5646L862m6668j28917
803c1526r9421J33028K6976q5633J1127P537J3083L089J9634p9459K3989l2838
$$ y = [-165802, -114484, 5852, 32719, 47665, -31741, -26074, -64788, -123238, -94967, -64062, -27926, -40130, -18167, -57999, 32304, 141760, 131805, 167591, 76850, 62978, 63691, 76409, 63171, -65393, -187791, -122500, 16410, 55887, 104169, 123574, 111750, 43376, 28615, 46080, 88907, 36053, -48651, -123956, -38202, -6932, -76114, -111497, -14425, 13825, -15425, -13154, -113594, -4013, -16955, -6515, 861, 16161, 113312, -29458, -70033, -17015, 44039, 68220, 56374, 85008, 129013, 87657, -7917, -35821, -34113, -29079, -47026, -29008, 14723, 50432, 196508, 99324, -34535, 16170, 121811, 115504, -30062, -86817, -52337, 104551, 140197, 144059, 97391, -31526, -130947, 2081, 29057, -56576, -45449, -37912, -24829, -21740, -2106, -81565, -57576, -90414]
791i0414M7954p733m5878n3352J72217m870L9488k1681j31372L1137J9951n2691
779i7244M9307J0847J4498N1211L0286R8301j64596n5705L0078n6934J1114k3395
767a02232J45775J4854m4543P1271K433j31910R157M9812K7141j249L478P045
755E1032o0338M2900q8805N4682M5935m1536l8545J14552l5058n4820j23515L4630
743i8886R3199p3592O8767R5533J6101n4021m3323q5947l1319O5506k8863j8325
731i5170M5029J9165K7732q663K7971P833O3479m9681K9511l1092k8824J18573
719A25863n7732n2450p3225R764L4112l1093k4575K9431N1380R2721j2638j8365
707G3193N0126o8355l5443M9219o3145m2821M5529J37862j07159L3360q3177K3456
$$ y = [-90414, -42460, -50193, -96071, -149423, 22794, 17924, 57412, 35731, -95641, -64504, -44553, -97244, -47937, -37090, -22592, 28619, 58905, 157206, -7390, -63095, -33017, -89951, -78837, -102232, 43543, 58397, 13854, 85125, 87558, -44352, -35195, 14617, 41758, 40509, 43987, 51032, -9306, 33594, -55211, -529, 45406, 3870, -34675, 79877, 44819, -10001, -133516, -98886, -5687, -79279, -10512, 85021, 101122, 47101, 3778, -82169, -113488, -47982, -76845, -95170, -50141, -30976, -3244, -11907, 16064, 23897, 87376, 37695, 67206, 36114, 7290, 125863, 68131, 15681, -57544, -47780, -13668, -44761, -69336, -39905, 11475, 104196, 91558, 73193, 123319, 54964, 19521, 68740, 5595, -37226, 8303, 146165, 39006, 72366, -10811, 12645]
695A2645L2319m7114l2166P320N114L1979P0735n9150P995M5489j3637m0389n7999
682c6859n5153J46247o8042q9451L4802R4960N3069o6129j2741q2236p542K60
670h8815J7049o091j7129J06282l0942L2757K9431J0252P2325n0494j53488J3545
658f5318k6636n8153L6047M032J48549O2168j2153p219M3340K3891r8899q4702
646c5053J03739P8596p799k5549M381p8916m3317J8905J8273N0099j06251k8311
634e1203J9320O3165m239l9446M4920J4021P8157k1964J9428L212o2642K0998
622H3727q16M1205m8724j8878o4248N1749p4559n3126K1160O7306P3365M5977
610A24138j2045n4432k3298N927L010J1745q5552p3973J831J09911o4186n4773
$$ y = [12645, 44964, -2150, -34316, -26996, -21882, 10097, 80832, 21682, 29677, 75166, 61529, 21140, -36859, -92012, 54235, -13807, -103258, -68456, 26504, 79573, 13444, 703, -81533, -89075, -88815, -71766, -77857, -94986, 11296, -19646, 13111, 42542, 52794, 125119, 74625, -78863, -65318, -91954, -150107, -114060, -110028, 38521, 100689, 88536, 81317, 124657, 148548, 49649, -35053, 68686, 147282, 139483, 113934, 118315, 39399, -3918, 14987, 33260, 83359, -22892, -51203, -31883, 31282, 27043, -12403, 32517, 46538, 124695, 102731, 122159, 125371, 62729, 83727, 82911, 124116, 75392, 56514, -7734, 44015, -30544, -83670, -62510, 4796, 78161, 124138, 112093, 57661, 34363, 40290, 43300, 55045, -30507, -104480, -102649, 7262, -56924, -111697]
598a11697O4081J42402K941j25683Q69L0823R0413m259m4226j5428N9150m7348
586D2038j40157K0945P9535n4699K5044l0661M7921J00113m2716k4592M1187m0493
574B3465L2865l7575p2208Q8902n2658M8890o0138k4257p109L1655N1953J4646
562C8431j11706j5646L6894K7530J4908J53368N7556j75094O2794o1410k4440
551C185L2984N4308J7846l7635l0311o6455r0167R2955P2930Q8944M6360M5830
539B30774k02758q621J03590k4565K8710j5546r4721p5110K9244Q5471n0584n5406
527d9522p438Q202O6185M7599R3622m1838r3064j6675l6758j929P082Q327Q2852
514F6645j14818L6830k2272o235M264l4003R2256Q3876j05771N620J30911j65336
$$ y = [-111697, -47616, 94786, 97727, -27956, -27087, 3736, 94149, 89890, 45664, 30236, 89386, 42038, -98119, -77174, 2361, -52338, -27294, -57955, -10034, 90079, 47363, 22771, 63958, 23465, 56330, 18755, -53453, 35449, -17209, 31681, -28457, -52714, -59823, -28168, 23785, 38431, -73275, -88921, -52027, -24497, -9589, 143779, 201335, 26241, 89035, 27625, 3185, 36169, 90477, 108323, 70688, 40377, -26078, -116245, -23290, 49640, 138584, 184944, 230774, 28016, 19395, 122985, 98420, 127130, 111584, 16863, -58247, -29003, 56468, 5884, -49522, -56960, -48758, 17427, 65026, 158648, 116810, 23746, 7071, -29687, -31616, -24534, -16207, 66645, -48173, -11343, -33615, -39850, -35586, -69589, 22667, 106543, 772, 6392, 137303, -28033]
502b8033M450M7491M4826O9191j34215r6810L8350N9229j7198O6013L3346o6787
490A9853j28131J03722J56896n8558q4173l6n3143l3139P1770M8372N2763Q481
478A04677p6215n7635n6887R8756P3626J9084N5175p6595p2029N9658q5039K5773
466A2349M8572q6479O9088o3586Q7940n5774j16246o8576J13034J32554J06148
455A79024j74324M9583m9028J1630k9093J1307O2728m6355N38Q2348J9735k4756
443I3337j12155k0138J26926n823K0242j4998K0146L710L0867k4137J7761n0253
431H5485k456l4203p8484M6832R764q9320n197j796L0745m942p616N3210Q6513
418H8535q919l667j6639N6941N3649P1699l3231n7613o458l2747p3787m6452m2360
$$ y = [-28033, -23583, 23908, 68734, 137925, 3710, -93100, -54750, 4479, -12719, 53294, 86640, 19853, -108278, -4556, 152340, 93782, 9609, 9573, -43570, -76709, -4939, 43433, 96196, 104677, 28462, -29173, -86060, 12696, 86322, 105406, 160581, 83986, 11957, 71615, -13424, 12349, 60921, -25558, 43530, -20056, 67884, 12110, -104136, -172712, -59678, 72876, 179024, 4700, 54283, 5255, 16885, -12208, -901, 61827, 15472, 16010, 98358, 118093, 93337, -18818, -38956, 87970, 82147, 102389, 87391, 107537, 111247, 142114, 117977, 135738, 85485, 83029, 48826, -29658, 17174, 26938, -62382, -67579, -69375, -38630, -43572, -51188, 2022, 88535, 79616, 75949, 59310, 116251, 169900, 241599, 208368, 150755, 144297, 111550, 37763, -8689, -51049]
405e1049J69776m9782n1653N4392M5291o8412j9970K5266j9090l5143K7152J17702
393A44480j42978J9926L9926K9980M8786q9975M5640P9622j6829o4734l1106m9428
381A3310L5725M8343j5896p2192J0544l8375L3852M733L5297p3411L3373Q4066
369I9369K8314l2601n9503m5706p6978J13364N6139L0187O9493m5083o4987L7076
357A09084l8889J6003n5960r105L4446L6680n9343n5406k2666J3234K5305J9729
345A3112j25705M4770J02180R292L179M2937n5465o4871J19815O2220L580J1438
333A66482o2805O0130m0229j6149n2022k3453M5544k3189j6575k2526j8602K7214
321B3820O4049N7929J2635n9680O394m056l8601K8250K359j5973J1358j08254
$$ y = [-51049, 118727, 68945, 17292, 71684, 116975, 48563, 28593, 53859, 34769, -374, 26778, 144480, 1502, 21428, 61354, 91334, 140120, 50145, 95785, 175407, 158578, 93844, 62738, 13310, 49035, 97378, 81482, 9290, 19834, -18541, 15311, 20044, 55341, -18070, 15303, 99369, 127683, 95082, 35579, -10127, -87105, 26259, 82398, 112585, 182078, 136995, 72008, 109084, 70195, 86198, 30238, 21133, 55579, 92259, 32916, -22490, -45156, -31922, -6617, 13112, -112593, -67823, 34357, 43649, 46828, 89765, 34300, -30571, 89244, 151464, 155044, 166482, 103677, 163807, 123578, 107429, 55407, 31954, 77498, 54309, 37734, 15208, -3394, 23820, 87869, 145798, 158433, 98753, 105147, 101091, 62490, 90740, 93099, 77126, 88484, -19770]
309a9770m1354J00724P8903k745L56o551j6978M5042J3067m5836k2242m8942O9864
296A03538j62353p940Q2312N374m7826P3193L0391n0826R8949M0384l7922p4960
284E2314j4251M0707p519o6972N8181N9665P542l0246M6154j9098j47550p3765
272i4838J11758j0573j3603p3975M2814L1237q723L7510J4079N757J06062J2182
260A59687q5444K1692n9899N5772n388K1171O9681n9051l964p2584N9963J24260
248B25896q8482n2522l1901m6329j9815P3864L8345l1929J4065l6162j3304m0096
236h370Q1851j3387O1187J3678j12483M984J7453L8364m9490M652J15088M0756
224A94283j16975j8871Q1445q2297j25423m775J6093J87934k144j8670l0266M0834
$$ y = [-19770, -61124, 39600, 118503, 115758, 116114, 109563, 92585, 137627, 150694, 104858, 82616, 33674, 103538, -58815, -66755, 15557, 20931, -26895, 46298, 76689, 25863, 124812, 165196, 127274, 52314, 38063, 78770, 71251, 4279, 62460, 122125, 129667, 99421, 145575, 126477, -21073, -94838, 16920, 6347, -7256, -81231, -38417, -7180, -15903, 21607, 35686, 41443, 147505, 159687, 74243, 95935, 36036, 91808, 86420, 107591, 177272, 118221, 114257, 41673, 101636, 225896, 137414, 84892, 52991, 6662, -13153, 60711, 99056, 67127, 81192, 45030, 31726, -8370, 73481, 60094, 121281, 134959, 22476, 27460, 44913, 83277, 33787, 38439, 153527, 194283, 77308, 58437, 139882, 57585, -67838, -72613, -56520, 131414, 129270, 110600, 80334, 121168]
212A21168L0939K1736m4661m9767l1984K3165O3768l7659Q508k9140k1826J7384
200G1631n8265P6841m2016n3118L0346K3492Q6333L2506k8302o5160P6516r2402
188E8402k1191J16606n7425j2394L1267Q310r6617J3194Q373p3667Q4606J1303
176G0767j6430P2516l7479l1396q405L7239J24203M878R037q8660o6883J609m5124
163B5872M7305P9974n2237J30248j02521o0719M2933M0368o4323M0564R9944j12004
151A15404r3577M4513p2494O0896n8130j21275J13834P4070J3189q2645K9461
140B3246L6742L853N0188j9777l9571L9222o5442N3422n9023j00195J10973L8350
128G1988n8697P3976j0798J1921K0513L2745j6026n9220l9414J2947N2208M3133
$$ y = [121168, 152107, 173843, 129182, 79415, 47431, 70596, 134364, 96705, 105213, 76073, 54247, 71631, 13366, 90207, 48191, -4927, 25419, 48911, 135244, 167750, 139448, 74288, 150804, 58402, 37211, 153817, 96392, 83998, 115265, 123575, 26958, 40152, 48525, -25142, 59464, 70767, 54337, 126853, 89374, 57978, 49573, 86812, 211015, 215893, 224930, 136270, 69387, 70996, 25872, 73177, 153151, 100914, 231162, 128641, 67922, 110855, 151223, 86900, 127464, 227408, 115404, 21827, 66340, -6154, 54742, -3388, -124663, -10829, 63241, 76430, -6215, 23246, 59988, 63841, 114029, 94252, 54681, 93903, 28461, 81883, 22860, -77335, 33638, 71988, 13291, 87267, 76469, 88390, 108903, 141648, 125622, 66402, 26988, 39935, 92143, 135276]
116A35276l7788k9953J5869k8783l8476o6097O4941O082M852M5400l665P426m0688
103C4396J955j87K0597M4963R1548l2632q4545l5479O734j1565M6881J02591r631
90A75626J0450l9883J1913P669q5593j1107n2040N5405N7973m369K8951l5479
78A19516l7650N1428j01478K5751R9641l1735m7146K180K1279k1575Q4037R3283
66B57531j09045n4535O0799L4791j0752j5112p3481n6567J5038K9497K22K2815
$$ y = [135276, 97488, 67535, 83404, 54621, 16145, -49952, 14989, 21071, 25923, 71323, 67658, 75084, 34396, 36351, 36164, 56761, 101724, 193272, 160640, 76095, 40616, 47350, 35785, 82666, 185257, 175626, 186076, 146193, 158106, 165775, 80182, 69075, 17035, 72440, 130413, 126044, 154995, 119516, 81866, 133294, 31816, 57567, 157208, 125473, 78327, 80507, 101786, 80211, 164248, 257531, 148486, 93951, 154750, 189541, 178789, 163677, 90196, 33629, 48667, 78164, 78386, 101201]
$$ [...]
##END NTUPLES=NMR SPECTRUM
##END=
