##TITLE=1H_TG-2362-1
 CDCl3
 8 sc, 
 18.10.2022
##JCAMPDX= 6.0         $$ Bruker NMR JCAMP-DX V2.0
##DATA TYPE= NMR SPECTRUM
##DATA CLASS= NTUPLES
##ORIGIN= UXNMR, Bruker Analytische Messtechnik GmbH
##OWNER= root
$$ XWIN-NMR		Version 3.5
$$ Tue Oct 18 12:33:00 2022 Russian Standard Time (UT+4h)  she@DPX200
##.OBSERVE FREQUENCY= 200.1313499994
##.OBSERVE NUCLEUS= ^1H
##.ACQUISITION MODE= SIMULTANEOUS
##.ACQUISITION SCHEME= undefined
##.AVERAGES= 9
##.DIGITISER RES= 18
##SPECTROMETER/DATA SYSTEM= spect
##.PULSE SEQUENCE= zg30
##.SOLVENT NAME= CDCl3
##.SHIFT REFERENCE= (INTERNAL, CDCl3, 0, 15.7888)
##AUDIT TRAIL= $$ (NUMBER, WHEN, WHO, WHERE, WHAT)
$$ ##TITLE= Audit trail, XWIN-NMR		Version 3.5
$$ ##JCAMPDX= 5.01
$$ ##ORIGIN= Bruker BioSpin GmbH
$$ ##OWNER= she
$$ F:/spectra/data/she/nmr/H-F/1/pdata/1/auditp.txt
$$ ##AUDIT TRAIL=  $$ (NUMBER, WHEN, WHO, WHERE, WHAT)
(   1,<2022-10-18 12:31:35.09 +0400>,<she>,<DPX200>,
      <created by zg, POWCHK disabled, PULCHK disabled
       terminated by command 'halt'
       configuration hash MD5:
       00 E9 B6 7A A2 85 ED C7 34 08 36 98 17 FE 4E 26
       data hash MD5: 16K
       AE B8 FC 31 F5 EA 28 A7 9F 90 A0 96 EE 75 97 75>)
(   2,<2022-10-18 12:31:39.23 +0400>,<she>,<DPX200>,
      <Start of raw data processing
       efp BC_mod = 2 LB = 0.24 FT_mod = 6 PKNL = 1 PHC0 = -18035.75 PHC1 = 11.8007 SI = 16K 
       data hash MD5: 16K
       81 21 EE F1 A1 DD 41 84 66 99 5F 8A 02 2E A9 B9>)
(   3,<2022-10-18 12:31:57.79 +0400>,<she>,<DPX200>,
      <pk PHC0 = 1.560316 PHC1 = -2.2 
       data hash MD5: 16K
       32 57 B8 3B 48 4F 90 89 7A 56 C3 F6 B5 DC 96 F6>)
(   4,<2022-10-18 12:32:01.10 +0400>,<she>,<DPX200>,
      <abs ABSG = 5 
       data hash MD5: 16K
       F4 64 78 0F 28 E1 AB C2 D8 2B 8F D9 21 32 35 7B>)
$$ ##END=
$$ 
$$ hash MD5
$$ 62 ED B5 61 FC 87 7F FC 16 F2 97 27 16 08 38 4C
##$RELAX= 
##$RELAX= 
##$RELAX= 
##$RELAX= 
##$RELAX= 
##$RELAX= 
$$ Bruker specific parameters
$$ --------------------------
##$DU= <F:/spectra>
##$EXPNO= 1
##$NAME= <H-F>
##$PROCNO= 1
##$TYPE= <nmr>
##$USER= <she>
##$AMP= (0..31)
100 100 100 100 100 100 100 100 100 100 100 100 100 100 100 100 100 100 
100 100 100 100 100 100 100 100 100 100 100 100 100 100 
##$AQSEQ= 0
##$AQ_mod= 1
##$AUNM= <au_zg>
##$AUTOPOS= <>
##$BF1= 200.13
##$BF2= 200.13
##$BF3= 200.13
##$BF4= 200.13
##$BF5= 200.13
##$BF6= 200.13
##$BF7= 200.13
##$BF8= 200.13
##$BYTORDA= 1
##$CFDGTYP= 0
##$CFRGTYP= 5
##$CHEMSTR= <none>
##$CNST= (0..31)
1 1 145 1 1 1 1 1 1 1 1 1 1 1 1 1 1 1 1 1 1 1 1 1 1 1 1 1 1 1 1 1 
##$CPDPRG= <>
##$CPDPRG1= <>
##$CPDPRG2= <>
##$CPDPRG3= <>
##$CPDPRG4= <mlev>
##$CPDPRG5= <mlev>
##$CPDPRG6= <mlev>
##$CPDPRG7= <mlev>
##$CPDPRG8= <mlev>
##$CPDPRGB= <>
##$CPDPRGT= <>
##$D= (0..31)
0 1.2 0 0 0 0 0 0 0 0.06 0 0.03 0 0 0 0 0.0002 0 0 0 0 0 0 0 0 0 0 0 0 
0 0 0 
##$DATE= 1666081894
##$DBL= (0..7)
120 120 120 120 120 120 120 120 
##$DBP= (0..7)
150 150 150 150 150 150 150 150 
##$DBP07= 0
##$DBPNAM0= <>
##$DBPNAM1= <>
##$DBPNAM2= <>
$$ [...]
##$SUBNAM3= <"">
##$SUBNAM4= <"">
##$SUBNAM5= <"">
##$SUBNAM6= <"">
##$SUBNAM7= <"">
##$SUBNAM8= <"">
##$SUBNAM9= <"">
##$SW= 18.0517283424941
##$SWIBOX= (0..15)
0 0 2 0 0 0 0 0 0 0 0 0 0 0 0 0 
##$SW_h= 3612.71676300578
##$TD= 16384
##$TD0= 1
##$TE= 0
##$TE2= 300
##$TE3= 300
##$TEG= 300
##$TL= (0..7)
0 120 120 120 120 120 120 120 
##$TP= (0..7)
150 150 150 150 150 150 150 150 
##$TP07= 0
##$TPNAME0= <>
##$TPNAME1= <>
##$TPNAME2= <>
##$TPNAME3= <>
##$TPNAME4= <>
##$TPNAME5= <>
##$TPNAME6= <>
##$TPNAME7= <>
##$TPOAL= (0..7)
0.5 0.5 0.5 0.5 0.5 0.5 0.5 0.5 
##$TPOFFS= (0..7)
0 0 0 0 0 0 0 0 
##$TUNHIN= 0
##$TUNHOUT= 0
##$TUNXOUT= 0
##$USERA1= <user>
##$USERA2= <user>
##$USERA3= <user>
##$USERA4= <user>
##$USERA5= <user>
##$V9= 5
##$VALIST= <valist>
##$VCLIST= <CCCCCCCCCCCCCCC>
##$VD= 0
##$VDLIST= <DDDDDDDDDDDDDDD>
##$VPLIST= <PPPPPPPPPPPPPPP>
##$VTLIST= <TTTTTTTTTTTTTTT>
##$WBST= 1024
##$WBSW= 4
##$XGAIN= (0..3)
0 0 0 0 
##$XL= 0
##$YL= 0
##$YMAX_a= 385708
##$YMIN_a= -771740
##$ZGOPTNS= <>
##$ZL1= 120
##$ZL2= 120
##$ZL3= 120
##$ZL4= 120
##$ABSF1= 15.75019
##$ABSF2= -2.30166
##$ABSG= 5
##$ABSL= 3
##$ALPHA= 0
##$AQORDER= 0
##$ASSFAC= 0
##$ASSFACI= 0
##$ASSFACX= 0
##$ASSWID= 0
##$AUNMP= <proc_1d>
##$AZFE= 0.1
##$AZFW= 0.1
##$BCFW= 0
##$BC_mod= 2
##$BYTORDP= 0
##$COROFFS= 0
##$CY= -3
##$DATMOD= 1
##$DC= 0
##$DFILT= <>
##$DTYPP= 0
##$F1P= 0
##$F2P= 0
##$FCOR= 1
##$FTSIZE= 16384
##$FT_mod= 6
##$GAMMA= 0
##$GB= 0
##$INTBC= 1
##$INTSCL= 3.70164e-10
##$ISEN= 128
##$LB= 0.24
##$LEV0= 0
##$LPBIN= 0
##$MAXI= 10000
##$MC2= 0
##$MEAN= 0
##$ME_mod= 0
##$MI= 1.114404
##$NCOEF= 0
##$NC_proc= -5
##$NLEV= 6
##$NOISF1= 3.799351
##$NOISF2= 2.8
##$NSP= 0
##$NTH_PI= 0
##$NZP= 0
##$OFFSET= 15.78876
##$PC= 1
##$PHC0= -18034.19
##$PHC1= 9.6007
##$PH_mod= 1
##$PKNL= yes
##$PPARMOD= 0
##$PSCAL= 0
##$PSIGN= 0
##$REVERSE= no
##$SF= 200.129996552652
##$SI= 16384
##$SIGF1= 3
##$SIGF2= 2
##$SINO= 5.538805
##$SIOLD= 16384
##$SREGLST= <1H.CDCl3>
##$SSB= 0
##$STSI= 16384
##$STSR= 0
##$SW_p= 3612.71676300578
##$SYMM= 0
##$S_DEV= 0
##$TDeff= 16384
##$TDoff= 0
##$TI= <>
##$TILT= no
##$TM1= 0
##$TM2= 0
##$TOPLEV= 0
##$USERP1= <user>
##$USERP2= <user>
##$USERP3= <user>
##$USERP4= <user>
##$USERP5= <user>
##$WDW= 1
##$XDIM= 16384
##$YMAX_p= 292158553
##$YMIN_p= -380107
$$ End of Bruker specific parameters
$$ ---------------------------------
##NTUPLES= NMR SPECTRUM
##VAR_NAME=  FREQUENCY,     SPECTRUM/REAL,   SPECTRUM/IMAG
##SYMBOL=    X,             R,               I
##VAR_TYPE=  INDEPENDENT,   DEPENDENT,       DEPENDENT
##VAR_FORM=  AFFN,          ASDF,            ASDF
##VAR_DIM=   16384,         16384,           16384
##UNITS=     HZ,            ARBITRARY UNITS, ARBITRARY UNITS
##FACTOR=    0.220516191357247, 1,           1
##FIRST=     3159.80452144307, 0,            0
##LAST=      -452.91224156271, 0,            0
##MIN=       -452.91224156271, -380107,      0
##MAX=       3159.80452144307, 292158553,    0
$$ Real data points
##PAGE= N=1
##DATA TABLE= (X++(R..R)), XYDATA
$$ [...]
$$ plain form
6252 1011694 969321 959737 930344 948936 885577 891525 995903 1003914 1014602 999581 1006338 983849
6240 983849 1006805 1035169 1037749 1040582 1133465 1178152 1188104 1190628 1226115 1243212 1300542 1338567
6228 1338567 1306500 1274203 1332182 1362832 1431210 1501701 1633595 1688773 1648964 1642336 1750172
6217 1750172 1921927 1952606 2023744 2105742 2113354 2086962 2120101 2126761 2126313 2087649 2090274 2195699
6205 2195699 2248134 2306737 2312061 2410813 2544808 2624975 2732948 2807315 2878609 2986778 3064530
6194 3064530 3095434 3182826 3202605 3256551 3285088 3256682 3294742 3281799 3317178 3397215 3482358
6183 3482358 3477159 3627235 3750164 3786076 3827594 3958036 4069964 4172457 4292444 4411419
6173 4411419 4524139 4642884 4837235 4979191 5137244 5330137 5476762 5600833 5738523 5809053
$$ packed form
6252A011694m2373r584k9393J8592o3359N948J04378Q011J0688j5021O757k2489
6240I83849K2956K8364K580K833R2883M4687R952K524L5487J7097N7330L8025
6228A338567l2067l2297N7979L0650O8378P0491J31894N5178l9809o628J07836
6217A750172J71755L0679P1138Q1998P612k6392L3139O660m48l8664K625J05425
6205B195699N2435N8603N324R8752J33995Q0167J07973P4367P1294J08169P7752
6194C064530L0904Q7392J9779N3946K8537k8406L8060j2943L5379Q0037Q5143
6183C482358n199J50076J22929L5912M1518J30442J11928J02493J19987J18975
6173D411419J12720J18745J94351J41956J58053J92893J46625J24071J37690P0530
$$ plain form
6163 5809053 5798852 5768836 5730346 5679266 5624918 5560258 5515936 5528818 5557595 5663600 5567186
6152 5567186 5558587 5647836 5684847 5683589 5732123 5824657 5878628 5892556 5875528 5787951 5740150 5698936
6140 5698936 5644906 5523050 5401776 5322514 5272925 5234640 5185341 5167466 5118408 5087350 5026728
6129 5026728 5054731 4939208 4898867 4843578 4829762 4758508 4777495 4756730 4641881 4589827 4596224
6118 4596224 4649941 4711205 4731258 4836683 4920659 4964719 5066547 5133467 5188411 5234332 5287954
6107 5287954 5259132 5197439 5156774 5072403 4972561 4912960 4824795 4716405 4623904 4596517 4649190
6096 4649190 4624089 4587577 4572152 4570033 4510213 4345951 4225039 4037214 3905607 3702026 3564521
6085 3564521 3475445 3364596 3322819 3223046 3246067 3279754 3211665 3143558 3091196 3067487 3028588
$$ packed form
6163E809053j0201l0016l8490n1080n4348o4660m4322J2882K8777J06005r6414
6152E567186q599Q9249L7011j258M8534R2534N3971J3928j7028q7577m7801m1214
6140E698936n4030j21856j21274p9262m9589l8285m9299j7875m9058l1058o0622
6129E026728K8003j15523m0341n5289j3816p1254J8987k0765j14849n2054O397
6118D596224N3717O1264K0053J05425Q3976M4060J01828O6920N4944M5921N3622
6107E287954k8822o1693m0665q4371r9842n9601q8165j08390r2501k7387N2673
6096D649190k5101l6512j5425k119n9820j64262j20912j87825j31607k03581j37505
6085C564521q9076j10849m1777r9773K3021L3687o8089o8107n2362k3709l8899
$$ plain form
6074 3028588 2985888 2987772 2882813 2869292 2811988 2874155 2959669 3015612 3013764 3059409 3061579 3157535
6062 3157535 3233972 3347565 3418533 3431682 3491718 3439833 3451900 3446118 3438930 3467566 3490338 3483814
6050 3483814 3576180 3744599 3829335 3932450 3959460 4026990 4088746 4222115 4228565 4184178 4158620
6039 4158620 4096980 4046383 4054904 4115799 4128103 4181982 4240627 4336504 4434299 4526181 4643118
6028 4643118 4776314 4883060 5058639 5196090 5473714 5703348 6015732 6356752 6660275 7091845
6018 7091845 7735472 8478535 9533803 10951508 12571103 13950549 14516693 13838225 12322224
6009 12322224 10811863 9605747 8693706 8128378 7780343 7572198 7438037 7391581 7335323
6000 7335323 7334048 7378478 7440781 7565052 7786536 8018748 8329309 8663405 9124316 9691122
$$ packed form
6074C028588m2700J884j04959j3521n7304O2167Q5514N5943j848M5645K170R5956
6062C157535P6437J13593P0968J3149O0036n1885J2067n782p188K8636K2772o524
6050C483814R2366J68419Q4736J03115K7010O7530O1756J33369O450m4387k5558
6039D158620o1640n0597Q521O0895J2304N3879N8645R5877R7795R1882J16937
6028D643118J33196J06746J75579J37451K77624K29634L12384L41020L03523M31570
6018G091845O43627P43063J055268J417705J619595J379446N66144o78468j516001
6009A2322224j510361j206116r12041n65328l48035k08145j34161m6456n6258
6000G335323j275M4430O2303J24271K21484K32212L10561L34096M60911N66806
$$ plain form
5990 9691122 10313085 10946565 11813312 12868778 14219359 16089513 18718007 22518256 27615111
5981 27615111 32013325 34455518 33415650 29066327 24260592 20109661 16933793 14778607
5973 14778607 13317203 12197525 11358552 10709139 10249546 9958336 9759915 9685890 9678494 9594470
5963 9594470 9674506 9798915 10068517 10370902 10687554 11183974 11783590 12563826 13545201 14735043
5953 14735043 16390580 18837928 22293128 27145137 31886604 34890099 34601489 30411125
5945 30411125 25249178 20668085 17067364 14519864 12775135 11446265 10493728 9742297
5937 9742297 9106554 8662547 8336086 7994940 7751315 7562371 7441397 7313796 7200427 7178437
5927 7178437 7203461 7216564 7310505 7426126 7632938 7913739 8339764 9103052 10144425 11664254
$$ packed form
5990I691122O21963O33480Q66747J055466J350581J870154K628494L800249N096855
5981B7615111M398214K442193j039868m349323m805735m150931l175868k155186
5973A4778607j461404j119678q38973o49413m59593k91210j98421p4025p396q4024
5963I594470Q0036J24409K69602L02385L16652M96420N99616P80236R81375J189842
5953A4735043J655537K447348L455200M852009M741467L003495k88610m190364
5945C0411125n161947m581093l600721k547500j744729j328870r52537p51431
5937I742297o35743m44007l26461l41146k43625j88944j20974j27601j13369k1990
5927G178437K5024J3103R3941J15621K06812K80801M26025P63288J041373J519829
$$ plain form
5917 11664254 13247923 14334875 14464683 13225935 11509401 9895221 8550452 7600900
5909 7600900 6889417 6368788 6005918 5689179 5425194 5298778 5183106 4995497 4879173 4823595
5899 4823595 4797167 4690334 4664359 4617178 4623378 4648884 4690851 4715369 4743356 4830136 4907234
5888 4907234 4937990 5064409 5223589 5289646 5441295 5525965 5545158 5502687 5485222 5390921 5316491
5877 5316491 5243406 5159578 5136694 5127459 5093753 5065785 5106720 5216151 5219228 5275478 5365177 5423214
5865 5423214 5532558 5678162 5759055 5740396 5694988 5659742 5567187 5540125 5525870 5478621 5461102
5854 5461102 5476089 5481707 5595060 5630901 5699305 5773356 5907603 6089596 6325055 6498508 6704044
5843 6704044 6953534 7211390 7596126 7803925 8031472 8280309 8275025 8182864 8074733 7841075
$$ packed form
5917A1664254J583669J086952J29808j238748j716534j614180j344769r49552
5909G600900p11483n20629l62870l16739k63985j26416j15672j87609j16324n5578
5899D823595k6428j06833k5975m7181O200K5506M1967K4518K7987Q6780P7098
5888D907234L0756J26419J59180O6057J51649Q4670J9193m2471j7465r4301p4430
5877E316491p3085q3828k2884r235l3706k7968M0935J09431L077N6250Q9699N8037
5865E423214J09344J45604Q0893j8659m5408l5246r2555k7062j4255m7249j7519
5854E461102J4987N618J13353L5841O8404P4051J34247J81993K35459J73453K05536
5843F704044K49490K57856L84736K07799K27547K48837n284r2161j08131k33658
$$ plain form
5833 7841075 7648334 7542041 7344189 7208988 7140157 7073612 7056921 7081136 7080026 7164883 7244026
5822 7244026 7352189 7539659 7651035 7843428 7963662 7953906 7894158 7777438 7572664 7477213
5812 7477213 7406614 7405490 7394718 7369993 7453613 7569617 7633065 7635836 7562508 7478566 7258469
5801 7258469 7010684 6745015 6518468 6228573 5928471 5772173 5595854 5488001 5385092 5335375
5791 5335375 5310646 5288859 5281334 5350460 5447833 5575556 5642038 5763777 5857937 5966156 6080835
5780 6080835 6047845 5936821 5768778 5526499 5241972 4992160 4786740 4470582 4294802 4181303
5770 4181303 4046307 3966010 3913954 3907916 3869292 3776230 3733692 3699418 3700855 3694853 3667558 3625839
5758 3625839 3527625 3410022 3323465 3229312 3095812 3009784 2926393 2850865 2808407 2713601 2623801
$$ packed form
5833G841075j92741j06293j97852j35201o8831o6545j6691K4215j110Q4857P9143
5822G244026J08163J87470J11376J92393J20234r756n9748j16720k04774r5451
5812G477213p0599j124j0772k4725Q3620J16004O3448K771p3328q3942k20097
5801G258469k47785k65669k26547k89895l00102j56298j76319j07853j02909m9717
5791E335375k4729k1787p525O9126R7373J27723O6482J21739R4160J08219J14679
5780F080835l2990j11024j68043k42279k84527k49812k05420l16158j75780j13499
5770D181303j34996q0297n2056o038l8624r3062m2538l4274J437o002k7295m1719
5758C625839r8214j17603q6557r4153j33500q6028q3391p5528m2458r4806q9800
$$ plain form
5747 2623801 2570950 2506435 2549176 2522623 2539354 2512591 2544176 2618924 2622384 2651160 2712180 2749097
5735 2749097 2722856 2683254 2594554 2413647 2297091 2180339 2059179 1944522 1901850 1854505
5725 1854505 1843403 1805875 1732764 1669892 1572233 1543211 1483417 1456550 1448825 1493674 1478312 1411412
5713 1411412 1365489 1356203 1341811 1328773 1387236 1379833 1346387 1305255 1257704 1267578 1259796 1232941
5701 1232941 1203378 1112608 1113095 1080605 1062378 1075882 1007118 1001295 1045715 979830 1008353 1067245
5689 1067245 1132051 1124077 1129925 1060424 1009591 1027176 1115934 1135725 1015651 965846 915824 961417
5677 961417 990649 1010410 1072810 1089152 1029992 1038158 1002094 979803 936585 954792 989447 980117
5665 980117 971706 1007037 979539 969440 943206 944868 1028862 975170 974118 978706 1051720 1161596
$$ packed form
5747B623801n2851o4515M2741k6553J6731k6763L1585P4748L460K8776O1020L6917
5735B749097k6241l9602q8700j80907j16556j16752j21160j14657m2672m7345
5725A854505j1102l7528p3111o2872r7659k9022n9794k6867p725M4849j5362o6900
5713A411412m5923r286j4392j3038N8463p403l3446m1132m7551R874p782k6855
5701A232941k9563r0770M87l2490j8227J3504o8764n823M4420o5885K8523N8892
5689A067245O4806p974N848o9501n0833J7585Q8758J9791j20074m9805n0022M5593
5677I61417K9232J9761O2400J6342n9160Q166l6064k2291m3218J8207L4655r330
5665I80117q411L5331k7498j0099k6234J662Q3994n3692j052M588P3014J09876
$$ plain form
5653 1161596 1116885 1112175 1084705 1129812 1052497 956090 996051 1063610 1047499 1039250 1090590 1152825
5641 1152825 1122119 1111703 1151977 1199747 1207592 1178130 1168782 1158554 1134235 1178900 1215265 1091348
5629 1091348 1141949 1119366 1077711 1005650 1052643 1003646 983996 1034948 1021851 1042006 987888
5618 987888 1043770 1084893 1126651 1165329 1092574 1049480 1102855 1115301 1076841 1107133 1108117 1083767
5606 1083767 1129653 1168171 1166618 1100333 1059086 1043271 1054056 1026174 1038418 1021851 997177 1050855
5594 1050855 1076429 1018843 1062858 1088553 1066736 1065965 1039291 1024037 1095172 1121981 1148354 1170364
5582 1170364 1102707 1138545 1167297 1188907 1087336 1107151 1170277 1207783 1186428 1116271 1076087
5571 1076087 1064270 1073762 1093352 1058569 1090343 1165709 1156150 1148362 1109942 1136150 1151225 1171766
$$ packed form
5653A161596m4711m710k7470M5107p7315r6407L9961O7559j6111q249N1340O2235
5641A152825l0706j0416M0274M7770P845k9462r348j0228k4319M4665L6365j23917
5629A091348N0601k2583m1655p2061M6993m8997j9650N0952j3097K0155n4118
5618I87888N5882M1123M1758L8678p2755m3094N3375J2446l8460L0292R84k4350
5606A083767M5886L8518j553o6285m1247j5815J0785k7882J2244j6567k4674N3678
5594A050855K5574n7586M4015K5695k1817p71k6674j5254P1135K6809K6373K2010
5582A170364o7657L5838K8752K1610j01571J9815O3126L7506k1355p0157m0184
5571A076087j1817R492J9590l4783L1774P5366r559p788l8420K6208J5075K0541
$$ plain form
5559 1171766 1214738 1242701 1284721 1287366 1248884 1194136 1235373 1287498 1300919 1307350 1347676 1328219
5547 1328219 1349277 1406884 1447028 1493086 1484846 1454490 1454648 1549894 1576023 1572499 1591795 1677790
5535 1677790 1799928 1932865 1967799 2000626 2047667 2015290 1933301 1918175 1917216 1954774 1904852
5524 1904852 1917828 1959657 1905335 1973934 2012864 2092760 2135323 2100217 2099324 2152206 2242472 2277782
5512 2277782 2405540 2465292 2469504 2591885 2744729 2933146 3068041 3139303 3179463 3176975 3259710
5501 3259710 3345553 3418058 3584973 3739294 3840200 3989231 4078050 4221102 4386612 4584808
5491 4584808 4847097 5203278 5775435 6350594 6888159 7299220 7503785 7372062 6967398 6575165
5481 6575165 6150997 5831953 5643803 5478594 5380776 5364268 5440318 5611139 5767388 5916430
$$ packed form
5559A171766M2972K7963M2020K645l8482n4748M1237N2125J3421O431M0326j9457
5547A328219K1058N7607M0144M6058q240l0356J58R5246K6129l524J9296Q5995
5535A677790J22138J32937L4934L2827M7041l2377q1989j5126r59L7558m9922
5524A904852J2976M1829n4322O8599L8930P9896M2563l5106q93N2882R0266L5310
5512B277782J27758N9752M212J22381J52844J88417J34895P1262M0160k488Q2735
5501C259710Q5843P2505J66915J54321J00906J49031Q8819J43052J65510J98196
5491D584808K62289L56181N72157N75159N37565M11061K04565j31723m04664l92233
5481F575165m24168l19044j88150j65209r7818j6508P6050J70821J56249J49042
$$ plain form
5471 5916430 6067233 6141212 6284963 6449151 6639067 6911204 7276216 7852382 8649726 9582137
5461 9582137 10660674 11608590 12218428 12302382 11710680 10827346 9857169 8883020 8073525 7480544
5451 7480544 6998270 6653673 6439096 6264853 6191804 6089245 6015860 6031724 6023443 5967885 5938366
5440 5938366 5959625 6187060 6352199 6583740 6940605 7414706 7921579 8353551 8599636 8464292
5430 8464292 8106623 7480428 6941317 6587549 6225836 6045969 5785177 5598959 5433825 5264203
5420 5264203 5128925 4884199 4698239 4552970 4352620 4184714 4027900 3918539 3859500 3710453
5410 3710453 3709408 3611434 3538809 3459331 3427912 3500239 3497556 3540895 3557890 3563325 3616556 3590855
5398 3590855 3665766 3818663 3867350 3962281 4095476 4049002 3902513 3807824 3737810 3667732 3576846
$$ packed form
5471E916430J50803P3979J43751J64188J89916K72137L65012N76166P97344R32411
5461I582137J078537R47916O09838Q3954n91702q83334r70177r74149q09495n92981
5451G480544m82274l44597k14577j74243p3049j02559p3385J5864q281n5558k9519
5440E938366K1259K27435J65139K31541L56865M74101N06873M31972K46085j35344
5430H464292l57669o26195n39111l53768l61713j79867k60792j86218j65134j69622
5420E264203j35278k44726j85960j45269k00350j67906j56814j09361n9039j49047
5410C710453j045r7974p2625p9478l1419P2327k683M3339J6995N435N3231k5701
5398C590855P4911J52897M8687R4931J33195m6474j46489r4689p0014p0078r0886
$$ plain form
5387 3576846 3512141 3421589 3251371 3125793 2961557 2919002 2828731 2687903 2654630 2622333 2666303
5376 2666303 2758453 2707578 2638080 2649183 2652977 2688659 2662446 2699622 2756820 2830924 2884596 2867056
5364 2867056 2835884 2780570 2716120 2679008 2651357 2630305 2576597 2479912 2437018 2382374 2332067
5353 2332067 2329770 2350509 2371039 2370919 2351945 2321582 2310162 2331164 2340831 2281283 2241630 2201130
5341 2201130 2157347 2163505 2258004 2225326 2257418 2338474 2385450 2389230 2423687 2428311 2397083 2413709
5329 2413709 2491574 2481816 2602846 2566893 2555132 2677429 2742699 2730076 2785256 2836769 2871866
5318 2871866 2994023 3060744 3182470 3208422 3223076 3145472 3251352 3327310 3404549 3561295 3804837
5307 3804837 4019899 4217712 4496816 4885287 5432246 6166728 6904664 7469120 7689294 7389363
$$ packed form
5387C576846o4705r0552j70218j25578j64236m2555r0271j40828l3273l2297M3970
5376B666303R2150n0875o9498J1103L794L5682k6213L7176N7198P4104N3672j7540
5364B867056l1172n5314o4450l7112k7651k1052n3708r6685m2894n4644n0307
5353B332067k297K0739K0530j20j8974l0363j1420K1002R667n9548l9653m0500
5341B201130m3783O158R4499l2678L2092Q1056M6976L780L4457M624l1228J6626
5329B413709P7865r758J21030l5953j1761J22297O5270j2623N5180N1513L5097
5318B871866J22157O6721J21726K5952J4654p7604J05880P5958P7239J56746K43542
5307C804837K15062J97813K79104L88471N46959P34482P37936N64456K20174k99931
$$ plain form
5297 7389363 6825568 6138875 5542492 5097395 4760607 4614623 4441382 4336216 4319841 4374091
5287 4374091 4377796 4434509 4589197 4764813 4881548 4985440 5119197 5278124 5444724 5730288
5277 5730288 6146657 6585072 7179404 8055668 9130135 10621378 12134707 13203573 13343162
5268 13343162 12387031 10848798 9355729 8134792 7186576 6551863 6104295 5738269 5530287
5259 5530287 5298386 5141085 5164481 5093451 4948620 4976945 5098850 5203078 5293736 5396171
5249 5396171 5529956 5650280 5824140 6032285 6346880 6790174 7433955 8183736 8861698 9284111
5239 9284111 9195689 8553898 7832761 7177601 6544683 6056348 5753594 5522251 5298145 5119526
5229 5119526 4998352 4854892 4726222 4658561 4663966 4533353 4509886 4441221 4420446 4485039 4517188
$$ packed form
5297G389363n63795o86693n96383m45097l36788j45984j73241j05166j6375N4250
5287D374091L705N6713J54688J75616J16735J03892J33757J58927J66600K85564
5277E730288M16369M38415N94332Q76264J074467J491243J513329J068866J39589
5268A3343162r56131j538233j493069j220937r48216o34713m47568l66026k07982
5259E530287k31901j57301K3396p1030j44831K8325J21905J04228R0658J02435
5249E396171J33785J20324J73860K08145L14595M43294O43781P49781O77962M22413
5239I284111q8422o41791p21137o55160o32918m88335l02754k31343k24106j78619
5229E119526j21174j43460j28670o7661N405j30613k3467o8665k0775O4593L2149
$$ plain form
5218 4517188 4446387 4344204 4400398 4431197 4382428 4341087 4301735 4212973 4173080 4227756 4228664 4165503
5206 4165503 4049228 4001018 3954954 3928221 3866401 3817774 3744318 3669670 3613862 3585798 3551672
5195 3551672 3534342 3457030 3464179 3469036 3385570 3417937 3357802 3347278 3434957 3504231 3571163 3630333
5183 3630333 3599127 3631428 3644299 3657588 3692826 3681086 3722155 3763975 3773669 3684113 3720856 3749973
5171 3749973 3744244 3690656 3621282 3566001 3530514 3476398 3459140 3376976 3360985 3407558 3415840 3473249
5159 3473249 3490289 3489646 3477505 3496254 3478901 3579463 3614433 3575906 3541595 3583256 3533444 3427100
5147 3427100 3408078 3422371 3326238 3270464 3220694 3212942 3129482 3109830 3076371 2977703 3014346 3044153
5135 3044153 2984193 2958588 2917427 2926272 2968741 2927159 2889862 2885027 2922775 2896769 2918404 2869917
$$ packed form
5218D517188p0801j02183N6194L0799m8769m1341l9352q8762l9893N4676R08o3161
5206D165503j16275m8210m6064k6733o1820m8627p3456p4648n5808k8064l4126
5195C551672j7330p7312P149M857q3466L2367o0135j0524Q7679O9274O6932N9170
5183C630333l1206L2301J2871J3289L5238j1740M1069M1820R694q9556L6743K9117
5171C749973n729n3588o9374n5281l5487n4116j7258q2164j5991M6573Q282N7409
5159C473249J7040o43j2141J8749j7353J00562L4970l8527l4311M1661m9812j06344
5147C427100j9022J4293r6133n5774m9770p752q3460j9652l3459r8668L6643K9807
5135C044153n9960k5605m1161Q845M2469m1582l7297m835L7748k6006K1635m8487
$$ plain form
5123 2869917 2817144 2864185 2883975 2903177 2882906 2899855 2944038 2948520 2997967 3107156 3124426
5112 3124426 3176955 3232605 3338409 3524690 3653988 3790247 3896021 3950010 3833616 3750491
5102 3750491 3604080 3578438 3576868 3591629 3631121 3652077 3642107 3572857 3560657 3612880 3656325 3754863
5090 3754863 3814226 3817494 3852292 3895826 3990301 4014501 4114488 4215503 4341908 4410165 4491992
5079 4491992 4578168 4684158 4773319 4851335 4950419 5040394 5055588 5076332 5105500 5073447 5033725
5068 5033725 5046810 5041446 4987044 4963472 4961672 4986573 5015045 5016653 5017448 5098540 5070665 5174563
5056 5174563 5265170 5370709 5459275 5482308 5630297 5805907 5884752 6014719 6136500 6316046
5046 6316046 6588403 6723095 6874135 6911431 6976515 6890623 6790696 6726236 6705446 6524965 6467753
$$ packed form
5123B869917n2773M7041J9790J9202k0271J6949M4183M482M9447J09189J7270
5112C124426N2529N5650J05804J86281J29298J36259J05774N3989j16394q3125
5102C750491j46411k5642j570J4761L9492K0956r970o9250j2200N2223M3445R8538
5090C754863N9363L268L4798M3534R4475K4200R9987J01015J26405O8257Q1827
5079D491992Q6176J05990Q9161P8016R9084Q9975J5194K0744K9168l2053l9722
5068E033725J3085n364n4402k3572j800K4901K8472J608P95Q1092k7875J03898
5056E174563R0607J05539Q8566K3033J47989J75610P8845J29967J21781J79546
5046F316046K72357J34692J51040L7296O5084q5892r9927o4460k0790j80481n7212
$$ plain form
5035 6467753 6461364 6423507 6413813 6422448 6364997 6395128 6446634 6506556 6545199 6596842 6674951 6778671
5023 6778671 6884246 7007959 7095034 7229354 7459639 7648239 7793517 7977815 8239254 8546736
5013 8546736 8857949 9067862 9249577 9318182 9477325 9614664 9690368 9731805 9812014 9882804
5003 9882804 10103325 10219155 10367821 10599120 10850861 11201574 11417142 11560509 11887388 12217175
4993 12217175 12493797 12879041 13218663 13534541 13887111 14181132 14538700 14928263 15419258
4984 15419258 15972237 16410548 17012784 17645353 18236468 18904006 19597953 20362415 21248162
4975 21248162 22247320 23324441 24516918 25895611 27472288 29182237 31144290 33370729
4967 33370729 35851566 38645746 41519253 44280688 46655011 48228358 48821607 48278225
$$ packed form
5035F467753o389l7857r694Q635n7451L0131N1506N9922L8643N1643P8109J03720
5023F778671J05575J23713Q7075J34320K30285J88600J45278J84298K61439L07482
5013H546736L11213K09913J81715O8605J59143J37339P5704M1437Q0209P0790
5003I882804K20521J15830J48666K31299K51741L50713K15568J43367L26879L29787
4993A2217175K76622L85244L39622L15878L52570K94021L57568L89563M90995
4984A5419258N52979M38311O02236O32569N91115O67538O93947P64462Q85747
4975B1248162R99158J077121J192477J378693J576677J709949J962053K226439
4967C3370729K480837K794180K873507K761435K374323J573347N93249n43382
$$ plain form
4959 48278225 46954191 45125126 43210167 41496374 40081548 38945888 38209799 37674378
4951 37674378 37418420 37327438 37480814 37808923 38383793 39197095 40249220 41576095 43240165
4942 43240165 45134360 47444964 50020079 53080824 56578396 60626158 65322986 70817070
4934 70817070 77068307 84318599 92468118 100911872 108703136 114134161 115992123 113563244
4926 113563244 107679480 99938069 91674045 83811682 77046009 71332748 66748184 63102988
4918 63102988 60277612 58131225 56511592 55393143 54777135 54679146 55008239 55715342 56995516
4909 56995516 58785607 61029350 63515749 66150677 68791638 71619622 74962262 79016579
4901 79016579 84093864 90180122 97152970 104673091 111813947 117137472 119193468 117200429
$$ packed form
4959D8278225j324034j829065j914959j713793j414826j135660p36089n35421
4951C7674378k55958r0982J53376L28109N74870Q13302J052125J326875J664070
4942D3240165J894195K310604K575115L060745L497572M047762M696828N494084
4934G0817070O251237P250292Q149519Q443754P791264N431025J857962k428879
4926A13563244n883764p741411q264024p862363o765673n713261m584564l645196
4918F3102988k825376k146387j619633j118449o16008r7989L29093P07103J280174
4909E6995516J790091K243743K486399K634928K640961K827984L342640M054317
4901G9016579N077285O086258O972848P520121P140856N323525K055996j993039
$$ plain form
4893 117200429 111436201 103124926 93800570 84736756 76566945 69598626 63706929 58799976
4885 58799976 54671714 51221453 48358966 45943106 44017103 42413648 41246200 40469189
4877 40469189 40016443 39877320 40099909 40713282 41572763 42459314 43011932 43319902 43621354
4868 43621354 44315969 45445656 47022424 48768692 50469043 51634758 51826887 50820497
4860 50820497 48661502 45716479 42403619 39064367 35945241 33184940 30864745 28826905
4852 28826905 27089376 25614066 24378734 23145201 22255688 21440359 20732316 20015013 19404721
4843 19404721 18859508 18448522 18051896 17751793 17508431 17264034 17093666 16940246 16837498
4834 16837498 16738695 16691153 16787618 16786578 16752179 16677004 16723378 16685282 16701580 16768844 16791300
$$ packed form
4893A17200429n764228q311275r324356r063814q169811o968319n891697m906953
4885E8799976m128262l450261k862487k415860j926003j603455j167448p77011
4877D0469189m52746j39123K22589O13373Q59481Q86551N52618L07970L01452
4868D3621354O94615J129687J576768J746268J700351J165715J92129j006390
4860E0820497k158995k945023l312860l339252l119126k760301k320195k037840
4852B8826905j737529j475310j235332j233533q89513q15329p08043p17303o10292
4843A9404721n45213m10986l96626l00103k43362k44397j70368j53420j02748
4834A6837498r8803m7542R6465j040l4399p5175M6374l8096J6298O7264K2456
$$ plain form
4823 16791300 16985240 17173879 17438187 17740421 18064500 18553812 18955853 19447205 19956246
4814 19956246 20523523 21120036 21908504 22825701 23865011 25098082 26481627 27982385 29737433
4805 29737433 31723618 34102211 36782710 39909654 43643759 48347014 54493728 63120844
4797 63120844 75483907 94282330 117448898 135724679 143860428 132525062 110149607
4790 110149607 88536459 70521797 57548308 48349414 41736935 36747008 32992511 29985055
4782 29985055 27540480 25453198 23804556 22338639 21190443 20136175 19268041 18511290
4774 18511290 17898597 17263574 16671476 16027283 15488962 15009357 14633749 14257824 13900649
4765 13900649 13566612 13325331 13007286 12758476 12539603 12264166 11971843 11673927 11379735
$$ packed form
4823A6791300J93940J88639K64308L02234L24079M89312M02041M91352N09041
4814A9956246N67277N96513P88468R17197J039310J233071J383545J500758J755048
4805B9737433J986185K378593K680499L126944L734105M703255O146714Q627116
4797F3120844J2363063J8798423K3166568J8275781Q135749j1335366k2375455
4790A10149607k1613148j8014662j2973489r198894o612479m989927l754497l007456
4782B9985055k444575k087282j648642j465917j148196j054268q68134p56751
4774A8511290o12693o35023n92098o44193n38321m79605l75608l75925l57175
4765A3900649l34037k41281l18045k48810k18873k75437k92323k97916k94192
$$ plain form
4756 11379735 11171710 10983864 10849582 10730650 10560046 10457918 10382426 10377982 10314802 10244821
4746 10244821 10269959 10293885 10265549 10261873 10325308 10465393 10720528 11004565 11220174 11297761 11164445
4735 11164445 10920603 10618558 10218549 9750729 9248089 8763319 8407359 8116073 7834573
4726 7834573 7579355 7410363 7337533 7195145 7025549 6900247 6809180 6635871 6513309 6323247
4716 6323247 6218984 6170666 6131190 6191341 6099237 6033911 6008928 5972258 5937059 5864873 5804684
4705 5804684 5799352 5813886 5754496 5742643 5712523 5705915 5687475 5704353 5638599 5598628 5580319 5500611
4693 5500611 5468658 5464983 5416705 5404550 5324447 5324832 5315111 5263666 5212274 5121909 5134400 5200360
4681 5200360 5150053 5198313 5210919 5237990 5249660 5286419 5328256 5437076 5554506 5673394 5703720
$$ packed form
4756A1379735k08025j87846j34282j18932j70604j02128p5492m444o3180o9981
4746A0244821K5138K3926k8336l676O3435J40085K55135K84037K15609P7587j33316
4735A1164445k43842l02045m00009m67820n02640m84770l55960k91286k81500
4726G834573k55218j68992p2830j42388j69596j25302r1067j73309j22562j90062
4716F323247j04263m8318l9476O0151r2104o5326k4983l6670l5199p2186o0189
4705E804684n332J4534n9390j1853l0120o608j8440J6878o5754l9971j8309p9708
4693E500611l1953l675m8278j2155q0103L85r721n1445n1392r0365J2491O5960
4681E200360n0307M8260J2606K7071J1670L6759M1837J08820J17430J18888L0326
$$ plain form
4670 5703720 5684652 5586580 5469980 5383723 5256792 5168847 5164622 5169668 5170190 5176041 5136096 5100669
4658 5100669 5121146 5140049 5158819 5135700 5208074 5266047 5352704 5392264 5464868 5575030 5656827
4647 5656827 5826430 5998041 6106968 6242796 6300341 6380924 6496610 6657215 6851621 6959923
4637 6959923 7161093 7358434 7568811 7714661 7795707 7911101 8075834 8377092 8743075 9198008
4627 9198008 9755260 10359088 10929859 11264124 11463179 11408186 11231871 10985905 10617970 10379790
4617 10379790 10225447 10068479 10017351 10031986 10043461 10125107 10173750 10295693 10472158 10689561
4607 10689561 10943274 11166402 11446256 11759690 12131307 12417136 12804010 13081275 13503196
4598 13503196 13936168 14295759 14669167 15046885 15546946 16009304 16554142 17202970 17891270
$$ packed form
4670E703720j9068r8072j16600q6257j26931q7945m225N046N22N851l9945l5427
4658E100669K0477J8903J8770k3119P2374N7973Q6657L9560P2604J10162Q1797
4647E656827J69603J71611J08927J35828N7545Q0583J15686J60605J94406J08302
4637F959923K01170J97341K10377J45850Q1046J15394J64733L01258L65983M54933
4627I198008N57252O03828N70771L34265J99055n4993j76315k45966l67935k38180
4617A0379790j54343j56968n1128J4635J1475Q1646M8643J21943J76465K17403
4607A0689561K53713K23128K79854L13434L71617K85829L86874K77265M21921
4598A3503196M32972L59591L73408L77718N00061M62358N44838O48828O88300
$$ plain form
4589 17891270 18681614 19425288 20294930 21222524 22222219 23220956 24277529 25368869 26696117
4580 26696117 28113476 29724290 31538810 33669651 36037199 38793123 41911363 45537980
4572 45537980 49713364 54443270 59799747 66215737 74078451 83917340 96718103 113901479
4564 113901479 136569472 164232049 190628590 207481301 207427184 189270667 162350210
4557 162350210 134574171 110358891 91319829 76924985 65992735 57650133 51077586
4550 51077586 45732148 41448811 37801896 34622919 32043905 29785586 27784572 26047047
4542 26047047 24504295 23158669 21962577 20879864 19894342 19036651 18228938 17495724 16791765
4533 16791765 16153787 15535157 14889496 14315680 13702115 13098056 12551793 12074237 11554267
$$ packed form
4589A7891270P90344P43674Q69642R27594R99695R98737J056573J091340J327248
4580B6696117J417359J610814J814520K130841K367548K755924L118240L626617
4572D5537980M175384M729906N356477O415990P862714R838889J2800763J7183376
4564A13901479K2667993K7662577K6396541J6852711n4117j8156517k6920457
4557A62350210k7776039k4215280j9039062j4394844j0932250q342602o572547
4550E1077586n345438m283337l646915l178977k579014k258319k001014j737525
4542B6047047j542752j345626j196092j082713r85522q57691q07713p33214p03959
4533A6791765o37978o18630o45661n73816o13565o04059n46263m77556n19970
$$ plain form
4524 11554267 11002871 10606422 10220379 9900782 9533722 9200081 8874042 8614971 8342499
4515 8342499 8075487 7811730 7618704 7466172 7227056 6967881 6773775 6660174 6513579 6411879
4505 6411879 6234363 6125060 6033751 5937793 5831955 5764363 5606202 5495417 5317935 5144078
4495 5144078 5059456 4978315 4905215 4788729 4724186 4654792 4557728 4525196 4462530 4372900 4298691
4484 4298691 4248438 4205918 4168222 4170883 4225886 4238068 4285969 4319448 4248431 4037715 3822084
4473 3822084 3649511 3579165 3487416 3351841 3279056 3201813 3186852 3176045 3235451 3147793 3022832
4462 3022832 2907589 2828517 2787577 2738176 2730317 2772480 2769690 2735718 2652143 2591986 2608260 2607944
4450 2607944 2622853 2560075 2558428 2522928 2525459 2490103 2457400 2414315 2460709 2456580 2403089 2416536
$$ packed form
4524A1554267n51396l96449l86043l19597l67060l33641l26039k59071k72472
4515H342499k67012k63757j93026j52532k39116k59175j94106j13601j46595j01700
4505F411879j77516j09303r1309r5958j05838o7592j58161j10785j77482j73857
4495E144078q4622q1141p3100j16486o4543o9394r7064l2532o2666q9630p4209
4484D298691n0253m2520l7696K661N5003J2182M7901L3479p1017k10716k15631
4473C822084j72573p0346r1749j35575p2785p7243j4961j0807N9406q7658j24961
4462C022832j15243p9072m0940m9401p859M2163k790l3972q3575o0157J6274l16
4450B607944J4909o2778j647l5500K531l5356l2703m3085M6394m129n3491J3447
$$ plain form
4438 2416536 2366021 2408962 2442008 2386202 2326228 2229900 2162111 2233299 2284824 2238409 2183673
4427 2183673 2139168 2157859 2157911 2153880 2107970 2094371 2033155 1988235 1935891 1961158 1947830 1924436
4415 1924436 2028399 2026265 1984368 2028798 2011954 2026720 1982318 1998736 2034475 2021666 1938881
4404 1938881 1950008 2018352 2079068 2115051 2127711 2123169 2037724 2052847 2025445 2053846 2077349 2060635
4392 2060635 2002970 1991547 1939618 1955715 1888018 1875314 1891282 1797633 1755409 1712512 1678777
4381 1678777 1661486 1589699 1613541 1596165 1551845 1524010 1570226 1599365 1601739 1639770 1603685 1620673
4369 1620673 1631163 1574785 1581601 1565537 1551440 1638133 1614196 1548362 1540694 1537094 1473320 1452735
4357 1452735 1473723 1417297 1416070 1413915 1474926 1499762 1435852 1430431 1470020 1424047 1349597 1413445
$$ packed form
4438B416536n0515M2941L3046n5806n9974r6328o7789P1188N1525m6415n4736
4427B183673m4505J8691N2m031m5910j3599o1216m4920n2344K5267j3328k3394
4415A924436J03963k134m1897M4430j6844J4766m4402J6418L5739j2809q2785
4404A938881J1127O8344O0716L5983J2660m542q5445J5123k7402K8401K3503j6714
4392B060635n7665j1423n1929J6097o7697j2704J5968r3649m2224m2897l3735
4381A678777j7291p1787K3842j7376m4320k7835M6216K9139K374L8031l6085J6988
4369A620673J0490n6378O816j6064j4097Q6693k3937o5834p668l600o3774k0585
4357A452735K0988n6426j227k155O1011K4836o3910n421L9589m5973p4450O3848
$$ plain form
4345 1413445 1440583 1412130 1460052 1435491 1393194 1398699 1443473 1400459 1428704 1374363 1447271 1453978
4333 1453978 1480738 1476476 1465003 1497147 1448499 1422148 1401337 1392781 1405770 1389807 1405808 1425384
4321 1425384 1451701 1445634 1443600 1482253 1556419 1503891 1515654 1535665 1466596 1452112 1526752 1496596
4309 1496596 1521736 1555624 1533594 1510746 1574567 1649531 1526741 1543994 1475056 1513360 1554942
4298 1554942 1508552 1483294 1492046 1489640 1548883 1540633 1565370 1542637 1518775 1618771 1650198 1598136
4286 1598136 1594066 1619018 1587817 1546832 1535361 1575180 1634300 1580293 1574014 1642536 1622773 1566191
4274 1566191 1570287 1556245 1624796 1625306 1618284 1557960 1633649 1724804 1815203 1781910 1789956 1853617
4262 1853617 1917952 1991266 2039848 2065220 2159033 2321457 2460975 2608873 2702332 2765021 2722187
$$ packed form
4345A413445K7138k8453M7922k4561m2297N505M4774m3014K8245n4341P2908O707
4333A453978K6760m262j1473L2144m8648k6351k0811q556J2989j5963J6001J9576
4321A425384K6317o067k034L8653P4166n2528J1763K0011o9069j4484P4640l0156
4309A496596K5140L3888k2030k2848O3821P4964j22790J7253o8938L8304M1582
4298A554942m6390k5258Q752k406N9243q250K4737k2733k3862R9996L1427n2062
4286A598136m070K4952l1201m0985j1471L9819N9120n4007o279O8522j9763n6582
4274A566191M096j4042O8551N10p022o0324P5689R1155R0399l3293Q046O3661
4262A853617O4335P3314M8582K5372R3813J62424J39518J47898R3459O2689m2834
$$ plain form
4251 2722187 2634228 2487270 2382817 2348514 2234874 2108626 2067837 2079598 2108456 2156621 2146144
4240 2146144 2090886 2140073 2208697 2273635 2359393 2415513 2390865 2420315 2555208 2590360 2608581
4229 2608581 2638257 2662256 2662936 2616774 2560440 2550111 2560024 2581656 2561898 2518473 2432740 2482680
4217 2482680 2486430 2450812 2404384 2358185 2412181 2420259 2396759 2432853 2460541 2550906 2593361 2550291
4205 2550291 2542417 2499041 2525196 2534690 2536637 2574704 2667826 2695455 2749025 2756227 2805044 2813448
4193 2813448 2860187 2962884 2930780 2983428 3035772 3065196 3182754 3170680 3261963 3303268 3315890
4182 3315890 3436640 3524136 3542500 3640628 3720023 3802767 3860923 3920999 3972467 4140737 4224349
4171 4224349 4396937 4553191 4580107 4656416 4724529 4815529 4825271 4875194 4976885 5101740 5218864
$$ packed form
4251B722187q7959j46958j04453l4303j13640j26248m0789J1761K8858M8165j0477
4240B146144n5258M9187O8624O4938Q5758N6120k4648K9450J34893L5152J8221
4229B608581K9676K3999O80m6162n6334j0329R913K1632j9758m3425q5733M9940
4217B482680L750l5618m6428m6199N3996Q078k3500L6094K7688R0365M2455m3070
4205B550291p874m3376K6155R494J947L8067R3122K7629N3570P202M8817Q404
4193B813448M6739J02697l2104N2648N2344K9424J17558j2074R1283M1305J2622
4182C315890J20750Q7496J8364R8128P9395Q2744N8156O0076N1468J68270Q3612
4171D224349J72588J56254K6916P6309O8113R1000R742M9923J01691J24855J17124
$$ plain form
4160 5218864 5325965 5379382 5481623 5553036 5686046 5812212 5966222 6098634 6188711 6270455
4150 6270455 6402051 6555766 6726523 6855507 7105178 7383349 7599732 7837991 8049626 8383488
4140 8383488 8633545 8958014 9289782 9574589 9996500 10416119 10796934 11325903 11854337 12436467
4130 12436467 13123830 13817519 14531272 15449577 16446378 17543755 18801984 20193318 21706765
4121 21706765 23190028 24830700 26718925 28922380 31533182 34736775 38172195 41439636
4113 41439636 44256501 46487850 48546618 51038948 54457335 59218329 65223963 71365422
4105 71365422 76174345 77842843 75727305 70436633 63274424 55786171 48824901 42794560
4097 42794560 37852070 33830086 30574454 27948971 25840235 24017601 22526043 21351000
$$ packed form
4160E218864J07101N3417J02241P1413J33010J26166J54010J32412R0077Q1744
4150F270455J31596J53715J70757J28984K49671K78171K16383K38259K11635L33862
4140H383488K50057L24469L31768K84807M21911M19619L80815N28969N28434N82130
4130A2436467O87363O93689P13753R18305R96801J097377J258229J391334J513447
4121B1706765J483263J640672J888225K203455K610802L203593L435420L267441
4113D1439636K816865K231349K058768K492330L418387M760994O005634O141459
4105G1365422M808923J668498k115538n290672p162209p488253o961270o030341
4097D2794560m942490m021984l255632k625483k108736j822634j491558j175043
$$ plain form
4089 21351000 20281990 19411303 18715134 18095935 17493312 17026632 16590493 16236404 15950800
4080 15950800 15646681 15351880 15125051 14859257 14615270 14428362 14259836 14174632 14099984 13962645
4070 13962645 13789396 13595033 13528164 13392673 13227953 13072641 12900519 12756177 12524570 12307211
4060 12307211 12087979 11940510 11729128 11653770 11509410 11372956 11244935 11103492 11031969 10870003
4050 10870003 10756303 10522946 10367154 10212935 9935756 9610830 9440573 9244979 9008135
4041 9008135 8770734 8663055 8572261 8455089 8280574 8094315 7934405 7736009 7450141 7179660
4031 7179660 7031914 6916887 6741420 6603600 6552155 6363372 6261259 6203376 6050826 5953755
4021 5953755 5857483 5793864 5725983 5643421 5634844 5549249 5473765 5401925 5386724 5414372 5416894 5384810
$$ packed form
4089B1351000j069010q70687o96169o19199o02623m66680m36139l54089k85604
4080A5950800l04119k94801k26829k65794k43987j86908j68526q5204p4648j37339
4070A3962645j73249j94363o6869j35491j64720j55312j72122j44342k31607k17359
4060A2307211k19232j47469k11382p5358j44360j36454j28021j41443p1523j61966
4050A0870003j13700k33357j55792j54219k77179l24926j70257j95594k36844
4041I008135k37401j07679r0794j17172j74515j86259j59910j98396k85868k70481
4031G179660j47746j15027j75467j37820n1445j88783j02113n7883j52550r7071
4021E953755r6272o3619o7881q2562q577q5595p5484p1840j5201K7648K522l2084
$$ plain form
4009 5384810 5359171 5343215 5373335 5463357 5466159 5419611 5508642 5577448 5720058 5924959 6083301
3998 6083301 6178185 6204047 6100902 5964978 5854195 5693181 5553246 5472228 5369449 5339312
3988 5339312 5332239 5304524 5285474 5251488 5289583 5349077 5478688 5664654 5720129 5788114 5940551
3977 5940551 6047177 6172124 6423390 6735126 7140581 7605093 8067418 8383264 8397065 8231146
3967 8231146 7909579 7346219 6821963 6362104 5918309 5594217 5353699 5215186 5158836 5016779
3957 5016779 4950986 4954622 4948769 5038541 5118354 5250955 5375098 5545719 5840691 6132345 6528554
3946 6528554 7126881 7747714 8517055 9227824 9804034 10050699 9941849 9454197 8805469 8136135
3936 8136135 7407591 6784291 6288236 5920875 5634594 5430594 5248771 5155933 5115341 5063111
$$ packed form
4009E384810k5639j5956L0120R0022K802m6548Q9031O8806J42610K04901J58342
3998F083301R4884K5862j03145j35924j10783j61014j39935q1018j02779l0137
3988E339312p073k7715j9050l3986L8095N9494J29611J85966N5475O7985J52437
3977E940551J06626J24947K51266L11736M05455M64512M62325L15846J3801j65919
3967H231146l21567n63360n24256m59859m43795l24092k40518j38513n6350j42057
3957E016779o5793L636n853Q9772P9813J32601J24143J70621K94972K91654L96209
3946F528554N98327O20833P69341P10769N76210K46665j08850m87652o48728o69334
3936H136135p28544o23300m96055l67361k86281k04000j81823r2838m0592n2230
$$ plain form
3926 5063111 5181892 5347094 5577956 5699445 5687693 5638639 5606274 5569488 5715949 5988506
3916 5988506 6355197 6788332 7163643 7290196 7109190 6818019 6307762 5764485 5293959 4877962
3906 4877962 4495066 4190020 3963183 3775661 3632557 3484319 3488326 3488392 3523604 3543373 3493311
3895 3493311 3507824 3523363 3568138 3533814 3486624 3456663 3509651 3596537 3688262 3806014 3925371
3884 3925371 3907962 3768763 3655028 3440426 3315163 3319840 3171056 3165776 3204027 3188444 3133438
3873 3133438 3170106 3268513 3467615 3594607 3735202 4025669 4296707 4459810 4351813 4172940
3863 4172940 3843249 3591869 3491976 3223731 3024776 2893993 2824271 2733302 2719227 2669764
3853 2669764 2669855 2695046 2725865 2685112 2736137 2779626 2832883 2965229 3094556 3144919 3183941 3173445
$$ packed form
3926E063111J18781J65202K30862J21489j1752m9054l2365l6786J46461K72557
3916E988506L66691M33135L75311J26553j81006k91171n10257n43277m70526m15997
3906D877962l82896l05046k26837j87522j43104j48238M007O6L5212J9769n0062
3895C493311J4513J5539M4775l4324m7190k9961N2988Q6886R1725J17752J19357
3884C925371j7409j39199j13735k14602j25263M677j48784n280L8251j5583n5006
3873C133438L6668R8407J99102J26992J40595K90467K71038J63103j07997j78873
3863D172940l29691k51380r9893k68245j98955j30783o9722r0969j4075m9463
3853B669764R1K5191L0819m0753N1025M3489N3257J32346J29327N0363L9022j0496
$$ plain form
3841 3173445 3187333 3238360 3308053 3294157 3214740 3164101 2999446 2931044 2916971 2874355 2746377
3830 2746377 2677729 2635061 2628690 2598941 2651467 2577799 2561660 2509392 2457032 2519323 2525220 2545845
3818 2545845 2561824 2558579 2594736 2721004 2747442 2755059 2717162 2703052 2789015 2722565 2686794 2650039
3806 2650039 2603853 2585362 2603224 2638730 2608882 2596240 2676371 2664950 2676825 2710032 2666067
3795 2666067 2660136 2675560 2659621 2690725 2775624 2839774 2857603 2911926 2982728 3028647 3085494 3128040
3783 3128040 3287825 3386739 3463956 3462603 3455982 3503146 3489924 3608181 3672993 3726092 3726986 3805280
3771 3805280 3849214 3927728 3959654 4026233 4132985 4170337 4198598 4240722 4343120 4376626 4400946
3760 4400946 4449518 4529951 4451170 4484282 4549834 4570099 4625742 4737686 4750061 4690098 4707683
$$ packed form
3841C173445J3888N1027O9693j3896p9417n0639j64655o8402j4073m2616j27978
3830B746377o8648m2668o371k9749N2526p3668j6139n2268n2360O2291N897K0625
3818B545845J5979l245L6157J26268K6438P617l7897j4110Q5963o6450l5771l6755
3806B650039m6186j8491J7862L5506k9848j2642Q0131j1421J1875L3207m3965
3795B666067n931J5424j5939L1104Q4899O4150J7829N4323P0802M5919N6847M2546
3783C128040J59785R8914P7217j353o621M7164j3222J18257O4812N3099Q94P8294
3771C805280M3934P8514L1926O6579J06752L7352K8261M2124J02398L3506K4320
3760D400946M8572Q0433p8781L3112O5552K0265N5643J11944J2375n9963J7585
$$ plain form
3749 4707683 4744836 4795972 4833065 4863363 4934977 4969105 5025974 5099623 5094669 5121515 5211932 5308753
3737 5308753 5413996 5501351 5555148 5687022 5849358 6076902 6342555 6494842 6682884 6889599
3727 6889599 7111225 7379399 7674538 7940842 8122279 8365230 8624202 8918204 9133880 9294872
3717 9294872 9551775 9791744 9948234 10187978 10367823 10541751 10630975 10760453 10857720 10960666
3707 10960666 11084017 11153724 11253053 11252913 11284483 11302227 11353360 11209920 11143133 11146813 11130809
3696 11130809 11090966 11090573 11096791 11110643 11054684 10996632 10955474 10861337 10882193 10916137 10848980 10782271
3684 10782271 10751007 10773325 10808210 10784071 10767381 10632606 10542409 10509051 10454772 10368126 10209746
3673 10209746 10080098 9949831 9837963 9724672 9561620 9436666 9340503 9276962 9118709 8935633
$$ packed form
3749D707683L7153N1136L7093L0298P1614L4128N6869P3649m954K6846R0417R6821
3737E308753J05243Q7355N3797J31874J62336K27544K65653J52287J88042K06715
3727F889599K21626K68174K95139K66304J81437K42951K58972K94002K15676J60992
3717I294872K56903K39969J56490K39744J79845J73928Q9224J29478R7267J02946
3707A0960666J23351O9707R9329j40L1570J7744N1133j43440o6787L680j6004
3696A1130809l9843l93O218J3852n5959n8052m1158r4137K0856L3944o7157o6709
3684A0782271l1264K2318L4885k4139j6690j34775r0197l3358n4279q6646j58380
3673A0209746j29648j30267j11868j13291j63052j24954r6163o3541j58253j83076
$$ plain form
3663 8935633 8688275 8472770 8257100 7994287 7732984 7577461 7369179 7161106 6935835 6773619
3653 6773619 6602986 6447992 6244408 6140405 6069113 5945165 5853284 5789577 5730958 5663640
3643 5663640 5659734 5617559 5605105 5613988 5667760 5683854 5765440 5806660 5906155 5967120 6020756 6027396
3631 6027396 6056828 6033801 6044157 6081968 6059830 6091944 6124784 6157707 6253257 6327968 6344535
3620 6344535 6386554 6480052 6560667 6593992 6632114 6651909 6696094 6697063 6589697 6506127 6407714 6242918
3608 6242918 6083105 6054233 5944810 5865823 5857319 5882011 5819030 5748737 5715774 5713339 5675621
3597 5675621 5604685 5639208 5684973 5666202 5620200 5662116 5735703 5846705 5910740 6028957 6222101
3586 6222101 6353175 6603473 6795514 7062135 7365531 7537274 7641272 7644898 7622298 7583438
$$ packed form
3663H935633k47358k15505k15670k62813k61303j55523k08282k08073k25271j62216
3653F773619j70633j54994k03584j04003p1292j23948r1881o3707n8619o7318
3643E663640l906m2175j2454Q883N3772J6094Q1586M1220R9495O0965N3636O640
3631F027396K9432k3027J0356L7811k2138L2114L2840L2923R5550P4711J6567
3620F344535M2019R3498Q0615L3325L8122J9795M4185R69j07366q3570r8413j64796
3608F242918j59813k8872j09423p8987q504K4692o2981p0293l2963k435l7718
3597E675621p0936L4523M5765j8771m6002M1916P3587J11002O4035J18217J93144
3586F222101J31074K50298J92041K66621L03396J71743J03998L626k2600l8860
$$ plain form
3576 7583438 7645327 7723871 7785430 7920586 8004207 8125206 8279047 8425833 8552157 8758751
3566 8758751 8957806 9032125 9184050 9302423 9450190 9519292 9632971 9637799 9646793 9621505 9582202
3555 9582202 9597412 9544322 9578898 9546593 9526093 9589271 9664174 9662016 9733855 9724079 9622238 9639614
3543 9639614 9619987 9689233 9723533 9747082 9804035 9895933 10027543 10130834 10357345 10541257 10676066
3532 10676066 10815844 11009349 11339958 11637557 11937159 12218248 12539561 12852264 13152795
3523 13152795 13515101 13919885 14237125 14572369 14974880 15372005 15754166 16092556 16532362
3514 16532362 16916419 17347221 17711224 17959268 18283184 18523995 18663003 18780317 18951886
3505 18951886 18991661 18948841 19004019 19070421 19115872 19164987 19237495 19333213 19466366 19575202 19695036
$$ packed form
3576G583438O1889P8544O1559J35156Q3621J20999J53841J46786J26324K06594
3566H758751J99055P4319J51925J18373J47767O9102J13679M828Q994k5288l9303
3555I582202J5210n3090L4576l2305k0500O3178P4903k158P1839r776j01841J7376
3543I639614j9627O9246L4300K3549N6953R1898J31610J03291K26511J83912J34809
3532A0676066J39778J93505L30609K97599K99602K81089L21313L12703L00531
3523A3152795L62306M04784L17240L35244M02511L97125L82161L38390M39806
3514A6532362L84057M30802L64003K48044L23916K40811J39008J17314J71569
3505A8951886L9775m2820N5178O6402M5451M9115P2508R5718J33153J08836J19834
$$ plain form
3494 19695036 19995307 20296741 20519652 20859749 21243768 21536954 21827027 22103356 22364158
3485 22364158 22609439 22893550 23100970 23336848 23618408 23932792 24304547 24593011 24863638
3476 24863638 25268129 25610722 25836944 26018231 26114719 26096966 25990442 25741223 25413677 25005759
3466 25005759 24445850 23837512 23285045 22726465 22071505 21474180 20971337 20449760 19963765
3457 19963765 19492470 19095929 18826140 18561330 18330296 18191574 18080475 17962293 17844653
3448 17844653 17794962 17817179 17854363 17943342 18029535 18051307 18182822 18345822 18476401 18584601
3438 18584601 18706760 18719695 18711627 18715919 18740586 18663963 18638516 18595076 18518788 18390666 18217130
3427 18217130 18097559 17944372 17784976 17634055 17551980 17419287 17279953 17169075 17055596 16967705
$$ packed form
3494A9695036L00271L01434K22911L40097L84019K93186K90073K76329K60802
3485B2364158K45281K84111K07420K35878K81560L14384L71755K88464K70627
3476B4863638M04491L42593K26222J81287R6488j7753j06524k49219l27546m07918
3466B5005759n59909o08338n52467n58580o54960n97325n02843n21577m85995
3457A9963765m71295l96541k69789k64810k31034j38722j11099j18182j17640
3448A7844653m9691K2217L7184Q8979Q6193K1772J31515J63000J30579J08200
3438A8584601J22159J2935q068M292K4667p6623k5447m3440p6288j28122j73536
3427A8217130j19571j53187j59396j50921q2075j32693j39334j10878j13479q7891
$$ plain form
3417 16967705 16873513 16760740 16698456 16683935 16706106 16667330 16796308 16976518 17123492 17363879
3407 17363879 17533795 17714110 17780251 17878484 18038064 18163102 18380174 18687129 19021204 19272931
3397 19272931 19624105 19973966 20359488 20757443 21278624 21799136 22375214 23035186 23837671
3388 23837671 24665567 25625000 26666405 27800953 29120655 30813372 32958895 35944384
3380 35944384 40055622 45672715 50866925 54260849 53780786 49611767 44861741 40644223
3372 40644223 37393428 35278504 33960908 33141834 32823965 32653590 32577059 32725668 32942588
3363 32942588 33322869 33890923 34609332 35406307 36375152 37545086 38910486 40373258 42108907
3354 42108907 44019278 46280811 48908696 52089792 56096215 61772238 69616130 80758517
$$ packed form
3417A6967705r4192j12773o2284j4521K2171l8776J28978J80210J46974K40387
3407A7363879J69916J80315O6141R8233J59580J25038K17072L06955L34075K51727
3397A9272931L51174L49861L85522L97955N21181N20512N76078O59972Q02485
3388B3837671Q27896R59433J041405J134548J319702J692717K145523K985489
3380C5944384M111238N617093N194210L393924m80063m169019m750026m217518
3372D0644223l250795k114924j317596q19074l17869j70375p6531J48609K16920
3363C2942588L80281N68054P18409P96975R68845J169934J365400J462772J735649
3354D2108907J910371K261533K627885L181096M006423N676023P843892J1142387
$$ plain form
3346 80758517 92079522 100307267 102040518 95405145 86601001 78769356 73216233 70244090
3338 70244090 69102189 69268171 70581751 72748217 75682918 79394305 84081814 90136159
3330 90136159 98005976 108164845 121029372 136194251 151430975 162821088 166962833
3323 166962833 162377006 151416665 138130366 125638405 115463777 108258977 103952426
3316 103952426 102313892 103455393 106257509 108526813 108733109 105267614 100529801 96540590
3308 96540590 94029644 93149355 93797371 95521959 98414952 102266667 107019160 112817227
3300 112817227 119857110 128493596 139352546 153283300 171579482 195601264 225365992
3293 225365992 256877329 281879795 292158553 282920240 259009176 229569426 201063722
$$ packed form
3346H0758517J1321005Q227745J733251o635373q804144p831645n553123k972143
3338G0244090j141901J65982J313580K166466K934701L711387M687509O054345
3330I0136159P869817J0158869J2864527J5164879J5236724J1390113M141745
3323A66962833m585827j0960341j3286299j2491961j0174628p204800m306551
3316A03952426j638534J141501K802116K269304K06296l465495m737813l989211
3308I6540590k510946q80289O48016J724588K892993L851715M752493N798067
3300A12817227P039883Q636486J0858950J3930754J8296182K4021782K9764728
3293B25365992L1511337K5002466J0278758r238313k3911064k9439750k8505704
$$ plain form
3286 201063722 177047977 158340241 144164809 133392107 125285181 119025035 114088606
3279 114088606 110246139 107081909 104623787 102784033 101552130 100728112 100341596 100308272 100570082
3270 100570082 101210683 102349071 103846602 105858488 108568730 112044154 116742841 123106745
3262 123106745 131603331 142345421 154013387 163793759 168226253 164879488 154076384 139296501
3254 139296501 123822390 109824063 98196027 88893209 81408164 75424964 70498307 66262505
3246 66262505 62683802 59630984 56865777 54458685 52278998 50359756 48641039 47084537
3238 47084537 45712246 44544284 43547937 42774120 42035315 41430431 40969561 40501028 40087125
3229 40087125 39745790 39435105 39093102 38615732 38237965 37827636 37246631 36663584 36114275
$$ packed form
3286B01063722k4015745j8707736j4175432j0772702q106926o260146m936429
3279A14088606l842467l164230k458122j839754j231903q24018l86516l3324K61810
3270A00570082O40601J138388J497531K011886K710242L475424M698687O363904
3262A23106745Q496586J0742090J1667966R780372M432494l346765j0803104j4779883
3254A39296501j5474111j3998327j1628036r302818p485045n983200m926657m235802
3246F6262505l578703l052818k765207k407092k179687j919242j718717j556502
3238D7084537j372291j167962r96347p73817p38805o04884m60870m68533m13903
3229D0087125l41335l10685l42003m77370l77767m10329n81005n83047n49309
$$ plain form
3220 36114275 35584120 35110955 34686937 34304840 33985270 33722195 33499558 33231559 32926102
3211 32926102 32586113 32308763 31986507 31577532 31235080 30934340 30686985 30397751 30180042
3202 30180042 30106592 30028380 30022662 30131310 30242643 30436595 30650755 30890781 31076886 31166216
3192 31166216 30943484 30466693 29891689 29161650 28424169 27651141 26759498 25818521 24853566
3183 24853566 23940462 23042642 22084687 21236361 20454917 19745985 19132105 18658606 18246069
3174 18246069 17870050 17478608 17224403 16992319 16789915 16613999 16450403 16313567 16151259
3165 16151259 16100890 16139138 16164182 16216292 16256841 16169701 16127304 16090877 16124211 16203200 16207218
3154 16207218 16247828 16222326 16174892 16056827 15822779 15540571 15314746 14999317 14794756 14661340
$$ packed form
3220C6114275n30155m73165m24018l82097l19570k63075k22637k67999l05457
3211C2926102l39989k77350l22256m08975l42452l00740k47355k89234k17709
3202C0180042p3450p8212n718J08648J11333J93952K14160K40026J86105Q9330
3192C1166216k22732m76791n75004p30039p37481p73028q91643r40977r64955
3183B4853566r13104q97820r57955q48326p81444p08932o13880m73499m12537
3174A8246069l76019l91442k54205k32084k02404j75916j63596j36836j62308
3165A6151259n0369L8248K5044N2110M0549q7140m2397l6427L3334P8989M018
3154A6207218M0610k5502m7434j18065k34048k82208k25825l15429k04561j33416
$$ plain form
3144 14661340 14667756 14736116 14824468 14879948 14997679 15205085 15469307 15786356 16018687 16378585
3134 16378585 16794641 17204411 17632442 18142598 18700897 19287150 19825212 20339608 21060827
3125 21060827 21789547 22540736 23356981 23966245 24587752 25239234 25870531 26313832 26630881
3116 26630881 26837425 26899924 26854978 26819556 26661735 26438317 26129113 25696984 25277761 24803094
3106 24803094 24280659 23630057 22994360 22324462 21663809 20906460 20221331 19482209 18731821
3097 18731821 18017757 17348458 16773929 16120301 15513779 14931359 14412681 13976171 13524166
3088 13524166 13108528 12675130 12423099 12089663 11736295 11450435 11211588 10996009 10780204
3079 10780204 10662807 10534158 10463602 10367126 10288072 10285730 10320827 10385051 10468389 10469355 10525609
$$ packed form
3144A4661340O416O8360Q8352N5480J17731K07406K64222L17049K32331L59898
3134A6378585M16056M09770M28031N10156N58299N86253N38062N14396P21219
3125B1060827P28720P51189Q16245O09264O21507O51482O31297M43301L17049
3116B6630881K06544O2499m4946l5422j57821k23418l09204m32129m19223m74667
3106B4803094n22435o50602o35697o69898o60653p57349o85129p39122p50388
3097A8731821p14064o69299n74529o53628o06522n82420n18678m36510m52005
3088A3524166m15638m33398k52031l33436l53368k85860k38847k15579k15805
3079A0780204j17397j28649p0556r6476p9054k342L5097O4224Q3338R66N6254
$$ plain form
3068 10525609 10594811 10586108 10687189 10840492 10911981 10920487 10952822 10901220 10891207 10773315 10698707
3057 10698707 10611299 10528787 10483796 10343566 10237650 10026623 9750009 9502328 9280829 8929678
3047 8929678 8643352 8380506 8066504 7787753 7531021 7379209 7176404 6994931 6782073 6748850
3037 6748850 6669607 6493962 6494689 6453365 6447256 6354686 6318694 6229980 6104878 5990154 5785566
3026 5785566 5646583 5555281 5540162 5512708 5461724 5414303 5345528 5300550 5281009 5246612 5109584
3015 5109584 5075144 5056215 5046767 5013644 4956695 4946393 4983365 5034201 5037475 5056708 5141373 5184994
3003 5184994 5354632 5437558 5588442 5813134 5946357 5995578 5971366 5826185 5673271 5535730
2993 5535730 5350907 5299360 5231870 5163419 5121505 5041453 4996556 4962720 4923307 4879869 4829081
$$ packed form
3068A0525609O9202q703J01081J53303P1489Q506L2335n1602j0013j17892p4608
3057A0698707q7408q2512m4991j40230j05916k11027k76614k47681k21499l51151
3047H929678k86326k62846l14002k78751k56732j51812k02805j81473k12858l3223
3037F748850p9243j75645P27m1324o109r2570l5992q8714j25102j14724k04588
3026E785566j38983r1302j5119k7454n0984m7421o8775m4978j9541l4397j37028
3015E109584l4440j8929r448l3123n6949j0302L6972N0836L274J9233Q4665M3621
3003E184994J69638Q2926J50884K24692J33223M9221k4212j45181j52914j37541
2993E535730j84823n1547o7490o8451m1914q0052m4897l3836l9413m3438n0788
$$ plain form
2982 4829081 4729842 4714819 4647328 4581729 4562911 4482043 4608614 4700680 4735835 4783414 4772787
2971 4772787 4762207 4779557 4876323 4917862 4982679 5080744 5148593 5169622 5201276 5183933 5114460
2960 5114460 5140640 5107580 5082310 5104599 5133196 5133482 5209969 5241122 5321995 5367815 5385898 5462925
2948 5462925 5508612 5545538 5598471 5674199 5797603 5931979 6003709 6127879 6233449 6304795 6428815
2937 6428815 6423084 6497026 6483525 6581882 6698221 6713725 6827457 6920321 7061197 7075808 7158280
2926 7158280 7263431 7354010 7445831 7591512 7735114 7893656 7959595 8064526 8179418 8339923
2916 8339923 8432169 8561851 8746493 8911073 9077722 9333203 9626717 9896677 10091729 10360209
2906 10360209 10591165 10759845 10809045 10968420 11175967 11386973 11666283 11902065 12175152 12463629
$$ packed form
2982D829081r9239j5023o7491o5599j8818q0868J26571R2066L5155M7579j0627
2971D772787j0580J7350R6766M1539O4817R8065O7849K1029L1654j7343o9473
2960E114460K6180l3060k5270K2289K8597K86P6487L1153Q0873M5820J8083P7027
2948E462925M5687L6926N2933P5728J23404J34376P1730J24170J05570P1346J24020
2937F428815n731P3942j3501R8357J16339J5504J13732R2864J40876J4611Q2472
2926G158280J05151R0579R1821J45681J43602J58542O5939J04931J14892J60505
2916H339923R2246J29682J84642J64580J66649K55481K93514K69960J95052K68480
2906A0360209K30956J68680M9200J59375K07547K11006K79310K35782K73087K88477
$$ plain form
2896 12463629 12840136 13071120 13372085 13712850 14112843 14584023 15051159 15482376 15947858
2887 15947858 16479168 17017574 17595610 18267298 19048836 19780478 20598574 21510650 22365713
2878 22365713 23304030 24400777 25520591 26725999 28024590 29375221 30923201 32614506
2870 32614506 34429320 36434129 38682870 41200848 43966784 46912336 50252430 54075047
2862 54075047 58220416 62690698 67574013 72486168 76977850 80701772 83208714 83871943
2854 83871943 82963461 80733997 77639775 74118041 70803197 67737565 65099930 62823414
2846 62823414 60830381 58974874 57090407 55082600 52952667 50696283 48300762 45818742
2838 45818742 43506094 41380970 39380695 37548058 36046829 34634800 33427681 32451086
$$ packed form
2896A2463629L76507K30984L00965L40765L99993M71180M67136M31217M65482
2887A5947858N31310N38406N78036O71688P81538P31642Q18096R12076Q55063
2878B2365713R38317J096747J119814J205408J298591J350631J547980J691305
2870C2614506J814814K004809K248741K517978K765936K945552L340094L822617
2862E4075047M145369M470282M883315M912155M491682L723922K506942O63229
2854H3871943r08482k229464l094222l521734l314844l065632k637635k276516
2846F2823414j993033j855507j884467k007807k129933k256384k395521k482020
2838D5818742k312648k125124k000275j832637j501229j412029j207119r76595
$$ plain form
2830 32451086 31592011 30896648 30348897 29986306 29748243 29451597 29050974 28574563 28112119
2821 28112119 27728982 27360275 27318014 27443771 27865740 28523323 29504077 30706295 32052951
2812 32052951 33394671 34357710 34516109 33740692 32182410 30128328 27821777 25548689 23507044
2803 23507044 21755333 20204632 18836023 17655380 16643853 15777216 14952061 14272740 13649142
2794 13649142 13022657 12441993 11958520 11567230 11228393 10900112 10469768 10124106 9865209
2785 9865209 9576202 9299228 9033322 8758031 8644481 8501497 8268269 8006380 7743162 7498610
2775 7498610 7325354 7204301 7047279 6865648 6749687 6651447 6512950 6355968 6354268 6300455
2765 6300455 6171718 6107603 6033131 5964812 5897085 5961827 5957195 5851984 5913360 6003974 6022843
$$ packed form
2830C2451086q59075o95363n47751l62591k38063k96646m00623m76411m62444
2821B8112119l83137l68707m2261J25757M21969O57583R80754J202218J346656
2812C2052951J341720R63039J58399p75417j558282k054082k306551k273088k041645
2803B3507044j751711j550701j368609j180643j011527q66637q25155o79321o23598
2794A3649142o26485n80664m83473l91290l38837l28281m30344l45662k58897
2785I865209k89007k76974k65906k75291j13550j42984k33228k61889k63218k44552
2775G498610j73256j21053j57022j81631j15961r8240j38497j56982j700n3813
2765F300455j28737o4115p4472o8319o7727O4742m632j05211O1376R0614J8869
$$ plain form
2754 6022843 6029127 6038770 6010526 6129626 6080410 6090927 5997626 5824440 5675650 5455337 5319199
2743 5319199 5130341 4854696 4786280 4600620 4458644 4329749 4248977 4120511 4021740 3900051
2733 3900051 3804254 3721074 3645119 3536500 3373450 3296615 3209346 3157649 3051673 2990715 2846611
2722 2846611 2833628 2795920 2710841 2646675 2612270 2564236 2474026 2525293 2475959 2447294 2489871
2711 2489871 2427739 2396471 2389057 2345327 2368702 2378179 2368875 2440092 2396810 2409547 2421060 2449612
2699 2449612 2457202 2465288 2317187 2237421 2192455 2073395 1956330 1828204 1756866 1697345 1618294
2688 1618294 1585931 1569614 1529083 1442628 1422542 1444936 1392905 1308041 1286528 1290007 1311783 1200675
2676 1200675 1175836 1202674 1196636 1099700 1093659 1033345 1041209 1062126 996909 938257 970579 970119
$$ packed form
2754F022843O284R643k8244J19100m9216J0517r3301j73186j48790k20313j36138
2743E319199j88858k75645o8416j85660j41976j28895q0772j28466r8771j21689
2733C900051r5797q3180p5955j08619j63050p6835q7269n1697j05976o0958j44104
2722B846611j2983l7708q5079o4166l4405m8034r0210N1267m9334k8665M2577
2711B489871o2132l1268p414m3730K3375R477r304P1217m3282J2737J1513K8552
2699B449612P590Q086j48101p9766m4966j19060j17065j28126p1338n9521p9051
2688A618294l2363j6317m0531q6455k0086K2394n2031q4864k1513L479K1776j11108
2676A200675k4839K6838o038r6936o041o0314P864K0917o5217n8652L2322m60
$$ plain form
2664 970119 970601 887429 842680 859721 845933 832219 847620 851460 866875 861992 794850 734018
2652 734018 709240 666906 657149 672585 641298 620367 619574 677290 641195 667031 691226 716987
2640 716987 686128 616604 589993 555760 570263 648119 610882 630582 626400 608923 588063 584602
2628 584602 520512 505077 542037 549902 574843 577833 559508 511196 555783 558393 533453 515657
2616 515657 498905 482185 485718 507387 554596 549157 515897 514155 493136 478085 430328 464362
2604 464362 484600 461218 481406 470588 418536 428814 524757 505573 493600 458120 441404 449596
2592 449596 448333 455482 482350 457449 449865 447237 465611 411263 416912 480391 442941 461251 484414
2579 484414 491108 532441 563645 521021 544999 600986 621287 601257 586366 567012 530206 468653
$$ packed form
2664I70119M82q3172m4749J7041j3788j3714J5401L840J5415m883o7142o0832
2652G34018k4778m2334r757J5436l1287k0931p93N7716l6095K5836K4195K5761
2640G16987l0859o9524k6611l4233J4503P7856l7237J9700m182j7477k0860l461
2628E84602o4090j5435L6960P865K4941K990j8325m8312M4587K610k4940j7796
2616E15657j6752j6720L533K1669M7209n439l3260j742k1019j5051m7757L4034
2604D64362K0238k3382K0188j0818n2052J0278R5943j9184j1973l5480j6716Q192
2592D49596j263P149K6868k4901p584k628J8374n4348N649O3479l7450J8310K3163
2579D84414O694M1333L1204m2624K3978N5987K0301k0030j4891j9354l6806o1553
$$ plain form
2567 468653 464508 509968 586605 537641 549821 574113 571228 518679 436849 409823 460944 480440
2555 480440 414850 379192 383743 408885 379368 287904 346479 350292 381240 335992 354654 314350
2543 314350 302779 321314 339864 352478 379737 304026 334292 378257 329367 252335 277964 307317
2531 307317 252135 249340 348788 304334 300795 266965 207610 254192 252204 286002 229515 218435
2519 218435 281540 360135 300208 256729 170482 181153 186155 175378 198525 170057 153585 61850
2507 61850 82888 148104 164579 171814 168781 187890 144572 176022 147724 181825 136220 95104
2495 95104 92090 124500 95721 121047 148111 99639 80076 57423 95517 119636 107969 133694
2483 133694 61116 71510 70250 93561 101787 112021 73703 78922 16466 28068 78657 107272
$$ packed form
2567D68653m145M5460P6637m8964J2180K4292k885n2549q1830k7026N1121J9496
2555D80440o5590l5658M551K5142k9517r1464N8575L813L0948m5248J8662m0304
2543C14350j1571J8535J8550J2614K7259p5711L0266M3965m8890p7032K5629K9353
2531C07317n5182k795R9448m4454l539l3830n9355M6582j988L3798n6487j1080
2519B18435O3105P8595n9927m3479q6247J0671N002j0777K3147k8468j6472r1735
2507F1850K1038O5216J6475P235l033J9109m3318L1450k8298L4101m5605m1116
2495I5104l014L2410k8779K5326K7064m8472j9563k2653L8094K4119j1667K5725
2483A33694p2578J0394j260K3311Q226J0234l8318N219o2456J1602N0589K8615
$$ plain form
2471 107272 133569 122089 96103 61601 51513 -13157 32664 18690 -17497 -30042 -3199 22750
2459 22750 7365 31230 94453 144640 117864 17424 -42526 19519 67899 94125 58097 31019
2447 31019 46742 94867 70191 -19085 -38721 -19779 -94492 -38042 -29426 -20969 13026 -17867
2435 -17867 10591 3689 -17373 -21495 -33039 -34424 -51704 31333 29052 -4877 17221 -46418 -17222
2422 -17222 17847 2723 -13027 61832 87106 46996 25308 -5426 -77209 -81765 -11314 39654
2410 39654 -41821 7539 912 -50623 -16867 -162 -38407 -56044 7500 9951 -49083 29595
2398 29595 43057 18873 27940 28154 6577 -24595 -2267 34475 39092 22382 10224 5813 -5489
2385 -5489 -30096 -54193 -56513 10778 -23606 -69160 -21725 -81907 -31169 -33807 -60071 -23790
$$ packed form
2471A07272K6297j1480k5986l4502j0088o4670M5821j3974l6187j2545K6843K5949
2459B2750j5385K3865O3223N0187k6776j00440n9950O2045M8380K6226l6028k7078
2447C1019J5723M8125k4676q9276j9636J8942p4713N6450Q616Q457L3995l0893
2435a7867K8458o902k1062m122j1544j385j7280Q3037k281l3929K2098o3639K9196
2422a7222L5069j5124j5750P4859K5274m0110k1688l0734p1783m556P0451N0968
2410C9654q1475M9360o627n1535L3756J6705l8245j7637O3544K451n9034P8678
2398B9595J3462k4184R067K14k1577l1172K2328L6742M617j6710j2158m411j1302
2385e489k4607k4097k320O7291l4384m5554M7435o0182N0738k638k6264L6281
$$ plain form
2373 -23790 41215 -15412 -1105 28878 25690 7718 -29104 -46220 -9819 -5820 -95587 -99012
2361 -99012 -33732 -18006 -56453 -39083 -49388 -66950 -3746 -11790 -317 -17817 -17624 -31271
2349 -31271 -66322 -14624 -20121 -503 -18330 -20584 -13739 -22057 -61475 20058 33964 5911 -11529
2336 -11529 -9859 -43316 -27184 6642 25983 -63018 -56392 6679 20680 26841 13989 -26907
2324 -26907 52988 122343 94718 148933 90008 41782 56084 74190 53356 53754 62388 -35075
2312 -35075 -21284 -14041 -23024 -22088 -43539 -53465 -54594 -22684 -49710 -38835 -28228 41325 28992
2299 28992 -44872 -86136 -66211 688 24874 -27586 -73710 -12270 23449 -29620 -6756 44632
2287 44632 84199 31297 58379 75265 43407 4961 -22333 -25514 -15027 34295 -2838 -4261
$$ packed form
2373b3790O5005n6627J4307K9983l188j7972l6822j7116L6401L999q9767l425
2361i9012O5280J5726l8447J7370j0305j7562O3204q044J1473j7500J93j3647
2349c1271l5051N1698n497J9618j7827k254O845q318l9418Q1533J3906k8053j7440
2336a1529J670l3457J6132L3826J9341q9001O626O3071J4001O161j2852m0896
2324b6907P9895O9355k7625N4215n8925m8226J4302J8106k0834L98Q634r7463
2312c5075J3791P243q983R36k1451r926j129L1910k7026J0875J0607O9553j2333
2299B8992p3864m1264J9925O6899K4186n2460m6124O1440L5719n3069K2864N1388
2287D4632L9567n2902K7082J6886l1858l8446k7294l181J0487M9322l7133j423
$$ plain form
2275 -4261 30506 49160 -5742 -51667 -58926 -72801 -110350 -81248 -9418 -7964 16791 31315
2263 31315 -13505 -45673 -72956 -76759 21630 72489 13030 -22590 -38050 -11286 6067 -17210
2251 -17210 19155 3547 -44649 -68736 -24353 14739 46651 11003 45413 59119 18143 31733
2239 31733 40452 125983 94011 54163 22038 -14116 -83031 -27251 1144 25894 -21636 -21483
2227 -21483 -315 2754 64850 39019 -12826 -4504 37781 13234 -5130 36228 16573 27139
2215 27139 17327 -2880 29729 28308 42651 121916 45411 -12922 48508 45558 -2316 -12349
2203 -12349 -10917 -31066 -46709 35586 33263 114641 107717 65484 101192 60500 9950 -559
2191 -559 26996 14886 47171 76344 45522 12294 81930 93938 99546 28963 24055 95357 76953
$$ packed form
2275d261L4767J8654n4902m5925p259j3875l7549K9102P1830J454K4755J4524
2263C1315m4820l2168k7283l803R8389N0859n9459l5620j5460K6764J7353k3277
2251a7210L6365j5608m8196k4087M4383L9092L1912l5648L4410J3706m0976J3590
2239C1733Q719Q5531l1972l9848l2125l6154o8915N5780K8395K4750m7530J53
2227b1483K1168L069O2096k5831n1845Q322M2285k4547j8364M1358j9655J0566
2215B7139r812k0207L2609j421J4343P9265p6505n8333O1430k950m7874j0033
2203a2349J432k0149j5643Q2295k323Q1378o924m2233L5708m0692n0550j0509
2191e59K7555j2110L2285K9173l0822l3228O9636J2008N608p0583m908P1302j8404
$$ plain form
2178 76953 73979 129411 78278 58733 82294 146281 131917 154438 133170 95774 133395 156909
2166 156909 174593 214041 154906 175046 157508 111439 134404 154474 123917 178477 208053 169893
2154 169893 143265 171410 191882 211555 230448 296777 244527 157034 146103 289521 274950
2143 274950 229978 327268 299997 308175 238579 260451 337798 342281 392856 369760 340110 406034
2131 406034 437383 380387 376740 419656 391462 387086 456788 499814 440455 458378 447174 492050
2119 492050 486609 558496 652877 626711 618102 627728 654423 665516 675819 676837 671790 695182 782981
2106 782981 793986 752994 856447 859734 875345 917811 919548 1011716 1030910 1053798 1107195 1146799
2094 1146799 1196664 1157006 1229153 1359230 1399990 1364142 1439869 1508106 1627716 1665455 1685073
$$ packed form
2178G6953k974N5432n1133j9545K3561O3987j4364K2521k1268l7396L7621K3514
2166A56909J7684L9448n9135K0140j7538m6069K2965K0070l0557N4560K9576l8160
2154A69893k6628K8145K0472J9673J8893O6329n2250q7493j0931J43418j4571
2143B74950m4972R7290k7271Q178o9596K1872P7347M483N0575k3096k9650O5924
2131D06034L1349n6996l647M2916k8194m376O9702M3026n9359J7923j1204M4876
2119D92050n441P1887R4381k6166q609R626K6695J1093J0303J018n047K3392Q7799
2106G82981J1005m0992J03453L287J5611M2466J737R2168J9194K2888N3397L9604
2094A146799M9865l9658P2147J30077M0760l5848P5727O8237J19610L7739J9618
$$ plain form
2083 1685073 1767099 1853119 1910056 2070581 2236015 2336478 2472699 2640374 2814781 3023561
2073 3023561 3201965 3496748 3802889 4168616 4506531 4782367 5033473 5368778 5755495 6182246
2063 6182246 6767174 7529878 8360391 9524444 11083837 13242735 16295956 21045517 25930741
2054 25930741 29262953 29361975 25167140 20230173 15905109 12539112 10182515 8551413
2046 8551413 7237705 6334521 5643121 5200689 4783513 4470297 4261713 3989435 3740587
2037 3740587 3413538 3098012 2835591 2660016 2555166 2403784 2261154 2094463 1978415 1921972
2027 1921972 1894026 1759242 1604023 1590959 1542789 1451057 1363834 1324429 1275627 1155020 1116700
2016 1116700 1091381 969691 998844 964007 950970 867450 814112 819517 766380 735919 776905
$$ packed form
2083A685073Q2026Q6020N6937J60525J65434J00463J36221J67675J74407K08780
2073C023561J78404K94783L06141L65727L37915K75836K51106L35305L86717M26751
2063F182246N84928P62704Q30513J164053J559393K158898L053221M749561M885224
2054B5930741L332212R9022m194835m936967m325064l365997k356597j631102
2046H551413j313708r03184o91400m42432m17176l13216k08584k72278k48848
2037C740587l27049l15526k62421j75575j04850j51382j42630j66691j16048n6443
2027A921972k7946j34784j55219j3064m8170r1732q7223l9405m8802j20607l8320
2016A116700k5319j21690K9153l4837j3037q3520n3338N405n3137l0461M0986
$$ plain form
2005 776905 740154 674855 626878 576493 572143 607639 578996 573467 566427 549446 514519 522523
1993 522523 535826 491860 519232 463893 463746 433920 391473 408203 461613 446546 370863 365723
1981 365723 356746 364081 312635 279403 356880 296215 285539 342647 286751 301273 301162 272862
1969 272862 194982 207391 248254 222183 175795 163887 182378 188203 159992 114449 154359 190135
1957 190135 179416 142262 130304 126468 98708 84844 162225 142426 150523 174444 101355 78285
1945 78285 112643 114386 100935 50641 89054 89557 89589 75651 92773 125466 87927 97687 57728
1932 57728 103306 82531 40687 47230 18124 18942 -25572 25201 61007 132468 112391 72053
1920 72053 54183 39860 86576 47616 64998 100930 58477 18535 63090 13168 49758 51719
$$ packed form
2005G76905l6751o5299m7977n0385m350L5496k8643n529p040j6981l4927Q004
1993E22523J3303m3966K7372n5339j47k9826m2447J6730N3410j5067p5683n140
1981C65723q977P335n1446l3232P7477o0665j0676N7108n5896J4522j11k8300
1969B72862p7880J2409M0863k6071m6388j1908J8491N825k8211m5543L9910L5776
1957A90135j0719l7154j1958l836k7760j3864P7381j9799Q097K3921p3089k3070
1945G8285L4358J743j3451n0294L8413N03L2j3938J7122L2693l7539R760l9959
1932E7728M5578k0775m1844O543k9106Q18m4514N0773L5806P1461k0077m0338
1920G2053j7870j4323M6716l8960J7382L5932m2453l9942M4555m9922L6590J961
$$ plain form
1908 51719 73494 76563 65997 18647 2523 -67748 -43572 -34411 9608 69971 33983 4508
1896 4508 19762 32719 -6292 -9550 13904 16180 4779 -31981 -8652 1447 -3278 -39388 -21009
1883 -21009 -30987 -69988 -48250 12737 13452 -26134 17761 -31194 -59172 -55685 -53608 -3988 -7509
1870 -7509 -35103 -20965 -78582 -37869 40160 78113 116026 118025 -17085 -29290 -32392 -66751
1858 -66751 -37158 -96121 -125660 -67955 -35111 57843 38820 48246 3802 -79149 -69210 -59775
1846 -59775 -39685 -92327 -73051 -16771 -3758 -22330 51921 46116 3927 71143 3256 -109723
1834 -109723 -75400 -64304 -31605 -35026 -60902 11937 -8991 777 -63298 -59807 -50114 -119717
1822 -119717 -101372 -90411 -58311 -26651 -86482 -61056 -82609 -120336 -10008 35701 -41037
$$ packed form
1908E1719K1775L069j0566m7350j6124p0271K4176R161M4019O0363l5988k9475
1896D508J5254J2957l9011l258K3454K276j1401l6760K3329J0099m725l6110J8379
1883b1009r978l9001K1738O0987P15l9586M3895m8955k7978L487K077M9620l521
1870g509k7594J4138n7617M0713P8029L7953L7913J999j35110j2205l102l4359
1858f6751K9593n8963k9539N7705L2844R2954j9023R426m4444q2951R939R435
1846e9775K0090n2642J9276N6280J3013j8572P4251n805m2189O7216o7887j12979
1834a09723L4323J1096L2699l421k5876P2839k0928R768o4075L491R693o9603
1822a19717J8345J0961L2100L1660n9831K5426k1553l7727J10328M5709p6738
$$ plain form
1811 -41037 -64137 -4253 -20529 -36699 34629 8594 -9130 -15408 -13797 -28642 -65930 -66936
1799 -66936 -8534 5302 29911 9269 57163 51110 1299 42327 81902 90082 28282 68407
1787 68407 125659 129897 176257 199263 106274 72567 45087 9223 4310 -1078 -9739 -18270 -34399
1774 -34399 12966 26252 22233 -13963 13997 -20040 -67623 -71872 -22708 -58213 -67636 -9616
1762 -9616 -18318 -54388 -30142 -87575 -92529 -19296 35632 -32453 -53774 -67428 -51180 -28229
1750 -28229 -66915 -27487 4064 -16749 -4628 -27302 -105985 -103563 -37414 -18902 -75658 -52635
1738 -52635 3350 46395 59272 84734 40058 36756 -28202 -12407 -53517 -74064 -22730 -6323
1726 -6323 -47251 -44440 -57661 -18782 -65076 -61072 -48841 -43352 12920 32173 51074 2549 33876
$$ packed form
1811d1037k3100N9884j6276j6170P1328k6035j7724o278J611j4845l7288j006
1799f6936N8402J3836K4609k0642M7894o053m9811M1028L9575Q180o1800M0125
1787F8407N7252M238M6360K3006r2989l3707k7480l5864m913n388q661q531j6129
1774c4399M7365J3286m019l6196K7960l4037m7583m249M9164l5505r423N8020
1762i616q702l6070K4246n7433m954P3233N4928o8085k1321j3654J6248K2951
1750b8229l8686L9428L1551k0813J2121k2674p8683K422O6149J8512n6756K3023
1738e2635N5985M3045J2877K5462m4676l302o4958J5795m1110k0547N1334J6407
1726f323m0928K811j3221L8879m6294M004J2231N489N6272J9253J8901m8525L1327
$$ plain form
1713 33876 6582 -18964 27891 1234 -41768 -15307 -15337 3813 8585 -79311 -76265 -63012 -73860
1700 -73860 -83952 -72899 -82332 -57098 -75775 -88364 -3574 36877 -5723 -69812 36095 -25697
1688 -25697 -45025 -51620 -33903 -53174 -53353 8716 -59829 -23720 -28569 -65077 -61871 -80654 -35448
1675 -35448 -5093 5556 -3877 34474 9125 -68171 -44688 -60551 -68973 -101829 -106657 -73410
1663 -73410 -88931 -57053 -88435 52245 572 -23836 33030 -26155 -51700 -39496 2173 -53044
1651 -53044 -86199 20882 -19133 -41108 -47502 -33448 -57806 -82064 -483 -37495 -68395 -51644
1639 -51644 -12335 -31784 -48295 -68430 -98815 -41304 4841 -74135 -40422 36942 -1121 -70727
1627 -70727 -34733 -28892 -16512 -87877 -90000 -32896 -14896 -46281 -93082 -21918 -31133 -20369
$$ packed form
1713C3876k7294k5546M6855k6657m3002K6461l0J9150M772q7896L046J3253j0848
1700g3860j0092J1053r433K5234j8677j2589Q4790M0451m2600o4089J05907o1792
1688b5697j9328o595J7717j9271j79O2069o8545L6109m849l6508L206j8783M5206
1675c5448L0355J0649r433L8351k5349p7296K3483j5863q422l2856m828L3247
1663g3410j5521L1878l1382J40680n1673k4408N6866n9185k5545J2204M1669n5217
1651e3044l3155J07081m0015k1975o394J4054k4358k4258Q1581l7012l0900J6751
1639e1644L9309j9449j6511k0135l0385N7511M6145p8976L3713P7364l8063o9606
1627g0727L5994N841J2380p1365k123N7104J8000l1385m6801P1164r215J0764
$$ plain form
1615 -20369 20588 -20348 -42844 -88254 -60423 -43244 -58819 -35008 -32660 -111666 -77671 -105595
1603 -105595 -51093 -42380 -78309 -44807 -47828 -36601 30177 -54825 -26868 50316 -3555 -22292
1591 -22292 -37096 -26311 -7943 122 -52987 -48337 -40906 -1833 32365 -27640 166 -20728
1579 -20728 -59862 -49566 -85498 -64123 -4368 22165 47952 68742 16444 -8035 -65665 -112098
1567 -112098 -155452 -150534 -161171 -73691 -89530 -196533 -109798 -44697 -12732 3041 -7606 7474
1555 7474 16818 -49821 6995 32165 -34690 30614 30614 54881 -48071 -10496 1975 -25541 12913
1542 12913 -42198 -115715 -158342 -90123 -57692 -49658 -48428 -77566 -116299 -37027 -44102 -119923
1530 -119923 -92208 -37443 -24926 -31862 -68191 -69348 -57235 -70002 -1060 35081 8391 -63907
$$ packed form
1615b0369M0957m0936k2496m5410K7831J7179j5575K3811K348p9006L3995k7924
1603a05595N4502Q713l5929L3502l021J1227O6778q5002K7957P7184n3871j8737
1591b2292j4804J0785J8368Q065n3109M650P431L9073L4198o0005K7806k0894
1579b0728l9134J0296l5932K1375N9755K6533K5787K0790n2298k4479n7630m6433
1567a12098m3354M918j0637Q7480j5839j07003Q6735O5101L1965J5773j0647J5080
1555G474R344o6639N6816K5170o6855O5304%K4267j02952L7575J2471k7516L8454
1542A2913n5111p3517m2627O8219L2431Q034J230k9138l8733P9272p075p5821
1530a19923K7715N4765J2517o936l6329j157J2113j2767O8942L6141k6690p2298
$$ plain form
1518 -63907 -76184 -74334 -50202 -55094 -36431 -53896 -65705 -90946 -67171 -162 -19859 -18140
1506 -18140 -12742 3255 -53601 -81717 -22514 -5487 -43628 -32967 -67799 -85151 -33375 -63958
1494 -63958 -62789 27854 22677 -43513 -4934 19262 8519 35288 11103 8746 -55566 19788
1482 19788 52694 3881 39073 55373 18521 -10368 -15576 -54719 -16693 51088 -5288 -19952
1470 -19952 -12500 -31472 26732 41987 -3391 45010 109099 15370 -30475 -6545 -28266 -112574
1458 -112574 -75139 -92816 -90138 -92145 -74560 -52275 -79185 -39667 -8334 31307 36586 -17615
1446 -17615 -18492 11186 -52157 -63211 -66798 -108131 -123235 -76951 -33025 -63515 -63684 -31293 -56833
1433 -56833 -39597 -16498 -9339 -9994 -10817 40933 27951 -74768 -75232 -39759 -86418 -99652 -3265
$$ packed form
1518f3907j2277J850K4132m892J8663j7465j1809k5241K3775O7009j9697J719
1506a8140N398J5997n6856k8116N9203J7027l8141J0661l4832j7352N1776l0583
1494f3958J169R0643n177o6190L8579K4196j0743K6769k4185k357o4312P5354
1482A9788L2906m8813L5192J6300l6852k8889n208l9143L8026O7781n6376j4664
1470a9952P452j8972N8204J5255m5378M8401O4089r3729m5845K3930k1721q4308
1458a12574L7435j7677K678k007J7585K2285k6910L9518L1333L9641N279n4201
1446a7615q77K9678o3343j1054l587m1333j5104M6284M3926l0490j69L2391k5540
1433e6833J7236K3099P159o55q23N1750j2982j02719m64L5473m6659j3234R6387
$$ plain form
1420 -3265 49195 26094 -10003 -16407 -14751 -4694 -1951 -9974 -52018 -60573 -46702 -72364 -92200
1407 -92200 -112968 -28746 -26894 -47611 -34405 -48634 -17578 -17777 -62566 -60480 -58122 -59772 11921
1394 11921 11262 2768 19002 26737 43523 -11637 -25199 -30531 18471 -11338 -41352 -53230 -42811
1381 -42811 -27365 -63522 -33549 -48956 -74230 -72873 -104352 -38295 -25469 -86506 -32876 -43752
1369 -43752 -13157 22324 1007 -31948 -2819 17328 -17078 17416 -46142 -83914 -41735 8029
1357 8029 77906 58996 -9117 -30870 38682 4269 -24939 -64976 -20332 50884 41424 63418
1345 63418 62413 59332 31828 -3501 68498 50514 24025 15636 -16274 -36029 -10466 11524
1333 11524 26716 53287 -17914 -25192 2867 -38582 -81100 -38864 12954 27661 -11357 308
$$ packed form
1420c265N2460k3101l6097o404J656J0057K743q023m2044q555J3871k5662j9836
1407i2200k0768Q4222J852k0717J3206j4229L1056j99m4789K086K358j650P1693
1394A1921o59q494J6234P735J6786n5160j3562n332M9002k9809l0014j1878J0419
1381d2811J5446l6157K9973j5407k5274J357l1479O6057J2826o1037N3630j0876
1369d3752L0595L5481k1317l2955K9129K0147l4406L4494o3558l7772M2179M9764
1357H029O9877j8910o8113k1753O9552l4413k9208m0037M4644P1216r460K1994
1345F3418j005l081k7504l5329P1999j7984k6489q389l1910j9755K5563K1990
1333A1524J5192K6571p1201p278K8059m1449m2518M2236N1818J4707l9018J1665
$$ plain form
1321 308 41833 -5279 -48560 -49842 -11439 -26676 22571 70301 76218 18368 21443 70738 57746
1308 57746 58013 -6794 7380 14702 -21982 -61661 -70710 -43420 -35094 -5589 -18606 -61193 -75347
1295 -75347 -87467 -42307 -33405 -17075 -80711 -30383 -1846 -47461 8628 28024 21280 -13052
1283 -13052 22736 -38055 -54058 -36062 -66055 -34769 -45088 4503 -17342 -28478 16408 27786
1271 27786 -41949 -23199 -13602 -43675 -43514 -8943 -30464 -47708 -25582 9054 -59838 -70461
1259 -70461 -45637 -43849 -112685 -75365 -861 5241 24198 -8541 -2999 15276 38219 -5605
1247 -5605 -7885 -10855 -18227 -53171 -43088 -25294 -54004 -38381 -42990 -94516 -51854 -57983 -26826
1234 -26826 -4666 -19325 -45567 -15896 28042 54776 -30345 -26601 10037 -1611 -31882 -20457
$$ packed form
1321C08M1525m7112m3281j282L8403j5237M9247M7730N917n7850L075M9295j2992
1308E7746K67o4807J4174P322l6684l9679r049K7290Q326K9505j3017m2587j4154
1295g5347j2120M5160Q902J6330o3636N0328K8537m5615N6089J9396o744l4332
1283a3052L5788o0791j6003J7996k9993L1286j0319M9591k1845j1136M4886J1378
1271B7786o9735J8750R597l0073J61L4571k1521j7244K2126L4636o8892j0623
1259g0461K4824J788o8836L7320P4504O102J8957l2739N542J8275K2943m3824
1247e605k280k970p372l4944J0083J7794k8710J5623m609n1526M2662o129L1157
1234b6826K2160j4659k6242K9671M3938K6734q5121L744L6638j1648l0271J1425
$$ plain form
1222 -20457 -51311 -58824 -31820 -56402 -76111 -120319 -96447 -21473 -41046 -31900 -51016 -17421
1210 -17421 74125 64918 81953 33977 -23848 -3332 -7461 -63206 -93097 -90208 -74103 -9133
1198 -9133 35770 11367 -19683 -29025 11386 -1029 -21201 -39738 -33078 -556 -10629 -14999 -37830
1185 -37830 6717 22048 -17166 15777 16131 -23760 -35248 17734 -45776 -35497 37266 46603
1173 46603 -26898 22626 -14452 -17659 20768 -23666 -36770 -33282 -50167 -29517 -37067 -70102
1161 -70102 -50562 -37706 -27476 -13531 -23117 27760 60872 63176 13335 -55251 -34808 -48108
1149 -48108 -25067 -12007 -35949 -83674 -77855 -91901 -72300 -82095 -62516 -9067 5110 -29197
1137 -29197 -89160 -32797 -35507 -19466 22976 -10023 40792 86420 12034 -57268 -37152 -3529
$$ packed form
1222b0457l0854p513K7004k4582j9709m4208K3872P4974j9573R146j9116L3595
1210a7421R1546r207J7035m7976n7825K0516m129n5745k9891K889J6105O4970
1198i133M4903k4403l1050r342M0411j2415k0172j8537O660L2522j0073m370k2831
1185c7830M4547J5331l9214L2943L54l9891j1488N2982o3510J0279P2763R337
1173D6603p3501M9524l7078l207L8427m4434j3104L488j6885K0650p550l3035
1161g0102J9540J2856J0230J3945r586N0877L3112K304m9841o8586K0443j3300
1149d8108K3041J3060k3942m7725N819j4046J9601r795J9579N3449J4177l4307
1137b9197n9963N6363k710J6041M2442l2999N0815M5628p4386o9302K0116L3623
$$ plain form
1125 -3529 571 -37040 -36746 -22357 -8273 -37500 -31416 -4364 -30966 21975 -22854 -78274 -32095
1112 -32095 -23700 -13051 -34801 -37837 -943 26922 -1183 -8555 -82817 -46681 -47387 -19481 23800
1099 23800 16815 7187 -61101 -62590 18070 -29669 -99408 -45341 -21819 37714 45945 -7180 -9979
1086 -9979 -46445 -22048 19536 -36893 -104379 -14091 10596 10018 -6657 -20965 32967 23934 -3740
1073 -3740 -30633 -19581 -7958 -19146 11224 -72547 -56012 -4116 -86269 -16738 8899 21048
1061 21048 -30457 53602 92072 36146 7505 -12122 -264 29596 -19801 46697 47368 17475
1049 17475 38521 63669 30361 -51522 6614 46711 32739 23826 -26986 -51772 -30538 -20375
1037 -20375 -75446 -78647 -60943 -8494 -31192 -69556 -11986 -29341 -35574 -32916 -42575 -21502 -1311
$$ packed form
1125c529M100l7611K94J4389J4084k9227O084K7052k6602N2941m4829n5420M6179
1112c2095Q395J0649k1750l036L6894K7865k8105p372p4262L6136p06K7906M3281
1099B3800o985r628o8288j489Q0660m7739o9739N4067K3522N9533Q231n3125k799
1086i979l6466K4397M1584n6429o7486R0288K4687n78j6675j4308N3932r033k7674
1073c740k6893J1052J1623j1188L0370q3771J6535N1896q2153O9531K5637J2149
1061B1048n1505Q4059L8470n5926k8641j9627J1858K9860m9397O6498O71k9893
1049A7475K1046K5148l3308q1883N8136M0097j3972q913n0812k4786K1234J0163
1037b0375n5071l201J7704N2449k2698l8364N7570j7355o233K658r659K1073K0191
$$ plain form
1024 -1311 -25683 7053 41557 -21169 -48385 5423 -12748 -58790 -51842 -17910 2462 2002 -8048
1011 -8048 20649 40573 -39383 -92644 -65945 -9861 14260 34888 -35996 -63507 15373 -3709
999 -3709 -28149 10637 18483 -23952 -41341 -31279 9678 -46119 5202 84067 93649 49907 18828
986 18828 -12941 -8178 27857 39258 7051 -56173 -13892 27060 -29832 -10437 19591 3352
974 3352 -59109 -75508 -18872 -5275 8533 29561 25045 -1912 24744 -1616 -1749 -11771 -70110
961 -70110 -34031 -13612 29281 53759 -44 62633 6268 -10398 7506 -3021 -39046 -30315
949 -30315 -41481 -41652 25762 23092 74039 78048 74209 46310 13487 21149 -45927 -67328 -26918
936 -26918 -1728 42872 34568 9941 -8184 -11750 -55496 25918 22964 -13145 14129 46888 -19374
$$ packed form
1024a311k4372L2736L4504o2726k7216N3808j8171m6042O948L3932K0372m60j0050
1011h048K8697J9924p9956n3261K6699N6084K4121K0628p0884k7511P8880j9082
999c709k4440L8786P846m2435j7389J0062M0957n5797N1321P8865R582m3742l1079
986A8828l1769M763L6035J1401l2207o3224M2281M0952n6892J9395L0028j6239
974C352o2461j6399N6636J3597J3808K1028m516k6957K6656k6360j33j0022n8339
961g0110L6079K0419M2893K4478n3803O2677n6365j6666J7904j0527l6025Q731
949c0315j1166j71O7414k670N0947M009l839k7899l2823P662o7076k1401M0410
936b6918K5190M4600q304k4627j8125l566m3746Q1414k954l6109K7274L2759o6262
$$ plain form
923 -19374 -13559 35698 27020 -23857 27248 29391 24861 89360 19157 27241 70990 -809 38060
910 38060 14974 -14693 6848 -9372 -12298 -9106 -1578 40222 92933 -34613 -38323 -14782 -23031
897 -23031 54883 84726 76285 85025 54610 39192 26413 3977 20949 7700 -7171 39796
885 39796 -43915 2144 52045 81957 36235 -2280 -6903 -24998 79877 76662 71154 63178 -9051
872 -9051 -77803 -60481 51625 14237 64769 15207 31135 49567 39692 -6918 -15762 -8367 -3841
859 -3841 13297 -12269 36144 8125 -16362 -40876 6361 11523 -5395 -19582 35137 42821 -27438
846 -27438 -2375 -9406 -15940 -19939 -30347 -71368 -14493 18095 23480 -4193 -52074 -72676 -52469
833 -52469 -12651 22361 96466 67163 75949 41810 55442 76171 29091 -3955 31339 69770
$$ packed form
923a9374N815M9257q678n0877N1105K143m530O4499p0203Q084M3749p1799L8869
910C8060k3086k9667K1541j6220k926L192P528M1800N2711j27546l710K3541q249
897b3031P7914K9843q441Q740l0415j5418j2779k2436J6972j3249j4871M6967
885C9796q3711M6059M9901K9912m5722l8515m623j8095J04875l215n508p976p2229
872i051o8752J7322J12106l7388N0532m9562J5928J8432r875m6610q844P395M526
859c841J7138k5566M8413k8019k4487k4514M7237N162j6918j4187N4719P684p0259
846b7438K5063p031o534l999j0408m1021N6875L2588N385k7673m7881k0602K0207
833e2469L9818L5012P4105k9303Q786l4139J3632K0729m7080l3046L5294L8431
$$ plain form
821 69770 1320 18327 53302 647 15869 -13360 10596 23179 35549 -14810 54172 53370
809 53370 -28727 -1487 29867 23688 -14072 -33416 22006 -42805 -20385 43114 -8181 -75250
797 -75250 -118888 -60848 -50609 -21507 9130 42736 8786 -60908 -39827 -34521 17788 75288
785 75288 8142 -17234 57574 35928 13157 -11756 64914 48327 25448 11260 985 8272
773 8272 24233 10521 29071 -18616 26087 82935 22254 46150 40846 9124 7868 48295 28053
760 28053 15364 -48109 -23077 -16092 45363 28039 60232 11329 3935 -42454 -26775 -13086
748 -13086 -16205 8146 29626 51931 49413 33383 -50887 -86306 -4845 5950 -58168 -28289
736 -28289 -649 6364 19685 -62893 -78104 -15437 32501 35771 -40667 -41313 -13973 -44050 -69069
$$ packed form
821F9770o8450J7007L4975n2655J5222k9229K3956J2583J2370n0359O8982q02
809E3370q2097K7240L1354o179l7760j9344N5422o4811K2420O3499n1295o7069
797g5250m3638N8040J0239K9102L0637L3606l3950o9694K1081N306N2309N7500
785G5288o7146k5376P4808k1646k2771k4913P6670j6587k2879j4188j0275P287
773H272J5961j3712J8550m7687M4703N6848o0681K3896n304l1722j256M0427k0242
760B8053j2689o3473K5032O985O1455j7324L2193m8903p394m6389J5679J3689
748a3086l119K4351K1480K2305k518j6030q4270l5419Q1461J0795o4118K9879
736b8289K7640P013J3321q2578j5211O2667M7938L270p6438o46K7340l0077k5019
$$ plain form
723 -69069 -95745 -103675 -36808 9925 26603 40213 52273 38135 11777 -17193 -38985 -58311
711 -58311 -14397 71880 9513 16250 55527 16020 -33591 -24799 -25546 -38041 -3024 46526 77446
698 77446 39237 45221 27654 17964 -31858 -17945 -19567 -15155 -18425 -31359 -35103 -38648 -55533
685 -55533 -58334 -56269 -59961 -75985 -22418 -53097 -71664 15901 8247 48807 46122 -7848 -54055
672 -54055 -1797 8418 -254 1584 41482 84364 -25011 -30326 -22397 -29649 -38854 12461 46739
659 46739 45711 84882 90614 59900 52809 50603 34095 -5771 26334 16755 -36626 -71910 -44165
646 -44165 -25615 -24976 18514 21493 -28607 22826 30983 -25475 13361 55532 24591 14254 32544
633 32544 7408 48333 7850 24432 4700 35367 85591 67529 35194 52702 30983 -6030
$$ packed form
723f9069k6676p930O6867M6733J6678J3610J2060j4138k6358k8970k1792j9326
711e8311M3914Q6277o2367O737L9277l9507m9611Q792p47j2495L5017M9550L0920
698G7446l8209N984j7567r690m9822J3913j622M412l270j2934l744l545j6885
685e5533k801K065l692j6024N3567l0679j8567Q7565p654M0560k685n3970m6207
672e4055N2258J0215q672J838L9898M2882j09375n315P929p252r205N1315L4278
659D6739j028L9171N732l0714p091k206j6508l9866L2105r579n3381l5284K7745
646d4165J8550O39M3490K979n0100N1433Q157n6458L8836M2171l0941j0337J8290
633C2544k5136M0925m0483J6582j9732L0667N0224j8062l2335J7508k1719l7013
$$ plain form
621 -6030 -2788 -54671 -45828 1402 -21287 40649 9838 3370 5783 -15412 2500 -61542 -60807
608 -60807 -61824 -4795 37084 33420 61806 33129 17446 89205 108324 73338 34063 77015
596 77015 77347 11191 17209 -13376 -55468 -42733 21207 36652 17676 43284 19820 28530 67962
583 67962 8480 28518 8328 1060 13808 19853 3282 -23408 -14013 -22644 -26659 -83100 33466
570 33466 43008 -19431 -15793 16702 24491 11995 32750 41839 55336 26775 89767 65845 31354
557 31354 50040 21178 32826 -28734 -70479 -41401 -18037 -5266 30386 12548 -27628 10328
545 10328 -410 -54147 -6931 -48542 18911 17962 22163 11379 -26284 -8568 28055 57833 11904
532 11904 -22122 -64064 -45215 -29526 12285 48938 100210 -938 -57704 38547 -3112 3840
$$ packed form
621f030L242n1883Q843M7230k2689O1936l0811o468K413k1195J7912o4042P35
608f0807j017N7029M1879l664K8386k8677j5683P1759J9119l4986l9275M2952
596G7015L32o6156O018l0585m2092J2735O3940J5445j8976K5608k3464Q710L9432
583F7962n9482K0038k0190p268J2748O045j6571k6690R395q631m015n6441J16566
570C3466R542o2439L638L2495P789j2496K0755R089J3497k8561O2992k3922l4491
557C1354J8686k8862J1648o1560m1745K9078K3364J2771L5652j7838m0176L7956
545A0328j0738n3737M7216m1611O7453r49M201j0784l7663J7716L6623K9778m5929
532A1904l4026m1942J8849J5689M1811L6653N1272j01148n6766R6251m1659O952
$$ plain form
520 3840 7453 -38803 -33784 -34485 19980 16705 40539 67138 9999 -40631 -1358 69824 39221
507 39221 64393 29173 1182 23387 1195 46629 79710 69968 51186 43543 24754 72293
495 72293 47436 44291 34389 4644 -5906 -22580 -43690 19061 22536 495 -17540 -57331 -29856
482 -29856 1932 3721 27314 17811 9411 -14285 15798 69779 31970 73275 68203 -2264 2691
469 2691 74584 108115 51751 43815 40944 73175 21949 -3746 80667 43205 -5553 -9281 -30487
456 -30487 -37381 -27202 1500 79242 44923 43229 50550 24875 39962 7243 2863 -21394 80224
443 80224 119565 -13119 -41225 -2760 44260 63619 70538 44278 -9693 -13122 77801 82194
431 82194 17920 -65342 -76625 -6439 14553 57 -26600 -22541 25893 41321 23397 32936
$$ packed form
520C840L613m6256N019p01N4465l275K3834K6599n7139n0630L9273P1182l0603
507C9221K5172l5220k7991K2205k2192M5434L3081r742j8782p643j8789M7539
495G2293k4857l145r902k9745j0550j6674k1110O2751L475k2041j8035l9791K7475
482b9856L1788J789K3593r503q400k3696L0083N3981l7809M1305n072p0467M955
469B691P1893L3531n6364p936k871L2231n1226k5695Q4413l7462m8758l728k1206
456c0487o894J0179K8702P7742l4319j694P321k5675J5087l2719m380k4257J01618
443H0224L9341j32684k8106L8465M7020J9359O919k6260n3971l429R0923M393
431H2194o4274q3262j1283P0186K0992j4496k6657M059M8434J5428j7924R539
$$ plain form
419 32936 22128 20272 13333 4596 7719 32057 39541 6099 -7922 18295 65737 19101 13465
406 13465 -14950 -74095 -44718 -86300 -13182 48919 -24691 38129 27885 -31954 -67520 7654
394 7654 -5243 -26175 -12188 7244 24771 -21884 6681 9485 -1956 -26838 30416 4891
382 4891 -25897 -46818 25503 32522 -51083 -10242 -20483 709 14350 40021 83617 87899 79505
369 79505 39772 -44509 -84794 14750 83313 64879 24176 8441 -4949 5654 86181 37378
357 37378 43793 -72954 -50875 7632 20027 65413 -8084 2106 17392 -95479 -20750 -15950
345 -15950 -70308 23673 60552 95331 124594 66925 -2096 -42577 -27509 -56 21680 55556
333 55556 14743 44522 29145 -25543 -13198 29921 38374 51998 32395 49081 1835 -25880
$$ packed form
419C2936j0808j856o939q737L123K4338P484l3442j4021K6217M7442m6636n636
406A3465k8415n9145K9377m1582P3118O2101p3610O2820j0244n9839l5566P5174
394G654j2897k0932J3987J9432J7527m6655K8565K804j1441k4882N7254k5525
382D891l0788k0921P2321P019q3605M0841j0241K1192J3641K5671M3596M282q394
369G9505l9733q4281m0285R9544O8563j8434m0703j5735j3390J0603Q0527m8803
357C7378O415j16747K2079N8507J2395M5386p3497J0190J5286j12871P4729M800
345a5950n4358R3981L6879L4779K9263n7669o9021m0481J5068K7453K1736L3876
333E5556m0813K9779j5377n4688J2345M3119Q453J3624j9603J6686m7246k7715
$$ plain form
321 -25880 -5026 14337 -35523 -8979 24504 32623 51339 5756 -16803 -16145 -40552 -8156 -18023
308 -18023 28974 5837 -18876 -15643 -9552 3812 -18775 -33825 -3014 34386 36245 20440 -18011
295 -18011 -25719 -28613 9205 2497 32138 93571 114209 49772 12223 9953 -16352 -84563 -44485
282 -44485 -18657 2 3133 -29849 -29667 -45853 -51545 -50972 -9639 -90398 -89874 -42246 -89839 -28672
268 -28672 -12927 18293 75709 11489 25226 34787 33143 65632 13886 -26925 16442 26617
256 26617 44463 6656 19810 15417 35885 56050 93741 79339 77567 76073 -28318 -1490
244 -1490 -44026 6478 2130 -2479 95784 78699 22515 -19302 -13144 -10180 -3164 -14656 -23660
231 -23660 29571 -33063 -71844 -1073 1958 -61213 -70184 -43178 13407 38427 58041 -4467
$$ packed form
321b5880K0854J9363m9860K6544L3483Q119J8716m5583k2559O58k4407L2396r867
308a8023M6997k3137k4713L233O091J3364k2587j5050L0811L7400J859j5805l8451
295a8011p708k894L7818o708K9641O1433K0638o4437l7549k270k6305o8211M0078
282d4485K5828J8659L131l2982J82j6186n692N73M1333q0759N24M7628m7593O1167
268b8672J5745L1220N7416o4220J3737R561j644L2489n1746m0811M3367J0175
256B6617J7846l7807J3154m393K0468K0165L7691j4402j772j494j04391K6828
244a490m2536N0504m348m609R8263j7085n6184m1817O158K964P016j1492r004
231b3660N3231o2634l8781P0771L031o3171q971K7006N6585K5020J9614o2508
$$ plain form
219 -4467 310 84307 1395 -39765 -7783 -10912 11108 84657 58974 26966 29248 18376 9363
206 9363 7959 43219 4175 -19405 -73658 -81107 14631 21680 55529 31253 -6316 -23302 6858
193 6858 13626 15355 68433 27895 -40829 23467 21557 12427 56415 52800 35822 22724 20255
180 20255 22465 26378 32989 15358 7656 94973 101027 78953 64683 58136 -3482 50225 67516
167 67516 32492 566 7334 58785 93009 50881 71289 36604 -2027 -21614 -25916 32026
155 32026 -12197 -11632 21222 -46461 -15372 13428 -15517 25014 69343 27709 -7812 -7166 -448
142 -448 -10889 16268 18619 41619 70355 19386 -7516 -11794 353 11336 25220 28196 25674
129 25674 -34318 -42118 -37922 -4165 67567 63208 44662 12438 14963 59125 21997 25174 45952
$$ packed form
219d467M777Q3997q2912m1160L1982l129K2020P3549k5683l2008K282j0872r013
206I363j404L5260l9044k3580n4253p449R5738P049L3849k4276l7569j6986L0160
193F858O768J729N3078m0538o8724O4296j910r130M3988l615j6978j3098k469
180B0255K210L913O611j7631p702Q7317O054k2074j4270o547o1618N3707J7291
167F7516l5024l1926O768N1451L4224m2128K0408l4685l8631j9587m302N7942
155C2026m4223N65L2854o7683L1089K8800k8945M0531M4329m1634l5521O46O718
142d48j0441K7157K351K3000K8736n0969k6902m278J2147J0983J3884K976k522
129B5674n9992p800M196L3757P1732m359j8546l2224K525M4162l7128L177K0778
$$ plain form
116 45952 -25144 -19775 24869 3306 50591 4893 51082 40888 17776 -27226 -14019 74267
104 74267 44106 28734 3629 -5300 22215 29201 15386 3000 26526 36136 88077 36125 -11764
91 -11764 35269 24015 25072 13723 -1052 -896 -13338 12233 26064 19646 22107 7317 13609
78 13609 25953 38964 29963 2724 21951 24603 24423 27605 27970 28021 34369 73250 62443 11309
64 11309 -6546 12596 22847 5822 -44291 -27048 -2763 1430 54074 166 -4190 45737 62640
51 62640 16794 -17978 -45228 -40964 13694 6180 37397 33127 40018 33852 14570 17953 36807
38 36807 25518 -11808 -9997 17334 81039 45614 55529 70181 31164 16577 31145 675 4289
25 4289 16129 -2996 48637 19297 36754 -23005 -38432 22302 51565 72113 74051 74605 39991
$$ packed form
116D5952p1096N369M4644k1563M7285m5698M6189j0194k3112m5002J3207Q8286
104G4267l0161j5372k5105q929K7515O986j3815j2386K3526R610N1941n1952m7889
91a1764M7033j1254J057j1349j4775J56j2442K5571J3831o418K461j4790O292
78A3609J2344J3011r001k7239J9227K652j80L182L65N1O348L8881j0807n1134
64A1309j7855J9142J0251j7025n0113J7243K4285M193N2644n3908m356M9927J6903
51F2640m5846l4772k7250M264N4658p514L1217m270O891o166j9282L383J8854
38C6807j1289l7326J811K7331O3705l5425R915J4652l9017j4587J4568l0470L614
25D289J1840j9125N1633k9340J7457n9759j5427O0734K9263K0548J938N54l4614
$$ plain form
12 39991 18131 10342 48514 51833 45428 45497 29947 62603 17754 16043 -425 -24096
0 -24096
$$ packed form
12C9991k1860p789L8172L319o405O9j5550L2656m4849j711j6468k3671
0b4096
$$ Imaginary data points
##PAGE= N=2
##DATA TABLE= (X++(I..I)), XYDATA
$$ plain form
16383 -1453987 -1415790 -1395945 -1354347 -1343300 -1324972 -1297658 -1291562 -1300509 -1309236 -1296697 -1259242 -1266635
16371 -1266635 -1244270 -1193788 -1192290 -1165346 -1170946 -1155155 -1077700 -1071705 -1055318 -1017304 -962795 -906260
$$ packed form
16383a453987L8197J9845M1598J1047J8328K7314O096q947q727J2539L7455p393
16371a266635K2365N0482J498K6944n600J5791P7455N995J6387L8014N4509N6535
$$ [...]
##END NTUPLES=NMR SPECTRUM
##END=
