##TITLE=1H_TG-2360-X
 DMSO
 8 sc, 
 17.10.2022
##JCAMPDX= 6.0         $$ Bruker NMR JCAMP-DX V2.0
##DATA TYPE= NMR SPECTRUM
##DATA CLASS= NTUPLES
##ORIGIN= UXNMR, Bruker Analytische Messtechnik GmbH
##OWNER= root
$$ XWIN-NMR		Version 3.5
$$ Mon Oct 17 14:50:48 2022 Russian Standard Time (UT+4h)  she@DPX200
##.OBSERVE FREQUENCY= 200.1313499994
##.OBSERVE NUCLEUS= ^1H
##.ACQUISITION MODE= SIMULTANEOUS
##.ACQUISITION SCHEME= undefined
##.AVERAGES= 8
##.DIGITISER RES= 18
##SPECTROMETER/DATA SYSTEM= spect
##.PULSE SEQUENCE= zg30
##.SOLVENT NAME= DMSO
##.SHIFT REFERENCE= (INTERNAL, DMSO, 0, 15.7546)
##AUDIT TRAIL= $$ (NUMBER, WHEN, WHO, WHERE, WHAT)
$$ ##TITLE= Audit trail, XWIN-NMR		Version 3.5
$$ ##JCAMPDX= 5.01
$$ ##ORIGIN= Bruker BioSpin GmbH
$$ ##OWNER= she
$$ F:/spectra/data/she/nmr/H-F/1/pdata/1/auditp.txt
$$ ##AUDIT TRAIL=  $$ (NUMBER, WHEN, WHO, WHERE, WHAT)
(   1,<2022-10-17 14:48:49.18 +0400>,<she>,<DPX200>,
      <created by zg, POWCHK disabled, PULCHK disabled
       configuration hash MD5:
       00 E9 B6 7A A2 85 ED C7 34 08 36 98 17 FE 4E 26
       data hash MD5: 16K
       17 59 D4 7B 6A ED 81 91 42 DD 43 D0 40 EE BB 45>)
(   2,<2022-10-17 14:48:52.64 +0400>,<she>,<DPX200>,
      <Start of raw data processing
       efp BC_mod = 2 LB = 0.24 FT_mod = 6 PKNL = 1 PHC0 = -18188.43 PHC1 = 6.800691 SI = 16K 
       data hash MD5: 16K
       51 29 C5 C1 BF 5B A0 C6 5F 2B 1C F0 0B 2E 6B FF>)
(   3,<2022-10-17 14:49:10.76 +0400>,<she>,<DPX200>,
      <pk PHC0 = -2.927976 PHC1 = 0.5999997 
       data hash MD5: 16K
       B2 0F 8B 8C 8D 55 62 96 0C F6 CA F8 C5 45 95 B8>)
(   4,<2022-10-17 14:49:14.06 +0400>,<she>,<DPX200>,
      <abs ABSG = 5 
       data hash MD5: 16K
       B2 1B 91 36 08 71 03 B1 52 C7 B5 7B 17 08 D6 02>)
(   5,<2022-10-17 14:49:36.34 +0400>,<she>,<DPX200>,
      <abs ABSG = 5 
       data hash MD5: 16K
       96 65 EE 04 B1 9B 09 85 4B 57 21 53 90 33 27 BC>)
$$ ##END=
$$ 
$$ hash MD5
$$ EC 58 A9 99 F8 7E 94 CA EF BF F8 12 E0 66 EB 20
##$RELAX= 
##$RELAX= 
##$RELAX= 
##$RELAX= 
##$RELAX= 
##$RELAX= 
$$ Bruker specific parameters
$$ --------------------------
##$DU= <F:/spectra>
##$EXPNO= 1
##$NAME= <H-F>
##$PROCNO= 1
##$TYPE= <nmr>
##$USER= <she>
##$AMP= (0..31)
100 100 100 100 100 100 100 100 100 100 100 100 100 100 100 100 100 100 
100 100 100 100 100 100 100 100 100 100 100 100 100 100 
##$AQSEQ= 0
##$AQ_mod= 1
##$AUNM= <au_zg>
##$AUTOPOS= <>
##$BF1= 200.13
##$BF2= 200.13
##$BF3= 200.13
##$BF4= 200.13
##$BF5= 200.13
##$BF6= 200.13
##$BF7= 200.13
##$BF8= 200.13
##$BYTORDA= 1
##$CFDGTYP= 0
##$CFRGTYP= 5
##$CHEMSTR= <none>
##$CNST= (0..31)
1 1 145 1 1 1 1 1 1 1 1 1 1 1 1 1 1 1 1 1 1 1 1 1 1 1 1 1 1 1 1 1 
##$CPDPRG= <>
##$CPDPRG1= <>
##$CPDPRG2= <>
##$CPDPRG3= <>
##$CPDPRG4= <mlev>
##$CPDPRG5= <mlev>
##$CPDPRG6= <mlev>
##$CPDPRG7= <mlev>
##$CPDPRG8= <mlev>
##$CPDPRGB= <>
##$CPDPRGT= <>
##$D= (0..31)
0 1.2 0 0 0 0 0 0 0 0.06 0 0.03 0 0 0 0 0.0002 0 0 0 0 0 0 0 0 0 0 0 0 
0 0 0 
##$DATE= 1666003728
##$DBL= (0..7)
$$ [...]
##$SUBNAM3= <"">
##$SUBNAM4= <"">
##$SUBNAM5= <"">
##$SUBNAM6= <"">
##$SUBNAM7= <"">
##$SUBNAM8= <"">
##$SUBNAM9= <"">
##$SW= 18.0517283424941
##$SWIBOX= (0..15)
0 0 2 0 0 0 0 0 0 0 0 0 0 0 0 0 
##$SW_h= 3612.71676300578
##$TD= 16384
##$TD0= 1
##$TE= 0
##$TE2= 300
##$TE3= 300
##$TEG= 300
##$TL= (0..7)
0 120 120 120 120 120 120 120 
##$TP= (0..7)
150 150 150 150 150 150 150 150 
##$TP07= 0
##$TPNAME0= <>
##$TPNAME1= <>
##$TPNAME2= <>
##$TPNAME3= <>
##$TPNAME4= <>
##$TPNAME5= <>
##$TPNAME6= <>
##$TPNAME7= <>
##$TPOAL= (0..7)
0.5 0.5 0.5 0.5 0.5 0.5 0.5 0.5 
##$TPOFFS= (0..7)
0 0 0 0 0 0 0 0 
##$TUNHIN= 0
##$TUNHOUT= 0
##$TUNXOUT= 0
##$USERA1= <user>
##$USERA2= <user>
##$USERA3= <user>
##$USERA4= <user>
##$USERA5= <user>
##$V9= 5
##$VALIST= <valist>
##$VCLIST= <CCCCCCCCCCCCCCC>
##$VD= 0
##$VDLIST= <DDDDDDDDDDDDDDD>
##$VPLIST= <PPPPPPPPPPPPPPP>
##$VTLIST= <TTTTTTTTTTTTTTT>
##$WBST= 1024
##$WBSW= 4
##$XGAIN= (0..3)
0 0 0 0 
##$XL= 0
##$YL= 0
##$YMAX_a= 58538
##$YMIN_a= -42109
##$ZGOPTNS= <>
##$ZL1= 120
##$ZL2= 120
##$ZL3= 120
##$ZL4= 120
##$ABSF1= 15.7546
##$ABSF2= -2.29725
##$ABSG= 5
##$ABSL= 3
##$ALPHA= 0
##$AQORDER= 0
##$ASSFAC= 0
##$ASSFACI= 0
##$ASSFACX= 0
##$ASSWID= 0
##$AUNMP= <proc_1d>
##$AZFE= 0.1
##$AZFW= 0.1
##$BCFW= 0
##$BC_mod= 2
##$BYTORDP= 0
##$COROFFS= 0
##$CY= -3
##$DATMOD= 1
##$DC= 0
##$DFILT= <>
##$DTYPP= 0
##$F1P= 0
##$F2P= 0
##$FCOR= 1
##$FTSIZE= 16384
##$FT_mod= 6
##$GAMMA= 0
##$GB= 0
##$INTBC= 1
##$INTSCL= 3.70164e-10
##$ISEN= 128
##$LB= 0.24
##$LEV0= 0
##$LPBIN= 0
##$MAXI= 10000
##$MC2= 0
##$MEAN= 0
##$ME_mod= 0
##$MI= 1.114404
##$NCOEF= 0
##$NC_proc= -10
##$NLEV= 6
##$NOISF1= 3.799351
##$NOISF2= 2.8
##$NSP= 0
##$NTH_PI= 0
##$NZP= 0
##$OFFSET= 15.7546
##$PC= 1
##$PHC0= -18191.36
##$PHC1= 7.400691
##$PH_mod= 1
##$PKNL= yes
##$PPARMOD= 0
##$PSCAL= 0
##$PSIGN= 0
##$REVERSE= no
##$SF= 200.130003389367
##$SI= 16384
##$SIGF1= 3
##$SIGF2= 2
##$SINO= 5.538805
##$SIOLD= 16384
##$SREGLST= <1H.CDCl3>
##$SSB= 0
##$STSI= 16384
##$STSR= 0
##$SW_p= 3612.71676300578
##$SYMM= 0
##$S_DEV= 0
##$TDeff= 16384
##$TDoff= 0
##$TI= <>
##$TILT= no
##$TM1= 0
##$TM2= 0
##$TOPLEV= 0
##$USERP1= <user>
##$USERP2= <user>
##$USERP3= <user>
##$USERP4= <user>
##$USERP5= <user>
##$WDW= 1
##$XDIM= 16384
##$YMAX_p= 498306388
##$YMIN_p= -16377111
$$ End of Bruker specific parameters
$$ ---------------------------------
##NTUPLES= NMR SPECTRUM
##VAR_NAME=  FREQUENCY,     SPECTRUM/REAL,   SPECTRUM/IMAG
##SYMBOL=    X,             R,               I
##VAR_TYPE=  INDEPENDENT,   DEPENDENT,       DEPENDENT
##VAR_FORM=  AFFN,          ASDF,            ASDF
##VAR_DIM=   16384,         16384,           16384
##UNITS=     HZ,            ARBITRARY UNITS, ARBITRARY UNITS
##FACTOR=    0.220516191357247, 1,           1
##FIRST=     3152.96806558799, 0,            0
##LAST=      -459.748697417795, 0,           0
##MIN=       -459.748697417795, -16377111,   0
##MAX=       3152.96806558799, 498306388,    0
$$ Real data points
##PAGE= N=1
##DATA TABLE= (X++(R..R)), XYDATA
$$ [...]
6794F039435k36008N98066m38689r4577J078224J246189p27119o70557L40822
6785G135786N02192J028632m10527j357450O49212L52531n15906k01061q13899
6776F369510J476455l76546Q85261O50148j292656N03654k49928j21547L69172
6767H213523m39313J277536N81416l78386k68190Q16350n3435k05831j309418
6758H234252J148918K08202N2651L49393L82639J4044j36793P87258p50249J540974
6748A1831289M32407n02983M2603j78150k76368q53106J329007J83130O60243
6739A2668072m14099l94633Q46602Q96490o52718n19061j47622R16117J160597
6730A4359745N46347N74764Q81233n56057j00166K74521Q30770M53327j348381
$$ y = [6039435, 5803427, 6401493, 5962804, 5868227, 6946451, 8192640, 7465521, 6794964, 7135786, 7637978, 8666610, 8256083, 6898633, 7547845, 7900376, 7384470, 7183409, 6369510, 7845965, 7469419, 8354680, 9004828, 7712172, 8215826, 7965898, 7844351, 8213523, 7774210, 9051746, 9633162, 9254776, 8986586, 9802936, 9749501, 9543670, 8234252, 9383170, 9591372, 9644023, 9993416, 10376055, 10390099, 10253306, 11040564, 10290315, 11831289, 12263696, 11760713, 11803316, 11625166, 11348798, 10495692, 11824699, 12007829, 12668072, 12253973, 11859340, 12705942, 13602432, 12949714, 12430653, 12283031, 13199148, 14359745, 14906092, 15480856, 16362089, 15806032, 15705866, 15980387, 16811157, 17264484, 15916103]
6721A5916103L53214J862917J23681q4820m78590N28457Q06612J76514n3758K89634
6711A9439964J32866M7769J370754J18190j5088M99596Q24114r34841R64875P27572
6701B3175771K408624j095039R00189L08971p46447J345364J269755j17680n3695
6692B7395813P77171P00036Q44437J417095l67268k56241J313349J167933Q0467
6683C3072792L90113J612411P31391R62790P29069k57705m4636N57856Q49433
6674C8603514N88964J047547O98815Q58753n00526m33067Q06734J368853J231910
6665D4271497N67442o11732k01819O10196J92000M38246J428649k22424m11918
6656D6060137j07238J45997K53540L78422M86693j360911J437988L86653r03021
$$ y = [15916103, 16269317, 18132234, 18255915, 18171095, 17692505, 18220962, 19027574, 19204088, 19150330, 19439964, 19572830, 19620599, 20991353, 21109543, 21094455, 21594051, 22418165, 21483324, 22448199, 23175771, 25584395, 24489356, 25389545, 25698516, 24952069, 26297433, 27567188, 27449508, 27395813, 28172984, 28873020, 29717457, 31134552, 30767284, 30511043, 31824392, 32992325, 33072792, 33462905, 35075316, 35806707, 36769497, 37498566, 37240861, 37196225, 37754081, 38603514, 39192478, 40240025, 40938840, 41797593, 41297067, 40864000, 41670734, 43039587, 44271497, 44838939, 44227207, 44025388, 44635584, 44827584, 45265830, 46694479, 46472055, 46060137, 45952899, 46098896, 46352436, 46730858, 47217551, 45856640, 47294628, 47681281, 46778260]
6647D6778260n84497m1793Q4608J84248J03985L73339M66209k73174j02776N5393
6637D7043802J081270q69747j311857K00272j2664O7477j27084n16541K80332
6628D5835260P62452m0793j55077j491228O00876o76598k027988l47015O71006
6619D3130895Q20093M91276n52685o25080K68249N60179q69245r85773O56339
6610D2894248P7631q9228O19348j327554j081323J518290j16706q74005J44165
6601D1764866O12966P28522r14273m24368Q64521K24848k26880r07433K50323
6592D1973092R8059l15155k24798P86679J024168k81505l9970j29399P19170o87629
6582D2922712L02179q54271j80961M70432N86495J13330L6253m98961k98392P33246
$$ y = [46778260, 46193763, 46151970, 46236578, 46420826, 46524811, 46898150, 47364359, 47091185, 46988409, 47043802, 48125072, 47255325, 45943468, 46143740, 46131076, 46198553, 46071469, 45554928, 45835260, 46597712, 46556919, 46401842, 44910614, 45511490, 44834892, 42806904, 42459889, 43130895, 43950988, 44442264, 43889579, 43264499, 43532748, 44092927, 43223682, 42237909, 42894248, 42971879, 42882651, 43501999, 42174445, 41093122, 42611412, 42494706, 41620701, 41764866, 42377832, 43106354, 42192081, 41767713, 42632234, 42857082, 42630202, 41722769, 41973092, 42071151, 41755996, 41531198, 42317877, 43342045, 43060540, 43020570, 42891171, 43610341, 42922712, 43224891, 42370620, 42189659, 42660091, 43246586, 43359916, 43396169, 42897208, 42598816, 43332062]
6572D3332062M13708M7129n34544n34659R13906m76140N43439K07096K23278R49663
6562D5084938p48114K98029J69398l46505P50849N73101o56581N17920Q425j020553
6552D4630907q6471R15235r08098M16877J345781r80382P01905M26850j822472
6543D4640132o55897j43889N17459P07737o2975j368721J106867k30265r94462
6534D3515986P60349Q2172j296289J51643M63497P4062j87883M28326K47767l10112
6524D3929518l75402n86423N32743j120941q00741N48915Q55144p11873K6048
6515D2296988R88347M5301j9874m03582K70342J38131L78621l37774j177469K51353
6505D2430384O95679K42746j59911L24155K74353n6604P30812j056460M76718
$$ y = [43332062, 43745770, 43792899, 43258355, 42723696, 43637602, 43161462, 43704901, 43911997, 44135275, 45084938, 44336824, 44634853, 44804251, 44457746, 45208595, 45781696, 45125115, 45643035, 45651460, 44630907, 44544436, 45459671, 44551573, 44968450, 46314231, 45333849, 46035754, 46462604, 44640132, 43984235, 43840346, 44357805, 45065542, 45002567, 43633846, 44740713, 44510448, 43515986, 44276335, 44358507, 43062218, 43213861, 43677358, 43751420, 43563537, 43991863, 44239630, 43929518, 43554116, 42967693, 43500436, 42379495, 41578754, 42127669, 42982813, 42270940, 42296988, 43285335, 43330636, 43310762, 42907180, 43177522, 43315653, 43694274, 43356500, 42179031, 42430384, 43126063, 43368809, 43208898, 43533053, 43807406, 43750802, 44481614, 43425154, 43901872]
6496D3901872k12265M9689N52680n3452o28376O54061M80218j51086M46669J429020
6486D6469030k03712m7025Q35691j493682o07730Q38486m7095n62582J062379
6477D6243760K14577J333012M09819M49617q6359J45424p28696m72118N57303
6468D8066339K81355R44733K97507J71651J86287k20006J99743K46946o839J862726
6458E2030442n66941m26487R75815M05902J068193M92231J49376n09416l8809
6449E3580306j740656l7796R20582M01793K12640M96440K33080N85348P37594
6440E5389331q51587O31714j41740L08417q37171m6229P69971l69541n15224L66486
6430E4704427Q87728R04541k70478k52982l65019M10701Q05340J23034k55367
$$ y = [43901872, 43689607, 43739296, 44291976, 44238524, 43610148, 44264209, 44744427, 44593341, 45040010, 46469030, 46265318, 46218293, 47053984, 45560302, 44952572, 45791058, 45743963, 45181381, 46243760, 46458337, 47791349, 48201168, 48650785, 48564426, 48709850, 47981154, 47509036, 48066339, 48347694, 49292427, 49589934, 49761585, 49947872, 49727866, 49927609, 50174555, 50167716, 52030442, 51463501, 51037014, 52012829, 52418731, 53486924, 53979155, 54128531, 53619115, 53580306, 51839650, 51801854, 52722436, 53124229, 53336869, 53833309, 54066389, 54651737, 55389331, 54537744, 55169458, 55027718, 55336135, 54498964, 54452735, 55222706, 54853165, 54337941, 54704427, 55592155, 56496696, 56226218, 55973236, 55608217, 56018918, 56824258, 56947292, 56691925]
6421E6691925M0521P7931k28415R05186j382360Q79285P37034n80980N55702k73514
6411E7422315M73827k21792R10799m89622L07530n35097r33956J356454J35249
6402E8425707L29147o68303K91921M11096m05020K88907M79108l91424p72181
6393E7988958O31699R37025K96163m1932Q82836K85480p75513o31103O44775J096396
6383F1314784p04427l39736n3853Q047M79280n94676J8019L06255m61962J252721
6373F1224452k09284N87690M46098P1046p17628J692198L00361j9258k37397j93056
6363F2945222j80339n86340L38849J485434j46025p41953k05947J116106p1641
6354F3953366k76848Q06374O02506o00296J71540J182095q69781r55364K39740
$$ y = [56691925, 56732446, 56810377, 56581962, 57487148, 56104788, 56984073, 57721107, 57140127, 57695829, 57422315, 57896142, 57674350, 58585149, 58095527, 58403057, 57867960, 56934004, 58290458, 58425707, 58754854, 58086551, 58378472, 58789568, 58384548, 58673455, 59152563, 58761139, 57988958, 58620657, 59557682, 59853845, 59811913, 60694749, 60980229, 60204716, 59573613, 60218388, 61314784, 60610357, 60270621, 60216768, 60224815, 60704095, 60109419, 60127438, 60433693, 59971731, 61224452, 61015168, 61602858, 62048956, 62120002, 61402374, 63094572, 63394933, 63375675, 63138278, 62945222, 62764883, 62178543, 62517392, 64002826, 63856801, 63114848, 62908901, 64025007, 63953366, 63676518, 64482892, 65085398, 64485102, 64656642, 65838737, 64968956, 64013592, 64253332]
6345F4253332P61392J08832l07743R8531Q47211O19049J136397j468893L64665
6336F6412773N77327K66628J184287q53468q1557J789100m50354n59287m93908
6327F7791541J07755O53429L06270j65248L16J591101N01443o69032o14332k43046
6317F9260197Q81261n72501Q57213m24156P2677R42629N89621r25251M33871j66869
6307G0948692m73947N05875m19945M62934J1115O16369m69510k6530p7198j175288
6297F9902567Q99847O69641K58593N83857k21169q54884L40500K65720K56875
6288G2101547K12789K68867l63367R02347N09136o16606p93541k46484R28773
6279G2903461j37430N69525K59765q86109P33747J153756j433607n71221N61550
$$ y = [64253332, 65014724, 65123556, 64815813, 64914344, 65761555, 66380604, 67517001, 66048108, 66412773, 66990100, 67256728, 68441015, 67587547, 67505990, 69295090, 68844736, 68285449, 67791541, 67899296, 68552725, 68858995, 68693747, 68694063, 70285164, 70786607, 70117575, 69503243, 69260197, 70141458, 69568957, 70426170, 70002014, 70074691, 71017320, 71606941, 70681690, 71115561, 70948692, 70474745, 70980620, 70560675, 71023609, 71034724, 71651093, 71181583, 71155053, 71077855, 69902567, 70802414, 71472055, 71730648, 72314505, 72093336, 71238452, 71578952, 71844672, 72101547, 72314336, 72583203, 72219836, 73122183, 73631319, 73014713, 72221172, 71974688, 72903461, 72766031, 73335556, 73595321, 72709212, 73442959, 74596715, 73163108, 72591887, 73153437]
6270G3153437J98586R51508p81540j31501P6623o93104J125999M90989r80890
6261G3410107j53847q5595p6797J605366j48114J87378L41649n22010m34256Q66534
6251G4990415N12931R19612n00601p29284n61002q1167K98019L88265N67784j54962
6241G5650010K12256r3884O34975J082925K58021n59970K59531O46535r26132
6232G7164267M23092J10394N98758o61162m91045L04254j040829J613232R86921
6223G9007882L73561L1575N26932K27628M06834P72605M12241j224277n96038
6214G9938943O01018P37450K77861j082850n22680L3485R49665M09884J72128
6205H1514904N43622J34770L00692m73275l64627Q20240Q57271N00957K17979
$$ y = [73153437, 73352023, 74303531, 73521991, 73390490, 73467113, 72774009, 73900008, 74390997, 73410107, 73256260, 73170665, 73093868, 74699234, 74551120, 74738498, 75080147, 74558137, 74123881, 74990415, 75503346, 76422958, 75922357, 75193073, 74632071, 74550904, 74848923, 75237188, 75804972, 75650010, 75862266, 75768382, 76403357, 77486282, 77744303, 77184333, 77443864, 78090399, 77164267, 77587359, 77697753, 78296511, 77635349, 77144304, 77448558, 76407729, 78020961, 79007882, 79381443, 79413018, 79939950, 80167578, 80574412, 81347017, 81759258, 80534981, 79938943, 80539961, 81277411, 81555272, 80472422, 79949742, 79983227, 80932892, 81342776, 81514904, 82058526, 82193296, 82493988, 82020713, 81656086, 82476326, 83333597, 83834554, 84052533]
6196H4052533l14789r89127p2406J251064R26323l22794J147329j360427o59436
6187H3658270R09253o46380l85253j69706O64868L46581q1269P8656L28181L48470
6177H5051671J61122n33950j59106m31890j00705P09871j265474o87214J025179
6168H3769504M87807p4939l67963M70817Q89611M77165k04971j86812O03592p5851
6158H5787960l62378J029788Q33286o61119m18471n45393K28962J104167j0659
6149H6986143J518347m47239q73476P86207O96198R59021m34931m97948Q69737
6140H9562059J436377o40291J193882M73390j97661J441969J156670j94637N5808
6131I4287566K50067N99470m16299K13341Q28858m51294M73878M96211N20499
$$ y = [84052533, 83737744, 82748617, 82676211, 83927275, 84853598, 84530804, 85678133, 84317706, 83658270, 84567523, 83921143, 83535890, 83366184, 84031052, 84377633, 84296364, 84375020, 84703201, 85051671, 85212793, 84678843, 84519737, 84087847, 83987142, 84697013, 83431539, 82744325, 83769504, 84257311, 84182372, 83814409, 84285226, 85174837, 85652002, 85447031, 85260219, 85863811, 85787960, 85425582, 86455370, 87288656, 86627537, 86209066, 85663673, 85892635, 86996802, 86986143, 88504490, 88057251, 87183775, 87969982, 88666180, 89625201, 89190270, 88692322, 89562059, 90998436, 90358145, 91552027, 92025417, 91827756, 93269725, 94426395, 94231758, 94287566, 94537633, 95137103, 94720804, 94934145, 95763003, 95311709, 95785587, 96281798, 96802297]
6122I6802297O62309M10342L4031P7115Q6869J436650l30701K27639Q38314O56058
6112A00900923q19245j800877L13453K84411O70535J201445K26m29211n86394
6103I9735266o05114j181371J15196m74401J03479j82342r53559j23608j61384
6094I6272162j875817r76618O30186K68883j20433p19436j550308j584297j93860
6085I0150462j079775j218349l21258j32462l95197j685847l94652j133231k787556
6076H1002135p83690r34983j09448L58354p66270j545113r57189j014071p82562
6067G4467163r06718l6622q11163p65775j007931L48975j366441k412064K52719
6058F7762143J06114j412128l26124r10657l96215l30643j064104K33113J22061
$$ y = [96802297, 97464606, 97874948, 97908979, 97986094, 98072963, 99509613, 99178912, 99406551, 100244865, 100900923, 100081678, 98280801, 98594254, 98878665, 99549200, 100750645, 100750871, 100321660, 99735266, 99130152, 97948781, 98063977, 97589576, 97693055, 97510713, 96557154, 96433546, 96272162, 94396345, 93419727, 94049913, 94318796, 94198363, 93478927, 91928619, 90344322, 90150462, 89070687, 87852338, 87531080, 87398618, 87003421, 85317574, 84922922, 83789691, 81002135, 80218445, 79283462, 79174014, 79532368, 78766098, 77220985, 76263796, 75249725, 74467163, 73560445, 73523823, 72712660, 71946885, 70938954, 71287929, 69921488, 67509424, 67762143, 67868257, 66456129, 66130005, 65219348, 64823133, 64492490, 63428386, 63661499, 63783560]
6049F3783560j230885n74815j003388j480622k56202M59302N13314l44829q51384
6040E9014051R36291N11111j409747J020697k94161J12149p9558k10553m15532
6031E9184748k61123o71578J169494l40910L20436N95769m54664J72719o14847
6022E9100044Q03119J667771k159307n78371R26502R35266J033961M03518j9448
6013F2113055n26377J140549j39579J311319K66794j049256R65998Q3776k66096
6004F3900183K50417P43402O17652J22404p33858l3885k51350L77482O77485p45693
5994F4924239p45458p59031p16391l93069r10708M56118J262889p05699j003807
5985F1409083N66162j56820L16520K80709r53533P12254J17488k15565K29793
$$ y = [63783560, 62552675, 61977860, 60974472, 59493850, 59237648, 59696950, 60210264, 59865435, 59014051, 59950342, 60461453, 59051706, 60072403, 59778242, 59890391, 59810833, 59600280, 59184748, 58923625, 58252047, 59421541, 59080631, 59401067, 59996836, 59542172, 59714891, 59100044, 59903163, 61570934, 59411627, 58833256, 59759758, 60695024, 61728985, 62132503, 62113055, 61586678, 62727227, 62587648, 63898967, 64165761, 63116505, 64082503, 64166279, 63900183, 64150600, 64894002, 65511654, 65634058, 64900200, 64866315, 64614965, 64992447, 65669932, 64924239, 64178781, 63419750, 62703359, 62310290, 61399582, 61855700, 63118589, 62412890, 61409083, 61975245, 61818425, 62134945, 62415654, 61462121, 62174375, 62291863, 62076298, 62306091]
5976F2306091O37732n73389J30819K52154l42693j953686j240975P49512n77545
5967E9388020j129278q61942j603558m0409j245890k14750J177718j327450m55243
5958E3687218j61466j378139J315886r67829l84693k19051q10037q37427Q80998
5949E1125460k25605l69850k47323j714355p95159r9030m48315p47087n4052L0141
5939D6454825j172547J03177L46724j104283o1989j530016j28843o48888n8586
5930D2199574M18888p31459L87621R44431M36036k54160L32957P98387J658573
5921D6190848J359327P60607J762219J649980J888073O33029K660699J759625
5913E8664407L077283M086526K930240M896609M929657N123219P003381P148667
$$ y = [62306091, 62943823, 62370434, 62501253, 62753407, 62410714, 60457028, 59216053, 59965565, 59388020, 58258742, 57396800, 55793242, 55752833, 54506943, 54292193, 55469911, 54142461, 53687218, 53525752, 52147613, 53463499, 52495670, 52110977, 51891926, 51081889, 50244462, 51125460, 50899855, 50530005, 50282682, 48568327, 47773168, 47674138, 47225823, 46478736, 46424684, 46454825, 45282278, 45385455, 45732179, 44627896, 44565907, 43035891, 42907048, 42258160, 42199574, 42618462, 41887003, 42274624, 43219055, 43655091, 43400931, 43733888, 44532275, 46190848, 47550175, 48310782, 50073001, 51722981, 53611054, 54244083, 56904782, 58664407, 61741690, 65828216, 68758456, 73655065, 78584722, 83707941, 90711322, 97859989]
5905I7859989O352155Q218231Q917206O557019P243778P156588N147164K224939
5897A49677069o30335k378252l852453o000274n453301m516836o159064n739533
5889A14947021m104700k723777k660817r97709q35797j073740N20636J53448J922780
5880A05147345J390898M08345J339475j286938o95113j917023j972726m900519
5872I7513744m697005n049164n800736n845255o302502m433222m566392k940344
5864E7879124m200463k131563l955656l023956k080098l397061j211649j572949
5856C6305729l428717j400886p4909k009056j578776k66263j949739r86733j424568
5847B3186082q48782j132619l57345l54892k40041K56338k390725r7795O89422
$$ y = [97859989, 104212144, 112430375, 121347581, 127904600, 135148378, 142304966, 147452130, 149677069, 149046734, 146668482, 142816029, 136815755, 131362454, 126845618, 120686554, 114947021, 110842321, 108118544, 105457727, 104460018, 103624221, 102550481, 103071117, 103224565, 105147345, 106538243, 106946588, 108286063, 106999125, 106304012, 104386989, 102414263, 97513744, 92816739, 87767575, 81966839, 76121584, 69819082, 65385860, 60819468, 57879124, 53678661, 51547098, 47591442, 44567486, 42487388, 39090327, 37878678, 36305729, 32877012, 31476126, 31401217, 29392161, 27813385, 27547122, 25597383, 24610650, 23186082, 22337300, 21204681, 20847336, 20492444, 20252403, 20508741, 18118016, 18020221, 18709643]
5838A8709643j334607m64641o14541p85714p72644R01262k46473j152741M45123
5829A4684667j311005R5878j007652l45078j02000j29358p69048p3592n17813
5820A0524999m13577K39272j509214O69252j5368K73686J026711j169365K38138
5811I864534j86533p05780n5870Q42877o69361o16319m24048l64991r55814l31319
5801F397376K5368K85658M89923J05245R8353l44774k11080L89696m03536j161273
5791E670956l89071N6530n51270K01654Q89497n87316J24998m99877M56010p99324
5781D572787L12111K41360r6631m99518L47966o03929O322M8977o02947J265360
5771D991858J41991m58523O8520j563149o23891J080247P82349j639885J22427
$$ y = [18709643, 17375036, 16910395, 16295854, 15510140, 14737496, 15638758, 15392285, 14239544, 14684667, 13373662, 13469540, 12461888, 12116810, 12014810, 11885452, 11116404, 11042812, 10524999, 10111422, 10350694, 8841480, 9510732, 9495364, 9769050, 10795761, 9626396, 9864534, 9678001, 8972221, 8916351, 9759228, 9089867, 8473548, 8049500, 7684509, 6728695, 6397376, 6422744, 6708402, 7198325, 7303570, 7401923, 7057149, 6846069, 7235765, 6832229, 5670956, 5281885, 5338415, 4787145, 4988799, 5878296, 5290980, 5415978, 4916101, 5372111, 4572787, 4884898, 5126258, 5029627, 4530109, 4878075, 4274146, 4280468, 4329445, 3726498, 4991858, 5133849, 4675326, 4743846, 3180697, 2556806, 3637053, 4419402, 2779517, 2901944]
5762B901944N71305l76583K33889M53457m19373p3357K99107p25885J432071n3128
5752D243447q56733n22231l12173p47108O17292l17074k2780k94682O55745K03976
5742B647679J39908J190585l05442r45540L91908J03321q46306n40940J110118
5733B945291j26428r3779j040098o02030M08791J89308P0956k7859L05544N63850
5723B593546m89229k41884J19404j16509p59539j265528R71931N04408j58698
5714A157902l55569O03719l57686l07597O35825O04261j72982o97138J025455
5705B136190k45499O75153j80696p90124J6489O53674o33077K99084k84143L0429
5695A677480M67921k80255k03101M47748L44423j025316m3521j164179n22722
$$ y = [2901944, 3473249, 3096666, 3330555, 3784012, 3364639, 3291282, 3590389, 2864504, 4296575, 4243447, 3386714, 2864483, 2552310, 1805202, 2422494, 2105420, 2082640, 1787958, 2443703, 2647679, 2787587, 3978172, 3672730, 2727190, 3119098, 3222419, 2376113, 1835173, 2945291, 2818863, 2725084, 1684986, 1082956, 1491747, 1681055, 1752011, 1724152, 2029696, 2593546, 2104317, 1862433, 1981837, 1865328, 1105789, -159739, 812192, 1316600, 1157902, 802333, 1406052, 1048366, 740769, 1376594, 1980855, 1807873, 1110735, 2136190, 1890691, 2565844, 2385148, 1595024, 1611513, 2265187, 1632110, 1931194, 1647051, 1677480, 2145401, 1865146, 1662045, 2109793, 2454216, 1428900, 1385379, 221200, -301522]
5686c01522J130437R44284k86942N89459p44098R46417o67846q19763M23574O34809
5676A848809n72896k76360j21179l75352n52646O82762J97741j9704K68685j77195
5666I02665k72617N37498N95672r8953J32635O2302R8068M90551N7033k93523
5656B211331m29317q14701m97039R82794n314q92327K07353l9708n85948P21849
5646H58973R0696q98240j53545J021294Q22282q57326q161M09450L08361p43302
5636H50482L69601P991j727712N40480R32671n38475O09737M51294j88329n52545
5626G55195K14141Q8092O32300K60121r54413j84461O96529n65477q53736P30355
5616H18646J12023l70958k27152r10588M23595J59302m61816k46736J175962Q00066
$$ y = [-301522, 828915, 1773199, 1486257, 2075716, 1331618, 2278035, 1610189, 790426, 1214000, 1848809, 1275913, 999553, 878374, 503022, -49624, 633138, 830879, 811175, 1079860, 902665, 630048, 1167546, 1763218, 1664265, 1796900, 1859202, 1957270, 2447821, 2504854, 2211331, 1782014, 967313, 470274, 1453068, 1447754, 555427, 762780, 723072, 137124, 858973, 949669, 51429, -102116, 919178, 1741460, 884134, 875973, 1285423, 1593784, 850482, 1220083, 1228074, -499638, 40842, 973513, 435038, 1044775, 1496069, 1307740, 755195, 969336, 1057428, 1689728, 1949849, 995436, 810975, 1507504, 942027, 88291, 818646, 930669, 559711, 332559, -578029, -154434, 4868, -456948, -703684, 472278, 1272344]
5606A272344o32146J02426p1804K53962j35798O3018j21459N40511r35096q44542
5596e08584j31429O69801n15911N90200P34368J9019N22443p49382k30017J67069
5586E67577K19411j92954L73696p54622L46916j08826O23223J97167j90277J13018
5576A194329l50665J80204Q43809J81173j201029m69875J25203M64797p0805n55500
5566C41641R54557j32044q65494M48478J262767N67575n12461J44386k31344M2233
5556B020294K17252j175163M28864o15784J017762P90265j169637p84768L23390
5547A052475k49624K01901K32184l91723J008348j068888M29592J206025R6152
5538B516442n1198m86423K00150q30253p84056L29501N62520P107o19295m44932
$$ y = [1272344, 640198, 742624, 670820, 924782, 788984, 852002, 730543, 1271054, 335958, -508584, -640013, 29788, -486123, 104077, 838445, 857464, 1379907, 630525, 400508, 567577, 786988, 594034, 967730, 213108, 560024, 451198, 1074421, 1271588, 1081311, 1194329, 843664, 1023868, 1867677, 2048850, 847821, 377946, 503149, 967946, 897141, 341641, 1296198, 1164154, 298660, 747138, 2009905, 2577480, 2065019, 2209405, 1978061, 2020294, 2237546, 1062383, 1491247, 875463, 1893225, 2683490, 1513853, 729085, 1052475, 802851, 1004752, 1236936, 845213, 1853561, 784673, 1214265, 2420290, 2516442, 2465244, 1978821, 2178971, 1348718, 564662, 894163, 1456683, 1463790, 844495, 399563]
5528C99563J089960o3725j255051j72483l77024K75254L34876l59138l74475Q20899
5518C18656N27126j333211q8221J363508l48122n28975j82312R79488K71450o02250
5508C77137J17456L07324p21606n41486Q68398P89515l14116j239672K8569M08305
5498G9824J05876N25317j005613K54467Q02324O21297p2997q22406n05257J62550
5488A45382l58822q19613J032384L48941n53049J75920K40343O27067j032163
5479a93610m57497J369952N33101o15444m89858O73041k95389n89260Q00719Q49146
5469A584901r21723j007797m56810m14020J72250Q44243J495546q79239M72673
5460H90024j21979K59580l24776j50330P34127J288740o27799j768765N30791
$$ y = [399563, 1489523, 1425798, 170747, -1736, -378760, -103506, 231370, -127768, -502243, 318656, 845782, -487429, -575650, 787858, 439736, -89239, -271551, 707937, 979387, 377137, 494593, 801917, 80311, -461175, 407223, 1196738, 882622, -357050, -328481, 79824, 185700, 711017, -294596, -40129, 762195, 1383492, 1310495, 488089, -17168, 145382, -213440, -1033053, -669, 348272, -204777, -28857, 211486, 838553, -193610, -651107, 718845, 1251946, 636502, 146644, 819685, 524296, -64964, 735755, 1584901, 663178, -344619, -801429, -1215449, -1043199, -198956, 1296590, 417351, 890024, 768045, 1027625, 702849, 552519, 1286646, 2575386, 1947587, 178822, 709613]
5451G09613p5716O60219o95437j645854N79631R84546o12397J73563O73906l79546
5441C72528J073678N12874q07203K83034l64986N27875l63965J21636j59769n01231
5431F94471m12436j34034J41662J91146k48776j33525J448031n30243j009801
5422F495O01666P5112J30288J27559q2948k47033j89986N00396R56635o03080
5412A275104m14953k12213j99032k1532l68421j71430j16598n26675m88685R26423
5402c18012N524o49895n5788l01702J159674m96062N43955J250385M12946l51403
5392A199622n15095N96896M7302l98568k50231K15867l99499m99660n07679J093473
5382E82428K84364K89390m40055l45114n64194m99113Q33123m09758Q44155K8352
$$ y = [709613, 633897, 1294116, 598679, -1047175, -467544, 517002, -95395, 78168, 752074, 372528, 1446206, 1959080, 1151877, 1434911, 1069925, 1597800, 1233835, 1355471, 1195702, 694471, 282035, 148001, 289663, 480809, 232033, 98508, 1546539, 1016296, 6495, 608161, 683273, 813561, 941120, 858172, 611139, 421153, 921549, 1878184, 1275104, 860151, 647938, 448906, 427374, 58953, -112477, -229075, -755750, -1244435, -318012, -312488, -962383, -1018171, -1319873, -160199, -656261, -112306, 1138079, 1551025, 1199622, 684527, 1281423, 1328725, 930157, 679926, 895793, 496294, -3366, -511045, 582428, 866792, 1156182, 716127, 371013, -193181, -692294, 140829, -268929, 575226, 603578]
5372F03578p51720Q06046M41732j26366o07551K40704k84373n57510l05672K71607
5362b69525M69516k91313O580L87400J158711k07648r29115j174768M38826M34970
5352B3634O84978m0027J91407N18249j10532p51703O62164P21389K09582m41737
5342A667404j073824p9351o15348L0534O21325Q83835J02193N31287j004429j34655
5332I28971p45069m88899R55122N03076p88925o69716j60872p03779J544529N86412
5322I60850p1022J56853K95092j085557o81474p88143J89365J302017r4059K38355
5312D22277K35458N25854q28100J9734l8317q63850l06220K72893J287907m23737
5302C03899m3263L69426J09093J121333j508721j067363J036441P73526r00429
$$ y = [603578, -148142, 657904, 1099636, 973270, 365719, 606423, 322050, -235460, -541132, -269525, 199991, -91322, -84742, 302658, 1461369, 1253721, 324606, -850162, -411336, 23634, 708612, 668585, 859992, 1378241, 1267709, 516006, 1178170, 1899559, 2109141, 1667404, 593580, 514229, -101119, -70585, 550740, 1434575, 1536768, 2068055, 1063626, 928971, 183902, -304997, 650125, 1153201, 364276, -305440, -466312, -1170091, 374438, 960850, 889828, 1046681, 1341773, 256216, -425258, -1213401, -1024036, 277981, 183922, 422277, 657735, 1183589, 355489, 375223, 336906, -526944, -833164, -560271, 727636, 303899, 260636, 630062, 739155, 1860488, 351767, -715596, 320845, 1094371, 193942]
5293A93942O84256l11298j103043N37659L57754P54450n35859J18257P23723j017879
5283D01962L844l55695P71014q6874O90905J64597m07500J55535m4258n28922
5273G64608l39609J09550j78217j563181n89329K007363K51924O88077j01436
5264A049750M8320j98136L21230L13908n45675j8707N3275O19036K15340l53211
5254A505130J20647n59646l46112q44374K23513O08931p5812K00166K6698k55309
5244F03832l37663L46848l14934L00043O20171k18858P6777J53310P1947L40317
5234A641790o57909p08234J1990K8268M34122j02049o99200N17344J99869q7443
5224E78548N88870n14509N36314P52523j596144L94206P73352j31376p95764j46565
$$ y = [193942, 878198, 566900, -536143, 1516, 359270, 1113720, 577861, 696118, 1419841, 401962, 405806, 50111, 821125, 734251, 1425156, 1589753, 1182253, 1337788, 1293530, 764608, 424999, 534549, 356332, -1206849, -1796178, 211185, 463109, 1151186, 1049750, 1098070, 899934, 1221164, 1535072, 989397, 970690, 1023965, 1643001, 1858341, 1505130, 1625777, 1066131, 720019, -124355, 99158, 708089, 632277, 832443, 859141, 603832, 266169, 613017, 298083, 598126, 1218297, 999439, 1076216, 1229526, 1301473, 1641790, 983881, 275647, 287637, 315905, 750027, 647978, -51222, 466122, 665991, 578548, 1167418, 652909, 1189223, 1941746, 345602, 739808, 1513160, 1381784, 586020, 439455]
5214D39455L47853M50507M98785j041031n20867L00126M96146K91469l26863j386621
5204d51041J3007J15575N35126M33278L16045K75374l42000M17670k95174m13373
5194F04487r354K52302O06997M76675m21823j365283Q02889j314929j67077J269973
5184G34857M88976j82902o14008m73611n039n35566P27956O68471N98703m48103
5174I59734j5240o55413o37179P6228P310J181740l46693k27490O05565J080942
5164B029504m50132p77401K77905P78665J88714n34296j392148K31225R08954
5155A260990O87954j18564j27582r88906q06241Q3154J87585Q44213P32791n08525
5145A246869J99429k54871j26221M06560m00910L06576n27445J005571l29904
$$ y = [439455, 787308, 1237815, 1736600, 695569, 174702, 474828, 970974, 1262443, 935580, -451041, -438034, -322459, 212667, 645945, 961990, 1237364, 895364, 1313034, 1017860, 604487, 595133, 847435, 1454432, 1931107, 1509284, 144001, 946890, -368039, -535116, 734857, 1223833, 1040931, 426923, -46688, -51727, -587293, 140663, 809134, 1407837, 959734, 944494, 289081, -348098, -271870, -264560, 917180, 570487, 342997, 948562, 2029504, 1579372, 801971, 1079876, 1858541, 2047255, 1512959, 120811, 352036, 1260990, 1948944, 1830380, 1702798, 713892, -92349, -9195, 178390, 1022603, 1755394, 1246869, 1446298, 1191427, 1065206, 1471766, 1070856, 1377432, 849987, 1855558, 1525654]
5136A525654Q12659k26818l69244J40349j80080n99519j17442P86538j22080k43479
5126A406538P7114k80669K47570K84047k49661l99571p58008J078847m78284M81456
5116A409379n40280J78331N48339J3002m80257M67119K40462K58255k85462n9981
5106A748907r47622N11524P95038p70372O102O21901O36789j230103M50188J026925
5096B849277j233274K93494K57607P71333L34450l45087j610216n36323N30096
5087A311357J78853j08231K21953k71936P00425P42758Q78o0663n96702L8247
5077B156939m5328J1939N68849l37623L10576L02404n68995J99506K82815q64296
5067B016786l20334l69758M53132P01688k24316r67998J818599J611267k112232
$$ y = [1525654, 2338313, 2111495, 1742251, 1882600, 1702520, 1103001, 985559, 1772097, 1650017, 1406538, 1483652, 1202983, 1450553, 1734600, 1484939, 1085368, 327360, 1406207, 927923, 1409379, 869099, 1047430, 1595769, 1608771, 1128514, 1595633, 1836095, 2094350, 1808888, 1748907, 801285, 1312809, 2107847, 1337475, 1343577, 1965478, 2602267, 1372164, 1822352, 2849277, 1616003, 1909497, 2167104, 2938437, 3272887, 2927800, 1317584, 781261, 1311357, 1490210, 1381979, 1603932, 1331996, 2032421, 2775179, 2776057, 2715394, 2118692, 2156939, 2111611, 2123550, 2692399, 2354776, 2665352, 2967756, 2398761, 2598267, 2881082, 2016786, 1696452, 1326694, 1779826, 2481514, 2257198, 1289200, 3107799, 4719066, 2606834]
5058B606834O05407n56524N13656O33177k33185q30870k20728m7122k08879K17791
5048B479557Q81270j74731r98r44853O87028P74172m21289l21892J127513O14020
5038D699797m52134m13709K65671L38593K56l58003l28839N91237p95501R48486
5028D495854K6349o66833R58710K972M00237p91618K94428k69103N11980k98111
5018D664865J13145m7031O93229L1959J71395J72721N73785P03978j239708M12941
5008F251279J662822P96996p13723K29771J90745j54031O40097P03615Q39065
4999A0446636L43666L56207R27372Q93461Q4719N07206J493360n70948M19989
4990A4901668M37860J5228o2143J045494O29832P06193o19346j199749Q25846
$$ y = [2606834, 3212241, 2655717, 3169373, 3802550, 3569365, 2738495, 2517767, 2470645, 2261766, 2479557, 3360827, 3186096, 3185098, 2240245, 2927273, 3701445, 3280156, 2958264, 4085777, 4699797, 4247663, 3833954, 4099625, 4438218, 4438474, 4080471, 3751632, 4342869, 3547368, 4495854, 4522203, 3855370, 4814080, 4817052, 5217289, 4425671, 4720099, 4450996, 4962976, 4664865, 4778010, 4730979, 5424208, 5456167, 5627562, 5800283, 6374068, 7078046, 5838338, 6251279, 7914101, 8711097, 7997374, 8227145, 8417890, 8263859, 8903956, 9607571, 10446636, 10790302, 11146509, 12073881, 12967342, 13052061, 13559267, 15052627, 14481679, 14901668, 15339528, 15354756, 15292613, 16338107, 16967939, 17674132, 17054786, 15855037, 16680883]
4981A6680883k19799n51059N23956O36825O96239L76772o16460o606R15860k43965
4971A8192646O59073M41100n75194P01324Q4853l19558p34156p3200R62723K56089
4961A9595700N3968r88511J450493J91547K12591L12643j33023l08597P46012
4952B1132823P73544N66645p40130J417349R85800L06822N99347J251984L98124
4943B6692308J035530M08953O47136J492838j072485J055967L38577P41645j042238
4934C0298231O74728N04117L48936Q07037P4262J104253r67574q24540M62326
4925C2481776q25397r6423p19217m61963K08320j65502o33094o00122j309313
4916B7879065q71222q5346o75732r24199L44901J16539O57195j111309j76060
$$ y = [16680883, 16461084, 15910025, 16433981, 17070806, 17767045, 18143817, 17527357, 17520751, 18436611, 18192646, 18851719, 19292819, 18717625, 19418949, 19503802, 19184244, 18450088, 18376888, 19339611, 19595700, 19649668, 18661157, 20111650, 20303197, 20515788, 20828431, 20695408, 20386811, 21132823, 21906367, 22473012, 21732882, 23150231, 24136031, 24442853, 25042200, 26294184, 26692308, 27727838, 28136791, 28783927, 30276765, 29204280, 30260247, 30598824, 31340469, 30298231, 30972959, 31477076, 31826012, 32633049, 32707311, 33811564, 32843990, 32019450, 32481776, 31656379, 31559956, 30840739, 30378776, 30587096, 30421594, 29788500, 29188378, 27879065, 27007843, 26922497, 26246765, 25322566, 25667467, 25784006, 26441201, 25329892, 25153832]
4907B5153832m27140r94593J65543o09752J467924Q5898p34098Q57985J247664
4898B6213263j169539o08451J284840K36112q176m06347m85215M46364o34585
4889B4868266N0081J094293K51665j311486k11763Q87792j81731j276093J144442
4880B5315466Q37199j734553j774291j122590O50140p03818o71408k66583n73378
4871A9956184r20669j662213N0561L07492q78291k042861m19578J42083o51466
4862A3881242P0012k45701j080697n42060k47892q72298J47259n82674o8338J90784
4852A0649637n66697J347863r91696o02313L16362r00204P80208m47313m868l47113
4842I233866r5155l43316r51803r13628M0524O74853J214552o03555r61899m7317
$$ y = [25153832, 24726692, 23732099, 23897642, 23287890, 24755814, 24841712, 24107614, 24965599, 26213263, 25043724, 24435273, 25720113, 25956225, 25948049, 25541702, 25056487, 25502851, 24868266, 24918347, 26012640, 26264305, 24952819, 24741056, 25628848, 25447117, 24171024, 25315466, 26152665, 24418112, 22643821, 21521231, 22171371, 21467553, 20796145, 20529562, 19956184, 19035515, 17373302, 17423863, 17731355, 16853064, 14810203, 14390625, 14532708, 13881242, 13951254, 13705553, 12624856, 12082796, 11834904, 10962606, 11109865, 10527191, 10458853, 10649637, 10082940, 11430803, 10439107, 9836794, 10153156, 9252952, 10033160, 9585847, 9580979, 9233866, 9138711, 8795395, 7843592, 6929964, 6970488, 7645341, 8859893, 8256338, 7294439, 7247122]
4832G247122p33372K08798j151335q77043P07024N76299p45488L55002J49677
4823E736684p5697J219286N1609j08058k05690m13993Q5888K42597R55923j04665
4813G383884J91661r46962R7108K51347j008745r6478m18601N11131J013588K39795
4803G217728Q8404M69812M00468p7527q67909Q22748J009780K35884j139296M82572
4793H642664M89199r33267N48802M35735O68103J073176K106831N0797o74365
4784A2407675Q31484o20649O73048J456738M19712L48528j95886M25445J316925
4775A7063020k91239l73332Q96424N37767K41138j00304J191938l54078m16027
4766A8395307J8411l43335J32050Q6899N2202j12055J79393L00551L281o40054
$$ y = [7247122, 6513750, 6722548, 5571213, 4694170, 5401194, 5977493, 5232005, 5587007, 5736684, 5660987, 6880273, 6931882, 6823824, 6618134, 6204141, 6290029, 6532626, 7488549, 7383884, 7575545, 6628583, 6725691, 6977038, 5968293, 5871815, 5453214, 5964345, 6977933, 7217728, 7306132, 7775944, 8176412, 8098885, 7230976, 8053724, 9063504, 9299388, 8160092, 8642664, 9131863, 8198596, 8747398, 9183133, 9851236, 10924412, 13031243, 13082040, 12407675, 13239159, 12618510, 13291558, 14748296, 15168008, 15516536, 15320650, 15746095, 17063020, 16771781, 16398449, 17294873, 17832640, 18073778, 17973474, 19165412, 18811334, 18395307, 18413718, 18070383, 18202433, 18289332, 18341534, 18229479, 18408872, 18709423, 18712704, 18072650]
4756A8072650n93834J67264J004532o47048n0797Q91640O18839O97598J97915
4747B0358759Q17770P03166J387651M34498j06320N29012j4834Q90628R23623
4738B5923953Q35439M22110P40981k89064L08504L29415J341916Q336l19460J340904
4728C0643034K71605k51886K84253j314072O03773n1012l64652J49459k02210
4719B9768292p44408n55770q94838j241897L89590m13307p78557r01640J239895
4710B5867360N23329o75292j309001k58355M29116J225680j620702o99109J56998
4701B3640024J22963M50223L49501m53626q10129n2322P69705K64175L91313M03811
4691B5075638j223110r13751J550960O57297J79429l53605Q67174L8030k34553
$$ y = [18072650, 17478816, 17646080, 18650612, 18003564, 17952767, 18844407, 19463246, 20160844, 20358759, 21176529, 21879695, 23267346, 23701844, 23595524, 24124536, 24109702, 25000330, 25923953, 26759392, 27181502, 27922483, 27633419, 27941923, 28271338, 29613254, 29621590, 29302130, 30643034, 30914639, 30662753, 30947006, 29632934, 30236707, 30185695, 29821043, 29970502, 29768292, 29023884, 28468114, 27573276, 26331379, 26720969, 26307662, 25529105, 24627465, 25867360, 26390689, 25715397, 24406396, 24148041, 24577157, 25802837, 24182135, 23483026, 23640024, 23762987, 24213210, 24562711, 24109085, 23298956, 23246634, 24016339, 24280514, 24671827, 25075638, 23852528, 22938777, 24489737, 25147034, 25326463, 24972858, 25840032, 25878062, 25643509]
4682B5643509N02435o07591J062237l33070m53011l20489l03970n94210k87308
4673B4308532r94683j45454J17660j194341q95180l82431l41841j314485m93519
4664A8664258j94913j083031j14211K32063n11398p21836m80911q7193j61858
4655A5540970k71969K59412j303167j272238L6719J6857K95521Q52796L72852
4646A4527753j704620J90014k21263j291191p688O32888N37649o53570R66605
4637A2976577k34102k38283j172527p6797n01573j626049J17019P91470R79878
4628A1015613l04489j638722j57522M76739M1442l8460j283659n66420J24651
4619G669173n14954o47355M23266p61496n18810J012914m36911p1591k45981j41020
$$ y = [25643509, 26145944, 25538353, 26600590, 26267520, 25814509, 25494020, 25190050, 24595840, 24308532, 23313849, 23168395, 23286055, 22091714, 21196534, 20814103, 20472262, 19157777, 18664258, 18469345, 17386314, 17272103, 17504166, 16992768, 16270932, 15790021, 15702828, 15540970, 15269001, 15528413, 14225246, 12953008, 12989727, 13006584, 13302105, 14154901, 14527753, 12823133, 13013147, 12791884, 11500693, 11493005, 12125893, 12663542, 12009972, 12976577, 12742475, 12504192, 11331665, 11254868, 10753295, 9127246, 9244265, 10035735, 11015613, 10711124, 9072402, 8914880, 9391619, 9433061, 9394601, 8110942, 7544522, 7669173, 7154219, 6506864, 6930130, 6168634, 5649824, 6662738, 6225827, 6154236, 5908255, 5767235]
4609E767235L957K62784n6353j226279Q85514p60281N46315L8795o07519j40717
4599D713451K24321J489281m91663k13188o65981j592764l92119o72766P62138
4590C160710j35805K45782L05474j38850L96933J89562j47769j197624J67101
4581B845514K22007K16234J68429K74241J68984j3876k403330o34436J198329
4572B042096R08443P94681j23794o47691j58303R59002k38139m01158J94149o7915
4562C261371o5625n40923L42947m07059p3847j06805Q04025P26814k568818O04336
4552A976416R05359O2315K00166l42125N62821J00291J33149M6687k68866q74073
4542B502140J15647Q46683J93864o46777P4963K35296j126724J69161J556075
$$ y = [5767235, 5771192, 6033976, 5977623, 4751344, 5636858, 4876577, 5422892, 5461687, 4854168, 4713451, 4937772, 6427053, 5935390, 5722202, 5056221, 3463457, 3071338, 2398572, 3160710, 3024905, 3270687, 3576161, 3437311, 3834244, 4023806, 3876037, 2678413, 2845514, 3067521, 3283755, 3452184, 3726425, 3895409, 3881533, 1478203, 843767, 2042096, 2950539, 3745220, 3621426, 2973735, 2815432, 3774434, 3536295, 3135137, 3329286, 3261371, 3195746, 2654823, 2997770, 2590711, 2516864, 2410059, 3214084, 3940898, 1372080, 1976416, 2881775, 2944090, 3144256, 2802131, 3364952, 3465243, 3598392, 3645079, 3376213, 2502140, 2617787, 3464470, 3658334, 3011557, 3086520, 3321816, 2195092, 2364253, 3920328]
4533C920328K82767o79487m44375L28414m67905j064657M41041N77081P0195J97367
4523C160769l14677M29912M12859M85290M81709j323031L37652m1488n28353N87577
4513C688219o82845k43859m64355M71828J267114K13701j86450n48150O38198
4504D153401o0685m56115P94479l75069q0174k33898p46791m08156L23818M6149
4494B956959K52624O9986j410869L97600J272282l46743J01481P54369r89359
4485C058330j33727J087901N94844m4163J95638q18667p31345n1248k77493P84112
4475C664182J996558j27750l44966M31455n38113n79184l09258o65678O68511
4466D195757R83018o52372K64300L67021P805k19388p54617N81420M8324J83193
$$ y = [3920328, 4203095, 3523608, 3079233, 3407647, 2939742, 1875085, 2316126, 2893207, 2963402, 3160769, 2846092, 3276004, 3688863, 4174153, 4655862, 3332831, 3670483, 3628995, 3100642, 3688219, 3005374, 2761515, 2297160, 2768988, 4036102, 4249803, 4063353, 3515203, 4153401, 4092716, 3636601, 4431080, 4056011, 3975837, 3741939, 2995148, 2586992, 2910810, 2956959, 3209583, 3279569, 1868700, 2266300, 3538582, 3191839, 3293320, 4047689, 3058330, 2924603, 4012504, 4607348, 4563185, 4758823, 3940156, 3208811, 3157563, 2880070, 3664182, 5660740, 5532990, 5188024, 5619479, 5081366, 4502182, 4192924, 3527246, 4195757, 5178775, 4526403, 4790703, 5157724, 5165529, 4946141, 4191524, 4772944, 4821268, 5004461]
4456E004461J62509L93287m85949q39014J81053J277021M37797o46556J96347
4447E680956Q32881L80056P2434L81091n03599M19271j96718K75545n25855K80192
4437G096254j14736K15149J357309m36889L1291L17200K75014n17777o929P77064
4427H992950R32673J125337L4869r70428L34509J784316J60153O47518j64974
4418A2876923l06996M48009Q80920J007639j62888K48547O96309n9793m46817
4409A5181853J414600J298353Q8076J75648P60195J59911J056386K123554J176263
4400B3434839j82780M63838J791580K31555J316893J893617K328349J330828K532276
4391C5140995K723497L018562M114570L695292M591574O009111P494527R212300
$$ y = [5004461, 5166970, 5560257, 5074308, 4235294, 4416347, 5693368, 6131165, 5484609, 5680956, 6513837, 6893893, 6966327, 7347418, 6843819, 7263090, 7066372, 7341917, 6816062, 7096254, 6981518, 7196667, 8553976, 8117087, 8148378, 8465578, 8740592, 8222815, 8215886, 8992950, 9925623, 11050960, 11085829, 10115401, 10449910, 12234226, 12394379, 13041897, 12876923, 12569927, 13017936, 13898856, 14906495, 14743607, 14992154, 15688463, 15628670, 15181853, 16596453, 17894806, 17982882, 18158530, 18918725, 19078636, 20135022, 22258576, 23434839, 23252059, 23715897, 25507477, 25739032, 27055925, 28949542, 31277891, 32608719, 35140995, 37864492, 40883054, 44997624, 48692916, 53284490, 59293601, 66788128, 76000428]
4383G6000428R008174Q287802Q012432M909770M187704O314042Q847423J0433223
4375A36000998J2008820J3056473R796527M169726j046864J3161J948213P080146
4367A83027200J2073451J1088239P595129o32095p985432j2461867j1200484p391953
4359A74112188j410677o220R97049m083540r783315j3085222j4204422j1830567
4351A20705274p358954m955124l605066m852508p055832r480464r749986r138064
4343F4509276p369311n640321n198245m098472l990306k473344k408697k132368
4335C1198212k642206k211754j703979j804907j095548r72420N0416j071764q72965
4326A8873085j047923j995336j60747K83959n7859o84608j99293j65672j022750
$$ y = [76000428, 85008602, 93296404, 101308836, 106218606, 110406310, 116720352, 125567775, 136000998, 148009818, 161066291, 170862818, 175032544, 173985680, 173998841, 175947054, 183027200, 195100651, 206188890, 213784019, 213151924, 205166492, 192704625, 181504141, 174112188, 172701511, 172695291, 173692340, 169608800, 159825485, 146740263, 132535841, 120705274, 113346320, 108391196, 104786130, 99933622, 92877790, 83397326, 73647340, 64509276, 57139965, 51499644, 46301399, 42202927, 38212621, 35739277, 33330580, 31198212, 28556006, 26344252, 24640273, 22835366, 21739818, 20767398, 20817814, 19746050, 18873085, 17825162, 15829826, 15669079, 15953038, 15895179, 15210571, 15011278, 14845606, 13822856]
4317A3822856p13686o72889L86295J026710j112064j075820r04853n83198K54500
4308A0427851J152761o94207N16660l06907j089255l99742j19819L13765p68739
4299I032368j347J037170m64355l06561Q90323L93977r42727m25966j316446k79858
4289G616578N67833L48934J58173L35028m05393q145r13793j090819l17968J072047
4279G362475O89321n20830q60009o36210Q49656Q25744Q51181m98448L11155J218211
4269I592246j225261k62428j381970Q72652J321841o05883p45859j686783J4494
4260E893049J252099j6394j180481j96471L30896r1050N1194j90122j19987l7246
4250E695487M65869k85435j175311L55830p0282k11915P39982L54833p61996m03423
$$ y = [13822856, 13109170, 12436281, 12822576, 13849286, 12737222, 11661402, 10756549, 10173351, 10427851, 11580612, 10886405, 11403065, 11096158, 10006903, 9607161, 9487342, 9801107, 9032368, 9031021, 10068191, 9603836, 9297275, 10187598, 10581575, 9638848, 9212882, 7896436, 7616578, 8184411, 8533345, 8691518, 9026546, 8621153, 8613008, 7699215, 6608396, 6290428, 7362475, 8051796, 7530966, 6670957, 6034747, 6884403, 7710147, 8561328, 8062880, 8374035, 9592246, 8366985, 8104557, 6722587, 7595239, 8917080, 8311197, 7565338, 5878555, 5893049, 7145148, 7128754, 5948273, 5751802, 6082698, 5991648, 6042842, 5852720, 5732733, 5695487, 6161356, 5875921, 4700610, 5056440, 4986158, 4774243, 5514225, 5869058, 5107062, 4703639]
4240D703639N41481M62164p84543k27607j7470O98534N19816k80161j023929J075991
4230E667915N88031m83557K88813l2422j433N67218r27403m9101k99125N66448
4220E885384J658363n80625j173533O77105L57446N19397r27336p79665n30064
4211E106472p20640J26017N53206P21258q1569n36869N36144j74715n54682o2165
4201D912457l92679J033323O25881N63318m41913n20013J947805j42489q45729
4192F739961m67428J182429l58858l41767J47507J073671k30509q20027l86546
4183F538433N7066M29901m89307J83838q52287M31227J207779K57421K10449P42825
4173H717345K04598j168523l40983Q0185K16138M00677O85741k75972j012052
$$ y = [4703639, 5245120, 5707284, 4922741, 4695134, 4677664, 5376198, 5896014, 5615853, 4591924, 5667915, 6255946, 5772389, 6061202, 6028780, 6027347, 6594565, 5667162, 5618061, 5318936, 5885384, 7543747, 6963122, 5789589, 6466694, 6824140, 7343537, 6416201, 5636536, 5106472, 4385832, 4511849, 5065055, 5786313, 5704744, 5167875, 5704019, 5529304, 4974622, 4912457, 4519778, 5553101, 6178982, 6742300, 6300387, 5780374, 7728179, 7585690, 6739961, 6272533, 7454962, 7096104, 6754337, 6901844, 7975515, 7745006, 6924979, 6538433, 6595499, 7025400, 6536093, 6719931, 5867644, 6298871, 7506650, 7764071, 7974520, 8717345, 8921943, 7753420, 7412437, 7492622, 7708760, 8109437, 8795178, 8519206, 7507154]
4164G507154r33776J874700J106067k56066K33534J82580J282647m21259p59014
4155I816567r55660Q97495N14789j64149j011461k02072M17528R50141o8254K000692
4145A2195616j92030Q5923o19082p6303J386806M10435P33788P23739n44761j01724
4135A4002407O55314j218661n86866K00995J308735J254704L94297J391104m29046
4126A6972983j91794M96346N8245M12021M99753J379734L60508j93762L3174J897398
4116B1724606L91814J47590J33151R66532K86012R86296J449213O3290J084740
4107B7233244M06496P22418R49173J511553Q75470Q38293J74241K372293J185518
4098C6268699O78862O13874J322411J005941J081266O57144K338068L100208K439914
$$ y = [7507154, 6573378, 8448078, 9554145, 9298079, 9531613, 9714193, 10996840, 10575581, 9816567, 8860907, 9758402, 10273191, 10109042, 9097581, 8895509, 9313037, 10263178, 10194924, 12195616, 12003586, 12089509, 11470427, 11394124, 12780930, 13191365, 13925153, 14648892, 14104131, 14002407, 14657721, 13439060, 12852194, 13053189, 14361924, 15616628, 16010925, 17402029, 16972983, 16781189, 17277535, 17335780, 17747801, 18247554, 19627288, 19987796, 19794034, 19827208, 21724606, 22116420, 22264010, 22397161, 23363693, 23649705, 24636001, 26085214, 26148504, 27233244, 27639740, 28362158, 29311331, 30822884, 31698354, 32536647, 32710888, 35083181, 36268699, 36947561, 37561435, 38883846, 39889787, 40971053, 41628197, 43966265, 47066473, 49506387]
4089D9506387K190466J823239K929409K358058K942268L916706M684553L148671
4081G3499757L021005M748777O154422M781016N675367O522540R458960R760403
4073A23622247J1052379J4714399J7664017K1256871K6314182L1884005L7617767
4066B84125867M4269210M9588343N1492410M3445501K5385057n493516l4547266
4059D58265606n2757281n6043216m6997344l7974916l1298015k4863000k0953450
4052A87378384j7068032j4274669j1948672j0327405q362841o993923o442191
4045A11960651m567677n004392m959015m390965j730898j409248k298494k384329
4037H5215633p14112j871823k48248M49553j038170j72848K04724K04883J094595
$$ y = [49506387, 51696853, 53520092, 56449501, 58807559, 61749827, 65666533, 70351086, 73499757, 76520762, 81269539, 87423961, 92204977, 97880344, 104402884, 113861844, 123622247, 134674626, 149389025, 167053042, 188309913, 214624095, 246508100, 284125867, 328395077, 377983420, 429475830, 472921331, 498306388, 492812872, 458265606, 405508325, 349465109, 302467765, 264492849, 233194834, 208331834, 187378384, 170310352, 156035683, 144087011, 133759606, 125396765, 118402842, 111960651, 107392974, 102388582, 97429567, 93038602, 91307704, 89898456, 87599962, 85215633, 84501521, 82629698, 82381450, 82831003, 81792833, 81619985, 81824709, 82029592, 83124187]
4028H3124187J210295J575805K207291R50463K222703J765531L147802K576386
4020I8780463L196806M150375K088390L055738L017093K665339L868586L533234
4012A24356024L818046M585702M443169M354604L423708N747687L868094M328279
4004A58925313N211830M204292M148072N069638L905782L967243M233656M392103
3996A94057929M262584N166389M370797M779347M569779N949364M575495P048427
3988B34780111Q699994J3242861J7189949K6502768L6650716L9279119L6327446
3981D12672964J6012046l5814141o3820032m7962202l3358444k2452264j8203507
3974B07074420j3206425j1798226j0267787q794132p831462p082730n701838p008765
$$ y = [83124187, 84334482, 85910287, 88117578, 89068041, 91290744, 93056275, 96204077, 98780463, 101977269, 106127644, 108216034, 111271772, 114288865, 116954204, 120822790, 124356024, 128174070, 132759772, 137202941, 141557545, 144981253, 150728940, 154597034, 158925313, 164137143, 168341435, 172489507, 177559145, 181464927, 185432170, 189665826, 194057929, 198320513, 203486902, 207857699, 212637046, 217206825, 223156189, 227731684, 234780111, 243480105, 256722966, 273912915, 300415683, 337066399, 376345518, 412672964, 428685010, 392870869, 329050837, 281088635, 247730191, 225277927, 207074420, 193867995, 182069769, 171801982, 163007850, 155176388, 148093658, 142391820, 135383055]
3966A35383055n549480n551456o004957n453564m475224m536177m708104l908377
3958I5195716l955705m008174l807231m257489k739984l437509l105449k602117
3950F7282058k245980j172420k373250k728778j428756k917259j162673o39441
3942E2613501j694950j932114j912254j101044q03020j874106j416295j484880
3934D0394838k559488j070727m136n64164n48353o74251r71600k54581l11659
3925C3435879k43750n80046M3434k31996j94188j120n29274l58563l54578k30679
3915C0755119q43214m89794Q7019k54567L24098J016046m85959o62633n50984
3906B8895131j28845k02218k42158R6505L76559k59487m9007p23256K22683k26569
$$ y = [135383055, 129833575, 124282119, 118277162, 112823598, 108348374, 103812197, 99104093, 95195716, 91240011, 87231837, 83424606, 79167117, 76427133, 72989624, 69884175, 67282058, 65036078, 63863658, 61490408, 58761630, 57332874, 54415615, 53252942, 52613501, 50918551, 48986437, 47074183, 45973139, 45170119, 43296013, 41879718, 40394838, 37835350, 36764623, 36760487, 36196323, 35647970, 34973719, 34002119, 33747538, 33435879, 33192129, 32612083, 32655517, 32423521, 32229333, 32228213, 31698939, 31340376, 30985798, 30755119, 29911905, 29422111, 29509130, 29254563, 29578661, 30594707, 30108748, 29446115, 28895131, 28766286, 28564068, 28321910, 28418415, 28794974, 28535487, 28486480, 27763224, 27985907, 27759338]
3896B7759338J688572n97196J50562L99832l89338J447169K96469K17926m92402
3887C0480932Q03120Q58710q6602Q01700N13720R72803P69101J230782J811780
3878C8156046L06989N01625N66310J541398n6546J323055O10527J309089K551985
3869D6810478J090534l11280R29601J666826Q66741r871J310257J275566k49603
3860E3379249J515837J330743R58823L09539L50235J539458J04784P65046J237908
3851F1491622Q36007J279233J668068J376236R93163N72781J023488J268853R99143
3842G1508594J985771K232197K555704L201083K492460K514846K782095M181785
3834I3454535M630963M020396M574479M528334L880372O557355N740936O693948
$$ y = [27759338, 29447910, 28850714, 29001276, 29401108, 29011770, 30458939, 30755408, 30973334, 30480932, 31284052, 32142762, 32056160, 32857860, 33371580, 34344383, 35113484, 36344266, 38156046, 38463035, 38964660, 39530970, 41072368, 41015822, 42338877, 42949404, 44258493, 46810478, 47901012, 47589732, 48519333, 50186159, 51052900, 51043029, 52353286, 53628852, 53379249, 54895086, 56225829, 57184652, 57494191, 57844426, 59383884, 59488668, 60253714, 61491622, 62327629, 63606862, 65274930, 66651166, 67644329, 68217110, 69240598, 70509451, 71508594, 73494365, 75726562, 78282266, 81483349, 83975809, 86490655, 89272750, 93454535, 98085498, 102105894, 106680373, 111208707, 115089079, 121646434, 127387370, 134081318]
3826A34081318Q005503Q568460R048809R773231R149040J0704930J0637533J0357712
3818B10326536J1487080J1976746J1457035J1557638J2150146J1998283J0814952
3811B91768416Q921482R101242Q556933Q983437N963825M189324L499332K721620
3803C43705611J363588k11767j129646k444279l307832m679966o027262o603252
3795C20665195p731416p668030r095534r773777j0039548j1136715r512803r618206
3787B46089166j0951952r605820r942577j0957935j1116978r428524r666263r956507
3779A64462610q475132p521309q482043o816741n974509n275490n281387o587504
3771A10048495m382841m544980m429769l772382l108456l702381k959264k134442
$$ y = [134081318, 142086821, 150655281, 159704090, 169477321, 178626361, 189331291, 199968824, 210326536, 221813616, 233790362, 245247397, 256805035, 268955181, 280953464, 291768416, 300689898, 309791140, 318348073, 327331510, 333295335, 337484659, 340983991, 343705611, 345069199, 344857432, 343727786, 341283507, 337975675, 333295709, 327268447, 320665195, 312933779, 305265749, 296170215, 286396438, 276356890, 265220175, 255707372, 246089166, 235137214, 225531394, 215588817, 204630882, 193513904, 184085380, 174419117, 164462610, 155987478, 148466169, 139984126, 133167385, 127192876, 121917386, 116635999, 110048495, 105665654, 101120674, 96690905, 92918523, 89810067, 86107686, 83148422, 81013980]
3763H1013980j718099k598339k398233j657688k423252j897530j031996o25108
3755F6663735j773296j847903n72440p85112j099378n06965j401321j448015n25378
3746E6703927k65345j178091m31818q24321k038665j098346o44755j64571n36397
3737D9521618k923404k463017M16088j56012j679424m00209j104491r64213j033372
3728C9213564j731943k103045n94095j012328q44984m71787k79322j093468l161928
3719B7920664N34734k74025j039082j49904p21244l66048j077577R669k59722
3710B4577465k70580j033360j018764l79754L19203M81851q04149m79699l70576
3701B1021637L53671l67432o38170o98719N29372Q59245n3151K70451q16252o02826
$$ y = [81013980, 79295881, 76697542, 74299309, 72641621, 70218369, 68320839, 67288843, 66663735, 64890439, 63042536, 62470096, 61684984, 60585606, 60078641, 58677320, 57229305, 56703927, 56438582, 55260491, 54828673, 54004352, 51965687, 50867341, 50222586, 50058015, 49521618, 46598214, 44135197, 44551285, 44395273, 42715849, 42315640, 41211149, 40246936, 39213564, 37481621, 35378576, 34784481, 33772153, 32927169, 32455382, 32176060, 31082592, 27920664, 28455398, 28181373, 27142291, 26992387, 26271143, 25905095, 24827518, 24837187, 24577465, 24306885, 23273525, 22254761, 21875007, 22194210, 22676061, 21871912, 21392213, 21021637, 21375308, 21007876, 20369706, 19670987, 20200359, 21059604, 21006453, 21276904, 20460652, 19857826]
3691A9857826R52930J68785N08087j412663p70174Q3954J12319P02072n50692
3682A9652444m23250l196j88898l47093K2115L0619l10819M00098q0634O664Q30382
3671A9588432P25285m28476m32403N26980m49218O22510Q73954l48076p95104
3662A9883884J602J21472J910994J160907m40665k33274M98550R76561n14287
3653B3365744J144447J242892L2489J022227O35646Q77222J403313Q51265J193734
3644C1768979J647259R09292R16984O54617J515589K776455J977134L71491J759329
3635D4297129M67299K165575J765557J617333J572998N08146J297884M66126J537327
3626E5695374K680749P57464m60201O54598J35226N55114J019018L49737l07591
$$ y = [19857826, 20810756, 20979541, 21487628, 20074965, 19304791, 19388745, 19501064, 20203136, 19652444, 19229194, 19225998, 19037100, 18690007, 18712122, 18742741, 18431922, 18832020, 18751386, 18758050, 19588432, 20313717, 19885241, 19452838, 19979818, 19530600, 20153110, 21027064, 20678988, 19883884, 19885486, 20006958, 21917952, 23078859, 22638194, 22404920, 22903470, 23880031, 23365744, 24510191, 25753083, 25785572, 26807799, 27443445, 28320667, 29723980, 30575245, 31768979, 33416238, 34325530, 35242514, 35897131, 37412720, 40189175, 42166309, 42537800, 44297129, 44764428, 46930003, 48695560, 50312893, 51885891, 52394037, 53691921, 54158047, 55695374, 58376123, 59133587, 58673386, 59327984, 59463210, 60018324, 61037342, 61387079, 61079488]
3617F1079488L43000l33097P7610J33347j31292l44829L33452q54095j208165
3608E9095419k80681l21823J095766L62457n76737L44954J37399P83091J371283
3599F2011128Q53778J203406J101507J423791K003150K475687K680672K651827
3591G6404946K953877L842335M666233L975041M612105M536987M678243N532588
3583A11202355N610485N752837O682669M617834N197056P009884O541609N034669
3575A57649398M404716L219157K641513M526105L493670K685781K612412K280793
3567A83513545K739174O47390R70174J071420N94777M48309K14857K607o79198
3558A89523055Q92905q87834j219180N27132j804794j464484n09366M22260M15858
$$ y = [61079488, 61422488, 61089391, 61167001, 61300348, 61169056, 60824227, 61157679, 60303584, 59095419, 58814738, 58492915, 59588681, 59951138, 59374401, 59719355, 59856754, 60639845, 62011128, 62864906, 64068312, 65169819, 66593610, 68596760, 71072447, 73753119, 76404946, 79358823, 83201158, 87867391, 91842432, 96454537, 100991524, 105669767, 111202355, 116812840, 122565677, 129248346, 133866180, 139063236, 146073120, 152614729, 157649398, 162054114, 165273271, 167914784, 172440889, 175934559, 178620340, 181232752, 183513545, 186252719, 186900109, 187870283, 188941703, 189536480, 189984789, 190199646, 190202253, 189523055, 190415960, 189528126, 188308946, 188836078, 187031284, 185566800, 185057434, 185479694, 185895552]
3549A85895552j04676L82118j2087P62621o93437Q35069K85565K86250q040P32624
3539A88361559M06890K98272L52693j75365O6552P81439m21619j146282n90634
3530A87933505j666744q06043j963696l205890m028158k844776l387407k956909
3522A67073882m334234l983874k995069n033242n430773m815739n741268n050067
3514A29689616n755133m540580m278842n603100n021521m209848m972390l885884
3506I1422318l294267k639179n032070k749129k703503k843187j439009k389924
3498F8332050j751034j825052q45767j956949R65946N32523n71908J064488j043288
3489F2901009m12799P43551j70813N0697j134860m83890k79968J75260M51597
$$ y = [185895552, 185790876, 186172994, 186160907, 186923528, 186230091, 187065160, 187350725, 187636975, 187628935, 188361559, 188768449, 189066721, 189419414, 189244049, 189310601, 190092040, 189670421, 188524139, 187933505, 186266761, 185460718, 183497022, 180291132, 176262974, 173418198, 170030791, 167073882, 162739648, 158755774, 155760705, 150727463, 145296690, 140480951, 134739683, 129689616, 123934483, 119393903, 115115061, 109511961, 104490440, 100280592, 95308202, 91422318, 88128051, 85488872, 80456802, 77707673, 75004170, 72160983, 70721974, 68332050, 66581016, 64755964, 63910197, 61953248, 62919194, 63451717, 62879809, 63944297, 62901009, 62488210, 63231761, 63060948, 63111645, 61976785, 61492895, 61212927, 61388187, 61839784]
3480F1839784N64280o43704j69362n50836L10414l99803M93394j719024j129230
3471E8595913j060418o93764k05459j525532j552043j439941p66266p01440k766377
3462D7884673k549826j414385r26161j487290j957394j290988j790734j993399
3454C4474496l97914r07946k205734k106093j556461j074031j592259l34785m48260
3445B3851013k255233m33843r24838j147243j217999l98740o56343o29996Q62308
3436A7049086N99051j089374j663498j65584j361877m55396K06770j26268j920355
3427A1072555l36835O90168j91290o15539j48508l09954q13703p33961M69585
3418I082518L50479m18885L44391o69838M99751P16858r06896j236801m2459M83846
$$ y = [61839784, 62404064, 61760360, 61590998, 61040162, 61350576, 60950773, 61444167, 59725143, 58595913, 57535495, 56841731, 56636272, 55110740, 53558697, 52118756, 51352490, 50651050, 47884673, 45334847, 43920462, 42994301, 41507011, 39549617, 38258629, 36467895, 34474496, 34076582, 33168636, 30962902, 28856809, 27300348, 26226317, 24634058, 24299273, 23851013, 21595780, 21161937, 20237099, 19089856, 17871857, 17473117, 16816774, 16186778, 17049086, 17648137, 16558763, 14895265, 14729681, 13367804, 12912408, 13119178, 12992910, 11072555, 10735720, 11425888, 11234598, 10619059, 10470551, 10160597, 9346894, 8612933, 9082518, 9432997, 9014112, 9358503, 8688665, 9188416, 9905274, 8998378, 7761577, 7719118, 8202964]
3408H202964l15197M62061j051641K52500r7870j010649q23929l39029j83376
3399E095834j97938L29961N57218j1685r44524q34562J208649Q80994L1615j745059
3389D370503j193822J393656k59603m54904N59684l54586J90754L8775j3081o65078
3379C612298p06011O2748O13882j162105N50048J014412M41379p53354q08303
3370B864994M51999j076748J188352N88344n34487N09410r61820j037749L42207
3361B334502K71353m06224j048715J358522R5585o33672N44442M32128q47140
3352B100781L42835m54230k35418J488563r28768k57159N73401J25881l92290
3343B363596M42416j55402j99949o52041j362443M31424N72687m73315M08780
$$ y = [8202964, 7887767, 8349828, 7298187, 7550687, 7452817, 6442168, 5618239, 5279210, 5095834, 4897896, 5227857, 5785075, 5773390, 4828866, 3994304, 5202953, 6083947, 6115562, 4370503, 3176681, 4570337, 4310734, 3855830, 4415514, 4060928, 4251682, 4290457, 4277376, 3612298, 2906287, 2969035, 3582917, 2420812, 2970860, 3985272, 4426651, 3673297, 2864994, 3316993, 2240245, 3428597, 4016941, 3482454, 3991864, 3030044, 1992295, 2334502, 2605855, 2199631, 1150916, 2509438, 2605023, 1971351, 2515793, 2947921, 2100781, 2443616, 1989386, 1753968, 3242531, 2313763, 2056604, 2630005, 2755886, 2363596, 2806012, 2650610, 2450661, 1798620, 436177, 867601, 1440288, 966973, 1375753]
3334A375753M29748M88620n06954n2960j10774j82010J077926j286618K10700
3325A443431m75350K59070j45061o72622R49304L27033p69447M39889L64261p56081
3315I64427n6164m31485l91739J08906L66237K34367q91475N42158J007744J58006
3305A610982j232653q72762J343548j85919P04323m12889Q68361j73876j02779
3296A546336j64920R17048R91464q32572q7770j217661o30627Q74722J304059
3287B700079m65435l47880l020r38578M59139L57973p4467R1065M86580p17093
3277A548363n25203Q59132P85689j650799n93702R01984m41527J945672p46231
3268B083378N81879q14064p05712R52301k72683o13996p5306L12764J35164j84647
$$ y = [1375753, 1805501, 2294121, 1787167, 1734207, 1623433, 1441423, 2519349, 1232731, 1443431, 968081, 1227151, 1082090, 409468, 1358772, 1685805, 916358, 1356247, 1720508, 964427, 908263, 476778, 85039, 193945, 560182, 794549, -96926, 445232, 1452976, 1610982, 378329, -494433, 849115, 663196, 1367519, 954630, 1822991, 1649115, 1546336, 1381416, 2298464, 3289928, 2457356, 2369586, 1151925, 521298, 1396020, 2700079, 2234644, 1886764, 1883744, 945166, 1404305, 1762278, 1687811, 1778876, 2265456, 1548363, 1023160, 1882292, 2667981, 1017182, 423480, 1325464, 883937, 2829609, 2083378, 2665257, 1851193, 1145481, 2097782, 1825099, 1211103, 1135797, 1448561, 1583725, 1399078]
3258A399078q30063M24946j8312p01200M9505L06038Q80856J108770L33611m83976
3248B469253p33556M39164J23729j347506L46993J033875R7659j27392j008169
3239A294050j048380O66662O63722j12089J43637n31421k5764L46976j28751M19038
3229A687680j103220K93805K2118L92830J34156j09091k25228l90057M93462J124880
3219B321335k40597m68828l89648L98250M2783K53699N4070n16176q6866j126323
3209B41699R21421J158262m29513r51243L51853K15100p9657l1358K85040k67028
3199A414576n07626k27494p13197k39370k10069L25341J285635M273R76868l77250
3189A731687r21557o196N86001k91108p50219l65837M2160k07107n09363L73480
$$ y = [1399078, 569015, 993961, 975649, 274449, 323954, 629992, 1510848, 2619618, 2953229, 2469253, 1735697, 2174861, 2298590, 951084, 1298077, 2331952, 2429611, 2302219, 1294050, 245670, 912332, 1576054, 1463965, 1607602, 1076181, 1050417, 1397393, 1268642, 1687680, 584460, 878265, 900383, 1293213, 1427369, 1318278, 1093050, 702993, 1196455, 2321335, 2080738, 1611910, 1222262, 1620512, 1663295, 1916994, 1971064, 1454888, 1368022, 241699, 1163120, 2321382, 1891869, 940626, 1292479, 1507579, 1427922, 1396564, 1681604, 1414576, 906950, 679456, -33741, -273111, -483180, -157839, 1127796, 1132069, 2108937, 1731687, 810130, 803934, 1389935, 1098827, 348608, -17229, 24931, -182176, -691539, -318059]
3179c18059K44564k33127k79235Q06560O94246o30282j27519j53711p63741L17534
3169d42770r9168m92384J40657Q78521J418290R1338k76812l15211K20702k88575
3159H34588j49911q56512N1170l8960j91468M96473j55832k32971K05968n7718
3149i5173Q5439K36249j33513j7536p80575p3626M25204N41624n3697l81685r6560
3138c43849o47326M49138N53426L25710R86043J057562r30282L85729Q9935J58970
3128B085056j061847O17637P38737k217j525211K89235N17573p70742m48288J29999
3118E69932L13506l98610o16287o11182O78598R4957M25130O03456M96015j163030
3108C92485l33868m21494L10141n55709K73338o4273M87925n32223q68003J74288
$$ y = [-318059, -73495, -306622, -585857, 220703, 914949, 284667, 157148, 3437, -760304, -442770, -541938, -1034322, -893665, -15144, 1403146, 1494484, 1217672, 902461, 1123163, 834588, 684677, -171835, -120665, -159625, -351093, 145380, -10452, -243423, -37455, -95173, -9734, 226515, 93002, 75466, -705109, -778735, -353531, 188093, 134396, -247289, -343849, -991175, -542037, 11389, 337099, 1323142, 2380704, 1450422, 1836151, 1926086, 2085056, 1023209, 1640846, 2379583, 2377366, 852155, 1141390, 1658963, 888221, 439933, 569932, 883438, 484828, -131459, -742641, -64043, 30914, 456044, 1059500, 1555515, 392485, 58617, -362877, -52736, -608445, -335107, -399380, 88545, -443678, -1311681, -1137393]
3098a137393J237156R31914j259195r35545J041463M6702j33484q45977K70016
3089g84343m63163R00291J59848j17774P63019l63258K21332o41341l06087M79306
3079a52170J89933J23738O6051l69308l79987N08920l43019o9743j254537k82066
3069a962188K218128P37188o95302p44954j27665j69472Q83398m81042m76726
3060h18635R92779M24451o02238j45433M47293j08530p76442O62397m90753r07562
3050a322673P02571m61781P5227R33705K47283J01617j523783m36351J265915
3041d18270R93077o05776L28981k95705L37845L28311o31137J85025j238886q55994
3031a872529M97358Q53119L70293J96188n2514j85159P61237q18727r30295N77021
$$ y = [-1137393, 99763, 1031677, -227518, -1163063, -121600, -74898, -208382, -1054359, -784343, -1247506, -347215, -187367, -305141, 457878, 94620, 315952, -325389, -631476, -152170, 37763, 161501, 227552, -141756, -521743, -12823, -355842, -425585, -1680122, -1962188, 255940, 993128, 297826, -447128, -574793, -744265, 139133, -341909, -818635, 174144, 598595, -3643, -149076, 298217, 189687, -586755, 75642, -415111, -1322673, -620102, -1081883, -1006656, -72951, 174332, 275949, -1247834, -1684185, -418270, 574807, -30969, 298012, 2307, 340152, 668463, 37326, 222351, -1016535, -1872529, -1375171, -522052, -151759, 44429, -8085, -193244, 567993, -250734, -1181029, -604008]
3021f04008j07544L86859K07890o7229M64089P82081l20562n24003j376462j127053
3011b285942K17033R02413l91441K44786J125175l02216o21773J51882Q13884
3002a46199O6331l51884L26434l67675O80228J03529k26354j35804p44885K07129
2992e89150j93591J77702j6230k65507k0386O76112l91112j46165M83860j163069
2982a447536n05837J286140o12103Q0193K110387q7200j170144j45919L65066
2973a26953q89076N45684k2978n8607L55847n09585n22434m83889Q1907q58017
2963b488101P9564J07573P77710J092368O86157p64655l00683O23437m05758q3266
2953f75654L08303Q194l82690q73897J42734O21995N1639J484841K39555q75487
$$ y = [-604008, -711552, -324693, -116803, -184032, 280057, 1062138, 741576, 217573, -1158889, -2285942, -2068909, -1166496, -1557937, -1313151, -187976, -490192, -1111965, -960083, -146199, -79868, -431752, -105318, -472993, 207235, 310764, 84410, -51394, -796279, -589150, -782741, -605039, -621269, -886776, -907162, -231050, -622162, -768327, -284467, -1447536, -1953373, -667233, -1279336, -1199143, 911244, 824044, -346100, -492019, -126953, -1016029, -470345, -493323, -551930, -196083, -705668, -1228102, -1711991, -1630084, -2488101, -2408537, -2300964, -1523254, -430886, 255271, -509384, -810067, -186630, -592388, -675654, -367351, -359157, -741847, -1615744, -1473010, -851015, -799376, 685465, 925020, 49533]
2943D9533K67057m20362q98230O73238O50538l61139j219101P1975R59239L58691
2933A31439J67478m39569K69552r58153j63744N71894P8288J155952M57518j073629
2923A97026j152065k29293J261686j66823Q02001k01656q08250J72138j142453
2914a267689L90296P54196j38578n15392q92223j01099Q12989J171557n65674
2905c51617k12435r56871m70416P94291Q69827n11538J66391N20826j37921m25629
2895g15092P7081N22982P52558J80253l31814r21991q16592P45328O62078K21101
2885C75892j001405R00454L72554K17412N09977l63605p37817k49042P34258J51998
2875I10676k99662j090065N8387P54124M20608L11113Q5730Q44669k03213m9937
$$ y = [49533, 316590, -103772, -1002002, -328764, 321774, -39365, -1258466, -1186491, -227252, 131439, 298917, -140652, 128900, -829253, -992997, -421103, -342815, 813137, 1270655, 197026, -955039, -1184332, 77354, -89469, 712532, 510876, -297374, -125236, -1267689, -877393, -123197, -261775, -777167, -1669390, -1770489, -957500, 214057, -351617, -564052, -1520923, -1991339, -1197048, -327221, -838759, -672368, -151542, -289463, -715092, -638011, -115029, 637529, 817782, 485968, -436023, -1252615, -507287, 154791, 375892, -625513, 274941, 647495, 864907, 1374884, 1011279, 273462, 24420, 758678, 910676, 611014, -479051, -420664, 333460, 754068, 1065181, 1150911, 1995580, 1792367, 1742430]
2865A742430j296647n22800Q32869M95739K31289K74468j839218k36264j49137
2856d67271J942707n90610j172367j49766j61863R0990Q9503L23730L6531l38884
2846c97300j189562J212485J009079K32358j68618j0378k94705n6606p86849j070780
2836a520876J468853J416493j558778m50760J59436n11277K45865J238340J65961
2827F53257M20097r20434P2965q4816n23108m36558n16640J199851k49656Q7353
2817b97689j36745p89803M82516J29066q31018P91943P86144L31468j212430O566
2807g39982O95q9594J037641j23644j371847M04052K15252p21367Q25177K38713
2797c24904m09638K40475O7339p68351M08185K4070j14418r21591N21653K61831
$$ y = [1742430, 445783, -77017, 755852, 1251591, 1482880, 1757348, -81870, -318134, -467271, 1475436, 884826, -287541, -437307, -599170, -508180, -418677, -94947, -58416, -397300, -1586862, -374377, 634702, 867060, 698442, 688064, 393359, 336753, -450096, -1520876, -52023, 1364470, -194308, -645068, -485632, -996909, -751044, 487296, 653257, 1073354, 152920, 225885, 141069, -382039, -818597, -1335237, -135386, -385042, -297689, -434434, -1224237, -741721, -612655, -1443673, -651730, 134414, 465882, -746548, -739982, -739287, -828881, 208760, 85116, -1286731, -882679, -667427, -1388794, -563617, -324904, -734542, -494067, -426728, -1195079, -786894, -762824, -877242, -1798833, -1277180, -1015349]
2787a015349P90925K21773j144760M00248J51960O06275l95708O02141k92426
2778g4921k88183J95105j13073K87994K26323l68818J74212J70843l6877O40166
2768H12771m19893j92763q61880m01481n74762m60703M64763L00127L67081O71046
2758b95694n76356j08485N6744N98879p75837M67994j44267p33492J232859Q22178
2748E44523q44087o67013q98981M00701J315599o97903l04011j87973P82082p777
2738e64840j317435q0227L35487M31172Q27465q64847k92572J045306o87974J81941
2728i86524N07850K12228J099774l05436N73693K91029q30401J97660M6933r46680
2718a39874l18278N70993o87420l80122k52082J370660K20993j9465L77716r67946
$$ y = [-1015349, -224424, -2651, -1147411, -747163, -595203, 11072, -384636, 217505, -74921, -363104, -167999, -281072, 6922, 233245, -135573, 38639, 209482, 172605, 812771, 392878, 200115, -661765, -1063246, -1638008, -2098711, -1633948, -1333821, -966740, -295694, -872050, -980535, -923791, -324912, -1100749, -632755, -777022, -1510514, -277655, 544523, -299564, -966577, -1865558, -1464857, -149258, -847161, -1151172, -1339145, -557063, -564840, -1882275, -1962502, -1627015, -1195843, -368378, -1233225, -1525797, -480491, -1168465, -986524, -478674, -266446, 833328, 527892, 1101585, 1392614, 562213, 759873, 806806, -139874, -458152, 112841, -574579, -954701, -1206783, 163877, 384870, 365405, 743121, -224825]
2708b24825p25599j57557J3305m47033P41657k17391M26116j191562K24831P65904
2698g92154j57812K90031k23982P6548J68209q1789j1827p35430P35623J401447
2688F68864p86179k55454M78379K04584r96598m89873Q31193j09479m19830m01464
2678a275857M39523j02575K78459R20159K85816q09254M79317K58703j205381
2669g31090n7128j326599N36872k2916j3419L8667p26303J368566K09711N9822
2659f63817L22317o6247m13295n31295J24044k21548L23842n79437M30969O0724
2649a213743J40751M78736P52327r4569p18422m74353K02341N2885n83750J822549
2639C64752k54465n88469m56454Q61052J03454q66921J92303j89588l11997R2447
$$ y = [-224825, -950424, -1107981, -1094676, -1541709, -800052, -1017443, -591327, -1782889, -1558058, -792154, -949966, -659935, -883917, -807369, -639160, -720949, -732776, -1468206, -732583, 668864, -117315, -372769, 105610, 310194, -686404, -1176277, -345084, -454563, -874393, -1275857, -836334, -938909, -660450, 259709, 545525, -263729, 215588, 474291, -731090, -788218, -2114817, -1577945, -1600861, -1614280, -1575613, -2301916, -933350, -723639, -663817, -341500, -407747, -821042, -1352337, -1228293, -1449841, -1125999, -1705436, -1274467, -1213743, -1072992, -594256, 158071, 63502, -654920, -1129273, -926932, -874047, -1457797, 364752, 110287, -478182, -934636, -73584, 29870, -837051, -644748, -834336, -1146333, -1053886]
2629a053886J01982J152016r69735q10479j15629P12027L14243n14033m6820m03692
2619a634006M39056J43750Q63257q32661R17156p47863j52543J363577l94688
2610c4965M6769r6202J72494n07440k1780p8552q95075K26516J46980N92805j52999
2599f01449Q11395n7362L76424j085561l38473k3037K40750m22630j40292M6576
2589a193659q8246J135979M84936L11372j215970j42896N44892m24294k69936
2580h57822Q0415K81872M91922j128496q76905o59768J272957l26818Q74195P08568
2570a39880N49318O80170r13880l43535q55214m16387K86361l40248N6813L71561
2560a064921M09714j94080m56817J3660P02840L83952J63110p12843N85872n5240
$$ y = [-1053886, -951904, 200112, -769623, -1580102, -1695731, -983704, -669461, -1183494, -1230314, -1634006, -1194950, -1051200, -187943, -1020604, -103448, -851311, -1003854, 359723, -34965, 11804, -84398, 88096, -419344, -441124, -519676, -1414751, -1188235, -1041255, -448450, -601449, 209946, 152584, 529008, -556553, -895026, -918063, -677313, -1099943, -1240235, -1193659, -1281905, -145926, 339010, 650382, -565588, -708484, -163592, -587886, -857822, -777407, -495535, -3613, -1132109, -2009014, -2668782, -1395825, -1722643, -848448, -139880, 409438, 1089608, 175728, -167807, -1023021, -1439408, -1153047, -1493295, -1436482, -1064921, -655207, -849287, -1306104, -1292444, -589604, -205652, -42542, -755385, -169513, -224753]
2550b24753M700j78524L20970O95395k58942j081204J72237o4071m56786n77945
2540a648923n75082J696703K49794o21875M77207m14713m03769n08647J766783
2531A7478N64869L31165o59104q53673O21653p32782m68180L91398J801423j585403
2521e71156J10341R14003N83106l98154r61441J53585k51706L02910m37474o60145
2511a216131m14j01947J165299L53381L62014o61086j078224o89884Q67206m3539
2501a043325m52759J110857j61337m11231M07636M11752q08874L51579Q73107
2492B77405L28794p89824l5023m09834O37765J346677p87881K2704k34745q28253
2482d72215K15901K37047q94387q61234P63561P48644K9552J084273r18008j11390
$$ y = [-224753, -220053, -398577, -77607, 617788, 358846, -722358, -550121, -614192, -1070978, -1648923, -2224005, -527302, -277508, -899383, -422176, -836889, -1240658, -1749305, 17478, 582347, 913512, 254408, -599265, 22388, -710394, -1178574, -787176, 1014247, -571156, -460815, 453188, 1036294, 638140, -323301, -169716, -421422, -118512, -555986, -1216131, -1216545, -1318492, -153193, 200188, 562202, -98884, -1177108, -1866992, -999786, -1043325, -1496084, -385227, -546564, -957795, -550159, -138407, -947281, -595702, 277405, 606199, -183625, -218648, -628482, 9283, 1355960, 568079, 590783, 356038, -472215, -256314, -19267, -913654, -1774888, -1011327, -262683, -233131, 851142, -66866, -178256]
2472a78256j19898p51593p02773k64659J06164J092575Qj95418J133355L02211
2462D21716j022803j60347k20017J560240k51157j425128N62832P94188j055024
2453g95500L98162l23364K58170p49031J067138p08735K5921L5364p69484J280570
2443b80789j310101q0222K88208L42647L88898q8913j23947L43649l8667l43443
2433i02680j017927N00660k13262L64012N35414L27510j07506r50443L76104K3793
2423a064325O79191N44269m44263K54293q45873m07777P2215J6797m97821J117044
2413e76250n28946N1064P56149m11755l66535O03319K05737L89427K44494m33525
2403f6821j11420J53462l72413o26274l96882N14568R93647N64531n88667N06906
$$ y = [-178256, -298154, -1049747, -1752520, -2017179, -1911015, -818440, -818432, -1013850, 119505, 421716, -601087, -761434, -981451, 578789, 327632, -1097496, -534664, 259524, -795500, -397338, -720702, -462532, -1211563, -144425, -853160, -827239, -791875, -1561359, -280789, -1590890, -1671112, -1382904, -1040257, -651359, -740272, -864219, -520570, -559237, -902680, -1920607, -1419947, -1633209, -1269197, -733783, -406273, -513779, -1464222, -1088118, -1064325, -385134, 159135, -285128, -30835, -876708, -1284485, -1212270, -1195473, -1693294, -576250, -1105196, -1054132, -297983, -709738, -1076273, -472954, -267217, 122210, 366704, -66821, -178241, -24779, -397192, -1023466, -1420348, -905780, 87867, 652398, 63731, 570637]
2393E70637m84581n70144Q16906N58120j728814O76207j255715K36405k25593
2384a406572n59981P005p3817L68304J627614P13537o14817o49400J26211n1431
2374e13347O69870j51331K58745k38487k55074n57593l26422K14585M09860L55850
2364a33344n38745Q85828l21674M28692q85217q0340p1786m85126J16699J000863
2354h4150m70009N65105q07323O2439J157691k50131Q90K6843K32728m81349j75280
2343b22546O55206M0628L9734j104893p73898J261006n06565K34957J024642o30901
2333A7370n56145q65477K28033J8628Q76081M32617j14923k48868L68190p19406
2323e63900j51518m48407R4750L56223N66322p26874j68390l63122M14983J77405
$$ y = [570637, 86056, -484088, 332818, 890938, -837876, -161669, -1417384, -1180979, -1406572, -1966553, -1959548, -2033365, -1665061, -37447, 676090, 61273, -588127, -461916, -513347, 156523, 5192, 263937, 25450, -229624, -787217, -1113639, -899054, -489194, -133344, -672089, 213739, -107935, 320757, -564460, -644800, -716586, -1201712, -1085013, -84150, -554159, 10946, -796377, -733938, 423753, 173622, 174512, 201355, 434083, -47266, -222546, 432660, 473288, 513022, -591871, -1365769, -104763, -611328, -376371, 648271, 17370, -538775, -1404252, -1176219, -1157591, -281510, 151107, 36184, -212684, 155506, -563900, -715418, -1163825, -1069075, -712852, -146530, -873404, -1041794, -1404916, -989933, -812528]
2313h12528J320297O93905j744128L5351N48976R43070M62838k02669j267208
2304b2096k62087N14914q71173P63597M18200K1698q69827m76097k22244k7149
2294a032264Q14459M44746N38449k30974Q9415l02789p98617R60773k78718q51112
2284f46632J266060K69494j348968k5672K27951N57891O17932l62870j498162
2275i42976K1772K52054L31095L82240J92555P3787K33106j136444p21351O6195
2265a247967O71715J240735k60265j39134q15691q22856N40938N61002l09649
2256e81172k29126J09834l4970K69971O11839N41431O81867j033322j74426N58051
2246G19977r3823l92291m98987n5568n8375j169813P11156o3628L40549P12133
$$ y = [-812528, 507769, 1201674, -542454, -507103, 41873, 984943, 1447781, 1245112, -22096, -284183, 230731, -640442, 123155, 541355, 563053, -306774, -782871, -1005115, -1032264, -217805, 226941, 765390, 534416, 623831, 321042, -477575, 483198, 204480, -646632, 619428, 888922, -460046, -485718, -257767, 300124, 918056, 555186, -942976, -921204, -669150, -338055, 44185, 236740, 310527, 543633, -592811, -1314162, -1247967, -576252, 664483, 404218, 265084, -550607, -1373463, -832525, -271523, -581172, -810298, -700464, -735434, -465463, 146376, 687807, 1369674, 336352, 161926, 719977, 626154, 233863, -265124, -320692, -379067, -1548880, -837724, -901352, -560803, 151330]
2236A51330M77340P70400n07539j020582L51288q58470j54562m74031R41021M8369
2226b75436o83548L70084n16249o45614k27015K94197J557987m32187M7844k52922
2216g62859q52460Q67033J33716m62429K36390M5494R52564N0505q02162k8270
2206f22478Q28577L66736l96903q44091O60718n4092k10361k77877l56105k456
2196i08332R72603R17343r28661J54194p54157j057693J307274Q30361J6794K65185
2186H14911p71589K815k77797K38692M0504P5559O82377K07494j041849n87932
2176f16815L72962R45892q81871n44171M41187m2111k26678K33742M96146M48329
2166F26612J10518Q3333j80432j063768J22520P6701N72882l87013O95200M02010
$$ y = [151330, 628670, 1399070, 891531, -129051, 222237, -636233, -790795, -1264826, -323805, -275436, -958984, -588900, -1105149, -1750763, -1977778, -1683581, -125594, -557781, -509937, -762859, -1615319, -748286, -614570, -1076999, -840609, -795115, 157449, 207954, -594208, -622478, 206099, 572835, 175932, -668159, -7441, -61533, -271894, -549771, -905876, -908332, 64271, 981614, 52953, 207147, -547010, -1604703, -297429, 532932, 549726, 814911, 43322, 46137, -231660, 7032, 47536, 123095, 805472, 1012966, -28883, -616815, -243853, 702039, -179832, -724003, -282816, -324927, -551605, -317863, 178283, 626612, 737130, 820463, 640031, -423737, -301217, -224516, 348366, -38647, 656553, 1058563]
2156A058563K78549N33598J64772l80254n83466q55487L84072O3133Q103r26971
2146b55388N86657J569511r52715J4340O64812K51498r89400J18536M755o33184
2136C79422l21486O73366o10109L43063O1733L49181N39414m4373j053809O72111
2126I88513P08149L47281N50954n75775j164630Q42997O47715l54911l73658N02240
2116B118875Q99961j292824m6218l8489o53209M75991j10162Q76629M31283O98712
2106C360549K62920O82260o78763M16085J001704R1201O5573K56759M68643R63254
2096F890185K04079P47966R68544K080144K423399J773156M139311N018393O188309
2087C0433486P827734Q711348O985275J039954q639860j2805515q050132n861099
$$ y = [1058563, 1337112, 1870710, 2035482, 1655228, 1071762, 216275, 600347, 663480, 671583, -255388, 331269, 1900780, 948065, 962405, 1627217, 1878715, 889315, 1007851, 1012606, 379422, 57936, 731302, 121193, 464256, 525989, 875170, 1414584, 1370211, 316402, 988513, 1696662, 2043943, 2594897, 2019122, 854492, 1697489, 2345204, 1990293, 1616635, 2118875, 3018836, 1726012, 1679794, 1641305, 988096, 1464087, 1353925, 2230554, 2661837, 3360549, 3623469, 4305729, 3626966, 4043051, 5044755, 5135956, 5201529, 5458288, 5926931, 6890185, 7094264, 7842230, 8810774, 10890918, 13314317, 15087473, 19226784, 24245177, 30433486, 38261220, 46972568, 53957843, 54997797, 46357937, 33552422, 25502290, 19641191]
2079A9641191l967089k776635k557481j979360q70372p06194N61468j29546j710031
2070E505951k16972N01800m70350j687845m71826n31069N89498K17758r44856
2061B492089O48544r49904q05529R59821j37950p0557l59070l58672j50022k73687
2051I95063L42633L58520k46186k03968o37958K17508J58984O94488J88515J095703
2041B963302j400783j45124M08825j047315l72769j6738P99158l95708J67575
2032I60423M3749j124189k88546O00681J03500q44247N41829r0189P32194j097016
2022d61811q039l97291R23856L60826R2782n15208P64750k45443n75715Q96161
2012H34868M35741J835L31193r4844j538439N39263l94923N2516P25698j74939
$$ y = [19641191, 15674102, 12897467, 10339986, 8360626, 7490254, 6784060, 7345528, 7215982, 5505951, 5288979, 5790779, 5320429, 3632584, 3160758, 2629689, 3219187, 3436945, 2492089, 3140633, 2190729, 1385200, 2345021, 2207071, 2136514, 1777444, 1418772, 1268750, 995063, 1337696, 1696216, 1450030, 1246062, 608104, 825612, 984596, 1679084, 1867599, 2963302, 1562519, 1417395, 1826220, 778905, 406136, 389398, 1188556, 792848, 960423, 1004172, -120017, -408563, 192118, 295618, -548629, -6800, -96989, 635205, -461811, -469850, -867141, 56715, 417541, 510323, -4885, 759865, 514422, -61293, 834868, 1270609, 1272444, 1603637, 1508793, -29646, 509617, 114694, 167210, 892908, 717969]
2002G17969l38075l07542k27839J168375o76073p83447p8810o7579N3844J00838
1992d38339M61242P20826o01104j74813J495291j023740p44069L48277j25612
1983h2041o77041N05108K95683m39526j42658j13502O80303j02971L63261p45727
1973d59111J060080M33566r12871m49228m63926M80805P52061N33245n78165j058280
1963f61824k49783j09246N83738k0963r8335L47932N51956q35625O4239J436178
1953A008267p85374m24561q63134M45211J256221k36092P78119r02792p98018
1944e22153N94065J87045J106988k72854m42097p61782L03521k59170m34848Q00268
1934B98983q5581q70619R60560O01978j008476j18229J5105J140500o5903k73595
$$ y = [717969, 379894, 72352, -155487, 1012888, 336815, -446632, -525442, -593021, -539177, -438339, 22903, 743729, 142625, -32188, 1463103, 439363, -304706, 43571, -82041, -759082, -253974, 41709, -397817, -540475, -653977, 26326, -76645, 286616, -459111, 600969, 1034535, 121664, -327564, -791490, -310685, 441376, 974621, 396456, -661824, -911607, -1020853, -437115, -458078, -556413, -208481, 343475, -492150, -427911, 1008267, 222893, -201668, -1064802, -619591, 636630, 400538, 1178657, 275865, -522153, 71912, 258957, 1365945, 1093091, 650994, -110788, 192733, -66437, -501285, 298983, 213402, -657217, 303343, 905321, -103155, -221384, -206279, 934221, 868318, 594723]
1924E94723M21600L09862q68837o63564n30698Q72949m11369K0266q16337J196586
1914A25181L04268J51466J70360j440010M58772R501O82008m06379o25324j118881
1904a689038J89535J150459M778j20354J04482Q82904k95367N89453J01563m06523
1894E11892l97838k27237j96944J02270K09455L20670N34062K21860j160469p08080
1884g90359K71815K92727L25096J16161j244944Q87555J455532r43066L69609
1875G40126l10118k31765p76663Q78621Q42513l98655p54529L2750k70524M62627
1865B14383j16486l80044J014339l81996n19195R23217k31742j046026K35231
1856b88319k76433L41159m99946R05550r76841p47974K16281Q92330N63496P3955
$$ y = [594723, 1016323, 1326185, 457348, -206216, -736914, 136035, -275334, -255068, -1071405, 125181, 429449, 580915, 751275, -688735, -229963, -220462, 461546, 55167, -570157, -1689038, -1499503, -349044, -344266, -464620, -360138, 522766, 227399, 816852, 918415, 511892, 114054, -113183, -310127, -207857, 1598, 322268, 856330, 1078190, -82279, -790359, -518544, -225817, 99279, 215440, -1029504, -141949, 1313583, 370517, 740126, 430008, 198243, -578420, 300201, 1142714, 744059, -10470, 22280, -248244, 214383, 97897, -282147, 732192, 350196, -168999, 754218, 522476, -523550, -288319, -564752, -223593, -723539, 182011, -794830, -1542804, -1326523, -434193, 129303, 203258]
1846B03258N9604j525638N05867K07700M4849J96771O28875l39051L37363M14669
1836G34267J76998m57672n35724m43089J027675m21224j94650P89290l30048p96382
1826d50559o3481K63732k48031J456524J51515j596315l98227N79976k65174j435082
1816b005122J314807J246479L60976q14616j060787P27649j70495q22470J016077
1807b07502N20781j132311M72604m81459j65151J139842n917L59069r4544K39005
1797F44417j65239q6806M53029m08647K05078j071847p43975J108286J69282J55423
1787B59001l49101n74746O03810Q03562r84088M65863M07776n2438n42000j17064
1777g9425r6177M62403R31468n18476q24261j037632N13597k18515J13826j33693
$$ y = [203258, 262862, -1262776, -756909, -549209, -504360, -307589, 321286, -17765, 319598, 734267, 911265, 453593, -82131, -525220, 502455, 81231, -113419, 675871, 345823, -450559, -514040, -250308, -498339, 958185, 1109700, -486615, -884842, -304866, -570040, -2005122, -690315, 556164, 917140, 102524, -958263, -230614, -401109, -1223579, -207502, 313279, -819032, -346428, -827887, -993038, 146804, 140887, 499956, 405412, 644417, 479178, 392372, 845401, 436754, 641832, -430015, -1173990, -65704, 103578, 259001, -90100, -664846, -61036, 742526, -241562, 224301, 632077, 579639, 37639, -79425, -175602, 286801, 1218269, 699793, -124468, -1162100, -648503, -867018, -753192, -886885]
1767h86885K90253j014962K6330J479044M64042P64530j003750L14931K47704
1758F81237q12479n21046J021666j108j00713Q9819J07726j28170K4863J08583
1748D70378K97348m22214j617672J020741n86643l58315M57517R65251q7104n8811
1738H0476L97871O46805L61798j110237p03958K61638R77352j59817j73907R08012
1728A486033O64588q09255n4941P61651k60146p68304n87375o1350j58116N1371
1718B64156l72906N50399J03808k8192n29136m59510r9329N2075k63296N6330
1708g25601o5149l37686K24080J187047R8900p28493j022170L68691O96409N49792
1698B45820J349195n28626n93073j16344l22758N08682p46948N35065Q73993p71067
$$ y = [-886885, -596632, -1611594, -1585264, -106220, 357822, 1122352, 118602, 433533, 681237, -131242, -652288, 369378, 368270, 267557, 357376, 465102, 336932, 361795, 470378, 767726, 345512, -1272160, -251419, -838062, -1196377, -738860, 226391, 139287, 80476, 478347, 1125152, 1486950, 376713, -327245, -65607, 911745, 751928, 578021, 1486033, 2150621, 1341366, 1286425, 2048076, 1787930, 1019626, 432251, 370901, 212785, 264156, -108750, 441649, 545457, 517265, -11871, -471381, -570710, -518635, -781931, -725601, -790750, -1128436, -904356, 282691, 381591, -346902, -1369072, -1000381, -303972, 245820, 1595015, 1066389, 473316, 356972, 34214, 542896, -204052, 331013, 1205006, 433939]
1688D33939K09696n9510N48290L33567j619511n08153l83341M13076M11309J157662
1678I37024j581723j50422j4891p2830J48304n13427O40306Q12295J115203j141563
1668A78276n37986k22634j30607N42517J51349O37132P11055j320461l666m34587
1658d29612p102J24871m65041R31794O87318r12689J025551K54785j806032n2616
1648f48773J062246J20529n36040o41820N46408J285897l04427o39866k31473
1639A2681L34941Q68278j361332M25874r8764k08674O2572N49690r26524m95584
1629h36842O33889l69793M84071j52178L44251j19251o47881M47000J3639R7038
1619a06057K49509q83398R9703K62821M33557P56515j74596j021924J17524O03449
$$ y = [433939, 643635, 584125, 1132415, 1465982, -153529, -661682, -1045023, -631947, -220638, 937024, -644699, -795121, -810012, -882842, -734538, -1247965, -607659, 204636, 1319839, 178276, -359710, -582344, -712951, -170434, -19085, 618047, 1329102, 8641, 4975, -429612, -436714, -311843, -776884, 154910, 842228, -70461, 955090, 1209875, -596157, -648773, 413473, 534002, -2038, -643858, -97450, 1188447, 884020, 244154, 12681, 347622, 1215900, -145432, 280442, 181678, -26996, 35576, 585266, -341258, -836842, -202953, -572746, -88675, -240853, 103398, -15853, -663734, -216734, -203095, -106057, 143452, -739946, -640243, -377422, 56135, 812650, 638054, -383870, -266346, 337103]
1609C37103R20717n68807q62071P89998M4534M50749L80353M53661j106655j028742
1599a89160K95895r6925J46829L46070j18670j84475o24879k64423K92483Q93913
1589D96658n22981p00985J34759m68644l29950N91699J221300K81916m98439l71606
1579a66273m49478K84496N33256o2310j67276Q83791p02126J23183N59988j98943
1569F38308k46639J34824l00767n7396p14488j54737K13139N33781O36282n71361
1559A10946k8363L61289L6788j330994M07679Q37796K61065j743692o5039K97784
1549h54741L19103m74291J044369j01586n6472P68228l69554J23008m11975K90596
1539B76685k37959j00640P99269q54809l42321K08885o99799J94257J340409M5509
$$ y = [337103, 1257820, 689013, -173058, 616940, 661474, 1112223, 1492576, 1946237, 839582, -189160, 106735, 9810, 156639, 502709, 384039, 199564, -425315, -689738, -397255, 496658, -26323, -727308, -592549, -1061193, -1391143, -799444, 421856, 703772, 205333, -166273, -615751, -331255, 202001, 139691, -27585, 856206, 154080, 277263, 837251, 638308, 391669, 526493, 225726, 168330, -546158, -700895, -487756, 46025, 682307, 110946, 82583, 443872, 480660, -850334, -442655, 395141, 656206, -1087486, -1152525, -854741, -535638, -1009929, 34440, -67146, -123618, 644610, 275056, 398064, -13911, 276685, 38726, -61914, 737355, -117454, -459775, -250890, -950689, -756432, 583977, 629486]
1529F29486k69218R17288K99255J41713j72366j071442r72047P48449L10219j477321
1519i15984j98529K17841m6012N79710l00695K94574P87182o15404J79370Q777
1509i170k54017n72135K98533O78453k77088m6594K38049j061310j70101L2075
1499a143305O29568r4326Q07093O34223o90771o94366j40936q2252q01535L84015
1489a192592N54255P16006Q18943k71667l39384j71120p77574N20701N24981M21395
1479H03944j049272J03501M19781Q92243l97292r17429L622l38298k56112P29693
1469e619p2073j12225r46501N24118K60453J026387m45756m76064j94235K16590
1459b24925k54386l85411J185948N4103O01020r45597l03206L24923L56925J40407
$$ y = [629486, 360268, 1277556, 1576811, 1718524, 1546158, 474716, -497331, 251118, 561337, -915984, -1114513, -896672, -942684, -362974, -663669, -369095, 418087, -197317, -17947, -9170, -263187, -835322, -536789, 141664, -135424, -182018, 56031, -1005279, -1175380, -1143305, -513737, -608063, 199030, 833253, 142482, -551884, -692820, -775072, -1576607, -1192592, -638337, 77669, 896612, 624945, 285561, 114441, -663133, -142432, 382549, 803944, -245328, -141827, 277954, 1170197, 772905, -144524, -140902, -479200, -735312, -5619, -77692, -189917, -1136418, -612300, -351847, 674540, 228784, -247280, -441515, -224925, -479311, -864722, 321226, 375329, 976349, 30752, -272454, 52469, 409394, 549801]
1449E49801J42068q65112m79981N99244l9921n22411M63413j005900P29822J349863
1439I20886o18377J13295n36307k08377J466951p05583p92784K13319l88798P76470
1429B40695K58057l43124O44218o65034M0744l32086j03716j1155j0685K18177
1419f3909l16364L65047N20924j02463j00585k26631P16611n85612m53583o49056
1409h95621m6818P6919M41243J029654n35718L67156n97264N33360N35741o07064
1399C01588P70462m77432q21905Q88264q24675K94132m21450M69763k72184q83057
1389i76494J050228M80173m62215l87634o84694K14023j74319P99879J36580L04111
1379B99638J25167q13063o79795P35260Q48009q16136j39126P89950M83300J94575
$$ y = [549801, 691869, -173243, -653224, -53980, -93901, -616312, -152899, -1158799, -428977, 920886, 302509, 415804, -120503, -328880, 1138071, 432488, -360296, -146977, -535775, 240695, 498752, 155628, 799846, 134812, 175556, -156530, -260246, -271401, -282086, -63909, -380273, -15226, 505698, 403235, 302650, 76019, 792630, 207018, -246565, -895621, -942439, -865520, -424277, 605377, 69659, 436815, -160449, 372911, 908652, 301588, 1072050, 594618, -227287, 660977, -163698, 130434, -291016, 178747, -93437, -976494, 73734, 553907, 91692, -295942, -980636, -766613, -940932, -141053, -4473, 299638, 424805, -388258, -1068053, -332793, 515216, -300920, -440046, 349904, 833204, 1027779]
1369A027779j404111J72425N07540j010724L79279m72111L57928k66906L36555
1360c72346J63803N93282O7251m02784L94455P20718l26616j437634R06417O55910
1350I62456j82071N91476o39309M71099j069552o48916L05198R45926k58489K54046
1340G31864J43127j59018m08620j99738O79852o58677n2774j5928j45847K49264
1330A63505Q60407N55427q47881l06603M21840o29792l52958q78543L92282l87005
1320a009321J161176J16188K67567o2126k05614j53656m26029k03826J66770P67659
1310D18788m09751j175446j84996J238911M8963K23402l65141K39972p91320j78677
1300i35295Q21274n43327M40665K8209J91905P24391n35496j142168J237993k17576
$$ y = [1027779, -376332, -203907, 303633, -707091, -327812, -799923, -441995, -708901, -372346, -208543, 384739, 451990, 49206, 443661, 1164379, 837763, -599871, 306546, 962456, 780385, 1371861, 732552, 1203651, 134099, -514817, -209619, 736307, 477818, 731864, 874991, 715973, 307353, 107615, 787467, 128790, 76016, 60088, -85759, 163505, 1023912, 1579339, 731458, 424855, 846695, 216903, -136055, -1014598, -622316, -1009321, 151855, 268043, 535610, 473484, 267870, 114214, -311815, -515641, -348871, 418788, 9037, -1166409, -1351405, -112494, -63531, 159871, -205270, 34702, -756618, -935295, -114021, -657348, -216683, -188474, 3431, 727822, 192326, -949842, 288151, 70575]
1290G0575j004230R86606L28653n79392q90087N51640J133255P76585k80759n39695
$$ y = [70575, -933655, 52951, 381604, -197788, -1087875, -536235, 597020, 1373605, 1092846, 553151]
$$ [...]
##END NTUPLES=NMR SPECTRUM
##END=
