##TITLE=1H_TG-2358
 CDCl3
 8 sc, 
 28.09.2022
##JCAMPDX= 6.0         $$ Bruker NMR JCAMP-DX V2.0
##DATA TYPE= NMR SPECTRUM
##DATA CLASS= NTUPLES
##ORIGIN= UXNMR, Bruker Analytische Messtechnik GmbH
##OWNER= root
$$ XWIN-NMR		Version 3.5
$$ Wed Sep 28 14:03:45 2022 Russian Standard Time (UT+4h)  she@DPX200
##.OBSERVE FREQUENCY= 200.1313499994
##.OBSERVE NUCLEUS= ^1H
##.ACQUISITION MODE= SIMULTANEOUS
##.ACQUISITION SCHEME= undefined
##.AVERAGES= 8
##.DIGITISER RES= 18
##SPECTROMETER/DATA SYSTEM= spect
##.PULSE SEQUENCE= zg30
##.SOLVENT NAME= CDCl3
##.SHIFT REFERENCE= (INTERNAL, CDCl3, 0, 15.7766)
##AUDIT TRAIL= $$ (NUMBER, WHEN, WHO, WHERE, WHAT)
$$ ##TITLE= Audit trail, XWIN-NMR		Version 3.5
$$ ##JCAMPDX= 5.01
$$ ##ORIGIN= Bruker BioSpin GmbH
$$ ##OWNER= she
$$ F:/spectra/data/she/nmr/H-F/1/pdata/1/auditp.txt
$$ ##AUDIT TRAIL=  $$ (NUMBER, WHEN, WHO, WHERE, WHAT)
(   1,<2022-09-28 14:02:29.43 +0400>,<she>,<DPX200>,
      <created by zg, POWCHK disabled, PULCHK disabled
       configuration hash MD5:
       00 E9 B6 7A A2 85 ED C7 34 08 36 98 17 FE 4E 26
       data hash MD5: 16K
       54 0D C4 CF B8 8F 34 8C 5A B9 85 2B 33 23 AF B7>)
(   2,<2022-09-28 14:02:32.32 +0400>,<she>,<DPX200>,
      <Start of raw data processing
       efp BC_mod = 2 LB = 0.24 FT_mod = 6 PKNL = 1 PHC0 = -18032.33 PHC1 = 8.600689 SI = 16K 
       data hash MD5: 16K
       0A DE 0B D8 6E 49 1A E5 22 0A 89 9C 3F CA 26 B7>)
(   3,<2022-09-28 14:02:56.01 +0400>,<she>,<DPX200>,
      <pk PHC0 = 0.1813213 PHC1 = -0.2 
       data hash MD5: 16K
       1A 57 E6 A5 44 22 99 74 61 9B 7B 03 60 D6 9E 22>)
(   4,<2022-09-28 14:02:59.54 +0400>,<she>,<DPX200>,
      <abs ABSG = 5 
       data hash MD5: 16K
       03 64 1C B0 03 8A 19 96 DA 2C 6E FB B0 B7 B7 67>)
$$ ##END=
$$ 
$$ hash MD5
$$ 6E 75 01 AF 44 CC CC DE 8E 9D DF 6B 33 EC 90 E6
##$RELAX= 
##$RELAX= 
##$RELAX= 
##$RELAX= 
##$RELAX= 
##$RELAX= 
$$ Bruker specific parameters
$$ --------------------------
##$DU= <F:/spectra>
##$EXPNO= 1
##$NAME= <H-F>
##$PROCNO= 1
##$TYPE= <nmr>
##$USER= <she>
##$AMP= (0..31)
100 100 100 100 100 100 100 100 100 100 100 100 100 100 100 100 100 100 
100 100 100 100 100 100 100 100 100 100 100 100 100 100 
##$AQSEQ= 0
##$AQ_mod= 1
##$AUNM= <au_zg>
##$AUTOPOS= <>
##$BF1= 200.13
##$BF2= 200.13
##$BF3= 200.13
##$BF4= 200.13
##$BF5= 200.13
##$BF6= 200.13
##$BF7= 200.13
##$BF8= 200.13
##$BYTORDA= 1
##$CFDGTYP= 0
##$CFRGTYP= 5
##$CHEMSTR= <none>
##$CNST= (0..31)
1 1 145 1 1 1 1 1 1 1 1 1 1 1 1 1 1 1 1 1 1 1 1 1 1 1 1 1 1 1 1 1 
##$CPDPRG= <>
##$CPDPRG1= <>
##$CPDPRG2= <>
##$CPDPRG3= <>
##$CPDPRG4= <mlev>
##$CPDPRG5= <mlev>
##$CPDPRG6= <mlev>
##$CPDPRG7= <mlev>
##$CPDPRG8= <mlev>
##$CPDPRGB= <>
##$CPDPRGT= <>
##$D= (0..31)
0 1.2 0 0 0 0 0 0 0 0.06 0 0.03 0 0 0 0 0.0002 0 0 0 0 0 0 0 0 0 0 0 0 
0 0 0 
##$DATE= 1664359348
##$DBL= (0..7)
120 120 120 120 120 120 120 120 
##$DBP= (0..7)
150 150 150 150 150 150 150 150 
##$DBP07= 0
##$DBPNAM0= <>
##$DBPNAM1= <>
##$DBPNAM2= <>
##$DBPNAM3= <>
##$DBPNAM4= <>
$$ [...]
##$SUBNAM3= <"">
##$SUBNAM4= <"">
##$SUBNAM5= <"">
##$SUBNAM6= <"">
##$SUBNAM7= <"">
##$SUBNAM8= <"">
##$SUBNAM9= <"">
##$SW= 18.0517283424941
##$SWIBOX= (0..15)
0 0 2 0 0 0 0 0 0 0 0 0 0 0 0 0 
##$SW_h= 3612.71676300578
##$TD= 16384
##$TD0= 1
##$TE= 0
##$TE2= 300
##$TE3= 300
##$TEG= 300
##$TL= (0..7)
0 120 120 120 120 120 120 120 
##$TP= (0..7)
150 150 150 150 150 150 150 150 
##$TP07= 0
##$TPNAME0= <>
##$TPNAME1= <>
##$TPNAME2= <>
##$TPNAME3= <>
##$TPNAME4= <>
##$TPNAME5= <>
##$TPNAME6= <>
##$TPNAME7= <>
##$TPOAL= (0..7)
0.5 0.5 0.5 0.5 0.5 0.5 0.5 0.5 
##$TPOFFS= (0..7)
0 0 0 0 0 0 0 0 
##$TUNHIN= 0
##$TUNHOUT= 0
##$TUNXOUT= 0
##$USERA1= <user>
##$USERA2= <user>
##$USERA3= <user>
##$USERA4= <user>
##$USERA5= <user>
##$V9= 5
##$VALIST= <valist>
##$VCLIST= <CCCCCCCCCCCCCCC>
##$VD= 0
##$VDLIST= <DDDDDDDDDDDDDDD>
##$VPLIST= <PPPPPPPPPPPPPPP>
##$VTLIST= <TTTTTTTTTTTTTTT>
##$WBST= 1024
##$WBSW= 4
##$XGAIN= (0..3)
0 0 0 0 
##$XL= 0
##$YL= 0
##$YMAX_a= 719803
##$YMIN_a= -953855
##$ZGOPTNS= <>
##$ZL1= 120
##$ZL2= 120
##$ZL3= 120
##$ZL4= 120
##$ABSF1= 15.75681
##$ABSF2= -2.295039
##$ABSG= 5
##$ABSL= 3
##$ALPHA= 0
##$AQORDER= 0
##$ASSFAC= 0
##$ASSFACI= 0
##$ASSFACX= 0
##$ASSWID= 0
##$AUNMP= <proc_1d>
##$AZFE= 0.1
##$AZFW= 0.1
##$BCFW= 0
##$BC_mod= 2
##$BYTORDP= 0
##$COROFFS= 0
##$CY= -3
##$DATMOD= 1
##$DC= 0
##$DFILT= <>
##$DTYPP= 0
##$F1P= 0
##$F2P= 0
##$FCOR= 1
##$FTSIZE= 16384
##$FT_mod= 6
##$GAMMA= 0
##$GB= 0
##$INTBC= 1
##$INTSCL= 3.70164e-10
##$ISEN= 128
##$LB= 0.24
##$LEV0= 0
##$LPBIN= 0
##$MAXI= 10000
##$MC2= 0
##$MEAN= 0
##$ME_mod= 0
##$MI= 1.114404
##$NCOEF= 0
##$NC_proc= -5
##$NLEV= 6
##$NOISF1= 3.799351
##$NOISF2= 2.8
##$NSP= 0
##$NTH_PI= 0
##$NZP= 0
##$OFFSET= 15.77664
##$PC= 1
##$PHC0= -18032.15
##$PHC1= 8.400689
##$PH_mod= 1
##$PKNL= yes
##$PPARMOD= 0
##$PSCAL= 0
##$PSIGN= 0
##$REVERSE= no
##$SF= 200.129998979414
##$SI= 16384
##$SIGF1= 3
##$SIGF2= 2
##$SINO= 5.538805
##$SIOLD= 16384
##$SREGLST= <1H.CDCl3>
##$SSB= 0
##$STSI= 16384
##$STSR= 0
##$SW_p= 3612.71676300578
##$SYMM= 0
##$S_DEV= 0
##$TDeff= 16384
##$TDoff= 0
##$TI= <>
##$TILT= no
##$TM1= 0
##$TM2= 0
##$TOPLEV= 0
##$USERP1= <user>
##$USERP2= <user>
##$USERP3= <user>
##$USERP4= <user>
##$USERP5= <user>
##$WDW= 1
##$XDIM= 16384
##$YMAX_p= 312816697
##$YMIN_p= -274167
$$ End of Bruker specific parameters
$$ ---------------------------------
##NTUPLES= NMR SPECTRUM
##VAR_NAME=  FREQUENCY,     SPECTRUM/REAL,   SPECTRUM/IMAG
##SYMBOL=    X,             R,               I
##VAR_TYPE=  INDEPENDENT,   DEPENDENT,       DEPENDENT
##VAR_FORM=  AFFN,          ASDF,            ASDF
##VAR_DIM=   16384,         16384,           16384
##UNITS=     HZ,            ARBITRARY UNITS, ARBITRARY UNITS
##FACTOR=    0.220516191357247, 1,           1
##FIRST=     3157.37893476147, 0,            0
##LAST=      -455.337828244313, 0,           0
##MIN=       -455.337828244313, -274167,     0
##MAX=       3157.37893476147, 312816697,    0
$$ Real data points
##PAGE= N=1
##DATA TABLE= (X++(R..R)), XYDATA
$$ [...]
7915B6752o4516J22807M1420O083j6987L9720O8303p729q1991K4909j14968O4240
7903A08043J33147m2294P894J3305M7769J7184j0759o6088K2512k3406P4313K1239
7891C02859j05598j8604R0754q050m7453O6004K3578n1998l0423L4369M0620o6621
7879B29437j6340P8492K6668q6157K1956J7037j07063J2846P9875l0315j8447
7868B07989j09946k001R1333J2605n9032m414J3646l815J5741J8305O5713r6693
7856A49431q0462o937J1101m54P6824L5205m3149q1576j1032k4435p4160M7507
7844b137k3066O8583o750J972o9467L5666K299n4285o3802q483Q5106o6930M5361
7831e5933N7515q3763J9511o5271M8332K2434O893P5386Q1746q194r9662l4337
$$ y = [26752, -37764, 85043, 126463, 132546, 115559, 155279, 223582, 215853, 133862, 158771, 43803, 108043, 241190, 198896, 206790, 220095, 267864, 285048, 274289, 208201, 230713, 207307, 281620, 302859, 197261, 178657, 269411, 261361, 213908, 279912, 303490, 251492, 221069, 255438, 296058, 229437, 213097, 291589, 318257, 232100, 254056, 271093, 164030, 176876, 256751, 226436, 207989, 98043, 96042, 187375, 199980, 140948, 136534, 150180, 146365, 162106, 180411, 246124, 149431, 68969, 62032, 73133, 72679, 149503, 184708, 141559, 59983, 48951, 24516, -49644, -2137, -25203, 43380, 36630, 38602, -30865, 4801, 7100, -47185, -110987, -119470, -34364, -101294, -55933, 1582, -82181, -62670, -127941, -79609, -57175, -50282, 25104, 106850, 98656, -1006, -35343]
7819c5343M6269L1824j7350m2760J5074o3239n0751O6581o8688r6038J19751N6309
7807c8361q3273M863M8617N0115n3172M6752M0061n5142k5253K1163J8673o411
7795c1368j25229M585J9538k2026R1264l637m6375K0472j9552P1327j8409k1630
7783h1040k9394L3202O914J2244K2503k5484q8025K477L5415O2668l1395j11064
7771a90979J1800L1666l448J9320O1835j1074j6870j9456n8794N2315M1359j695
7759h4021n5159o679L579m3431N2239J2752k1664m2969L6993m7461p2282J27259
7747a40844L7032r745k1448L3386m3063K7667L0339j0020o0154J1621J2817q492
7735a40904O1596J461K548n8634m7766k3405N9949M9249M2817q5221j3583l4580
$$ y = [-35343, 10926, 42750, 25400, -17360, -2286, -65525, -116276, -49695, -118383, -214421, -94670, -38361, -121634, -116771, -68154, -18039, -71211, -24459, 15602, -39540, -64793, -43630, -24957, -31368, -156597, -152012, -132474, -154500, -63236, -66873, -113248, -92776, -112328, -41001, -59410, -81040, -110434, -77232, -70318, -58074, -35571, -61055, -149080, -146603, -111188, -48520, -79915, -190979, -179179, -147513, -150961, -131641, -69806, -80880, -97750, -117206, -176000, -123685, -82326, -84021, -139180, -145859, -142280, -185711, -133472, -120720, -142384, -185353, -148360, -195821, -268103, -140844, -103812, -113557, -135005, -101619, -144682, -117015, -86676, -96696, -156850, -145229, -132412, -140904, -79308, -77847, -75299, -133933, -181699, -205104, -145155, -95906, -53089, -138310, -151893, -186473]
7723a86473l0563j2864K3633P3438p468k2931N7283j7174j0570l7512J6851m35
7711a54785k2936j0016m8863l7567M5843J22461m1137K2854n2138k4676J5395
7700a85565l3758K0877j0094O3398J1764J7827m6968k1323l7296j9584Q5109L6152
7688a19461j2631J8104p0571n79L799M5370j5013m215J2279J6721L9411o1028
7676a47814M9279k2463n1487P7900K9763q4954m2968L3383k0981m6914J02450
7665a24806r5633O9552K2446K5754o3461l8502Q779N3732J0839k0953L9141n4881
7653a67993l3130J11715o8725L670J01676n4934N1768k0948n9244m3389K7451
7642a52083p446O893n3465J37110L0895p1333J2921k3226q3469L375P4075K1686
$$ y = [-186473, -217036, -229900, -206267, -132829, -140297, -163228, -105945, -123119, -133689, -171201, -154350, -154785, -177721, -187737, -236600, -274167, -228324, -105863, -147000, -124146, -176284, -200960, -185565, -219323, -198446, -208540, -145142, -133378, -115551, -162519, -183842, -221138, -240722, -155613, -119461, -132092, -113988, -184559, -185138, -181339, -135969, -150982, -155197, -142918, -126197, -86786, -147814, -98535, -120998, -172485, -94585, -64822, -149776, -192744, -159361, -180342, -227256, -124806, -220439, -150887, -128441, -102687, -166148, -204650, -195871, -142139, -131300, -152253, -113112, -167993, -201123, -89408, -158133, -154463, -52787, -107721, -55953, -76901, -136145, -179534, -152083, -159529, -152636, -206101, -68991, -38096, -109429, -96508, -119734, -203203, -199828, -125753, -104067]
7630a04067m2420m616l03L8749Q00k6681K150p723L619l869J0689j9095j3109
7617a65876K0243R719N4348L9436r3848K2865J0353k0743N284l2058l8842L3674
7605a55445M1484k3058M697m7168M6289L9972k7896n2390M4199j541n0348M8927
7593a32278L220O251M1527p0156M911l8820l3838O2437l752o9416P0837R7302
7581f1775q1382j0373l8783k189L6187o0218L2312N3781L2677p4390j4632O5959
7569a22826k8413p256L3194L3574q1346J9989L2202M6768p530l4008o6491p7067
7557b59210J01299l125q4457O2655k9198O2625N6305n8006k1032k9619P2982k912
7545a31693r9408j1065J11635L6657m2600K9308J4167m1026k9855n4528l2124
$$ y = [-104067, -146487, -151103, -151406, -112657, -111857, -138538, -136388, -144111, -140492, -144361, -133672, -152767, -165876, -145633, -135914, -81566, -42130, -135978, -113113, -102760, -123503, -118219, -150277, -189119, -155445, -113961, -137019, -132322, -179490, -133201, -93229, -121125, -173515, -129316, -130857, -181205, -132278, -129058, -122807, -81280, -151436, -146525, -185345, -219183, -156746, -160498, -229914, -159077, -61775, -143157, -153530, -192313, -194502, -158315, -218533, -186221, -132440, -99763, -174153, -188785, -122826, -151239, -158495, -125301, -91727, -173073, -153084, -120882, -74114, -81644, -115652, -182143, -259210, -157911, -161036, -245493, -182838, -212036, -149411, -93106, -151112, -172144, -201763, -128781, -131693, -231101, -242166, -130531, -93874, -136474, -107166, -92999, -134025, -163880, -218408, -250532]
7534b50532k2860J7416J10981O3836j9011l8674l2816R584m8171j3411j1453r3
7522b35204M6712J5885l726L1432M0031n4945j2384n1939O7596m4320j9171o171
7510b26204k4839J9448j3372J08705K084j2606N1017n8053K9629L0766N2679l7673
7498g8419l2825k3633l4951O9182j5655M0269o0086k3762j513k9763J2224r382
7486a88314P203L8134k5096l628k2683O6897j3862L7299L2589n1816l1895k2238
7474a77410J04350J0587P83k8488k5617M5526K9012k7784L1164Q304L0546l2625
7462c1652m5073N373j8548M5861k3465m4085N3838o019M6852Q85m904m3149o0813
7449a24899k6153P1038n2539k5044O0484O3552k2968o8490N9432n7106k8833J1708
$$ y = [-250532, -273392, -255976, -144995, -81159, -100170, -138844, -171660, -162076, -210247, -223658, -235111, -235204, -188492, -172607, -176333, -144901, -104870, -159815, -172199, -224138, -156542, -200862, -220033, -226204, -251043, -231595, -244967, -136262, -134178, -146784, -95767, -153820, -124191, -93425, -40746, -78419, -111244, -134877, -169828, -100646, -116301, -76032, -136118, -159880, -161393, -191156, -178932, -188314, -181111, -142977, -168073, -171701, -194384, -127487, -141349, -104050, -71461, -123277, -155172, -177410, -73060, -62473, -61690, -90178, -115795, -70269, -41257, -69041, -37877, -29573, 973, -31652, -76725, -71352, -89900, -44039, -67504, -111589, -57751, -63770, -16918, -16033, -20937, -64086, -124899, -151052, -80014, -132553, -157597, -97113, -33561, -56529, -125019, -65587, -122693, -151526, -139818]
7437a39818j8054m8589l0059l646L7436Q3702R3117q3407n8999L1908k1247K2625
7425a35031j4853N6659Q323p1950j9m4717j298L4395L6900q09l8845O5028K6433
7412g9784k2983n507m2333P981J6248k3713l1138L3227N4527r236j7355n314q0849
7399b06229L1231M8641M5671K0408q444j5041J6243p5431M66K2044O2281o4171
7387a22331K3767k7765K044N034J9821k4601p5016P1296K4463N0909j3338p2325
7375a38042j0947L2239L8276L0874l7740J5299J5961L309n7884O6819q418J7445
7363c2809r035m1066l7293m9160P9518M0514j681l9282Q4198m1669q1386K400
7351a26751j266p355n2172L6421n98k8442P063p496l2264L6107j6029P2345m7376
$$ y = [-139818, -157872, -206461, -236520, -240166, -202730, -119028, -25911, -109318, -168317, -136409, -157656, -135031, -149884, -93225, -84902, -156852, -156871, -201588, -202886, -168491, -131591, -132400, -171245, -106217, -79784, -102767, -108274, -150607, -142626, -126378, -150091, -181229, -148002, -93475, -102711, -120066, -125380, -206229, -174998, -126357, -80686, -60278, -68722, -83763, -67520, -142951, -142485, -120441, -58160, -122331, -98564, -126329, -124285, -119251, -99430, -124031, -199047, -127751, -103288, -52379, -65717, -138042, -148989, -116750, -78474, -47600, -85340, -70041, -54080, -50771, -108655, -41836, -50254, -32809, -41844, -82910, -120203, -169363, -89845, -49331, -51012, -90294, -6096, -47765, -129151, -126751, -128017, -135372, -187544, -151123, -151721, -180163, -173100, -180596, -212860, -176753, -192782, -120437, -167813]
7338a67813L8378K5979M164k9219p832O6067N4471l8598l4688j0803q2041Q408
7326a73527L8948O3492l902J523K5869P4234n3589j4059m8844L36r3122J7015
7314a65626P1547O765k8758r3169J07862M4094q0183j4499M7462R287o0966O3542
7302i2642n2276k7556M7883L079j6183k8441Q394P3828J5248J3512M0968n9223
7290g3409n4994K3999K976j18804O6182P1582N095k7557j3631j8424p710k3071
7278a67766L9378K0607l237o556L2072q7138q86L5541j3617J774K3426m4829O0622
7265a10609P3051J9849j1497O95k566o3837m7520l161k531m536M7638J17070p1323
7252e9277m4263J1911K5712l3037o088M741N7090K3328n5429p8960o8301J14495
$$ y = [-167813, -129435, -103456, -99292, -128511, -136343, -70276, -15805, -54403, -89091, -99894, -181935, -173527, -134579, -71087, -74989, -73466, -47597, 26637, -26952, -41011, -89855, -89519, -182641, -165626, -94079, -87314, -116072, -209241, -101379, -57285, -137468, -151967, -104505, -95218, -156184, -92642, -144918, -172474, -124591, -121512, -137695, -166136, -157742, -83914, -68666, -55154, -14186, -73409, -128403, -104404, -101428, -220232, -154050, -82468, -77373, -104930, -118561, -136985, -144695, -167766, -128388, -107781, -111018, -117574, -85502, -172640, -173526, -137985, -151602, -149828, -126402, -171231, -110609, -37558, -17709, -29206, -28511, -31077, -94914, -142434, -145595, -148126, -152662, -105024, 12046, -59277, -103540, -91629, -65917, -98954, -105042, -100301, -43211, -19883, -75312, -154272, -222573, -108078]
7240a08078J8436m6322J0177l8512l2775Q5563O7062j5760j38319K944P8374k8046
7228a45256J582L3262k4412M1676k6846k1630K9427J3184q796O6955J6301M0138
7216A5585j39929l4726l5443P7568N5630J7838m9515l0094R5174K0089o2271k7462
7204i7556K1290j9278L9201L0866j2455p3038J3409Q886n3191j3224j6622n628
7192a77340N7232J7445J367J5562j9452L1047L5802K5466k8972l3594n4906L7644
7180i2699M4206j1115m121j9821j6241J38832o1574K6467J31019m5062l5020j16138
7168f1267K9997M366J4117N4960j8563K2130k1717m2327J5413M469J8384n3685
7156c3723P7604N5667J4858o0840n5066k2594N0291j7701j8347m9942J17314O6618
$$ y = [-108078, -89642, -135964, -125787, -164299, -197074, -111511, -44449, -60209, -198528, -195584, -117210, -145256, -143674, -110412, -134824, -93148, -119994, -141624, -112197, -99013, -107809, -40854, -24553, 15585, -124344, -159070, -194513, -116945, -61315, -43477, -92992, -123086, -27912, -7823, -70094, -97556, -76266, -95544, -56343, -25477, -37932, -110970, -97561, -88675, -141866, -155090, -171712, -177340, -120108, -102663, -101296, -85734, -105186, -74139, -38337, -12871, -41843, -75437, -130343, -92699, -48493, -59608, -63729, -83550, -99791, 39041, -22533, 3934, 134953, 89891, 54871, -61267, -31270, -26904, -12787, 42173, 23610, 45740, 24023, -18304, -2891, 1578, 19962, -33723, 43881, 99548, 114406, 53566, -1500, -24094, 26197, 8496, -9851, -59793, 57521, 124139]
7144A24139m5436m9847O5053M6511j7523o1190L7852O0020l1417m9817O524L6084
7132A20953m8932K2732P1891J14360R843p1535K4120R8604o3843m5538k8877q0489
7120A23289j3374Q5611L015J06961L1339J256Q7408l143r4532N9512L1030k6119
7108C92253J4135Q2296L0898K6480R037J7409j8239P2074J61835l1783n3005j441
7096G01949J14992K4644O1041K2728J6931N7057P444L1966J7518M4190O0181J21448
7084A282089J21365J99280J48488N1863J0884J84601J65610K47600K36949J77906
7074B826635L61703L78952M17034M51958O21916P52343N67433N77570K48599Q1883
7064G286026O425r7208o8646P2954L63350N52369O96697M52603P7460l19484o40847
$$ y = [124139, 78703, 28856, 93909, 140420, 122897, 61707, 99559, 159579, 128162, 78345, 84869, 120953, 72021, 94753, 166644, 281004, 290847, 219312, 243432, 342036, 278193, 232655, 203778, 123289, 109915, 195526, 198541, 305502, 336841, 338097, 425505, 422362, 327830, 387342, 418372, 392253, 406388, 488684, 519582, 546062, 555099, 572508, 554269, 626343, 788178, 756395, 703390, 701949, 816941, 841585, 902626, 925354, 942285, 999342, 1006786, 1038752, 1056270, 1100460, 1160641, 1282089, 1403454, 1602734, 1751222, 1803085, 1813969, 1998570, 2164180, 2411780, 2648729, 2826635, 3188338, 3567290, 3984324, 4436282, 5058198, 5810541, 6377974, 6955544, 7204143, 7286026, 7292451, 7195243, 7126597, 7199551, 7562901, 8115270, 8811967, 9264570, 9342030, 9022546, 8381699]
7053H381699r30486r15525r36589p54693o88233m73499m26099k75316j69132j47762
7043B664365p2350j33514n6120q8157P895m6761p5323m58j9193N2004L7644L8902
7031B308934N4204J03775K14055K24488K26627L01006L21066L31726N25393O60292
7021E271566O88929Q83094Q85066P49755L02189j67312o08497r61344j097777
7012E945669q87471q55302o16037m56506m38130l48554j90512k27294j60149q2967
7002A682747l7794j01971r1936j28690j22528j12030r5855m7694r7112m3655J3627
6991H17109o620r9534k7416n4307K108J7788j0494l3826l5271n1029m4546j9908
6979D54054k3543n8785K7239q8818o1795k7374P2159l3147K6696J1137N9095j0406
$$ y = [8381699, 7451213, 6535688, 5599099, 4844406, 4156173, 3682674, 3256575, 2981259, 2812127, 2664365, 2592015, 2458501, 2402381, 2314224, 2322119, 2275358, 2200035, 2199577, 2180384, 2232388, 2270032, 2308934, 2363138, 2466913, 2680968, 2905456, 3132083, 3433089, 3754155, 4085881, 4611274, 5271566, 5960495, 6843589, 7728655, 8478410, 8780599, 8613287, 8004790, 7043446, 5945669, 5058198, 4202896, 3586859, 3130353, 2692223, 2343669, 2153157, 1925863, 1765714, 1682747, 1644953, 1542982, 1451046, 1322356, 1199828, 1087798, 991943, 944249, 847137, 803482, 817109, 810489, 710955, 683539, 629232, 631340, 649128, 638634, 604808, 569537, 518508, 473962, 454054, 430511, 371726, 398965, 310147, 248352, 220978, 293137, 259990, 286686, 297823, 356918, 346512]
6967C46512N0908n9433k2897R619k8091l2762L0003N4873p8155k4596J1872k9669
6955B28184P3025k7801n4874J1666k2521M0108L5182l5847k3341n3001p334M549
6943A67995N0646L1963n8110m3587J5159K5982o330k630o1444k9636J14058j666
6931B02400l2930L1333m4311l0500P55K0450o0712O4432J6943k6532j0496N3701
6919A84533J9692M6657m3903r1686o671N0849J8538l0717l230r2688l962J7468
6907F4880j027k1008O8243J08070j6977k0514P491k6653O223R7523L3975j58855
6895A41371k7331O9863L3767l6032m0914L1593L3632m4311m8418R9722P1566m4267
6883B40241m0958Q4727Q8083n5153m3111R4609K3821K8977L0530J25892K9596
$$ y = [346512, 397420, 337987, 315090, 324709, 296618, 263856, 293859, 348732, 270577, 245981, 257853, 228184, 301209, 273408, 218534, 230200, 207679, 247787, 282969, 247122, 223781, 170780, 163446, 167995, 218641, 250604, 192494, 148907, 164066, 190048, 183718, 181088, 119644, 90008, 204066, 202400, 169470, 200803, 156492, 125992, 126747, 147197, 86485, 150917, 167860, 141328, 130832, 184533, 204225, 250882, 206979, 115293, 108622, 159471, 178009, 147292, 144062, 51374, 47412, 64880, 63853, 42845, 111088, 219158, 202181, 181667, 189158, 162505, 168728, 266251, 300226, 141371, 114040, 183903, 217670, 181638, 140724, 172317, 205949, 161638, 113220, 212942, 284508, 240241, 199283, 284010, 372093, 316940, 273829, 368438, 392259, 421236, 451766, 577658, 607254]
6872F07254J07257N0900Q5437J43970L5212r8140o7102j01553q4840n6395p9222
6861E42778N8333Q4738l920P595K5492N3498P4154P2713J09072K8162P660J72888
6849A233163O7794L9606Q3452q151O8470K4177k6475r6705j05618r7593m4263
6838A137857q7335j05837j34782o6307l1181j47046l0697N339r7550n4889q412
6827C79160j3339m072j10536m2465O0338J7660p4613j5487P4997L1464r7119l2549
6815A73439O3549L4419k5386q6235M0149M4347l8815J578M4628k7002n8067K6781
6803A93385l4627m912P5733q163n4187k0729O4904r297l4066j8558P6431l0085
6791A95829n779r821k463l5461M9658n255k962k685n3487R3965K175O8939k629
$$ y = [607254, 714511, 765411, 850848, 994818, 1030030, 931890, 864788, 763235, 678395, 622000, 542778, 601111, 685849, 681929, 689524, 715016, 768514, 842668, 915381, 1024453, 1052615, 1060275, 1233163, 1300957, 1340563, 1424015, 1415864, 1484334, 1508511, 1482036, 1385331, 1279713, 1182120, 1137857, 1050522, 944685, 809903, 743596, 712415, 565369, 534672, 540011, 442461, 387572, 379160, 365821, 361749, 251213, 208748, 269086, 286746, 212133, 196646, 271643, 303107, 205988, 173439, 236988, 271407, 246021, 159786, 199935, 244282, 205467, 207045, 251673, 224671, 166604, 193385, 158758, 153846, 229579, 221416, 167229, 146500, 211404, 202107, 168041, 149483, 225914, 195829, 190050, 180229, 177766, 142305, 191963, 186708, 183746, 181061, 127574, 221539, 223714, 292653, 290024]
6778B90024o1486q481J9871J2312r923l4000J9821P2833L872l3179k4060m7502
6766B00102M8969M124l33n8312N4893k5997m9379M1723m597m9707n9264L1865
6754A34087m9585N4424J6531M2014j7425M239l1678J7401j3160J9067k9641p1119
6742G5155K6979M1405J8072J100r3418o5177K3977L3243J3995k728J5565M5380
6730A33548n2069j11639L7662k3496M88Q0005L9646n2200K1137k6112Q0684Q46
6718A28500l713J7665m8973l1907L2745n7192K2830r1290l147J5377j1010K1650
6706h465m3551R0514n9272m2152J2280n4074J9868j400l8949R8581o6969k0462
6694a14051N1508N7729n9104K5384J1300k2306N7093M1465M4572o4804k9136M726
$$ y = [290024, 228538, 220057, 239928, 252240, 242317, 208317, 228138, 300971, 304843, 271664, 247604, 200102, 249071, 253195, 252862, 194550, 249443, 223446, 174067, 215790, 211193, 161486, 102222, 134087, 84502, 138926, 155457, 197471, 180046, 184285, 152607, 170008, 156848, 175915, 146274, 75155, 102134, 143539, 161611, 162711, 69293, 4116, 28093, 61336, 75331, 72603, 88168, 133548, 81479, -30160, 7502, -15994, -15506, 64499, 104145, 51945, 73082, 46970, 127654, 128500, 124787, 142452, 93479, 61572, 94317, 37125, 59955, -31335, -34482, -19105, -30115, -8465, -52016, 38498, -20774, -62926, -50646, -104720, -84852, -86252, -125201, -26620, -93589, -114051, -62543, -4814, -63918, -38534, -27234, -49540, 7553, 49018, 93590, 28786, -350, 4376]
6682D376j0178L7485k9718K2961k9781j0156m7511O66J8923J180K2187k9467J9045
6669b9988K17K8010J8917l4542q195l4536m802M7160J04984k5038o5609j7905
6657b1327l4535K0832J03555L948L1003l4979k3592M4580j2951n6392k7205L6466
6645B9403j2683L6734P294M9375p0392j03750M1529N0769K2160q506l6056R0304
6633I6181J2416Q532j10553J470J4112O9889J8550o6508Q211P6231k6608n4957
6621D6966J3809m4319N3012k4490n28R219n4477k3952P396L4694Q29M9346n9348
6608H157K4582J3998k6838l8424J6873J02259l7854k2349k1775n7525M3339L0826
6596C5269l5839N6881m3811o985P4436r4374J0896R4056o4768j849R2934L9601
$$ y = [4376, -5802, 31683, 1965, 24926, -4855, -15011, -62522, -61856, -42933, -41753, -19566, -49033, -29988, -29771, -1761, 17156, -17386, -25581, -60117, -64919, -17759, 87225, 62187, -3422, -21327, -55862, -35030, 68525, 72473, 103476, 68497, 44905, 89485, 76534, 20142, -7063, 29403, 16720, 53454, 60748, 110123, 39731, -64019, -22490, 28279, 50439, 41933, 5877, 96181, 108597, 117129, 6576, 8046, 22158, 92047, 110597, 44089, 52300, 128531, 101923, 46966, 60775, 16456, 69468, 44978, 44450, 53669, -808, -24760, -17364, 17330, 18159, 67505, 8157, 32739, 46737, 19899, -18525, -1652, 100607, 62753, 40404, 18629, -38896, 4443, 35269, -570, 56311, 12500, 5515, 79951, -14423, -3527, 90529, 25761, 23912, 116846, 156447]
6584A56447kJ7611n822l118M1983K2961p7458j752J76130J5881q6798p1366Q3189
6571B67886p766n3125L5357m710J8210O0937n5798m4436l74Q5288K3707n0515
6559B74661Q7761J00121k20j64877R3591l4647p3847m7658P9853J6830k01N8561
6547C89928J3263n3802p4147O2194n7873k1240J4444Q4599L0305j0774n0492m8197
6535B78208L5916k4932R3154M4848K756j9211l7538J1828J04114J5570P3903J03820
6523F82436P8435p1202p3326Q0906O810l0052m6419m9269n5534K4567n7224p4627
6511D15501j9513m5203K7374p9904m0742Q8614j52192j679k6604K0581K4904q1404
6499A29733n0072j8301M2190n6464k4992K1675L6145L7549J4017j9522L7874l9457
$$ y = [156447, 156445, 174056, 168234, 165116, 207099, 230060, 152602, 150850, 326980, 342861, 256063, 184697, 267886, 260120, 206995, 242352, 237642, 255852, 316789, 260991, 216555, 216181, 301469, 325176, 274661, 362422, 462543, 462323, 297446, 391037, 356390, 282543, 234885, 314738, 331568, 331367, 389928, 403191, 349389, 275242, 337436, 279563, 258323, 272767, 357366, 387671, 376897, 326405, 278208, 314124, 289192, 382346, 427194, 429950, 410739, 373201, 385029, 489143, 504713, 578616, 682436, 760871, 689669, 616343, 697249, 704059, 674007, 627588, 578319, 522785, 547352, 490128, 415501, 395988, 350785, 378159, 298255, 257513, 346127, 193935, 192256, 165652, 186233, 211137, 129733, 79661, 61360, 103550, 47086, 22094, 43769, 79914, 117463, 131480, 111958, 149832, 110375]
6487A10375o903J8009k7071q40N6485J2156j13707L3968N4652r9391m3691J3552
6475G594M3043j9153J2427j1805r0455N2634j7967N206j7907M2288J6867m600
6463A8172O4694k6041k6046K9201L102j34662M1446L8514Q02L1153j5830M9697
6451G4202K6146k4028k174M8078J8831o337J5171j1224l9857m7038L8581L2365
6439A22716k7478Q57K9203N5956m8306J0797o0925O4041L2574K3922L1772k7473
6427B07656J464m0514P8774m8295L316J5161J2620n3112Q3014L9677K703j61336
6415A41128j10742J35623R0466j905r2949k2934J231l1632K8987L8514J0008M2349
6403B28144J3654j3004k4173p0868m5045O86M1308j3523J4478n512o4901N0756
$$ y = [110375, 103472, 121481, 94410, 93570, 150055, 162211, 48504, 82472, 137124, 37733, -5958, 7594, 50637, 31484, 43911, 32106, -58349, -5715, -23682, -18476, -36383, 5905, 22772, 18172, 82866, 56825, 30779, 59980, 63082, -71580, -30134, 8380, 9182, 40335, 24505, 74202, 100348, 76320, 74146, 122224, 141055, 134718, 149889, 138665, 98808, 51770, 90351, 122716, 95238, 96095, 125298, 181254, 132948, 143745, 82820, 146861, 179435, 203357, 235129, 207656, 209120, 168606, 247380, 199085, 202401, 217562, 230182, 177070, 260084, 299761, 302464, 141128, 30386, 166009, 256475, 254570, 161621, 138687, 139918, 108286, 137273, 175787, 185795, 228144, 241798, 228794, 204621, 133753, 88708, 89394, 130702, 117179, 131657, 126145, 61244, 112000]
6391A12000L181k8231R356l4499r381M5231O3007K4713p8771Q107K1283m2486
6379I3510k9872N2666o988L9090l5648J4740j1288m9454O8407k665k1296J3589
6367A24791N0156n5851k0644R460J1598l2240m9734L0393j5071n4873q7721J12391
6355B2655M9956j7091j3043K078j2160N7525J3233P712o1525L179j9848l7639
6343d968o712R8796r6195l1324j369L6374J01903o7605K6814P2003M0497j2024
6331A56190j15790R609Q1568m2197J8190j6320m1410q7122K5840P9779j2054k5528
6319C0755L1417l5006K3237J8998K462J986K8008M8256l2200n184k2207k9369
6307F1153P7562q592l976o9258K6740o1289J8977m210n523n684q0170P3328N1838
$$ y = [112000, 115181, 86950, 96306, 61807, 52426, 97657, 160664, 185377, 106606, 114713, 135996, 93510, 63638, 116304, 109316, 148406, 112758, 127498, 116210, 66756, 135163, 132498, 111202, 124791, 174947, 119096, 98452, 107912, 119510, 87270, 37536, 67929, 52858, -2015, -89736, 22655, 72611, 55520, 42477, 44555, 32395, 89920, 103153, 110865, 49340, 52519, 32671, -4968, -11680, 87116, -9079, -40403, -41772, -5398, 96505, 28900, 55714, 127717, 168214, 156190, 40400, 50009, 131577, 89380, 107570, 91250, 49840, -37282, -11442, 68337, 56283, 30755, 62172, 27166, 50403, 69401, 71863, 73849, 101857, 150113, 117913, 112729, 90522, 61153, 138715, 130123, 126147, 56889, 83629, 22340, 41317, 37107, 31584, 25900, -54270, 19058, 70896]
6294G0896J4611j0062L0341K0145K6416L9449m3052q2488J7223N4643O397J3358
6282A57877P357j2531k7482M5103m4249j3124j5624j6699K3464M7223k2172N986
6270A35129L1399J3402P640k8025N4614Q0398M8379l8951m9906j7378q1594Q74
6258A55981K6576M0816l248m0824N8355J1563l1605K3561M015J9858K0314j8369
6246B66993p5823k4039J42075j8342m804N1902P082P971L5842k4618j772J4643
6234C77110L5366L1447k9554M006N7754j2124l3253O7546n7197m5831n6572K0290
6222C58988K9273M3299l8761R159j1877l8220N7734K4915J9981Q3143J2150j13973
6210D35811p2534J18092n613L3843M0876Q242r128o4522Q1002L6864M8433j5598
$$ y = [70896, 85507, 75445, 105786, 125931, 152347, 191796, 148744, 66256, 83479, 138122, 144519, 157877, 165234, 152703, 125221, 170324, 126075, 112951, 97327, 80628, 104092, 151315, 129143, 135129, 166528, 179930, 187570, 159545, 214159, 294557, 342936, 303985, 254079, 236701, 155107, 155981, 182557, 223373, 220125, 179301, 237656, 249219, 217614, 241175, 245190, 265048, 285362, 266993, 191170, 167131, 309206, 290864, 286060, 337962, 345044, 353015, 388857, 364239, 362467, 377110, 412476, 443923, 414369, 418375, 476129, 464005, 430752, 498298, 441101, 395270, 338698, 358988, 388261, 431560, 392799, 401958, 390081, 351861, 409595, 434510, 454491, 537634, 549784, 435811, 363277, 481369, 475756, 509599, 550475, 558717, 549589, 485067, 566069, 602933, 651366, 635768]
6198F35768n237J25220Q0241m3878Q6526J9672Q3206R716r8028q5863o1699L375
6186G49019N8438p2938l7189m2117N6774n8123n9663R533p807M9881l849k3883
6174F18076J4146o7295L738J5528j7237n812N9143N8659n4902L7076P943J3564
6162F82627n107l298R620O894Q4560j9579Q1154N2898n313N03r2994R087l0507
6149G70545k8520k3970o5408L5187O7213k9188o5714q241m5781R7249r680l3250
6137F60442N0016l2590n254L2427m7851L9576o111r710K1656l2459k8544n4315
6125E87283O7290k2917j2655m9238M7920J5883Q2024R603k6259j8324k9508O9359
6113G20461K01m450j3387k2231O135K7457q822n3908m5143K8399j78o5233J8125
$$ y = [635768, 630531, 755751, 835992, 792114, 878640, 898312, 981518, 991234, 893206, 807343, 745644, 749019, 807457, 734519, 697330, 655213, 711987, 653864, 594201, 603734, 595927, 645808, 641959, 618076, 632222, 564927, 568665, 584193, 566956, 561144, 620287, 678946, 624044, 661120, 669063, 682627, 677520, 674222, 683842, 690736, 775296, 755717, 836871, 889769, 884456, 884959, 791965, 801052, 770545, 742025, 718055, 652647, 687834, 755047, 725859, 660145, 651904, 606123, 703372, 693692, 660442, 710458, 677868, 672614, 705041, 657190, 696766, 690655, 680945, 702601, 670142, 641598, 587283, 654573, 631656, 619001, 569763, 617683, 633566, 715590, 725193, 698934, 680610, 651102, 720461, 720662, 716212, 702825, 680594, 686729, 714186, 705364, 651456, 606313, 634712, 634534, 569301, 587426]
6100E87426Q3297O7390n3705M0135M4850J0254k4266n2792J6689k8955J2183M4838
6088G47344N3769L8431L783m7394j7311k9992n1480N2082R6977N2964k2719r0177
6076G86277L2660J08339K8807O8503K9432P1698L1337R6058N6158J60201J18842
6065A588312K6864L8262P3991J71531J36159L8129k2718o9294r8303j24679j17459
6054A640795M095l149R6412Q3051M4356R3976M7695o7642j49534n4245j55186
6043A580624j42961l3129j5286j7751k557m3782q7458l5945K2665j40530m4075
6032A039815Q2236K4491l0086m1566N5126N5627J6346l872K3412k7372K8471J9830
6020A242458J561K6729J24477l3026O4276R7131J17941J09050J97632J92254J10902
$$ y = [587426, 670723, 738113, 684408, 724543, 769393, 779647, 755381, 702589, 719278, 690323, 702506, 747344, 801113, 839544, 843327, 795933, 778622, 748630, 697150, 749232, 846209, 899173, 876454, 786277, 818937, 927276, 956083, 1024586, 1054018, 1125716, 1157053, 1253111, 1309269, 1469470, 1588312, 1615176, 1653438, 1727429, 1898960, 2035119, 2073248, 2050530, 1981236, 1882933, 1758254, 1640795, 1644890, 1641741, 1738153, 1821204, 1865560, 1959536, 2007231, 1939589, 1790055, 1735810, 1580624, 1437663, 1404534, 1389248, 1371497, 1368940, 1325158, 1237700, 1201755, 1224420, 1083890, 1039815, 1122051, 1146542, 1116456, 1074890, 1130016, 1185643, 1201989, 1198117, 1221529, 1194157, 1222628, 1242458, 1244019, 1270748, 1395225, 1362199, 1426475, 1523606, 1641547, 1750597, 1948229, 2140483, 2251385]
6009B251385J10039P2661m5519r6681p3463o8040r7744r151J30106J37716J35053
5998B446362J43377K9798j04279j57934k21452j28782k57724k61896j59371j02973
5988A225126j18150k54K907l4035n4376L8173m0123l6644m2411L7352r594l4089
5976I33882j0129M9464O7778o6189n0545J05764R6555K1249O6164J5016M3462
5965A272471m5294L700m4546n4039l8878K363k7608o4786l0295j3542K244L5685
5953I97475m2509N4007O085q0786m8890K4455L8217Q4803j1368R2033j4998K1033
5941A119557J17938M3721J7745m37K1565l6404M6589m2214J8987l6397Q2523P4854
5929A428027L6487M2654p6426j5989M2505o148J9248k0293M0491J57934m4731
$$ y = [2251385, 2361424, 2434085, 2388566, 2291885, 2218422, 2150382, 2052638, 2043487, 2173593, 2311309, 2446362, 2589739, 2619537, 2515258, 2357324, 2135872, 2007090, 1749366, 1487470, 1328099, 1225126, 1106976, 1106722, 1109629, 1075594, 1021218, 1059391, 1019268, 982624, 940213, 977565, 967971, 933882, 923753, 973217, 1040995, 974806, 924261, 1030025, 1126580, 1147829, 1213993, 1229009, 1272471, 1227177, 1230877, 1186331, 1132292, 1093414, 1095777, 1068169, 1003383, 973088, 959546, 961790, 997475, 954966, 1008973, 1015058, 934272, 885382, 909837, 948054, 1032857, 1021489, 1113522, 1098524, 1119557, 1237495, 1281216, 1298961, 1298524, 1320089, 1283685, 1330274, 1288060, 1307047, 1270650, 1353173, 1428027, 1464514, 1507168, 1430742, 1414753, 1457258, 1451110, 1470358, 1450065, 1490556, 1648490, 1603759]
5918A603759o1125O9705M4884O6149Q63R9853J08217M5145J41797L4502N7438
5907B211187k6381N7592P8188J05154m907M6688J21209J03189J18038J26836P8410
5896C015203K1854J03269J3676J47932J44462J352N0278J01519J12668J27704
5886C839917R9674J07783J30120Q9060L8267N7555R9463J53602J44888J74922
5876D935251K13463J97695K13677K03983J74014K05818L79897M46474L21838L68199
5866G660309N00908M88826O72171Q59135R09428R38229R81676R24296P75279O02769
5856A5313026K36072j1678j63906k14705k56384k05245k14805l64029n06714o49345
5846A2962287q74610r05844q94997q23213p85526p03223n24332m17036m45022
$$ y = [1603759, 1542634, 1612339, 1657223, 1723372, 1724235, 1824088, 1932305, 1977450, 2119247, 2153749, 2211187, 2184806, 2242398, 2320586, 2425740, 2420833, 2467521, 2588730, 2691919, 2809957, 2936793, 3015203, 3037057, 3140326, 3154002, 3301934, 3446396, 3447748, 3498026, 3599545, 3712213, 3839917, 3939591, 4047374, 4177494, 4266554, 4304821, 4362376, 4461839, 4615441, 4760329, 4935251, 5148714, 5346409, 5560086, 5764069, 5938083, 6143901, 6523798, 6970272, 7292110, 7660309, 8161217, 8650043, 9322214, 10181349, 11090777, 12029006, 13010682, 13934978, 14710257, 15313026, 15549098, 15537420, 15373514, 15158809, 14902425, 14697180, 14482375, 14118346, 13611632, 12962287, 12087677, 11181833, 10286836, 9463623, 8678097, 7974874, 7450542, 7033506, 6588484]
5837F588484l05873k73762j67658m7504j13179j13652l5330K6377j4587n1104
5827E492212M3764J81537J83673J87363K37558K00310K92889M56534M48741O35248
5817H359829O41356R0464l47002n30336o19073p96623o99378n91339n02935l30206
5807D674757l28360k15973k11344o3070N7581m0095L9681j44405q9167J4053P4228
5796C767886J66967J80132J76021J85257L14771L03589L13401L60932N39895O03645
5786F912496O11432N55413J34261l57369m82355p16651p52853o61857o12099l83007
5776D247411k88448k99415k65185j34460j62816o7925N8971j47477n8165j07464
5766B775027J749m7767J902N0165J1099M012L8157O4723J57460J42567J35824
$$ y = [6588484, 6282611, 6008849, 5841191, 5793687, 5680508, 5566856, 5531526, 5557903, 5543316, 5492212, 5535976, 5717513, 5901186, 6088549, 6326107, 6526417, 6819306, 7275840, 7724581, 8359829, 9001185, 9091649, 8744647, 8214311, 7595238, 6798615, 6099237, 5507898, 5004963, 4674757, 4346397, 4130424, 3919080, 3856010, 3913591, 3873496, 3913177, 3768772, 3679605, 3693658, 3767886, 3934853, 4114985, 4291006, 4476263, 4791034, 5094623, 5408024, 5768956, 6308851, 6912496, 7523928, 8079341, 8213602, 7856233, 7373878, 6657227, 5904374, 5242517, 4630418, 4247411, 3958963, 3659548, 3394363, 3259903, 3097087, 3029162, 3088133, 2940656, 2882491, 2775027, 2776776, 2729009, 2730911, 2781076, 2792175, 2796187, 2834344, 2899067, 3056527, 3199094, 3334918]
5755C334918J34215J60467K41028K172j47011j84988j60113k36689k23964l07741
5745B612294j81075q8137j16068j10140q6293k9895m3335q5910p1598J9122N434
5734A824399j9089R3819M2258r5968l1133p0024M0433q479p401n8418j3713M4392
5722A741076l2488p7428J768m0095K931N2037j5709K1062n3469k6149K9351j5870
5710A587017o283o1938Q842K9960k9743J14925j165k0757L4273O3094k914J1609
5698A726920M8446J03626L235L7618M1709Q4720J24006J11333Q6698O24j56751
5687B212184j78896k00840o348j39032j11235o2236o1888J0917o0614L156k7378
5676A377790R1906L1555p218J4239O5977j6077Q603J8521K29547J69586J02817
$$ y = [3334918, 3469133, 3629600, 3870628, 3872800, 3725789, 3540801, 3380688, 3143999, 2920035, 2612294, 2431219, 2343082, 2227014, 2116874, 2030581, 2000686, 1957351, 1871441, 1799843, 1818965, 1824399, 1805310, 1899129, 1941387, 1845419, 1814286, 1744262, 1784695, 1776216, 1768815, 1710397, 1696684, 1741076, 1708588, 1631160, 1632928, 1592833, 1595764, 1647801, 1632092, 1653154, 1599685, 1573536, 1602887, 1587017, 1580734, 1518796, 1527638, 1557598, 1527855, 1642780, 1641615, 1620858, 1655131, 1718225, 1715311, 1726920, 1775366, 1878992, 1882227, 1919845, 1961554, 2046274, 2170280, 2281613, 2368311, 2368935, 2212184, 2033288, 1832448, 1826100, 1687068, 1575833, 1513597, 1451709, 1462626, 1402012, 1405168, 1377790, 1469696, 1501251, 1494033, 1508272, 1574249, 1558172, 1566775, 1585296, 1814843, 1984429, 2087246]
5665B087246J26134P0837R395j76172r9890k2577j60538j72078m2824p1573j18737
5654A429223o1559j0563K7211L1675J0615j0014K3998O5288o9515j6442J27719
5643A547636N5349J09100J31675R5102L926j91417j11281l6702m3006n210j26309
5632A428863j24464l2432o8500j1231q4728p359R2760J03513J0691j01536K6917
5621A232494l3394R6884Q0144K8901J03699N8010M7850J30767J35220J7408j2737
5610A885246r8471j03950n2617j14482j40360p3990m0779l8308j6533k2104o5773
5599A117879J5640o9165O640o502p5856N3642J24551J4985n9179j0906m3525N4911
5587A123115J1933Q820M3248O2035K2741r7455k4682J17090p756J3032J9407n9675
$$ y = [2087246, 2213380, 2284217, 2293612, 2117440, 2017550, 1994973, 1834435, 1662357, 1619533, 1547960, 1429223, 1367664, 1357101, 1384312, 1415987, 1426602, 1416588, 1440586, 1505874, 1436359, 1419917, 1547636, 1602985, 1712085, 1843760, 1938862, 1942788, 1751371, 1640090, 1603388, 1560382, 1555172, 1428863, 1304399, 1271967, 1203467, 1192236, 1107508, 1100149, 1192909, 1296422, 1307113, 1205577, 1232494, 1199100, 1295984, 1376128, 1405029, 1508728, 1566738, 1614588, 1745355, 1880575, 1897983, 1885246, 1786775, 1682825, 1630208, 1515726, 1375366, 1301376, 1260597, 1222289, 1205756, 1183652, 1117879, 1133519, 1064354, 1070994, 1064492, 988636, 1042278, 1166829, 1181814, 1122635, 1111729, 1068204, 1123115, 1135048, 1143868, 1187116, 1249151, 1271892, 1174437, 1149755, 1266845, 1259089, 1272121, 1291528, 1231853]
5575A231853N010O264J11592N2385Q2744j8606p147j3306K3495J06179Q9379O9423
5563A739265P5531Q4161M0670N1727J24666J63033J64746J71567J93858K06824
5553C016048K95768K88808K74933L32653L82293L98029M24826M26002L60931K28175
5543F428466J66971J52301m2483j67317k35873k49185l31863m05985m25578l70928
5533D518526l52192k78316k57556j45501j88910j48858j45236n2986j09541L0286
5523B869716m5627K946N9808L9448R2538L2218L5838P7009Q5894P3857m8177j62065
5511C113403m1308j21307m3292n4616j26357n7691M0133r777N8098L443R4358
5500B855087N9170J49729J17927J36577J82891J01184K55561K06870P6310J04836
$$ y = [1231853, 1236863, 1243127, 1354719, 1407104, 1489848, 1471242, 1464095, 1450789, 1474284, 1580463, 1669842, 1739265, 1814796, 1898957, 1939627, 1991354, 2116020, 2279053, 2443799, 2615366, 2809224, 3016048, 3311816, 3600624, 3875557, 4208210, 4590503, 4988532, 5413358, 5839360, 6200291, 6428466, 6595437, 6747738, 6705255, 6537938, 6302065, 6052880, 5721017, 5315032, 4889454, 4518526, 4166334, 3888018, 3630462, 3484961, 3296051, 3147193, 3001957, 2948971, 2839430, 2869716, 2824089, 2827035, 2886843, 2926291, 3018829, 3051047, 3086885, 3163894, 3249788, 3323645, 3275468, 3113403, 3072095, 2950788, 2907496, 2852880, 2726523, 2668832, 2708965, 2699188, 2757286, 2760729, 2855087, 2914257, 3063986, 3181913, 3318490, 3501381, 3602565, 3858126, 4064996, 4141306, 4246142]
5490D246142o96j31004p7525j21204j78271j46145r5266l0702j30229q2110l3648
5479C219342o5110J6280Q3842Q6796Q6875K28120J94098J63242J28913J34398
5469D276796Q1670l7719l1214k3434j4615j19653q8069p3883k11378p5240m8354
5458C634907K6647m8986J4334P022P7053N4549l0548L4162O6245K59903J53904
5447D249192j3064m3947n0581N948n1804j3936k0053n8027m5942r4100j17406
5436C746280j06434m2045m2779l0492J0847O4879j3552J8961k6152L6639l9101
5425C577051j32434M7089l930N2168K7936L8449N9743O7937J43955N3980Q1770
5414D013714n313Q5579L0041L3861J48762J75278M9660Q9769R6618K46025K96130
$$ y = [4246142, 4245446, 4114442, 4036917, 3915713, 3737442, 3591297, 3496031, 3465329, 3335100, 3252990, 3219342, 3154232, 3170512, 3254354, 3341150, 3428025, 3656145, 3850243, 4013485, 4142398, 4276796, 4358466, 4320747, 4289533, 4266099, 4251484, 4131831, 4043762, 3969879, 3758501, 3683261, 3634907, 3661554, 3612568, 3626902, 3633924, 3710977, 3765526, 3734978, 3769140, 3835385, 4095288, 4249192, 4236128, 4192181, 4141600, 4147548, 4095744, 4081808, 4061755, 4003728, 3957786, 3863686, 3746280, 3639846, 3597801, 3555022, 3524530, 3535377, 3600256, 3586704, 3605665, 3579513, 3616152, 3577051, 3444617, 3491706, 3487776, 3539944, 3567880, 3606329, 3666072, 3734009, 3877964, 3931944, 4013714, 4008401, 4093980, 4124021, 4157882, 4306644, 4481922, 4531582, 4621351, 4717969, 4963994, 5260124]
5403E260124K43602K78015K17006L09018L59112M64691N28768O40037O34929P91029
5393I726331R52592J151272J151652R98996Q39557N17740L81293K07192J88739
5384A6115364J86579J84374J46851k53116m23566m86667n73199n86959m36745
5375A3872916l26288j35944o1441J55896K87363L16276L92664J34592j90251k43414
5365A4202369k16213l47398l45100l99263j92454k49994k66197k34653o9981j26662
5355A1754454l84227n11950o33246o75662p83332q15974o92154n09014m99853
5346F249042m53570l37792k98012k40987r9921o3102o7167j00506p4349J0377
5336D524013j3450L7159N8439j7871N7286N1044J2756j3644k0129j37320n2243
$$ y = [5260124, 5503726, 5781741, 5998747, 6307765, 6666877, 7131568, 7660336, 8300373, 8935302, 9726331, 10678923, 11830195, 12981847, 13980843, 14820400, 15338140, 15719433, 15926625, 16115364, 16301943, 16486317, 16633168, 16380052, 15956486, 15469819, 14896620, 14309661, 13872916, 13546628, 13410684, 13349243, 13505139, 13792502, 14108778, 14501442, 14636034, 14445783, 14202369, 13986156, 13638758, 13293658, 12894395, 12701941, 12451947, 12185750, 11951097, 11881116, 11754454, 11370227, 10858277, 10225031, 9549369, 8766037, 7950063, 7257909, 6748895, 6249042, 5795472, 5457680, 5159668, 4918681, 4818760, 4755658, 4688491, 4587985, 4513636, 4524013, 4510563, 4547722, 4606161, 4588290, 4645576, 4696620, 4709376, 4695732, 4675603, 4538283, 4486040]
5325D486040q7834K9812J85801J24873P5435m8703j05285j98755k29996k20984
5315D010404k09291r1393p8271L7562J8092J3770O5161J05749J00139J79264J38668
5304D289854J59228K49819O6863Q7177J06347P3251O1247j35431j90345k94516
5294D473494l17351k83819k42086j05353o0542j2368j01185k969n4273j7214p183
5283C269151J17537Q888L4521P1924O2507O7516J84782n7486j38849j35092j32399
5272C353000j37742k34698k20011k10925j04520r4043j3232q1585m7209j9425
5262B189610k2772p2114K2456l3414q739O6608l5016j27816n845K0301K0946J21374
5250B135579J7886o666N3818l3823N5524k7619m8818M6843j204q5654r380R4135
$$ y = [4486040, 4398206, 4428018, 4613819, 4738692, 4814127, 4765424, 4660139, 4461384, 4231388, 4010404, 3801113, 3709720, 3631449, 3669011, 3687103, 3700873, 3766034, 3871783, 3971922, 4151186, 4289854, 4449082, 4698901, 4765764, 4852941, 4959288, 5032539, 5093786, 4958355, 4768010, 4473494, 4156143, 3872324, 3630238, 3524885, 3464343, 3451975, 3350790, 3347821, 3293548, 3276334, 3269151, 3386688, 3395576, 3430097, 3502021, 3564528, 3632044, 3816826, 3759340, 3620491, 3485399, 3353000, 3215258, 2980560, 2760549, 2549624, 2445104, 2351061, 2337829, 2256244, 2209035, 2189610, 2166838, 2094724, 2117180, 2083766, 2075027, 2141635, 2106619, 1978803, 1972958, 1993259, 2014205, 2135579, 2153465, 2146799, 2200617, 2166794, 2222318, 2194699, 2145881, 2192724, 2191520, 2105866, 2096486, 2190621]
5238B190621K1223O131J993J10682L2288K5092L6098J19841N7792N5557Q1738
5227B739056m071O4885N6106J22467R1598k1081P0172M6118o0852J2082R0456
5216C206936M8254K6643N3286Q3428J83569R0185P8605j4542J25819J57211J76066
5205D215460J49219J02381J37817J21680J34669J70363J92141J54247J69711P7584
5195E625272J27755J68453K18795J58288J91274K27714J48623K39768L53372K85480
5185G744794L16086L54829L97370L84594M04023N74239N77730N57783O23613N74727
5175A2509788P13026P93318P38072R08824J117442J375823J519801J904424K170577
5166B3751095K432406K849357L280033L774951M298587M955309N396219N413315
$$ y = [2190621, 2211844, 2217975, 2219968, 2330650, 2362938, 2388030, 2424128, 2543969, 2601761, 2657318, 2739056, 2734985, 2799870, 2855976, 2978443, 3070041, 3048960, 3119132, 3165250, 3104398, 3116480, 3206936, 3255190, 3281833, 3335119, 3418547, 3602116, 3692301, 3770906, 3756364, 3882183, 4039394, 4215460, 4364679, 4467060, 4604877, 4726557, 4861226, 5031589, 5223730, 5377977, 5547688, 5625272, 5753027, 5921480, 6140275, 6298563, 6489837, 6717551, 6866174, 7105942, 7459314, 7744794, 8060880, 8415709, 8813079, 9197673, 9601696, 10175935, 10753665, 11311448, 11935061, 12509788, 13222814, 14016132, 14754204, 15663028, 16780470, 18156293, 19676094, 21580518, 23751095, 26183501, 29032858, 32312891, 36087842, 40386429, 45341738, 50737957, 56151272]
5158E6151272N538831M832129L042635J597032O43077j731117l993733n085126
5150F0995000n774556o084570o051704n464715m781343l954851l087798k459676
5142B3335787k038151j612571j251987r41055p45151o43269n71659m39702l58459
5133A4733783j08290J34870K38272N5341k16028m74780o07024n62751n35910n29720
5123A2127763k85654j13488O1942J40772K04854L06821J24072j30683l21064l65475
5113A1749860l29538l49639j48746q3422Q156K96749L55468O1788k16242l56607
5103A0987827l90146m69301l93767k57543k05416q8584K467K25770L10698K21761
5093I943766M6239l27392n68795o14893n93934o66589m92716k87456k55918k08746
$$ y = [56151272, 61690103, 66522232, 69564867, 71161899, 71804976, 70073859, 66080126, 60995000, 55220444, 49135874, 43084170, 37619455, 32838112, 28883261, 25795463, 23335787, 21297636, 19685065, 18433078, 17492023, 16746872, 16103603, 15531944, 15092242, 14733783, 14625493, 14760363, 14998635, 15053976, 14837948, 14363168, 13756144, 13193393, 12657483, 12127763, 11842109, 11728621, 11790563, 11931335, 12136189, 12443010, 12567082, 12436399, 12115335, 11749860, 11420322, 11070683, 10921937, 10838515, 10846671, 11143420, 11498888, 11560676, 11344434, 10987827, 10597681, 10128380, 9734613, 9477070, 9271654, 9183070, 9185537, 9411307, 9722005, 9943766, 9990005, 9662613, 9093818, 8478925, 7884991, 7218402, 6725686, 6438230, 6182312, 5973566]
5083E973566k37928k14675j61743j34789j30923j16226r5101r5505k2163o9472
5073D695041p5670k5977O2821q7940j31369m0471j3585j08878j31275p8943j58787
5062C904967p0469j63295j22036q3189m9792k9078r394j0946l2328l5447P1075
5051C370068L394n6643O1834o011O0348M1452j02351o2488q8689q2756l6149l0460
5039C071549L6807M7687J3287M0967P3252N5253J50296K62095N9355P1126m4234
5028C837440r5041r7678k51219k49213j02601j36237k9466j1163p0643m7054p4065
5017B673060L8654K9224k4455o4244l7036L0340J1671o817M633J318q637l960
5005B643751n368N1459j5952o7089n6411j1679k7982O812o1506n249L1301j16663
$$ y = [5973566, 5735638, 5520963, 5359220, 5224431, 5093508, 4977282, 4882181, 4786676, 4764513, 4695041, 4619371, 4593394, 4656215, 4568275, 4436906, 4396435, 4382850, 4273972, 4142697, 4063754, 3904967, 3834498, 3671203, 3549167, 3465978, 3416186, 3387108, 3377714, 3366768, 3334440, 3298993, 3370068, 3373462, 3316819, 3378653, 3372642, 3432990, 3474442, 3372091, 3309603, 3220914, 3138158, 3102009, 3071549, 3108356, 3156043, 3169330, 3210297, 3283549, 3338802, 3489098, 3751193, 3810548, 3881674, 3837440, 3742399, 3644721, 3393502, 3144289, 3041688, 2905451, 2875985, 2864822, 2794179, 2747125, 2673060, 2711714, 2740938, 2716483, 2652239, 2615203, 2645543, 2657214, 2650397, 2655030, 2656348, 2647711, 2643751, 2638383, 2689842, 2673890, 2606801, 2550390, 2538711, 2510729, 2517541, 2456035, 2450786, 2482087, 2365424]
4993B365424n4079O3896O6597p280m458J888j5972q9753n8272o8273K0679L0849
4981B251246M7432L2338k7172r025m045l9401j0577M3742J1770O9274o783M9829
4969B408628O2181J22962K33383J93258P1301O6645O7455j899j74578k05183k26227
4958B617926k10661j53964j68124o155j31220r5255p0993l2431j19587r7086J1530
4947A543980q522L1618m7528m6501j6457J2847J4290l9649P9145m929o5812J7484
4935A469966N8878M0679K1013J057k2961n8170k1456J8325j5260K9413j1008J8170
4923A528646p3480k4623N0793K7539l4525r8923o7243N4648J6858J1331R0140
4912A481161k2754r732M0980N5405o2926L682J72169J64686M6807l1686k345M1288
$$ y = [2365424, 2311345, 2375241, 2441838, 2434558, 2430100, 2431988, 2416016, 2326263, 2267991, 2199718, 2220397, 2251246, 2298678, 2331016, 2303844, 2294819, 2290774, 2251373, 2240796, 2284538, 2296308, 2365582, 2358799, 2408628, 2470809, 2593771, 2827154, 3020412, 3091713, 3158358, 3225813, 3223914, 3049336, 2844153, 2617926, 2407265, 2253301, 2085177, 2079022, 1947802, 1852547, 1781554, 1749123, 1629536, 1532450, 1543980, 1535458, 1567076, 1519548, 1473047, 1456590, 1469437, 1483727, 1444078, 1523223, 1518294, 1452482, 1469966, 1528844, 1569523, 1590536, 1591593, 1568632, 1510462, 1489006, 1507331, 1492071, 1521484, 1510476, 1528646, 1455166, 1430543, 1481336, 1508875, 1474350, 1375427, 1308184, 1362832, 1379690, 1391021, 1481161, 1458407, 1448675, 1489655, 1545060, 1482134, 1485816, 1657985, 1822671, 1869478, 1837792, 1835447, 1876735]
4900A876735J3415j1874j1083P399M7546P0856Q180J2300N0836Q9855J00276L5925
4888B290366J2393M6964j7382K3180l5506k8396k5405Q442m558p1652m279L4610
4876B228777p863m9990k3550L4395J918Q302j1148N8706J7865r828J1319O5742
4864B324645j0976k5504Q2018N2601N3448Q1262k9158n6740J00663J13318L5824
4853B721401J04524P3472P39P8785R0956R4097K4587p38O2848L6340l1764O2594
4841C317841J1099L6027J22973O0895k2276J26862L6543J12062N2716L1623M2340
4830C928705Q267j4930q99l5904J3962J04169N8110J38829Q3333M3138J12825
4819D439605J78315N2621P8184J13440M9476O3364K1208L9889P8282R516J11163
$$ y = [1876735, 1890150, 1878276, 1867193, 1874592, 1922138, 1992994, 2001174, 2013474, 2064310, 2154165, 2254441, 2290366, 2302759, 2349723, 2332341, 2355521, 2320015, 2291619, 2266214, 2274656, 2270098, 2198446, 2194167, 2228777, 2220914, 2170924, 2147374, 2181769, 2183687, 2191989, 2180841, 2239547, 2257412, 2247584, 2258903, 2324645, 2313669, 2288165, 2370183, 2422784, 2476232, 2557494, 2528336, 2471596, 2572259, 2685577, 2721401, 2825925, 2899397, 2900136, 2978921, 3069877, 3163974, 3188561, 3187823, 3250671, 3287011, 3255247, 3317841, 3328940, 3364967, 3487940, 3548835, 3526559, 3653421, 3689964, 3802026, 3854742, 3886365, 3928705, 3936972, 3922042, 3921143, 3885239, 3899201, 4003370, 4061480, 4200309, 4283642, 4326780, 4439605, 4617920, 4670541, 4748725, 4862165, 4911641, 4975005, 4996213, 5036102, 5114384, 5123900, 5235063]
4808E235063P2411O1601R6490J08849J26753J25605J93613J43220J52429N2635
4798F368669J27975J94655J94120J60626K46329J44558J51445L05971K87840J95321
4788H377509J39709J95971K37053K70578K47230J99003K78405K30753J94181L02320
4778A0672712L33746K26928M29033M81410L89135L68641L62181L35191L76494
4769A3975471M52713M74852M70182N91684N78160N14789O06770N42329M64196
4760A8671146O14703N64594N53551P74146O84764O29786O73063P31747P75292
4751B4672792Q32325R14107J070817J152314J246168J288025J416162J618285
4743C4210995J618207J725600J988354K148381K389158K709521L023746L428136
$$ y = [5235063, 5307474, 5369075, 5465565, 5574414, 5701167, 5826772, 6020385, 6163605, 6316034, 6368669, 6496644, 6691299, 6885419, 7046045, 7292374, 7436932, 7588377, 7894348, 8182188, 8377509, 8517218, 8713189, 8950242, 9220820, 9468050, 9667053, 9945458, 10176211, 10370392, 10672712, 11006458, 11233386, 11662419, 12143829, 12532964, 12901605, 13263786, 13598977, 13975471, 14428184, 14903036, 15373218, 15964902, 16543062, 17057851, 17664621, 18206950, 18671146, 19285849, 19850443, 20403994, 21178140, 21862904, 22492690, 23165753, 23897500, 24672792, 25505117, 26419224, 27490041, 28642355, 29888523, 31176548, 32592710, 34210995, 35829202, 37554802, 39543156, 41691537, 44080695, 46790216, 49813962, 53242098]
4735E3242098L994698M855606N847729P002867Q206000R807680J1683897J3290499
4727A17931074J4596962J6079140J8604593K2652317K8545489L5191692L2880333
4720B86481600K0087946O247151j2088055k6112056l1334437l3634320l2992430
4713A76655399k9238924k3236970j7140741j2636734r378019p035615n703072
4706G2285324m562990l893267l385286k957482k533472k338421k043588j775336
4698D8795482j456303j111397j010309q86168o73145p06612n56546l95136k73332
4689D1726534k48914k67838l02856l40773l54335l39792j64263n034K80270M76574
4679D0459573N70884Q82227Q92098R89281J200084J423843J597357J699759J935557
$$ y = [53242098, 57236796, 62092402, 67940131, 74942998, 83148998, 92956678, 104640575, 117931074, 132528036, 148607176, 167211769, 189864086, 218409575, 253601267, 286481600, 306569546, 312816697, 300728642, 274616586, 243282149, 209647829, 176655399, 147416475, 124179505, 107038764, 94402030, 85024011, 77988396, 72285324, 67722334, 63829067, 60443781, 57486299, 54952827, 52614406, 50570818, 48795482, 47339179, 46227782, 45217473, 44331305, 43658160, 42951548, 42395002, 41999866, 41726534, 41477620, 41209782, 40906926, 40566153, 40211818, 39872026, 39707763, 39702729, 39982999, 40459573, 41030457, 41912684, 42804782, 43794063, 44994147, 46417990, 48015347, 49715106, 51650663]
4670E1650663K287750K663598L204215L670395M523804N347185O433873P808030
4662H7589513R732962J1321011J2788119J4345222J6647473K0073552K4199738
4655A96697590L0066836L2625920K2134611J1615942O204966j1332161k8100711
4648B59912993l1930340l1588416l0682964k7692763k2480289j6961701j2577271
4641H5999249r724317p516106n842870m798953m108801l442482l082837k893294
4633D4589589k695076k417472k254463k151583j915546j674017j518136j431924
4625B8531372j277386j185671j046495j057151r14724r45665q66297r44409q89584
4616A9403990p68584p37808p11377n98053o16271m82943m15152n23036m34530
$$ y = [51650663, 53938413, 56602011, 59806226, 63476621, 68000425, 73347610, 79781483, 87589513, 97322475, 108643486, 121431605, 135776827, 152424300, 172497852, 196697590, 226764426, 259390346, 281524957, 293140899, 299345865, 288013704, 259912993, 227982653, 196394237, 165711273, 138018510, 115538221, 98576520, 85999249, 76274932, 68758826, 62915956, 58117003, 54008202, 50565720, 47482883, 44589589, 41894513, 39477041, 37222578, 35070995, 33155449, 31481432, 29963296, 28531372, 27253986, 26068315, 25021820, 23964669, 23049945, 22104280, 21237983, 20293574, 19403990, 18635406, 17897598, 17186221, 16588168, 15971897, 15488954, 15073802, 14550766, 14116236]
4607A4116236k75663l21951l18669k43165k13748l04869l39495j48051j78750
4598A1771875l18488k35236j97420j64102j17147j42324k12059k62574j61785
4589I960740j65407q5500j48047p6402q0104k05948j21384R6285m2202p1348R141
4578I069824N3133J1941R7097Q0143N2882j5872q6248j55647k76036l13690k92974
4567H224553k12975k44025k15749k29644j94040k27008j29635j65148j96917j43851
4557F265561j56234o7414k8483j17170j7886N62K396O375K7850M0146L2795R19
4545E989417M9156j3029Q5157P3429r471J9813J09706R9657J39458J80550K12636
4534F936479J63749k6284Q0953j37109L664N0511N1950r917J12014K10593K04182
$$ y = [14116236, 13840573, 13518622, 13199953, 12956788, 12743040, 12438171, 12098676, 11950625, 11771875, 11453387, 11218151, 11020731, 10856629, 10739482, 10597158, 10385099, 10122525, 9960740, 9795333, 9709833, 9561786, 9485384, 9405280, 9199332, 9077948, 9174233, 9132031, 9060683, 9069824, 9122957, 9134898, 9231995, 9312138, 9365020, 9349148, 9262900, 9107253, 8831217, 8517527, 8224553, 8011578, 7767553, 7551804, 7322160, 7128120, 6901112, 6771477, 6606329, 6409412, 6265561, 6109327, 6041913, 6013430, 5896260, 5878374, 5878936, 5881332, 5887707, 5915557, 5955703, 5988498, 5989417, 6038573, 6025544, 6110701, 6184130, 6174659, 6194472, 6304178, 6403835, 6543293, 6723843, 6936479, 7100228, 7073944, 7154897, 7017788, 7021452, 7071963, 7123913, 7113996, 7226010, 7436603, 7640785]
4523G640785J49258R7826N073Q8806O6827J41255J30731J62979L14600L42671
4513I140811K55181L15670L23413K88766L09913J93400M4434l5217j33515j95104
4503A0507752k65350j67346j78735l36152k87350j50507k37997l74347k51844
4494H258124k69378k40804j96869j19555j84896J2388n71k0047k1095P279j5038
4483G209538m495J7526k2055l239J33726J14999J91892J67245J72238O4789R3102
4472H135266L4386N9832K8438J6469J57000J51006O0228J35171J19772Q1076J72610
4461I151254J89165J12025J18774P9219J51717K51154J41639J35316J70293K43421
4451A0743977J16435L04157L53008K41319L38791L55857L59287L77640L89904
$$ y = [7640785, 7790043, 7887869, 7892942, 7981748, 8048575, 8189830, 8320561, 8483540, 8798140, 9140811, 9395992, 9711662, 10035075, 10323841, 10633754, 10827154, 10871588, 10836371, 10702856, 10507752, 10242402, 10075056, 9896321, 9560169, 9272819, 9122312, 8884315, 8509968, 8258124, 7988746, 7747942, 7551073, 7431518, 7246622, 7259010, 7258439, 7238392, 7217297, 7224576, 7209538, 7205043, 7222569, 7200514, 7197275, 7331001, 7446000, 7637892, 7805137, 7977375, 8042164, 8135266, 8169652, 8229484, 8257922, 8274391, 8431391, 8582397, 8642625, 8777796, 8897568, 8978644, 9151254, 9340419, 9452444, 9571218, 9650437, 9802154, 10053308, 10194947, 10330263, 10500556, 10743977, 10860412, 11164569, 11517577, 11758896, 12097687, 12453544, 12812831, 13190471, 13580375]
4442A3580375L37671K68222L38065L87262L28219K86706L36119L29274L21535
4433A6513448M12515M68308N17984N28524N77648P16197P62545Q83727J003850
4424B2384746J036468J114920J268857J387437J588031J815587K132941K539967
4416C5268954K919416L366825M071415M771802N448064O146764O914591P631702
4408G6539533Q663465J0463525J2675381J4905264J5426970J1974613M941777
4401A55590528k686222q446469j1975707j4266331j5573799j5265421j3499438
4394G3877141j0955471q325469o197657m650412l665340k940641k478970k128856
4386C2534325j950163j848587j641603j630710j487752j326575j144397j017762
$$ y = [13580375, 13918046, 14186268, 14524333, 14911595, 15239814, 15526520, 15862639, 16191913, 16513448, 16925963, 17394271, 17912255, 18440779, 19018427, 19734624, 20497169, 21380896, 22384746, 23421214, 24536134, 25804991, 27192428, 28780459, 30596046, 32728987, 35268954, 38188370, 41555195, 45626610, 50398412, 55846476, 61993240, 68907831, 76539533, 85202998, 95666523, 108341904, 123247168, 138674138, 150648751, 155590528, 152904306, 144457837, 132482130, 118215799, 102642000, 87376579, 73877141, 62921670, 54596201, 48398544, 43748132, 40082792, 37142151, 34663181, 32534325, 30584162, 28735575, 27093972, 25463262, 23975510, 22648935, 21504538, 20486776]
4378B0486776r72575r42518p45464n57338o00415n97058n04172o35012n38981
4369A4393243m37890m31656l76587m26456k95684l75859k79709j22355k73366
4360A1373681k15217k36919j94897j12721j63099j63965L1708o8686q1404m7737
4350A0120744M266K7490J6053m798l7719M1477L9774L8202K5256O5181Q6697J24872
4338A0547495J02198P907L4221L0102r5468j83644k93593j65018j79745j10882
4328I693573j9303j7423Q3961R8142N0127J50019K71780L58299K85009M04957
4318A1359141M09390N66622N92248O48935N27126J76515j6338m52552n37197o86168
4308A2587722o14653m95765l55052k75333k01980q4810n9827j90l9812l0668K308
$$ y = [20486776, 19514201, 18571683, 17826219, 17268881, 16668466, 16071408, 15567236, 14932224, 14393243, 13955353, 13523697, 13147110, 12720654, 12424970, 12049111, 11769402, 11647047, 11373681, 11158464, 10921545, 10726648, 10613927, 10450828, 10286863, 10318571, 10249885, 10168481, 10120744, 10125010, 10152500, 10168553, 10163755, 10126036, 10167513, 10207287, 10245489, 10270745, 10335926, 10422623, 10547495, 10649693, 10657600, 10691821, 10721923, 10626455, 10442811, 10149218, 9984200, 9804455, 9693573, 9674270, 9656847, 9740808, 9838950, 9889077, 10039096, 10310876, 10669175, 10954184, 11359141, 11768531, 12335153, 12927401, 13576336, 14103462, 14279977, 14263639, 13811087, 13273890, 12587722, 11973069, 11477304, 11122252, 10846919, 10644939, 10560129, 10500302, 10500112, 10460300, 10429632, 10431940]
4297A0431940K3072R9989R7463J36664K5761N1230J83261J61290J77085L15168
4287A1702923K07234J87057L34749K93385M43928L64066L18847L02799L50548
4278A4505536M72757N37666N63820O33693P30911O34209N13339K53130P6385J07834
4268A9029280k3338j33773p6783j66933q1629l6149L3944J86400K23053K49563
4258A9203635L86208L64856L84052M72142M17236N01899M98918O33956O52556
4249B3515458O29454N50688P13838P44241Q12955R13649Q90267J012507J012893
4240C0795950J114416J269286J481659J672341J853428K073758K250581K674479
4232D5185898L075398L580461M177715M943966N679486O492820P277123P924619
$$ y = [10431940, 10455012, 10555001, 10652464, 10789128, 10814889, 10866119, 11049380, 11210670, 11387755, 11702923, 11910157, 12097214, 12431963, 12725348, 13169276, 13533342, 13852189, 14154988, 14505536, 14978293, 15515959, 16079779, 16713472, 17444383, 18078592, 18591931, 18845061, 18921446, 19029280, 19005942, 18872169, 18795386, 18628453, 18546824, 18510675, 18544619, 18731019, 18954072, 19203635, 19589843, 19954699, 20338751, 20810893, 21228129, 21730028, 22228946, 22862902, 23515458, 24144912, 24695600, 25409438, 26153679, 26966634, 27880283, 28770550, 29783057, 30795950, 31910366, 33179652, 34661311, 36333652, 38187080, 40260838, 42511419, 45185898, 48261296, 51841757, 56019472, 60963438, 66642924, 73135744, 80412867, 88337486]
4224H8337486Q840062J0267784J2061007J4128487J5444885J4021674Q835488
4217A71936873J849281l701189p180605r538043j1307583j2029606j1487657j0568901
4209A07972570r976425r006425p685862o511207n300707m072387l176473k408235
4201E9834849j870138j357190j046195p13519l15500m9152L52757P78722J136386
4192E6751020J601257K085368K714905L481197M207608M914279N538734O205815
4184H7500183O748214P696871Q984010J0626495J2291421J3009845J1352851O974622
4176A65184512J015766m418505p904629j0519710j2656273j3920001j3907221
4169A02873939j2602776j0422717q213440o246258m696206l614461k788347k035969
$$ y = [88337486, 97177548, 107445332, 119506339, 133634826, 149079711, 163101385, 171936873, 173786154, 170084965, 162904360, 153366317, 142058734, 130029128, 118541471, 107972570, 97996145, 88989720, 81303858, 74792651, 69491944, 65419557, 62243084, 59834849, 57964711, 56607521, 55561326, 54847807, 54532307, 54483155, 54835912, 55614634, 56751020, 58352277, 60437645, 63152550, 66633747, 70841355, 75755634, 81294368, 87500183, 94248397, 101945268, 110929278, 121555773, 133847194, 146857039, 158209890, 165184512, 166200278, 161781773, 153877144, 143357434, 130701161, 116781160, 102873939, 90271163, 79848446, 71635006, 65388748, 60692542, 57078081, 54289734, 52253765]
4161E2253765j466908j195920q56982l70069j97095m3026l62057j227974j964401
4152D4569333k325713k494922k306482j986760j733909j492309j216596j069146
4144B9943496r55614q21447p78737p11880o18136n03186m69794l02954m75297
4135B4306451l49749k11117j60016m5230J3529N9305K25455J88162J78628J86135
4125B4391553K22118K88539K79528L09988K78146L96806L53361M54654O49269
4116B7623962Q16834R71908J137534J394109J634654J856109K202810K559475
4108D0197395L020395L552912M032748M421684M888025N654518O414455N632530
4100G7814662K447179j626233n316172p253213p858795p375212o182264m835527
$$ y = [52253765, 50786857, 49590937, 48733955, 48363886, 48166791, 48123765, 47761708, 46533734, 44569333, 42243620, 39748698, 37442216, 35455456, 33721547, 32229238, 31012642, 29943496, 28987882, 28166435, 27387698, 26675818, 26057682, 25554496, 25084702, 24781748, 24306451, 23956702, 23745585, 23585569, 23540339, 23553868, 23613173, 23838628, 24026790, 24205418, 24391553, 24613671, 24902210, 25181738, 25491726, 25769872, 26166678, 26520039, 26974693, 27623962, 28440796, 29412704, 30550238, 31944347, 33579001, 35435110, 37637920, 40197395, 43217790, 46770702, 50803450, 55225134, 60113159, 65767677, 72182132, 77814662, 80261841, 78635608, 73319436, 66066223, 58207428, 50832216, 44649952, 39814425]
4092C9814425l650981k909484k094903j637946j248354j004244o99109n33141
4084B6036263n06148m25441k48940k31527n4764l7306m2646j00461K7316N5338
4074B4471684Q9773J21560J41165K90347K82468L68936M45929N68027O57470O39115
4064B8076474N93563N84513O20406M72105M58163O39321Q57954J130056J552326
4055C4984881J877287K157700K165743K328638K753969L440419M145374M235302
4047E8089313K054333r63866j958931k420427k717426k695555k053322j016001
4039D6318118N979P78726J550096K329726K899686L258017L790623M207228M818259
4030F9956458N678079O865459P712495Q024884P288425P015074N985333J773048
$$ y = [39814425, 36163444, 33253960, 31159057, 29521111, 28272757, 27268513, 26569404, 26036263, 25530115, 25104674, 24855734, 24624207, 24569443, 24532137, 24489491, 24389030, 24416346, 24471684, 24561457, 24683017, 24824182, 25114529, 25396997, 25765933, 26211862, 26779889, 27437359, 28076474, 28670037, 29254550, 29874956, 30347061, 30805224, 31444545, 32302499, 33432555, 34984881, 36862168, 39019868, 41185611, 43514249, 46268218, 49708637, 53854011, 58089313, 60143646, 59179780, 57220849, 54800422, 52082996, 49387441, 47334119, 46318118, 46324097, 47102823, 48652919, 50982645, 53882331, 57140348, 60930971, 65138199, 69956458, 75634537, 82499996, 90212491, 98237375, 105525800, 112540874, 118526207, 120299255]
4022A20299255k397722m260098o548656r188702j0554236j0444430r740327q608168
4014E8556916p349336o110743m853218l821927l019463k478319k051800j755932
4006B7116178j578081j462133j252827j137049j081684r85228q63092q43341p12417
3997A7200326p03365o49396o75915n02620n36614n11560m08155m28670l52924
3988A2431107l27989l97315l06215k74846k69561k42948l46593l91566l15202
3979I558872k28904k47531k07258j54104j44779j15994j83988n0674q9912j42169
3969G993559p9125j18203j29303j17498j5589n0125j20624j02139j20873q5831
3959G054249q4933j53658p9811j46995l5094m4854m5429r3102q2638o6015k19029
$$ y = [120299255, 117901533, 113641435, 107092779, 97904077, 87349841, 76905411, 67165084, 58556916, 51207580, 45096837, 40243619, 36421692, 33402229, 30923910, 28872110, 27116178, 25538097, 24075964, 22823137, 21686088, 20604404, 19619176, 18756084, 17912743, 17200326, 16496961, 15847565, 15171650, 14669030, 14132416, 13620856, 13212701, 12784031, 12431107, 12103118, 11705803, 11399588, 11124742, 10855181, 10612233, 10265640, 9874074, 9558872, 9329968, 9082437, 8875179, 8721075, 8576296, 8460302, 8276314, 8225640, 8135728, 7993559, 7914434, 7796231, 7666928, 7549430, 7533841, 7483716, 7363092, 7260953, 7140080, 7054249, 6969316, 6815658, 6735847, 6588852, 6553758, 6508904, 6463475, 6370373, 6287735, 6221720, 6002691]
3948F002691K4710M2635l8005l0564n9145o5363p7889o1303K6957L2715M9691
3937E847130L539l6367k6447J8090o4202o8763j5273K3993J05572n974m4934M4799
3925E781163O9944J41528j8519J574j38913r2011m9967q4081n988j6364p0357
3914E518009r1014N659O1229k801K3718J33348O5807P1186J53494J07359J72718
3903F218712J82555K27142L46172K96760L74943L09519K95963K54688O1681j36282
3893H431853j99673j79529m19267m00529k38406k53005j87662j08198r9136k37051
3883F109397p9151j03397j55625m3359r6189r1582o3501k8081p5009J0324k8906
3872E354921k4940j16139j29633k8376k9783L11l6966l6215Q0825l0975N7565
$$ y = [6002691, 6027401, 6070036, 6032031, 6001467, 5942322, 5876959, 5799070, 5737767, 5764724, 5797439, 5847130, 5850669, 5814302, 5787855, 5805945, 5741743, 5672980, 5657707, 5681700, 5787272, 5781298, 5736364, 5781163, 5851107, 5992635, 5974116, 5975690, 5836777, 5744766, 5694799, 5610718, 5604730, 5588366, 5518009, 5426995, 5432654, 5493883, 5491082, 5514800, 5648148, 5713955, 5785141, 5938635, 6045994, 6218712, 6401267, 6628409, 6974581, 7271341, 7646284, 7955803, 8251766, 8506454, 8568135, 8431853, 8232180, 8052651, 7633384, 7232855, 6994449, 6741444, 6553782, 6445584, 6346448, 6109397, 6030246, 5926849, 5771224, 5727865, 5631676, 5540094, 5476593, 5448512, 5373503, 5383827, 5354921, 5329981, 5213842, 5084209, 5055833, 5026050, 5026361, 4989395, 4953180, 5034005, 5003030, 5060595]
3861E060595L2404M6867K5531L9119J30012R6059N2105K1476J56016J06841L803
3850E770828L2238m5057q2333j1437Q6271J16712o6113N6805Q1756J53800K05101
3839F298571K22821J21388Q6454J51548K48948J21783J45938J38683J70052O6015
3829G772201L5116N9165k4031j12688j92095l19966k32035k47703k25131j81628
3819F331205j43685k0060r1044p6234m807l6398M7962Q083K6403P4806K6460k6772
3807F115919p466k5126l5295N6291N3109n106P9156R1036O4294Q7608j7460Q9760
3795F546720P8271K8257J30686J64856R5525J60308J82713J49650J75859J59780
3785G872625K47332L04682K93350K64579L27178K20533L32929M30397M33349M09598
$$ y = [5060595, 5092999, 5139866, 5165397, 5204516, 5334528, 5430587, 5482692, 5504168, 5660184, 5767025, 5770828, 5803066, 5758009, 5675676, 5664239, 5750510, 5867222, 5801109, 5857914, 5939670, 6093470, 6298571, 6521392, 6642780, 6729234, 6880782, 7129730, 7251513, 7397451, 7536134, 7706186, 7772201, 7807317, 7866482, 7842451, 7729763, 7537668, 7217702, 6985667, 6737964, 6512833, 6331205, 6187520, 6167460, 6076416, 6000182, 5995375, 5958977, 6006939, 6015022, 6041425, 6116231, 6142691, 6115919, 6108453, 6083327, 6048032, 6104323, 6157432, 6152326, 6231482, 6322518, 6386812, 6474420, 6456960, 6546720, 6624991, 6653248, 6783934, 6948790, 7044315, 7204623, 7387336, 7536986, 7712845, 7872625, 8119957, 8424639, 8717989, 8982568, 9309746, 9530279, 9863208, 10293605, 10726954, 11136552]
3775A1136552L55519M61486N64827N52644O72544Q63588R61427R97740J226440
3766A7792767J435274J649797J686902J346950Q53160K76867l62620j106756j540737
3757B2031604j796529j796257j687943j273071j090027r31109p96731n79611m91600
3748A1588726k68655k50524j78709j61390m8507j25338q2176k0613l0366j3685
3738A0408763J287l5860Q3534J65180R9558J67635J84064J10740J97165K34700
3728A1616766K13845J43864J89376K03740K82421K81405K99106L66097K82761
3719A3879381M20824L30176L41499M67940M80242L60390M71030L17095L98668
3710A7467245K89295J73423K83591K11562K1796o3741l9686j95457k59473k68732
$$ y = [11136552, 11492071, 11953557, 12518384, 13071028, 13743572, 14607160, 15568587, 16566327, 17792767, 19228041, 20877838, 22564740, 23911690, 24764850, 25041717, 24679097, 23572341, 22031604, 20235075, 18438818, 16750875, 15477804, 14387777, 13456668, 12659937, 12080326, 11588726, 11320071, 11069547, 10890838, 10729448, 10680941, 10555603, 10473427, 10452814, 10422448, 10408763, 10410050, 10374190, 10457724, 10622904, 10722462, 10890097, 11074161, 11184901, 11382066, 11616766, 11830611, 11974475, 12163851, 12367591, 12650012, 12931417, 13230523, 13596620, 13879381, 14300205, 14630381, 14971880, 15439820, 15920062, 16280452, 16751482, 17068577, 17467245, 17756540, 17929963, 18213554, 18425116, 18446912, 18383171, 18343485, 18148028, 17888555, 17619823]
3700A7619823k78214k06960j14527j7897Q1640J91196L16599M26062M96040N43468
3690A9057230P06949O53655O72307M86061K25807k5770m73188o97605r52689r98132
3680A8654625j000646r11663p45948o43010n88772m44726l46949k96981k26560
3671A3449370j69692j46819o5153j5259Q4901J83270J18601J35579L05255L83155
3661A4263208L78537N20125N66186P01266P09500R12678J198210J287135J518209
3652B2055054J939845K186776K584377L000711L078955K824845J735831M12201
3644C9818595j249175k672474l283067l570279l324026k779026k278350j907301
3636A8754897j451710j040848q21916o64909m69264l65814m03874k93363k98726
$$ y = [17619823, 17341609, 17134649, 17020122, 17002225, 17083865, 17275061, 17591660, 18017722, 18513762, 19057230, 19764179, 20417834, 21090141, 21576202, 21802009, 21776239, 21303051, 20605446, 19652757, 18654625, 17653979, 16742316, 15996368, 15353358, 14764586, 14319860, 13972911, 13675930, 13449370, 13279678, 13132859, 13067706, 13052447, 13137348, 13320618, 13439219, 13574798, 13880053, 14263208, 14641745, 15161870, 15728056, 16429322, 17138822, 18051500, 19249710, 20536845, 22055054, 23994899, 26181675, 28766052, 31766763, 34845718, 37670563, 39406394, 39818595, 38569420, 35896946, 32613879, 29043600, 25719574, 22940548, 20662198, 18754897, 17303187, 16262339, 15440423, 14775514, 14306250, 13940436, 13536562, 13243199, 12944473]
3627A2944473k22557k14454r4906j83852k46992j95172j10311j70361j01889l6200
3617A1367779k8485o4558m6309L1395P9224R1301n1228J38010J40873J3349J59750
3606A1831101J10781L08964K99380K26202L92079M71459O50564O87662P40730
3597A5718922R74907J055305J299771J470656J676942K086581K296150K801430
3589B9380664K876149K735744J966142O93708n18419j869336k778576l196862
3581B9289214l174116k913662k476133j993485j578760j184222q82902o72439
3573A4413495n50899m45687l54209l05544k13237k41944j70719j46361j52946
3564A1831949j2630l8134m5843o5568j07412j50962k02302j14790j26409j60005
$$ y = [12944473, 12721916, 12507462, 12412556, 12228704, 11981712, 11786540, 11676229, 11505868, 11403979, 11367779, 11339294, 11274736, 11228427, 11259822, 11339046, 11430347, 11379119, 11517129, 11658002, 11671351, 11831101, 11941882, 12250846, 12550226, 12776428, 13168507, 13639966, 14290530, 14978192, 15718922, 16693829, 17749134, 19048905, 20519561, 22196503, 24283084, 26579234, 29380664, 32256813, 34992557, 36958699, 37652407, 37133988, 35264652, 32486076, 29289214, 26115098, 23201436, 20725303, 18731818, 17153058, 15968836, 15085934, 14413495, 13862596, 13416909, 13062700, 12757156, 12543919, 12301975, 12131256, 11984895, 11831949, 11819319, 11781185, 11735342, 11669774, 11562362, 11411400, 11209098, 11094308, 10967899, 10807894]
3554A0807894j03388j75434j74841q2325l0491j63077p6778j31100k1146k0374
3544I828940j01078o0578n7104j05535j32085j69112r0418j07609p1633j37085
3534H796703j39621r2068l9360j07920j12548o0785j03448k2634p0472q3440l6490
3523G927917J3219O0024m1632l4776J8980M575j7017m3226q4949k194K0349N908
3511G827178k0956j03068j4498m9120k9071k1754m3077K0360N6975p0732Q93N8590
3499G611720j279N9837J15084r513l9788M2113M7171l3771O3577K0444q283o35
3487G866677N1386R2215R1224P8705R6355l3614N4238M2908r035l4785j3754L0519
3475H313039o1257k6424k3262j9191K1211m2730M0345L2663p7932J0177L7098
$$ y = [10807894, 10704506, 10529072, 10354231, 10271906, 10241415, 10078338, 10001560, 9870460, 9849314, 9828940, 9727862, 9667284, 9610180, 9504645, 9372560, 9203448, 9113030, 9005421, 8933788, 8796703, 8657082, 8565014, 8525654, 8417734, 8305186, 8244401, 8140953, 8118319, 8047847, 7964407, 7927917, 7941136, 8001160, 7959528, 7924752, 7943732, 7948307, 7931290, 7888064, 7803115, 7800921, 7821270, 7827178, 7806222, 7703154, 7688656, 7639536, 7610465, 7588711, 7545634, 7565994, 7622969, 7552237, 7553130, 7611720, 7610441, 7670278, 7785362, 7775849, 7736061, 7778174, 7825345, 7791574, 7855151, 7875595, 7867312, 7866677, 7918063, 8010278, 8101502, 8180207, 8276562, 8242948, 8297186, 8340094, 8331059, 8296274, 8282520, 8313039, 8251782, 8225358, 8202096, 8182905, 8204116, 8161386, 8201731, 8234394, 8156462, 8166639, 8203737]
3464H203737k0364J5388O1172L0446N2350L665K5423J32474M1773j8475O3535
3453H591124J00722J14009M2097K9727O2229P6187l492P5951R3158k8233J44721
3442I298200L6112m46Q5686P7425J71062O5271J04724J53585K02169J23734J36609
3431A0454131R6148K58587K80636K48552K71906K62152L75391L53305L27853L76351
3421A3305012N68755N62436O38552Q05672P26372P95441R52218J153192J105547
3412B0613197J293333J331792J486729J273868R36240M48709k89552q68212j289057
3403B4937047j405837j377689j174935r73483o95572n48928k87279j00531o0799
3394A8311994R2391M21241M86673N33235J54062k90758m78929o67143q50799q10451
$$ y = [8203737, 8183373, 8198761, 8259933, 8290379, 8342729, 8346394, 8371817, 8504291, 8546064, 8527589, 8591124, 8691846, 8805855, 8847952, 8877679, 8939908, 9016095, 9012603, 9088554, 9181712, 9153479, 9298200, 9334312, 9333866, 9419552, 9496977, 9668039, 9733310, 9838034, 9991619, 10193788, 10317522, 10454131, 10550279, 10808866, 11089502, 11338054, 11609960, 11872112, 12247503, 12600808, 12928661, 13305012, 13873767, 14436203, 15074755, 15880427, 16606799, 17402240, 18354458, 19507650, 20613197, 21906530, 23238322, 24725051, 25998919, 26935159, 27383868, 27094316, 26226104, 24937047, 23531210, 22153521, 20978586, 20005103, 19309531, 18760603, 18473324, 18372793, 18311994, 18404385, 18825626, 19312299, 19845534, 19999596, 19708838, 19229909, 18562766, 17711967, 16901516]
3384A6901516p13155n64283m47300k82636j74278j84370j25917p0150M4090J56039
3374A4539556K6551J48958J71394J87509K75883M69906M59436N35015N87618P43463
3364A8145289R26425J011532J200498J437989J700441J803725J115766k20242
3356B7121423q94837j273066j439259j446334j235803q93841n28342m52239k81967
3347A8675735j39066k4326J55909N9030J72031J49647K80025M34326N06845N16841
3337B0786997P23455P28338Q65735J075863J101600J324349J481865J685185J936790
3328C1710177K171393K252571K016656J448507J023184L54107k87156j014633
3320C9674806j430055j899116k036616k054023j888590j565793j478254j187859
$$ y = [16901516, 16188361, 15624078, 15176778, 14894142, 14719864, 14535494, 14409577, 14339427, 14383517, 14539556, 14566107, 14715065, 14886459, 15073968, 15349851, 15819757, 16279193, 16814208, 17401826, 18145289, 19071714, 20083246, 21283744, 22721733, 24422174, 26225899, 27341665, 27121423, 26226586, 24953520, 23514261, 22067927, 20832124, 19938283, 19409941, 18957702, 18675735, 18536669, 18512343, 18668252, 18727282, 18899313, 19048960, 19328985, 19763311, 20270156, 20786997, 21510452, 22238790, 23104525, 24180388, 25281988, 26606337, 28088202, 29773387, 31710177, 33881570, 36134141, 38150797, 39599304, 40622488, 40976595, 40689439, 39674806, 38244751, 36345635, 34309019, 32254996, 30366406, 28800613, 27322359, 26134500]
3312B6134500j015262p91801o89435n74068m76882m10161k81021k43942j93269
3303B1458659j02479j21634j7398P9778j7889J30680J80437K08192K25785L01374
3293B2325505L14112K95390K94293L18385L06472L81910M39657L81008M29379
3284B5486111O31299O72176P29269Q64343R27959J109787J283468J322694J346861
3275C4373967J511812J676501J713040J764009J619716J273718R83095O24654
3267D5540512J47952k23382m74475o67427p28531q14302q50448r41002j001588
3258C9987309j065544r65320j085407q82128p49008o77875m96008m56728l10407
3249C3298884k83907j94526n2487l4705r4259N7841J12929K07021K38464K89378
$$ y = [26134500, 25119238, 24327437, 23638002, 23063934, 22587052, 22176891, 21895870, 21651928, 21458659, 21356180, 21234546, 21217148, 21296926, 21279037, 21409717, 21590154, 21798346, 22024131, 22325505, 22639617, 22935007, 23229300, 23547685, 23854157, 24236067, 24675724, 25056732, 25486111, 26117410, 26789586, 27518855, 28383198, 29311157, 30420944, 31704412, 33027106, 34373967, 35885779, 37562280, 39275320, 41039329, 42659045, 43932763, 44915858, 45540512, 45688464, 45465082, 44990607, 44323180, 43594649, 42780347, 41929899, 40988897, 39987309, 38921765, 37956445, 36871038, 35988910, 35239902, 34562027, 34066019, 33609291, 33298884, 33014977, 32820451, 32767964, 32733259, 32639000, 32696841, 32809770, 33016791, 33255255, 33544633]
3239C3544633L35795L68999M77884N61856N84220P13692P07508P61699O13966
3230C8670252M51534M70494N07964N88903P44319Q87822R32779J269065J348555
3221D5871687J449009J590066J746018J804023J976974K011755K042236K085382
3213F0577150K175213K377609K349844K470006K537002K572323K477341K268147
3205G9804635K030189J428545N74426m84897j906315l086297l752194m272597
3197G0335495m277237l913417l520325l184485k517024k189254k102896k080022
3189D6550835k038660j907950j738598j541913j350047j174741j166913j047785
3181C4584228j074184q89621r28365q16520p59872q29133p24442o52103n17412
$$ y = [33544633, 33880428, 34249427, 34727311, 35289167, 35873387, 36587079, 37294587, 38056286, 38670252, 39121786, 39592280, 40100244, 40689147, 41433466, 42321288, 43254067, 44523132, 45871687, 47320696, 48910762, 50656780, 52460803, 54437777, 56449532, 58491768, 60577150, 62752363, 65129972, 67479816, 69949822, 72486824, 75059147, 77536488, 79804635, 81834824, 83263369, 83837795, 83352898, 81446583, 78360286, 74608092, 70335495, 66058258, 62144841, 58624516, 55440031, 52923007, 50733753, 48630857, 46550835, 44512175, 42604225, 40865627, 39323714, 37973667, 36798926, 35632013, 34584228, 33510044, 32620423, 31692058, 30875538, 30115666, 29286533, 28562091, 27909988, 27392576]
3172B7392576n67383n55270n75515m74304m05654m02684l41117k69424l08328
3163B3492897l26018k17190r5140j48359j84292j80266k87070l79043j99233k09214
3153B1267072k01498j45638j57151j80454j37784p0256r3879j59000j87854l33053
3143A9600505k38923k27905k89876k83943l16628l48398l65825k46155k81878
3134A7000974j77964k85286k03926j93685j60572j22040j14936j32332r7716r5091
3124A5417426k20975j79401j22340j46580j25087k12508j91120j09051j78864
3115A3931500k13638j46532j51622p1109k9200r0924j44114l4335j24813j35648
3105A2789565o4539j39244k7248q3779j17873K2954J191m316j04350k9086p2518
$$ y = [27392576, 26825193, 26269923, 25694408, 25220104, 24814450, 24411766, 24070649, 23801225, 23492897, 23166879, 22949689, 22854549, 22706190, 22521898, 22341632, 22054562, 21675519, 21476286, 21267072, 21065574, 20919936, 20762785, 20582331, 20444547, 20374291, 20280412, 20121412, 19933558, 19600505, 19361582, 19133677, 18843801, 18559858, 18243230, 17894832, 17529007, 17282852, 17000974, 16823010, 16537724, 16333798, 16140113, 15979541, 15857501, 15742565, 15610233, 15512517, 15417426, 15196451, 15017050, 14894710, 14748130, 14623043, 14410535, 14219415, 14110364, 13931500, 13717862, 13571330, 13419708, 13348599, 13319399, 13228475, 13084361, 13050026, 12925213, 12789565, 12725026, 12585782, 12558534, 12474755, 12356882, 12379836, 12381027, 12376711, 12272361, 12243275, 12170757]
3094A2170757N775j7983k673N3515l1678j5057L3851l133J02515M3472N3157R1963
3082A2484481M3481O9052L5465J37626J34710J31876J44422J65205K63908K64876
3072A3875102L30333M44708L29306M53819N13062N52739N42055N74749N49278
3063A8165151M72748L49361J99573L8646j63301m25318o17512o88533o33058p68876
3053A5928881o73063o60172o24878m31951l99296m34525m07191l32510k60919
3044A1704376l50991k92635j38339k19401j95161j46395k33141j54630j11938
3035I861745j49666j11958r6649m6314q4945j71098l2517l2828r3480j37070p9896
3024H825324l4351q6428j15253q1925k5295j5519j05839j72665M7851j2956q9037
$$ y = [12170757, 12176532, 12158549, 12155876, 12209391, 12177713, 12162656, 12196507, 12193374, 12295889, 12339361, 12392518, 12484481, 12527962, 12597014, 12632479, 12770105, 12904815, 13036691, 13181113, 13346318, 13610226, 13875102, 14205435, 14650143, 14979449, 15433268, 15946330, 16499069, 17041124, 17615873, 18165151, 18637899, 18987260, 19186833, 19225479, 19062178, 18636860, 18019348, 17330815, 16697757, 15928881, 15255818, 14595646, 13970768, 13538817, 13139521, 12704996, 12297805, 11965295, 11704376, 11353385, 11060750, 10922411, 10703010, 10507849, 10361454, 10128313, 9973683, 9861745, 9712079, 9600121, 9503472, 9457158, 9372213, 9201115, 9168598, 9135770, 9042290, 8905220, 8825324, 8790973, 8704545, 8589292, 8507367, 8482072, 8466553, 8360714, 8188049, 8235900, 8222944, 8133907]
3013H133907l1545n5703l3456p7446n1100N2937M107l2885p4630j24075K5987
3002G736098J2502o0498j15149k3097Q5801m9040k3740q7734J2381P4888M179
2991G566591j2701J3574L4927L3876J147r490K1048P7534k7366R4306P8605k1834
2979G850217J17393j660K9147J04294O0751N9066J48398j6894K5177P0077K3917
2968H469883J08158K4279L8667J8683k5952N7703J5649j3250L0902M6285M1492
2957H812499j64269L8694O5006P5116Q1649O0103P1694M1985Q6114J19939Q57
2946I289387J11212P9872P1761J57897J42017R4269Q4787K45931J06065J62776
2936A0545974J15224J39876Q4777Q3732O9350K653q881N0952M5916n1946P3156
$$ y = [8133907, 8102362, 8046659, 8013203, 7935757, 7884657, 7937594, 7941701, 7908816, 7834186, 7710111, 7736098, 7748600, 7688102, 7572953, 7549856, 7635657, 7586617, 7562877, 7475143, 7487524, 7562412, 7566591, 7553890, 7567464, 7602391, 7636267, 7637414, 7627924, 7648972, 7726506, 7699140, 7793446, 7872051, 7850217, 7967610, 7965950, 7995097, 8099391, 8160142, 8219208, 8367606, 8350712, 8375889, 8445966, 8469883, 8578041, 8602320, 8640987, 8659670, 8633718, 8691421, 8707070, 8693820, 8724722, 8771007, 8812499, 8648230, 8686924, 8751930, 8827046, 8908695, 8968798, 9040492, 9082477, 9168591, 9288530, 9289387, 9400599, 9480471, 9552232, 9710129, 9852146, 9946415, 10031202, 10277133, 10383198, 10545974, 10661198, 10801074, 10885851, 10969583, 11038933, 11041586, 11032705, 11083657, 11129573, 11077627, 11150783]
2925A1150783N7567M0806M2323N4690L7085Q0260J44994J49034J34063N1795K43002
2914A2186402K12991J88667K18362J38721K76384K47471K42740L46757K20020
2905A4278515J98037L16548L23812K66892L59946L52638L12112M10451L13377
2896A7132328L84695N07381M96227L86809K77629J91682J74509O9299K2865p0624
2886A9572800K1220K01953J15476K02753J09798K33365K76360K61905L05330L60451
2876B1661411M79613N16101O21204O16587O55762P53828Q19766O71761Q02465
2867B7598498Q47813P91976O17272N05673L78423J27574n8643m02238p44029q58315
2857B8804004p55681p52318o37460m69405k47895j79726l8346n6361Q1495K19451
$$ y = [11150783, 11208350, 11249156, 11291479, 11346169, 11383254, 11463514, 11608508, 11757542, 11891605, 11943400, 12186402, 12399393, 12588060, 12806422, 12945143, 13221527, 13468998, 13711738, 14058495, 14278515, 14476552, 14793100, 15116912, 15383804, 15743750, 16096388, 16408500, 16818951, 17132328, 17517023, 18024404, 18520631, 18907440, 19185069, 19376751, 19551260, 19620559, 19643424, 19572800, 19594020, 19795973, 19911449, 20114202, 20224000, 20457365, 20733725, 20995630, 21300960, 21661411, 22141024, 22657125, 23278329, 23894916, 24550678, 25304506, 26124272, 26796033, 27598498, 28446311, 29238287, 29855559, 30361232, 30739655, 30867229, 30808586, 30406348, 29662319, 28804004, 28048323, 27296005, 26658545, 26189140, 25941245, 25761519, 25723173, 25666812, 25748307, 25967758]
2847B5967758K12186J40335J30375J33137R9311K53133K26858J80150J56249Q4616
2837B7584108L810j77281k83067l64646n22303n38200n00118n06010o76847o94723
2827B3324723n16096n47166n15313m60898l58595k79473k91878k87754k08411
2818A9859139k90533k30840k68029l33168l68596l66304l85618m81779l73979
2809A6760293n20656m73334m82817m50837m46785m64323l20854l92004m36854
2800A2771829l07932k68834j45062k60369l92005k64451j82923j88227j82567
2791A0579459j93347k22257j08949j09145j38196j45960j72130k61659k06427
2782I021389p7385j58629k06288j23370j79435j52509j81941j57881j10971j80443
$$ y = [25967758, 26179944, 26320279, 26450654, 26583791, 26683102, 26936235, 27163093, 27343243, 27499492, 27584108, 27587918, 27410637, 27127570, 26762924, 26240621, 25702421, 25202303, 24696293, 24019446, 23324723, 22808627, 22261461, 21746148, 21285250, 20926655, 20647182, 20355304, 20067550, 19859139, 19568606, 19337766, 19069737, 18736569, 18367973, 18001669, 17616051, 17134272, 16760293, 16239637, 15766303, 15283486, 14832649, 14385864, 13921541, 13600687, 13208683, 12771829, 12463897, 12195063, 12050001, 11789632, 11397627, 11133176, 10950253, 10762026, 10579459, 10386112, 10163855, 10054906, 9945761, 9807565, 9661605, 9489475, 9227816, 9021389, 8944004, 8785375, 8579087, 8455717, 8276282, 8123773, 7941832, 7783951, 7672980, 7492537]
2772G492537j50375n140j75987j76029l7761j09577j48314j92681j30133j26186
2762F240354j00604r5068m0124m4918m8152j92287k5800o9046j19231j35473j58820
2751E210831J5201R161j42570r1485q8107p6781j59186m0508k297j14944r5562
2740D423753r4334o5963m4575j3555j58063j1634M437p4685q6514j04819j26433
2729C647615l3720m6391p3308m6537o2271q0845J3339p2344q6488O4864j6618
2718C207296j25872l4037m4482j36250M0367l4069n3706J799j6480j40830M0118
2707B703854n7575l4802m4175j53563k0520l0861k2773k7955J4655L9515q2834
2696B282966p6460m5125o208j7224j7462n4305m5535j327J4419p1659j19510j4675
$$ y = [7492537, 7342162, 7337022, 7161035, 6985006, 6947245, 6837668, 6689354, 6496673, 6366540, 6240354, 6139750, 6044682, 6004558, 5959640, 5911488, 5719201, 5693401, 5624355, 5505124, 5369651, 5210831, 5226032, 5235193, 5092623, 5001138, 4913031, 4836250, 4677064, 4636556, 4634259, 4519315, 4423753, 4329419, 4263456, 4218881, 4205326, 4047263, 4035629, 4040066, 3965381, 3878867, 3774048, 3647615, 3613895, 3567504, 3494196, 3447659, 3385388, 3304543, 3317882, 3245538, 3159050, 3223914, 3207296, 3081424, 3047387, 3002905, 2866655, 2907022, 2872953, 2819247, 2821046, 2804566, 2663736, 2703854, 2646279, 2611477, 2567302, 2413739, 2393219, 2362358, 2339585, 2311630, 2326285, 2365800, 2282966, 2206506, 2161381, 2155173, 2137949, 2120487, 2066182, 2020647, 2019320, 2033739, 1962080, 1842570, 1827895]
2684A827895O6055m7480l7495n173k2282k2445j07461O6780p3673K3492k8785
2673A639428m1481n5683L7727K2718m7600r551J9512r6168n5130o1822K9427o0993
2661A320384r497M5380m6563j18580J56996P7608j08667n2186j02326K262m7060
2650A117751M1443M2969J5819l8138n5532n9122K7686K9026l6603J4797M3302
2639A143398l037q5868P4916p7662l4603j0943j489k9387m1735K4103m1742Q9412
2627A005363J0210m0292p745K6656L95n3194P404n3806j6283N480M121K4750o6164
2614H46895k8761J2973J2975m5944k0290R0694j9929q3999J0923k0959n9503l8554
2602F56521Q4047o783l7018k0550J13993j6832j0468k743n2611Q67n337J6722
$$ y = [1827895, 1893950, 1846470, 1808975, 1803802, 1781520, 1759075, 1651614, 1718394, 1644721, 1668213, 1639428, 1597947, 1542264, 1579991, 1602709, 1555109, 1545558, 1565070, 1468902, 1413772, 1351950, 1381377, 1320384, 1310887, 1356267, 1309704, 1191124, 1348120, 1425728, 1317061, 1264875, 1162549, 1164811, 1117751, 1159194, 1202163, 1217982, 1179844, 1124312, 1065190, 1092876, 1121902, 1085299, 1100096, 1143398, 1140361, 1054493, 1129409, 1051747, 1017144, 1006201, 1004712, 975325, 933590, 957693, 915951, 1005363, 1015573, 975281, 967536, 994192, 994587, 941393, 948797, 894991, 878708, 884188, 888309, 913059, 846895, 818134, 831107, 844082, 798138, 777848, 868542, 848613, 764614, 775537, 754578, 695075, 656521, 740568, 733785, 696767, 676217, 790210, 773378, 762910, 760167, 707556, 708423, 703086, 719808]
2590G19808j7419J5415l7077J2998L3016Q062M8997k6030J5014m0564m5189k8532
2578F58499O45K0025l1189q5357k464j0736K9689k1398L8186J9499M5591m8731
2566F12259p8704M0355L5290m3671K2522m6393N2498L7332K3970p7085J5892J8062
2554F12327l4144R386J9211p0542N257K492n9756m2255l7518J5319J7599R5979
2542E33355k6814l7873m466J2881N566j8853m2362Q489K9087m0483N0218j0314
2530D58431r9954K9573j39183P2912N0820n8612R779J2336K2938m5272q1138O2693
2518B95323J0372n1801M1415l303l3085J5032n2621m0348K4900L5681N7246K8353
2506C27164j06357M9760l6138l0076K2414P5951m0272j0637k0635o108j9111Q7412
$$ y = [719808, 702389, 717804, 680727, 693725, 726741, 734803, 783800, 757770, 772784, 732220, 687031, 658499, 659144, 679169, 647980, 562623, 560159, 549423, 579112, 557714, 595900, 615399, 660990, 612259, 533555, 573910, 609200, 565529, 588051, 541658, 594156, 631488, 655458, 578373, 594265, 612327, 578183, 587569, 606780, 536238, 541495, 543987, 484231, 441976, 404458, 419777, 437376, 533355, 506541, 468668, 464202, 477083, 482649, 463796, 421434, 429923, 459010, 418527, 468745, 458431, 358477, 388050, 248867, 321779, 372599, 313987, 323766, 336102, 359040, 313768, 232630, 295323, 305695, 253894, 295309, 292006, 258921, 273953, 221332, 180984, 205884, 241565, 298811, 327164, 220807, 270567, 234429, 204353, 226767, 302718, 262446, 251809, 231174, 225066, 205955, 293367]
2494B93367m9138K8853l648m4388m5267k4441Q337L35M1684j4967j7739N1502
2482B24490j6540r3411K0071j18777L0360Q2719j5396K0195M7532Q258k9841L6011
2470A95671N5897m3233m8783n7240k0713p414M201J3138J1076J7972k3627j1188
2458H5757k193L866O4055k2770P646J5302j07602N0974P6973l5637K8249p7633
2446H6987l3717J15753M5516r9744j3639k5131q9067j9516M9090N0480l138N4953
2434A18827K9210m3888l3348k6083O6501J7304k692o9991P0353j5376o8627j4507
2422B7683m7336O7292o6025J7242k7294M1286P7753l3816j0233j0045k8247o3159
2410e4899Q1205J6176l0387J3055J904m1348J6029m1844L9298P489j0734L3309
$$ y = [293367, 244229, 273082, 269434, 225046, 179779, 155338, 163675, 164010, 205694, 190727, 172988, 224490, 207950, 114539, 134610, 15833, 46193, 128912, 113516, 133711, 181243, 189501, 159660, 195671, 251568, 208335, 159552, 102312, 81599, 74185, 78386, 91524, 102600, 120572, 96945, 85757, 83564, 87430, 151485, 128715, 136361, 151663, 44061, 95035, 172008, 136371, 164620, 86987, 53270, 169023, 214539, 114795, 101156, 76025, -13042, -32558, 16532, 67012, 63874, 118827, 148037, 104149, 70801, 44718, 111219, 128523, 125831, 55840, 126193, 110817, 42190, 27683, -19653, 47639, -18386, -1144, -28438, 12848, 90601, 56785, 46552, 36507, 8260, -54899, 26306, 42482, 12095, 25150, 27054, -14294, 1735, -40109, -811, 6678, -4056, 29253]
2398B9253k714j3886L6754M7169j4073o4782L78K1985r167Q219J4433m5609J0038
2385A7998p385l6825J301m2655J15107k2669m6076M9776J4294p3050K188q637
2373c6633l596l5195k7042J6109N6915O869m3219Q1942n0038K6187J9204J2859
2361B4362n5352J2165r875n2238m1627J31514L8205l6948K3057k4318q3226K0599
2349e3682L7396l0201N6313j954N902J5314L661p9285O2597q7559m7856k5588
2337a44942J1346J24746M9786j5967M121O3385J4507N1206n793j48270m8215K6155
2325a7935L9547N3041j181r6790n6998k1072j3593R4767l518j3266J7126l9783
2313e9655k3010l263k6138J1974J8096L067r324O5853R39p4260L0811O9925n6623
$$ y = [29253, 26539, 12653, 49407, 96576, 82503, 17721, 18099, 40084, 30917, 39136, 53569, 7960, 17998, 10613, -26212, -24911, -67566, 47541, 24872, -21204, 28572, 42866, -30184, -27996, -36633, -40229, -75424, -102466, -86357, -29442, -22573, -65792, 16150, -33888, -7701, 11503, 24362, -30990, -18825, -28700, -80938, -122565, 8949, 47154, 10206, 33263, 8945, -74281, -53682, -16286, -46487, 9826, 7872, 13774, 29088, 32749, -46536, 16061, -71498, -119354, -144942, -133596, -8850, 40936, 24969, 29090, 92475, 106982, 158188, 152395, 4125, -44090, -17935, 21612, 74653, 73472, -23318, -80316, -101388, -114981, -20214, -23732, -36998, -19872, -59655, -82665, -85928, -112066, -100092, -81996, -78929, -88253, -22400, -21461, -95721, -64910, 5015, -51608]
2300e1608L1560Q1773m3794L0334n8852j1449m930L0777N729l742k9228j5766
2288c9196J3461n6609L2184L452R765k5402j8307J3132j9876R0863l5577M3738
2276A1628L5673Q501j4355m5997m5352l0223r565J07756O710l720L927j47292
2264a22309M0900K7674L2592m4311n1573Q4132l3556K006l2493J04228J6986m4141
2252a9865P318j907J0555o3609j3575P6236k6665j11681J5595P1033O4495n8226
2240e0296k0718k2590N4370R0604n3064Q318K2839p8788M5099N4877J8210n2097
2228A6764K3847j4368l8062M1951j00195j6786M8585n5393J1054o288K9275K7370
2216c2246N5160J2233O9422l0341l9213K4986M182k9045K8198N0207k4532o1528
$$ y = [-51608, -20048, 61725, 17931, 48265, -10587, -22036, -26966, 3811, 9540, 5798, -23430, -39196, -25735, -82344, -50160, -46708, -36943, -62345, -80652, -67520, -87396, 3467, -32110, 11628, 47301, 55802, 41447, -4550, -49902, -80125, -89690, 18066, 24776, 21056, 24983, -122309, -81409, -53735, -21143, -65454, -117027, -32895, -66451, -64445, -96938, 7290, 24276, -19865, -12547, -14454, -3899, -67508, -81083, -4847, -31512, -143193, -127598, -56565, 7930, -50296, -71014, -93604, -39234, 51370, -1694, 6624, 29463, -49325, -4226, 50651, 68861, 16764, 40611, 26243, -11819, 30132, -70063, -86849, -38264, -93657, -82603, -88891, -59616, -32246, 22914, 35147, 104569, 74228, 35015, 60001, 64183, 35138, 63336, 113543, 89011, 27483]
2204B7483o2729L5358L4833O268j2684L2751r08l4570J2537k0920l9410K4097
2192B106K7150M9900j3392o4569N035N9155m8192o7453O5024P849n702K1298M0847
2179G9056m7836J8885M2068l5391j535p747j5746j6692L8633P5330L356r1205
2167D1176K534n13N8442M308m4977k8976j5822K1267J00074J03211k1166j4049
2155B05509n4637R748M4248K6808Q0699K9033K7840P4696K1524Q8802k4340o7899
2143D62031Q9189l8254n3992k5954P497J3781j691n8354j02910M8909O6983L5451
2131D42686p8856K6375R2299N380M1094K8304m2052K298R0391l2127L2033R70
2119F08795O1133m931J0717J3908M1985K1240J4726J14202o640M4571J30247r644
$$ y = [27483, -35246, 112, 34945, 41213, 28529, 61280, 60372, 25802, 38339, 17419, -21991, 2106, 29256, 79156, 65764, 1195, 6230, 65385, 17193, -50260, 14764, 22613, 16911, 38209, 79056, 31220, 50105, 92173, 56782, 55247, 47500, 31754, 15062, 53695, 129025, 132381, 41176, 43710, 43197, 101639, 105947, 60970, 31994, 16172, 37439, 137513, 240724, 219558, 205509, 150872, 160620, 204868, 231676, 312375, 341408, 369248, 443944, 465468, 554270, 529930, 462031, 551220, 512966, 458974, 433020, 440517, 454298, 452607, 394253, 291343, 340252, 407235, 442686, 363830, 390205, 482504, 487884, 528978, 557282, 515230, 517528, 607919, 575792, 607825, 608795, 669928, 664997, 675714, 689622, 731607, 752847, 767573, 881775, 875135, 919706, 1049953, 1040309]
2107A040309L588N93L8626M5862K7942Q8436N2232N7877j4944L3692M7965N4710
2095A476888N7146O8110J16862J05621J78873J62485Q2285J99358J57312Q1344
2085B686284J45492K43763K51122L05401L44717K75844K96693L44165M26592N85395
2075E905468P13493Q64129J167157J451874J619790J897808K225690L115684L751406
2066B2712499L181982p90244l452077l665458l791063k869740k089587j494768
2058G741544j100753r17159o22258m98031m12683k51880j95137m3661j95735k71705
2048C232542l07307k04217k06583j41074k07382k17540j25302j09571j41820n9594
2038A512152n6866j03122j69335m8597p623q9240O386P887r5744k5791Q854p4648
$$ y = [1040309, 1043897, 1044490, 1083116, 1128978, 1156920, 1245356, 1297588, 1355465, 1340521, 1374213, 1422178, 1476888, 1534034, 1602144, 1719006, 1824627, 2003500, 2165985, 2248270, 2447628, 2604940, 2686284, 2831776, 3075539, 3326661, 3632062, 3976779, 4252623, 4549316, 4893481, 5320073, 5905468, 6618961, 7483090, 8650247, 10102121, 11721911, 13619719, 15845409, 18961093, 22712499, 25894481, 25104237, 21652160, 17986702, 14195639, 11325899, 9236312, 7741544, 6640791, 5723632, 5101374, 4603343, 4190660, 3938780, 3743643, 3699982, 3504247, 3232542, 2925235, 2721018, 2514435, 2373361, 2165979, 1948439, 1823137, 1713566, 1571746, 1512152, 1455286, 1352164, 1182829, 1134232, 1126609, 1037369, 1043755, 1051642, 955898, 930107, 938961, 864313]
2026H64313q0873j153n3716M5547k5563m0939o6659r5180k2956L4165j6005j4766
2014E26215o9940q7150Q8515L6845j6154J5825R633k8642j18350j07431N7506
2003C06872J3917j4308o3521J9828N6186p7212N0164l6389l702j0758M732M0702
1991B86511p5842k7760K321n2912P7892j8129M1259P3821r3692p9660r958M7235
1979A71086l77k2929k1863J2514J1686k6729o4507L535N90O499k3771L4723l9386
1966D1071l3330R716j6519l1103J29284J0164m1461J5393n4177L8888J9208k8976
1954E8158j3891k2972j098K5886K381k5019o220R712l8025Q1883o375k8531k159
1941C3730l8434Q1193m6154l8827M5326M9248q6443J7734O025L8340k2844m8096
$$ y = [864313, 783440, 782287, 728571, 774118, 748555, 707616, 640957, 545777, 522821, 556986, 540981, 526215, 456275, 369125, 457640, 494485, 478331, 494156, 503789, 475147, 356797, 249366, 306872, 320789, 306481, 242960, 262788, 318974, 241762, 291926, 255537, 251835, 241077, 245809, 286511, 210669, 182909, 185230, 132318, 210210, 192081, 233340, 307161, 213469, 133809, 123851, 171086, 170709, 147780, 125917, 138431, 150117, 123388, 58881, 62416, 63006, 69505, 45734, 80457, 41071, 7741, 17457, 938, -30165, 99119, 109283, 67822, 83215, 29038, 67926, 87134, 58158, 44267, 21295, 20197, 46083, 48464, 23445, 17225, 26937, -11088, 70795, 64420, 35889, 33730, -4704, 76489, 30335, -8492, 36834, 86082, -361, 17373, 23398, 61738, 38894, -9202]
1929i202M5537p433n9737L8187j3682j5969O839k8896j1095j7667J6302j2269
1917f9085l6037n073N9289j4752n8145J02952r34k216j6521o8042o8015J3782
1905a62797n405O532O0119O9006J7149j6992j2374l6647O3422m5942k5885k0839
1893a10653N1981j6486K0380j3465j2519K1529J5478o5433N5535j0092K2259k7568
1881f9054k9546J8614M9735j0053M1009Q3212r9189Q796P1811o5819o0245K205
$$ y = [-9202, 36335, 28902, -30835, 7352, -6330, -22299, -15460, -44356, -55451, -73118, -56816, -69085, -105122, -110195, -50906, -65658, -123803, -20851, -21785, -24001, -40522, -108564, -176579, -162797, -168202, -161670, -101551, -32545, -15396, -32388, -44762, -81409, -17987, -63929, -89814, -110653, -58672, -75158, -54778, -68243, -80762, -59233, -43755, -109188, -53653, -63745, -41486, -69054, -98600, -79986, -30251, -40304, 705, 83917, -15272, -6476, 65335, -484, -60729, -58524]
$$ [...]
##END NTUPLES=NMR SPECTRUM
##END=
