##TITLE=1H_TG-2358-2
 CDCl3
 8 sc, 
 28.09.2022
##JCAMPDX= 6.0         $$ Bruker NMR JCAMP-DX V2.0
##DATA TYPE= NMR SPECTRUM
##DATA CLASS= NTUPLES
##ORIGIN= UXNMR, Bruker Analytische Messtechnik GmbH
##OWNER= root
$$ XWIN-NMR		Version 3.5
$$ Wed Sep 28 14:09:59 2022 Russian Standard Time (UT+4h)  she@DPX200
##.OBSERVE FREQUENCY= 200.1313499994
##.OBSERVE NUCLEUS= ^1H
##.ACQUISITION MODE= SIMULTANEOUS
##.ACQUISITION SCHEME= undefined
##.AVERAGES= 8
##.DIGITISER RES= 18
##SPECTROMETER/DATA SYSTEM= spect
##.PULSE SEQUENCE= zg30
##.SOLVENT NAME= CDCl3
##.SHIFT REFERENCE= (INTERNAL, CDCl3, 0, 15.8295)
##AUDIT TRAIL= $$ (NUMBER, WHEN, WHO, WHERE, WHAT)
$$ ##TITLE= Audit trail, XWIN-NMR		Version 3.5
$$ ##JCAMPDX= 5.01
$$ ##ORIGIN= Bruker BioSpin GmbH
$$ ##OWNER= she
$$ F:/spectra/data/she/nmr/H-F/1/pdata/1/auditp.txt
$$ ##AUDIT TRAIL=  $$ (NUMBER, WHEN, WHO, WHERE, WHAT)
(   1,<2022-09-28 14:08:35.21 +0400>,<she>,<DPX200>,
      <created by zg, POWCHK disabled, PULCHK disabled
       configuration hash MD5:
       00 E9 B6 7A A2 85 ED C7 34 08 36 98 17 FE 4E 26
       data hash MD5: 16K
       45 EE 93 7A B2 9D A3 99 87 8E A9 69 92 FF 20 FD>)
(   2,<2022-09-28 14:08:37.50 +0400>,<she>,<DPX200>,
      <Start of raw data processing
       efp BC_mod = 2 LB = 0.24 FT_mod = 6 PKNL = 1 PHC0 = -18032.15 PHC1 = 8.400689 SI = 16K 
       data hash MD5: 16K
       08 0A 54 2B F7 D6 79 7D 40 EC 6B A8 7F 0F 29 0C>)
(   3,<2022-09-28 14:09:03.37 +0400>,<she>,<DPX200>,
      <pk PHC0 = -14.52493 PHC1 = 19.6 
       data hash MD5: 16K
       37 71 D6 56 A6 5F 96 83 F9 32 3E 65 C2 31 33 D8>)
(   4,<2022-09-28 14:09:06.48 +0400>,<she>,<DPX200>,
      <abs ABSG = 5 
       data hash MD5: 16K
       13 9C B1 51 7B 3B 0D 39 2D F3 22 57 6C 7E 12 70>)
(   5,<2022-09-28 14:09:23.25 +0400>,<she>,<DPX200>,
      <abs ABSG = 5 
       data hash MD5: 16K
       BD BD 8D 58 55 25 35 6F BE 29 20 CE D9 E2 A7 3D>)
$$ ##END=
$$ 
$$ hash MD5
$$ 55 5F 7A 72 C0 56 65 EF C8 CD 5E 7D CE BB 91 BB
##$RELAX= 
##$RELAX= 
##$RELAX= 
##$RELAX= 
##$RELAX= 
##$RELAX= 
$$ Bruker specific parameters
$$ --------------------------
##$DU= <F:/spectra>
##$EXPNO= 1
##$NAME= <H-F>
##$PROCNO= 1
##$TYPE= <nmr>
##$USER= <she>
##$AMP= (0..31)
100 100 100 100 100 100 100 100 100 100 100 100 100 100 100 100 100 100 
100 100 100 100 100 100 100 100 100 100 100 100 100 100 
##$AQSEQ= 0
##$AQ_mod= 1
##$AUNM= <au_zg>
##$AUTOPOS= <>
##$BF1= 200.13
##$BF2= 200.13
##$BF3= 200.13
##$BF4= 200.13
##$BF5= 200.13
##$BF6= 200.13
##$BF7= 200.13
##$BF8= 200.13
##$BYTORDA= 1
##$CFDGTYP= 0
##$CFRGTYP= 5
##$CHEMSTR= <none>
##$CNST= (0..31)
1 1 145 1 1 1 1 1 1 1 1 1 1 1 1 1 1 1 1 1 1 1 1 1 1 1 1 1 1 1 1 1 
##$CPDPRG= <>
##$CPDPRG1= <>
##$CPDPRG2= <>
##$CPDPRG3= <>
##$CPDPRG4= <mlev>
##$CPDPRG5= <mlev>
##$CPDPRG6= <mlev>
##$CPDPRG7= <mlev>
##$CPDPRG8= <mlev>
##$CPDPRGB= <>
##$CPDPRGT= <>
##$D= (0..31)
0 1.2 0 0 0 0 0 0 0 0.06 0 0.03 0 0 0 0 0.0002 0 0 0 0 0 0 0 0 0 0 0 0 
0 0 0 
##$DATE= 1664359714
##$DBL= (0..7)
$$ [...]
##$SUBNAM3= <"">
##$SUBNAM4= <"">
##$SUBNAM5= <"">
##$SUBNAM6= <"">
##$SUBNAM7= <"">
##$SUBNAM8= <"">
##$SUBNAM9= <"">
##$SW= 18.0517283424941
##$SWIBOX= (0..15)
0 0 2 0 0 0 0 0 0 0 0 0 0 0 0 0 
##$SW_h= 3612.71676300578
##$TD= 16384
##$TD0= 1
##$TE= 0
##$TE2= 300
##$TE3= 300
##$TEG= 300
##$TL= (0..7)
0 120 120 120 120 120 120 120 
##$TP= (0..7)
150 150 150 150 150 150 150 150 
##$TP07= 0
##$TPNAME0= <>
##$TPNAME1= <>
##$TPNAME2= <>
##$TPNAME3= <>
##$TPNAME4= <>
##$TPNAME5= <>
##$TPNAME6= <>
##$TPNAME7= <>
##$TPOAL= (0..7)
0.5 0.5 0.5 0.5 0.5 0.5 0.5 0.5 
##$TPOFFS= (0..7)
0 0 0 0 0 0 0 0 
##$TUNHIN= 0
##$TUNHOUT= 0
##$TUNXOUT= 0
##$USERA1= <user>
##$USERA2= <user>
##$USERA3= <user>
##$USERA4= <user>
##$USERA5= <user>
##$V9= 5
##$VALIST= <valist>
##$VCLIST= <CCCCCCCCCCCCCCC>
##$VD= 0
##$VDLIST= <DDDDDDDDDDDDDDD>
##$VPLIST= <PPPPPPPPPPPPPPP>
##$VTLIST= <TTTTTTTTTTTTTTT>
##$WBST= 1024
##$WBSW= 4
##$XGAIN= (0..3)
0 0 0 0 
##$XL= 0
##$YL= 0
##$YMAX_a= 935782
##$YMIN_a= -1069058
##$ZGOPTNS= <>
##$ZL1= 120
##$ZL2= 120
##$ZL3= 120
##$ZL4= 120
##$ABSF1= 15.82953
##$ABSF2= -2.222322
##$ABSG= 5
##$ABSL= 3
##$ALPHA= 0
##$AQORDER= 0
##$ASSFAC= 0
##$ASSFACI= 0
##$ASSFACX= 0
##$ASSWID= 0
##$AUNMP= <proc_1d>
##$AZFE= 0.1
##$AZFW= 0.1
##$BCFW= 0
##$BC_mod= 2
##$BYTORDP= 0
##$COROFFS= 0
##$CY= -3
##$DATMOD= 1
##$DC= 0
##$DFILT= <>
##$DTYPP= 0
##$F1P= 0
##$F2P= 0
##$FCOR= 1
##$FTSIZE= 16384
##$FT_mod= 6
##$GAMMA= 0
##$GB= 0
##$INTBC= 1
##$INTSCL= 3.70164e-10
##$ISEN= 128
##$LB= 0.24
##$LEV0= 0
##$LPBIN= 0
##$MAXI= 10000
##$MC2= 0
##$MEAN= 0
##$ME_mod= 0
##$MI= 1.114404
##$NCOEF= 0
##$NC_proc= -4
##$NLEV= 6
##$NOISF1= 3.799351
##$NOISF2= 2.8
##$NSP= 0
##$NTH_PI= 0
##$NZP= 0
##$OFFSET= 15.82953
##$PC= 1
##$PHC0= -18046.68
##$PHC1= 28.00069
##$PH_mod= 1
##$PKNL= yes
##$PPARMOD= 0
##$PSCAL= 0
##$PSIGN= 0
##$REVERSE= no
##$SF= 200.129988395596
##$SI= 16384
##$SIGF1= 3
##$SIGF2= 2
##$SINO= 5.538805
##$SIOLD= 16384
##$SREGLST= <1H.CDCl3>
##$SSB= 0
##$STSI= 16384
##$STSR= 0
##$SW_p= 3612.71676300578
##$SYMM= 0
##$S_DEV= 0
##$TDeff= 16384
##$TDoff= 0
##$TI= <>
##$TILT= no
##$TM1= 0
##$TM2= 0
##$TOPLEV= 0
##$USERP1= <user>
##$USERP2= <user>
##$USERP3= <user>
##$USERP4= <user>
##$USERP5= <user>
##$WDW= 1
##$XDIM= 16384
##$YMAX_p= 312090055
##$YMIN_p= -178180
$$ End of Bruker specific parameters
$$ ---------------------------------
##NTUPLES= NMR SPECTRUM
##VAR_NAME=  FREQUENCY,     SPECTRUM/REAL,   SPECTRUM/IMAG
##SYMBOL=    X,             R,               I
##VAR_TYPE=  INDEPENDENT,   DEPENDENT,       DEPENDENT
##VAR_FORM=  AFFN,          ASDF,            ASDF
##VAR_DIM=   16384,         16384,           16384
##UNITS=     HZ,            ARBITRARY UNITS, ARBITRARY UNITS
##FACTOR=    0.220516191357247, 1,           1
##FIRST=     3167.96360763045, 0,            0
##LAST=      -444.753155375331, 0,           0
##MIN=       -444.753155375331, -178180,     0
##MAX=       3167.96360763045, 312090055,    0
$$ Real data points
##PAGE= N=1
##DATA TABLE= (X++(R..R)), XYDATA
$$ [...]
8070A24951j884k556N748K022N5348k9597j3987k2412J0575k3541m490M4231q504
8057A35904l3408M0745K7616J3288j0706m6644O008L7898k6082J6609K1547k4175
8045A58600j1525k0541J6646K0819q978K6381o427l4784J7235L8909K6448L8060
8033B60843o0313k4441R007j2475l7474L2092K0620k334K4536j2246l1807j3403
8021A52605P738k863l0927j170K6529k0344M723o624K8907J9284n039j4647N014
8008A63186N761J5092n1998K9757k0998m8833O769K1866K8805m7905L4086o272
7996A29316n0093N1678j5454k622L5226J9633k1138K21j600O246O297J7068j1097
7983A63681l7161J3321j3031k2592M4304j0892l39L6532P549m4649j5254J472
$$ plain form
8070 124951 123067 120511 126259 128281 183629 154032 140045 117633 128208 104667 100177 144408 135904
8057 135904 102496 143241 170857 184145 173439 126795 132803 170701 144619 161228 182775 158600
8045 158600 147075 126534 143180 163999 155021 181402 174975 140191 157426 196335 222783 260843
8033 260843 200530 176089 185096 172621 135147 167239 187859 185525 210061 197815 166008 152605
8021 152605 160343 157480 126553 125383 151912 131568 136291 129667 158574 177858 172819 158172 163186
8008 163186 168947 184039 132041 161798 140800 91967 98736 120602 149407 101502 135588 129316
7996 129316 79223 130901 115447 112825 148051 167684 146546 146767 145167 151413 157710 174778 163681
7983 163681 126520 139841 126810 104218 148522 137630 137291 173823 181372 136723 121469 122941
7971A22941K3115J0591k3454j121l19K2201K6627J0965J5320j7607K4580j9263
7959A94576j6277J940M8542r960k2601k8025J9702L2549m7661J0661O452k333
7947A87565k5272N73j6775L7917Q955J9806l3563j1200N780l0194K4059J2130
7935A79781l459l1995K4300k1599j7042L3454M1883m4954n626P886k8272L1160
7923A65517L9572o1057K3175j355J666q564J8707K2363m4553k2250N215Q818J2924
7910A60178j3788j7219J941P459r79o119L4188n1338M5220J189k1744p20K4456
7897A62724k3409k22M2043j9436n0890k630L1374J6271k5443l6425j2762J9099
7885A00294M5207J2476k5071R756K7821j0587k0897N956j1224j1634l0499M301
$$ plain form
7971 122941 146056 156647 133193 132072 131753 153954 180581 191546 206866 189259 213839 194576
7959 194576 178299 180239 228781 218821 196220 168195 187897 220446 172785 183446 189898 187565
7947 187565 162293 162866 146091 184008 192963 212769 179206 168006 173786 143592 167651 179781
7935 179781 176322 144327 168627 147028 129986 163440 205323 160369 154743 162629 134357 165517
7923 165517 205089 144032 167207 165852 167518 158954 177661 200024 155471 133221 138436 147254 160178
7910 160178 146390 129171 131112 138571 137592 131473 165661 114323 159543 160732 138988 138268 162724
7897 162724 139315 139093 181136 161700 110810 108180 139554 155825 130382 93957 81195 100294
7885 100294 145501 157977 132906 142662 170483 159896 138999 144955 133731 122097 91598 95899
7873I5899J626O1747j1999o575j5705j2541k6745L8850n989M138M646j7609J6507
7860A26250O324j6212K0611K1620j9395p098J7477l188k4099J3743j5895k2653
7848I7485K8729m812j0617K6237k7639k4481j5027L7139K5253j2864L517n901
7836A17019L177m1097j9012M7839m789j8826L352j3599j8683K5645k8165J4079
7824F6940p650L1179k9415K0667l530l908M1807l6069j2507k0440L4151j0922
7812G0303P27L4889o562q6J5410j883l2081K242L2j4240J7881k402J5245K458
7798A01933j0727J4792k5915k666J1953J8518J9073l9015n218k5099k1492K1229
7786E7366J3073L6889L680j1784L3983m9514l0303L4060j317l033Q388K9683J3522
$$ plain form
7873 95899 97525 159272 147273 140698 124993 112452 85707 124557 118568 122706 127352 109743 126250
7860 126250 132574 116362 136973 158593 139198 132100 149577 146389 122290 136033 120138 97485
7848 97485 126214 121402 110785 137022 109383 84902 69875 107014 132267 119403 122920 117019
7836 117019 120196 79099 60087 107926 103137 84311 87663 74064 55381 81026 52861 66940
7824 66940 59290 90469 61054 81721 78191 74283 116090 80021 67514 47074 81225 70303
7812 70303 71030 105919 99357 99271 114681 112798 80717 82959 82991 68751 86632 84230 99475 101933
7798 101933 91206 105998 80083 77417 89370 107888 126961 87946 82728 57629 36137 57366
7786 57366 70439 107328 111008 99224 133207 83693 53390 87450 86133 83100 91488 121171 134693
7773A34693j3546k0796j5020O188K1802k0166K9106j6005k8593k98J4890N291
7761I7546K6253k7311l8799p86O2660j8078r637Q386j7678K850J0880N1051J7785
7748A65122l6717K3154j999k8621l0649k7534K0264J9782N919Q810l3077k7619
7736E6835K8489J551j5783K6045k8075m2769L0569L5695j938N9290m2675m3386
7724F3848J2941j1769J8703j5398L2441k5067j2205K477M212L5661P702j5193
7712I8353o059P565k7904L027P9M996N0140o40k0564n7190J6592M1474j4450K8371
7698A23790Q809j8604J994r374k0185j0733M3231J464j1282j6031l6398Q437Q032
7685G3150k2239N3897k215M96o861p77k066j0225q727k2826J3249N758r238j7332
$$ plain form
7773 134693 121147 100351 85331 91519 113321 93155 122261 106256 77663 77365 92255 97546
7761 97546 123799 96488 57689 56903 119563 101485 91848 100234 82556 85406 96286 147337 165122
7748 165122 128405 151559 149560 120939 90290 62756 83020 102802 108721 117531 84454 56835
7736 56835 85324 86875 71092 97137 69062 26293 56862 92557 90619 149909 107234 63848
7724 63848 76789 65020 83723 68325 100766 75699 63494 65971 70183 105844 113546 98353
7712 98353 92294 99859 71955 74982 75061 80057 130197 129557 108993 51803 68395 109869 95419 123790
7698 123790 132599 113995 115989 106615 86430 75697 118928 120392 109110 93079 56681 65118 73150
7685 73150 50911 104808 102593 103089 96228 95451 93385 83160 74433 51607 64856 70614 61376 44044
7671D4044L2076o880j0052J2369k9139J7243K193K0573o2009m738P080L3603J6247
7658G2610m063p797J0286o790J599Q307k9229O145j4734J0023M6820k739J1114
7645A01552k3298R618j2370k6903K2065L488j4208j4071K6120M958j0989k3083
7633D2879P473k1395L8406J6447N802n605n2128k345L901P108M2036l285m2244
7620C7050l562m337N6832j7395J2079Q232j5647J3522n449j5205K830M5860k4633
7607I0177j2749q892K2553k3410r309j6232J2938K0949r352J8121j2049L926Q343
7594H5014R098J0889k1590j8844k1829J8338j8018j721K8887J7198n2241K6531
7582F1712L3426l2959r277K6707l0170K1700J6820N586m5253L3596q7k0137K9927
$$ plain form
7671 44044 76120 69240 59188 71557 42418 59661 61854 82427 20418 15680 22760 56363 72610
7658 72610 68547 60750 71036 64246 65845 74152 44923 51068 36334 46357 93177 90438 101552
7645 101552 78254 87872 75502 48599 70664 74152 59944 45873 71993 76951 65962 42879
7633 42879 50352 28957 67363 83810 89612 84007 31879 29534 33435 40543 82579 79294 37050
7620 37050 33488 29151 85983 68588 80667 88899 73252 86774 81325 66120 68950 114810 90177
7607 90177 77428 68536 91089 67679 58370 42138 55076 76025 66673 84794 72745 76671 85014
7594 85014 94112 105001 83411 64567 42738 61076 43058 41337 70224 87422 35181 61712
7582 61712 95138 62179 52902 79609 49439 71139 87959 93545 48292 81888 81801 61664 91591
7569I1591K7636k8078j8933K485k1459J5745k2977K1302n995n66q269J0308N962
7556F8752J1471r417J3859j4296j312J1632j3669p007K2135L938l1112J6060k6331
7543D4703j1013p745L4289j0444m3284K414L2398J2662O039k5153J7134K8997
7531H0997j6216o899J7283n6187N183K7043l461q977j233J7359l4768J6232J1862
7518D8218n975O391L9434L093j1129j6207N796K8401j4719p373m468Q175M444
7505H4081j3670M763m5570K7142J84R93K1451j2292K1251K8265J1343k2142q822
7492I6977L289k4777K8936L9348J9021r279M3321l0614j5531N181J7937n9047
7480A14762l6514m872J419j0657k8313K273k2511L1396K9966j9278M2043J7089
$$ plain form
7569 91591 119227 91149 72216 74701 53242 68987 46010 67312 61317 60751 52482 62790 68752
7556 68752 80223 70806 84665 70369 69057 80689 67020 60013 82148 86086 54974 71034 44703
7543 44703 33690 25945 60234 49790 6506 8920 41318 53980 60019 34866 52000 80997
7531 80997 64781 57882 75165 18978 24161 51204 47743 38766 37533 54892 20124 36356 48218
7518 48218 42243 48634 88068 91161 80032 63825 69621 98022 83303 75930 71462 79637 84081
7505 84081 70411 75174 29604 56746 56930 57923 79374 67082 88333 116598 127941 105799 96977
7492 96977 100266 75489 104425 143773 162794 153515 196836 166222 150691 155872 173809 114762
7480 114762 78248 73376 74795 64138 35825 38098 15587 46983 76949 57671 99714 116803
7468A16803l3681m9608L0826J5867L4102j0599r587l2135J7005j1273K196K4739
7456I4655J8233l679l3391P3197j325l8184q143j9760P98r931L137K7308m7399
7443E5516k3665J262L8080k9920M554j1784J3534n485J2184Q258K0811J5927l6773
7430F2499M1858Q7o174M8346l9653Q01j7351J0867J9876m6504Q983J6648L7323
7417A37606k8309l6600n061j2884N2516K57m0621L83K3807k8684K1255K7588j2705
7404I8548l7575R582Q036R532K8930l613m3813K2297K557k3280k96K4351J9541
7391A14797k7455r818P563K828k5953q789N7009R82J4352J1984m4881L044K2203
7378A17866O259l3900p119l103q665o70Q619j4887K4971J2227L739J1602m0774
$$ plain form
7468 116803 83122 33514 64340 80207 114309 103710 94123 61988 78993 67720 69916 94655
7456 94655 112888 109209 75818 149015 147690 109506 101363 81603 82401 72470 75607 102915 55516
7443 55516 31851 33113 71193 41273 45827 34043 47577 42092 54276 62534 83345 99272 62499
7430 62499 104357 104444 98270 146616 106963 107764 90413 101280 121156 74652 83635 100283 137606
7417 137606 109297 72697 67636 54752 107268 107525 66904 67287 91094 62410 83665 111253 98548
7404 98548 60973 70555 78591 88123 117053 113440 69627 91924 94481 71201 70905 95256 114797
7391 114797 87342 77524 85087 87915 61962 53173 110182 111164 125516 137500 92619 95663 117866
7378 117866 124125 90225 83106 80003 71338 70668 79287 64400 89371 101598 105337 116939 76165
7365G6165o0719J9366Q015K334N4607o530K19p982r594k4912j5686K6265J0986
7352G2534n3930J7686p303L2976N3327j5516k8893j0739P212M131L5256k7784
7340G8957J813J3364K0169k6402m2715p337l918K0571Q013j7977o58K8546k1187
7327E1239k2486q558j934k070q460M7345j0064J7732o148m568l676m410K1435
7314F5377q039j3241j4974L700j3161J0491K7423k8860K0769L4811j8794k6631
7302C8871r149K8848N051l0747M7961o724o1579J7993K5325l7767j4990L4630
7290C7723L5540l6864l4976J3248o549L606j3527J5313L330j5717j0976J0568
7278G19K0982L8361N526j3096l3521K1166O5992o087j9152j6673L992j5180m976
$$ plain form
7365 76165 15446 34812 42827 45161 99768 93238 93457 85475 75881 50969 35283 61548 72534
7352 72534 18604 36290 28987 61963 115290 99774 70881 60142 67354 71485 106741 78957
7340 78957 80770 94134 114303 87901 45186 37849 33931 54502 62515 44538 43880 72426 51239
7327 51239 28753 20195 18261 16191 7731 55076 45012 62744 56596 52028 48352 43942 65377
7314 65377 57338 44097 29123 32823 19662 30153 57576 28716 49485 84296 65502 38871
7302 38871 29722 58570 63621 32874 80835 74111 12532 30525 55850 18083 3093 37723
7290 37723 73263 36399 1423 14671 8122 11728 -1799 13514 16844 1127 -9849 719
7278 719 21701 60062 65588 52492 18971 40137 106129 100042 80890 64217 68209 53029 48053
7265D8053j7739L701j5972j248J5590J2112Q358k809J4877m140j7180k4740Q496
7252B7359J3810k2727J0408j4809q13M1371K8615O273j5023n324k6523j7317L371
7239B8671k0610N3691J056l3826j9589L8369j5500j8969k1230o582K7908K0498
7227C3887J5671K040O862k1423k735l3489N497L4828k373J8636j558k937k7606
7214B5300J2606K0842m1304j2064K9489N1735l3588o412m7406L4025L5269K262
7202G0754r393l765O729q855j5003J6299l6504l148K4289P3l0572p516K2814K006
7188B8208l6429J3402K9912J0662j5443R830j4193l029J4311Q794j6857p252r429
7175A2487j332J1211L0288j5p564J4828P533J9277m2759J1795l833j1289j8631
$$ plain form
7265 48053 30314 34015 18043 16795 32385 44497 52855 50046 64923 60783 43603 18863 27359
7252 27359 41169 18442 28850 14041 13228 54599 83214 89487 74464 69140 42617 25300 28671
7239 28671 8061 61752 62808 28982 9393 47762 32262 13293 -7937 -14519 13389 33887
7227 33887 49558 51598 58460 37037 34302 813 6310 41138 38765 57401 55843 52906 25300
7214 25300 37906 58748 17444 5380 34869 86604 53016 46604 -802 33223 68492 70754
7202 70754 61361 57596 64325 55470 40467 56766 20262 17114 41403 41476 10904 3388 26202 28208
7188 28208 -8221 5181 35093 45755 30312 40142 25949 22920 37231 46025 29168 21916 12487
7175 12487 11155 22366 52654 52639 45075 59903 67436 86713 43954 55749 51916 40627 21996
7162B1996n616r118K2679J3227j4656K4366j9938L3944k0263j2749R675j6092
7150B7455K5680m5088L0991K9424j3066l5909K7258M0577l4561k7002J287J2177
7138C9223L2576o548L029O122l3384k7679j1854K9554L3729L745o442N7027J0009
7125A29107j0134r723k7848J3773j9688k069K1331o267r849J4539M292M969J7132
7112A19565L8586l0511m873J2258k9650j583J0696K3901K986M862K1260k7712
7100A39785j0631J6064J9108j2002J0272J7456j8398r990J97j447M7837k951l665
7087A91635J8997k0841K6669L672j9019r48J5874L8771J9834K1210K6241m714
7075C17381j8966j7194L2631K6876j2532K0945K0620M2803k5537o267K0617L0264
$$ plain form
7162 21996 16380 7262 29941 43168 28512 52878 32940 66884 46621 33872 43547 27455
7150 27455 53135 8047 39038 68462 55396 19487 46745 87322 52761 25759 27046 39223
7138 39223 71799 65251 68280 74402 41018 13339 1485 31039 64768 68513 62071 119098 129107
7125 129107 118973 109250 81402 95175 75487 73418 94749 88482 78633 93172 97464 102433 119565
7112 119565 158151 127640 122767 135025 105375 103792 114488 138389 141375 146237 167497 139785
7100 139785 129154 145218 164326 152324 162596 180052 161654 151664 151861 150414 198251 195300 191635
7087 191635 210632 189791 216460 220132 201113 200165 216039 254810 274644 295854 322095 317381
7075 317381 298415 281221 313852 340728 328196 349141 369761 412564 387027 380760 401377 431641
7063D31641j3615K1721N4989N7832J5699K4317Q4058N4136K5002J6348Q0319P7757
7051I30204N8799J15151R5747O4749R8337K5636K4146K5281n0723q9460l0364
7040A267503j0345r1299r7879j01966p3262P388j18998r4819p8542o7663l6231
7029E03887l8638m6045k0137m7752m2955p427O087k8443l3802J3227k9439l0422
7017A98141j0026k8248L5098j6111o602L32M490J9407j2047k880k9591k007k2495
7004A27461j7563L4829N651q644J9214K5418k439k7557l9702J2336Q030j6173
6992A20861l7159l823Q8K1979R412R35o8k0629O590o266j0367j8539L218j3590
6978E2642J3126Q61j6844J3342k355r684J7845M492r187K855m7155N9428M2732
$$ plain form
7063 431641 418026 439747 494736 552568 568267 592584 676642 730778 755780 772128 852447 930204
7051 930204 989003 1104154 1199901 1264650 1362987 1388623 1412769 1438050 1387327 1297867 1267503
7040 1267503 1257158 1165859 1067980 966014 892752 900140 781142 686323 607781 540118 503887
7029 503887 465249 419204 399067 351315 308360 300933 307020 278577 244775 258002 228563 198141
7017 198141 188115 159867 194965 178854 172252 172584 177074 196481 184434 181554 151963 149956 127461
7004 127461 109898 144727 150378 141734 160948 186366 183927 156370 116668 129004 137034 120861
6992 120861 83702 79879 79967 101946 111358 112293 112225 91596 98186 91920 81553 63014 66232 52642
6978 52642 65768 66629 49785 63127 60772 51088 68933 73425 64238 67093 19938 79366 122098
6965A22098l1353o222j4537K0808q029L6586M877j6346l1154p0K6229L559q416
6952I8030J5098r315j8660j0271k406Q790J8691m9971J5401M4054j1468r01r37
6939I6135J6050J6833k1222j6285J3926J1243P413R922j0963K6916q013K2055
6927A64010k5550k5336K9794L076k6597J6863L9166Q682K7186q325q89O365L1701
6914B40146l8302N706K8408l3404M815M0046K2966k614j7738M596J3504K6448
6902B94577k0824K2076L9973J1706l2188q327k5021J0145K8789K9994k7135o426
6890C17339K0144J5888K0600l4958j9381K3753L5374j6513j0501r021K809J6968
6878C62501N160J0227K9532J7466k0028k2525Q486K2277r86k794L293k3793j8960
$$ plain form
6965 122098 90745 84523 69986 90794 82765 119351 124228 107882 76728 76658 102887 106446 98030
6952 98030 113128 103813 85153 74882 72476 81266 99957 49986 65387 109441 97973 97072 96135
6939 96135 112185 129018 107796 91511 105437 116680 124093 134015 123052 149968 141955 164010
6927 164010 138460 113124 142918 145994 119397 136260 175426 184108 211294 202969 202080 208445 240146
6914 240146 201844 207550 235958 202554 207369 247415 270381 267767 250029 254625 268129 294577
6902 294577 273753 295829 335802 347508 315320 306993 281972 292117 320906 350900 323765 317339
6890 317339 337483 353371 373971 339013 319632 343385 378759 362246 351745 342724 345533 362501
6878 362501 367661 377888 407420 424886 404858 382333 390819 413096 412110 409316 412609 388816 369856
6865C69856N6967m291O130M5124L816L5936K3717K5085M7521J05368K3154O4950
6853H03333P4532O3794J07037R2670J18238J55964J20172J40202k1893l9785o8105
6842A546159j24017n4241j01543j29610j47333j41151j42176q5398n6210n4551
6832E09929n4728n4219m1325k6547m4566J4437l0103k3744n919j7672K1320k71
6820B46592m1578l2326J9715j5097r219K6977j4145n4408J3027L9383J0079L1667
6808B20667J1888l8875K7934j563k9800j8856k1257k3975k674M243M324k4060
6796A07996J1122R490p484K8910L3510J8670k4207l0942k6270J6926J1374M046
6784A53141o1791L2827O6312n1576J7056N966k9089J6754k501K6681K0503j5360
$$ plain form
6865 369856 426823 422532 428662 473786 477602 513538 537255 562340 609861 715229 738383 803333
6853 803333 877865 941659 1048696 1141366 1259604 1415568 1535740 1675942 1654049 1614264 1546159
6842 1546159 1422142 1367901 1266358 1136748 989415 848264 706088 620690 564480 509929
6832 509929 455201 400982 359657 333110 288544 302981 272878 249134 243215 225543 246863 246592
6820 246592 205014 172688 192403 177306 168087 195064 180919 126511 139538 178921 189000 220667
6808 220667 232555 193680 221614 220051 190251 171395 150138 126163 123489 127732 132056 107996
6796 107996 119118 128608 121124 150034 183544 202214 178007 147065 120795 137721 149095 153141
6784 153141 91350 124177 190489 138913 155969 161935 132846 149600 147099 173780 194283 178923
6772A78923j6651k2647j187M744r411J917K2327J5494j6742M9723m684r774p557
6759A84475J2034k8594J7589J1217L0100K8581k6957m6387P872L1104J0743J8701
6747B50478j0347l3367J1001M3125M288j5974l1454P4545L7000q757k1488o112
6735B92938k9238K7099J1818J2673M0551N7J4386K9994j413J7600j5401n3188
6723C47876K1933J590k5041J8274L6409k0706l5392j8683K1498K260J5112n7553
6711C07577O968l7541l2109J0037l0213M9191O664J2187k8927j8442m2759P294
6699B09927J6635M479n1737k8803Q834K1585N489L162K1791l3180k9451j3310
6687A35421R147J8372J4185j0064j7621j2863j3222K9326r425J1790J9868n5808
$$ plain form
6772 178923 162272 139625 138438 143182 133771 135688 158015 173509 156767 206490 201806 192032 184475
6759 184475 196509 167915 185504 196721 226821 255402 228445 182058 189930 221034 231777 250478
6747 250478 240131 206764 217765 260890 265178 249204 217750 292295 329295 320538 299050 292938
6735 292938 263700 290799 302617 315290 355841 355898 370284 400278 398865 416465 401064 347876
6723 347876 369809 371399 346358 364632 401041 380335 344943 326260 347758 350018 365130 307577
6711 307577 314545 277004 244895 254932 224719 273910 280574 292761 263834 245392 202633 209927
6699 209927 226562 231041 179304 150501 159335 180920 186409 189571 211362 178182 148731 135421
6687 135421 144568 162940 177125 167061 149440 136577 123355 152681 143256 155046 174914 119106
6675A19106m9571l3119K4256J0118J4730N571r08J5661O346N768k3415O454p251
6662I3746j2013j9192k29q787k421R114j2483J9205L6796k3111K935k721k6361
6649E4478q540k0218k0907m121K5246P228r747n405N382N816o951N162L6218j2154
6635E1487j6116K301k9862q499j1089l469k9810k0007N2561K0614j0375l9642
6623d1906M4176j034p888J5804K1316j5339j4021P730l4356K7412P357j2674k6950
6610c0373K7094K1090m958j6765j052J3429k3117L3202l8133k3149k0837j2062
6598g5631l7301N627L3957M3589j1628l7253L164l6253J6595J6908J9504L1148
6586b7574j7416k760L2654j9392N508J0569j3880l6864l5239L377k322J1475M6354
$$ plain form
6675 119106 69535 36416 60672 70790 85520 91091 90183 105844 112190 117958 94543 100997 93746
6662 93746 81733 62541 62312 53525 51104 60218 47735 66940 103736 80625 83560 80839 54478
6649 54478 45938 25720 4813 692 25938 33166 23419 18014 23396 29212 22261 27423 63641 51487
6635 51487 35371 37672 7810 -689 -11778 -15247 -45057 -65064 -12503 8111 -2264 -41906
6623 -41906 2270 1236 -6652 9152 30468 15129 1108 8838 -25518 1894 9251 -3423 -30373
6610 -30373 -3279 17811 12853 -3912 -4964 8465 -14652 18550 -19583 -42732 -63569 -75631
6598 -75631 -112932 -107305 -73348 -29759 -41387 -78640 -75476 -111729 -95134 -78226 -58722 -27574
6586 -27574 -44990 -47750 -15096 -34488 -28980 -18411 -32291 -69155 -104394 -101017 -103339 -91864 -45510
6573d5510K7200r429K803k4186l2287J9058J3072N641N799K4442K2830m4642k2662
6560e7871L258k1899J4752m800K8794R104l6102j680J5855K0297m026m7081J7855
6547f3544J3365L5366j0774l1291k6981k6551K3801J8292J7617j3487O722k505
6535e9970J8134k4381l5404O048j639K484k8348L1953J5855J2786j0929l4230
6523a07641K7359l0727L908Q728M9951m5k6810j158P932N7160l9572j0349K0004
6510d1260J703m0514Q986L701J612L1594j327J1474k6611k0353j8505l396K6282
6497f6614k6404J220j851L1064k5902j4180M1688j8350l9324R141P368j1739J1478
6484a02405j2636K6212q370j3376J799J3076m5337J4574J3506K347J9284N2949
$$ plain form
6573 -45510 -18310 -27739 -24936 -49122 -81409 -62351 -49279 -43638 -37839 -13397 9433 -35209 -57871
6560 -57871 -54613 -76512 -61760 -66560 -37766 -28662 -64764 -66444 -50589 -30292 -34318 -81399 -63544
6547 -63544 -50179 -14813 -25587 -56878 -83859 -110410 -86609 -68317 -50700 -64187 -57465 -59970
6535 -59970 -41836 -66217 -101621 -95573 -97212 -94728 -123076 -91123 -75268 -62482 -73411 -107641
6523 -107641 -80282 -111009 -107101 -98373 -48422 -48467 -75277 -76435 -68503 -11343 -50915 -61264 -41260
6510 -41260 -39557 -80071 -71085 -67384 -65772 -34178 -35505 -24031 -50642 -70995 -89500 -92896 -66614
6497 -66614 -93018 -91798 -93649 -62585 -88487 -102667 -60979 -79329 -118653 -109512 -102144 -113883 -102405
6484 -102405 -115041 -88829 -97199 -110575 -108776 -95700 -141037 -126463 -112957 -110610 -91326 -38377
6472c8377M948l1677j2362J502j5393N103K5316q8086k9154Q2386K6170r787l204
6459h2615l6685m7365L8516L3866K6892j1727K201o504k425n159n944L850n919
6446i9018j2362N0628k2678m3256O6698L9932r278n5931J3600m5714J6788J8716
6434h1875J2841K5553n936k6278L349M283j7071k327n85K3470J2786K0279q903
6421d0414l0282j0247o190Q032j3512K7283l96J7906q410k2146m473k0344o968
6408a10161J5737j8416L8064L9480j4402K0764l7538j0136J0832j0468P873K275
6396f6096o6207K5292L2471J578N393m6771K3174k0655M716K1827K7692j087k6192
6383h4865o867O794j3612J1408M7586j6319l4351k7274J4603p320M0053j2164
$$ plain form
6472 -38377 -33429 -65106 -77468 -75966 -91359 -86256 -60940 -149026 -178180 -95794 -69624 -79411 -82615
6459 -82615 -119300 -166665 -128149 -94283 -67391 -79118 -76917 -83421 -85846 -91005 -96949 -93099 -99018
6446 -99018 -111380 -60752 -83430 -126686 -59988 -20056 -29334 -85265 -71665 -117379 -100591 -81875
6434 -81875 -69034 -43481 -49417 -75695 -72346 -68063 -85134 -87461 -88046 -64576 -51790 -31511 -40414
6421 -40414 -70696 -80943 -87133 -79101 -92613 -65330 -65726 -47820 -56230 -78376 -82849 -103193 -110161
6408 -110161 -94424 -112840 -74776 -35296 -49698 -28934 -66472 -76608 -65776 -76244 -68371 -66096
6396 -66096 -132303 -107011 -74540 -72962 -67569 -114340 -91166 -111821 -107105 -85278 -57586 -58673 -84865
6383 -84865 -91732 -84938 -98550 -87142 -39556 -55875 -90226 -117500 -102897 -110217 -70164 -82328
6371h2328o604L2617J1324k6257J9055J5774j8354k3607o5569J6387N1844K3302
6359e2416k5971n7307l950O5436r494k7451L7272r58l692k3874J1872M1898m2738
6346i1373j663K863J5209J3466p155J067K997r128m388L9133r691m9766J4871
6333h3558J0624K8908M170l1481j9753K8357k52K720j2069K1080k5637l0156l981
6320a11028L0515J5648o4963j5605M096Q896M8069j7864K1706P446m4146J8717
6308i8513j8966L3970Q247Q798l0627j3254k6512N1534N721J614J7899O930k1318
6295g4477k6158N903p281k8276K7387J2062j7201K2196J0079m013L1075k125j1562
6282f2391n0136L2906L050m102N068J7296R449j5972k3603O038K9355K2589j206
$$ plain form
6371 -82328 -88932 -56315 -44991 -71248 -52193 -36419 -54773 -78380 -143949 -127562 -75718 -52416
6359 -52416 -78387 -135694 -139644 -74208 -83702 -111153 -73881 -74839 -78531 -102405 -90533 -48635 -91373
6346 -91373 -93036 -90173 -74964 -61498 -68653 -67586 -64589 -73717 -78105 -38972 -48663 -98429 -83558
6333 -83558 -72934 -44026 -39856 -71337 -91090 -62733 -62985 -60265 -72334 -51254 -76891 -107047 -111028
6320 -111028 -80513 -64865 -129828 -145433 -141337 -132441 -84372 -102236 -80530 -73084 -117230 -98513
6308 -98513 -117479 -83509 -75262 -66464 -97091 -110345 -136857 -85323 -79602 -77988 -60089 -53159 -74477
6295 -74477 -100635 -94732 -102013 -130289 -102902 -90840 -108041 -85845 -75766 -79779 -48704 -50829 -62391
6282 -62391 -112527 -79621 -76571 -80673 -75605 -58309 -48860 -64832 -88435 -82397 -53042 -30453 -31659
6269c1659J8769k1236k2005P562k5729j9979k6074J8170M613p953M5724M9204
6257a0593k2733r389L9720q584l1908j4102k566J7003j3063J2466j4747L0393
6245b8103r1l01N1821Q222r0294j6794p23M7785k9890j7883k51N3399j3903n7253
6231i4259j066J7241O699o09Q138N581J3119J2440k4004P5269k5405j9101l687
6218b9644k6260K6086J3049l3398J0708l716o693J1407k2607K3356l3598M796
6206f6514J6331K2605j9193n820K7711J6279k636m1515J5999j1615j3889M2682
6194a9575j2287M74K941O083k3493q989k57k7923K1672J5197Q895J6903j0081
6181c0440p283J5931L88m2582Q015k3276L8975o604R774j2590k7405l0676J6052
$$ plain form
6269 -31659 -12890 -34126 -56131 -48569 -74298 -94277 -120351 -102181 -97568 -105521 -59797 -10593
6257 -10593 -33326 -42715 -2995 -11579 -43487 -57589 -60155 -43152 -56215 -43749 -58496 -28103
6245 -28103 -28194 -28495 23326 31548 -58746 -75540 -76263 -28478 -58368 -76251 -76502 -23103 -37006 -94259
6231 -94259 -95325 -78084 -71385 -71994 -63856 -58275 -45156 -32716 -56720 18549 -6856 -25957 -29644
6218 -29644 -55904 -29818 -16769 -50167 -39459 -43175 -49868 -38461 -61068 -37712 -71310 -66514
6206 -66514 -50183 -27578 -46771 -52591 -24880 -8601 -11237 -52752 -36753 -48368 -62257 -19575
6194 -19575 -31862 -31388 -28447 -22364 -45857 -54846 -55103 -83026 -61354 -46157 -37262 -20359 -30440
6181 -30440 -37723 -21792 -21404 -63986 -55971 -79247 -40272 -46876 -37102 -49692 -77097 -107773 -91721
6168i1721L3429q169j4984J0610M6474J2693l6394q870K256K295J8856j3733M406
6155d2852k0669O345M1050K0464j5716m0584L5443j3125m457q098k0195J6907
6143d5487O487J9698m6428J3380J2392K506M0477Q538l1954n7023K2433L2271
6131b2710O824k8260k6453k8706K5767K2830P490m998j60J7582l0456J0909q436
6118e8777k7639J6283j2876J8984M8492l1771m339K6143J2512k2743j8195l8081
6106i2007J4070K1899J7714K4670r369j6845L245n152O767J3961j0599K4038Q745
6093A137M866k0666K74l877k7479J4848R525J2907m035K4402J0954o2099N342
6080c3901O5718o859J1677m95Q246J00l342l215j4464P152l1226K8784p768k2957
$$ plain form
6168 -91721 -58292 -66461 -81445 -70835 -24361 -11668 -48062 -56932 -54676 -52381 -33525 -47258 -42852
6155 -42852 -63521 -57176 -16126 4338 -11378 -51962 -16519 -29644 -34101 -42199 -62394 -45487
6143 -45487 -39000 -19302 -65730 -52350 -39958 -37452 3025 11563 -20391 -77414 -54981 -22710
6131 -22710 -15886 -44146 -70599 -99305 -73538 -50708 -43218 -48216 -48376 -30794 -61250 -50341 -58777
6118 -58777 -86416 -70133 -83009 -64025 -15533 -47304 -51643 -25500 -12988 -35731 -53926 -92007
6106 -92007 -77937 -56038 -38324 -13654 -23023 -39868 -36623 -41775 -35008 -21047 -31646 -7608 1137
6093 1137 6003 -14663 -14389 -18266 -45745 -30897 -21372 -8465 -12500 11902 22856 -39243 -33901
6080 -33901 31817 24958 36635 36140 44386 44486 41144 37929 23465 30617 -609 28175 20407 -2550
6066b550l032k735m32l0748k112K6261L7748J6890L0565p0520J3034K8411o0393
6053a9613J8063K2137J8903M698M019l5785P059k5104j4571k4934K5825K2248
6041B945l833k0093K363M4976j1325p359K517K0666l8114j3411l1888N7270Q57
6028E571K1349o278k6293K4613J5158j8878R614R783N061J0326j2849K0116j8617
6015C8676l718J9466L4677k1020j4014J6101l1961K1656J4032L0746K3478k2847
6003A05272k9018J1098K2195q447K1234p362j484M504Q661m1834M058o027K6835
5990A09685j9728j6948J5810J7955r667K292K3407p222O498P623J517k4097m58
5977A06667m396P81j9763K4861o387K9201N3393M562k4972L199j4157k7564J080
$$ plain form
6066 -2550 -5582 -8317 -8749 -39497 -41609 -15348 22400 39290 69855 -665 12369 40780 -19613
6053 -19613 -1550 20587 39490 44188 48207 12422 19481 -5623 -20194 -45128 -19303 2945
6041 2945 -888 -20981 -18618 26358 15033 7674 10191 30857 -7257 -20668 -52556 4714 5571
6028 5571 26920 20642 -5651 18962 34120 15242 24856 34639 39700 50026 37177 57293 38676
6015 38676 34958 54424 89101 68081 54067 70168 38207 59863 73895 104641 128119 105272
6003 105272 76254 87352 109547 101100 122334 114972 113488 117992 126653 84819 88877 82850 109685
5990 109685 89957 73009 88819 106774 97107 99399 122806 115584 122082 129705 131222 107125 106667
5977 106667 102271 103052 83289 108150 101763 130964 184357 188919 163947 167146 152989 125425 126505
5964A26505k4938M7131J8304l2981k054K3959q330J3875R028L3797l2310o372
5952A65614K1301O290j5151P339J0983K4743M290n650L58l4832K6692r020M428
5939B07385K1535K5347K975j3109K1694J1889J6722K9368j2044l539N580Q909
5927C22712L051J4114M0920J3539m824k2756K4299J2035L7818k540j2923L892
5915D29337k5780N5309J0675K7279K6627J2243r753p522M736R829J3878j461N7195
5902F02592K5448J761J4207l3039L0885M3747J2908R0262M2498P9R862O7578M3303
5889I52091L4516J3093K5458P494J1125M0115L8744K0137k0577K6882K040M9490
5877A200608J5981L5826P9621l10M3950O0213K5208N5428N3137R0626M5753J260
$$ plain form
5964 126505 101567 148698 167002 134021 131967 155926 147596 161471 170499 204296 171986 165614
5952 165614 186915 193205 178054 185393 196376 221119 225409 219759 220117 185285 211977 202957 207385
5939 207385 228920 254267 257242 244133 265827 277716 294438 323806 311762 308223 313803 322712
5927 322712 325763 339877 380797 394336 389512 366756 391055 403090 440908 438368 425445 429337
5915 429337 403557 458866 469541 496820 523447 535690 525937 518415 523151 532980 546858 545397 602592
5902 602592 628040 629801 644008 610969 641854 685601 698509 788771 831269 831348 841210 908788 952091
5889 952091 986607 999700 1025158 1032652 1043777 1083892 1122636 1142773 1122196 1149078 1151118 1200608
5877 1200608 1216589 1252415 1332036 1331726 1375676 1435889 1461097 1516525 1569662 1660288 1706041 1707301
5865A707301L3334P6519L1882J9551Q482J07499M0007j225Q3207N3860M7352J2945
5853B220714K1295O5317J0393J4622N4946J15627P4502K0941N7481R0102O6606
5842B812546P0339N2131M0625P0093K0727L1539M7595j5105l6463m7300n4502
5831B992225j37006q3414o2980r9756o2736j14189r6467o9963p6745j01992o3301
5820B023676j01799r5754l9013o7233k8081m4052k5648n3300n5989m2109l2139
5809A438559M1807J104K5907j1717q595m6577m185L265J9479J7941l152j6691
5797A457145K215k3556k1047o634l8979j0744N212J2352k0006J7661k2165r4m7975
5784A303385J9752L2104l7276K7389j1247J1584P378P8268P738q730J0211L7559
$$ plain form
5865 1707301 1740635 1817154 1849036 1868587 1877069 1984568 2024575 2023350 2106557 2160417 2207769 2220714
5853 2220714 2242009 2307326 2317719 2332341 2387287 2502914 2577416 2598357 2655838 2745940 2812546
5842 2812546 2882885 2935016 2975641 3045734 3066461 3098000 3145595 3130490 3094027 3046727 2992225
5831 2992225 2855219 2771805 2708825 2609069 2546333 2432144 2335677 2265714 2188969 2086977 2023676
5820 2023676 1921877 1826123 1787110 1719877 1691796 1647744 1622096 1568796 1512807 1470698 1438559
5809 1438559 1480366 1481470 1507377 1495660 1487065 1440488 1436303 1439568 1459047 1476988 1473836 1457145
5797 1457145 1459360 1435804 1414757 1408123 1369144 1358400 1363612 1375964 1355958 1373619 1351454 1351360 1303385
5784 1303385 1323137 1355241 1317965 1345354 1334107 1345691 1353069 1431337 1439075 1430345 1440556 1478115
5772A478115J600L0307O0897N487L1546N7267N6507L7395o276O9263O6260L6469
5760A924837P9288O2221J44981M5563O9476O4546R6522J52219J20360K12540J62798
5749C135351J96569K33104K44012K96467L93774M44324M09787M07005M45222M94666
5739F700281O73208Q42893J011856J178184J278315J147370P49653J76496l39379
5730A3418877o43975o37288n25776o29757q79770j070668j108214j023645q61133
5721F038651o29593m73582m16005l09899k06729k06154k22001j54940j21599j90492
5711C107657j96397r2384j51850n4808j19815j13770o1242p0941o0979l121n3915
5700B128435l0422J6345J7980N6424O5220R6099Q9024M0986m5928o5488r0188
$$ plain form
5772 1478115 1479715 1510022 1570919 1576406 1607952 1665219 1721726 1759121 1752845 1822108 1888368 1924837
5760 1924837 2004125 2066346 2211327 2256890 2326366 2390912 2487434 2639653 2760013 2972553 3135351
5749 3135351 3331920 3565024 3809036 4105503 4499277 4943601 5353388 5760393 6205615 6700281
5739 6700281 7373489 8216382 9228238 10406422 11684737 12832107 13581760 13758256 13418877
5730 13418877 12774902 12137614 11611838 10982081 10102311 9031643 7923429 6899784 6038651
5721 6038651 5409058 4935476 4519471 4209572 4002843 3796689 3574688 3419748 3298149 3107657
5711 3107657 2911260 2818876 2667026 2612218 2492403 2378633 2317391 2246450 2185471 2182350 2128435
5700 2128435 2098013 2114358 2132338 2188762 2253982 2350081 2439105 2480091 2434163 2368675 2278487
5689B278487p0760m8840r3313q8615j02869j31574j46541j26713o7961r3642n6685
5678A250974o9344r7074m9342k5266k3432o1237k2960k6518j806p6799o1296j5596
5666G20304J9142M336k2149l4353r46R640K11o8022k6651N714j9646j6459J135
5653E72256K4649O113q722o5093l891l1839o1853M6143J5951l6562j285j8940
5641D36927n500m913K1154J6872j980k823k4169J0343k3862K49J798m0695J5183
5628C98584k0713K475L0553K1178m7369n6910j6199J7077j4484J1241L5680L4923
5616C96036n7742j2531k5927L9412J5857L498K175J345J5092j8005j4426J9521
5604C64305p829N379O618O309K6029o994k6839Q626K4105j8716o913J3680K0758
$$ plain form
5689 2278487 2207727 2158887 2065574 1976959 1874090 1742516 1595975 1469262 1401301 1307659 1250974
5678 1250974 1181630 1084556 1035214 1009948 986516 925279 902319 875801 873995 797196 735900 720304
5666 720304 739446 743782 721633 687280 686334 695974 696185 628163 601512 607226 587580 571121 572256
5653 572256 596905 603018 594296 529203 525312 493473 431620 477763 493714 457152 455867 436927
5641 436927 431427 426514 447668 464540 462560 459737 435568 445911 422049 422298 424096 383401 398584
5628 398584 377871 380346 410899 432077 384708 327798 311599 328676 314192 325433 361113 396036
5616 396036 338294 325763 299836 339248 355105 358603 360778 362123 377215 359210 344784 364305
5604 364305 356476 361855 368473 374782 400811 393817 366978 375604 399709 380993 374080 387760 408518
5591D08518k1164j334M4452p982k3918K7516j226L3406N059J7269j7426k2247
5579D40923k145k5627K679Q849R178N8627J6616k8854L6986L4029M4371j0186
5567E85446o9161j1060L7839L2973J3134J9437j520J7282J6954N1028J0680k5601
5555F77431L7850M5880M74K8331J7170J7292O084p219L8325m5668j1419L1983
5543H36514l073M5051m0722M574J5109J9102o164j4410M5412N645R566J2160K5765
5530I54529M8381P1615Q220j1290L1899k7963M9269K4861K2650L9131j93O3133
5518A274242J2663P0791L6749L6063K7827J6344Q1057N4156N627O3436N3426M5514
5506A777895O7467N6691P5522K9469M0360O2041L3665O2220Q3030L2475M2951
$$ plain form
5591 408518 387354 386020 430472 422490 398572 426088 424862 458268 463327 480596 463170 440923
5579 440923 438778 413151 415830 424679 433857 492484 509100 480246 517232 551261 595632 585446
5567 585446 516285 505225 543064 576037 589171 608608 607088 624370 641324 692352 703032 677431
5555 677431 715281 761161 761635 789966 807136 824428 830512 823293 861618 815950 804531 836514
5543 836514 833441 878492 837770 842344 857453 876555 870391 855981 901393 907038 916604 928764 954529
5530 954529 1002910 1074525 1082745 1071455 1103354 1075391 1124660 1149521 1172171 1211302 1211109 1274242
5518 1274242 1286905 1357696 1394445 1430508 1458335 1474679 1555736 1609892 1615519 1678955 1732381 1777895
5506 1777895 1845362 1902053 1977575 2007044 2047404 2109445 2143110 2205330 2288360 2320835 2363786
5495B363786Q9280Q1596Q8988Q4362J06813J28796J57180J20078J56175J29111
5485C506165J37571K38329K18326K41269K85599L22907M34406M45813N19971M92691
5475F843047M74668N11044N11726N93971P26957Q71409J079313J311742J576244
5466A4500121J618759J391984R73370K85965k01253o95217j036904p61234l16785
5457A5758806l40578o94464j109036j315345j482508j431067j108833q58121p10422
5448F708432m94779m57079l07701k89686j46920j49135j44230j38172n1781Q062
5438D537011j8921O2639J06079R9813Q2160L5008j02607j19384j53586j20648
5428D407564q6612p1131j16059j53388k09087j57292j68333j93120j45876p5461
$$ plain form
5495 2363786 2453066 2534662 2623650 2708012 2814825 2943621 3100801 3220879 3377054 3506165
5485 3506165 3643736 3882065 4100391 4341660 4627259 4950166 5384572 5830385 6350356 6843047
5475 6843047 7317715 7828759 8340485 8934456 9661413 10532822 11612135 12923877 14500121
5466 14500121 16118880 17510864 18484234 18770199 18568946 17873729 16836825 16075591 15758806
5457 15758806 15418228 14723764 13614728 12299383 10816875 9385808 8276975 7418854 6708432
5448 6708432 6213653 5756574 5448873 5159187 5012267 4863132 4718902 4580730 4528949 4537011
5438 4537011 4518090 4580729 4686808 4786621 4868781 4903789 4801182 4681798 4528212 4407564
5428 4407564 4320952 4249821 4133762 3980374 3771287 3613995 3445662 3252542 3106666 3031205
5418C031205j50754q7359n6042o4510j1446o7563M463p242o8312k2344k7904j2348
5406B459844J1228L3039k878J9602J7626k3472L1263L5203K2277J8695K4229L9884
5394B686540k191Q2238M6743k7198N1298O746K6593L922l8765m1616j3528K0257
5382B801039m1005o0290L957k2622n8789n3684k844k3088p2191k351m0567l3845
5370B393720k5970J5178k6818L0605l3651j113k600r410m4098K8042J5176R468
5358B348529l384K547P0524L0419K5115L9331M3682L64J7762j8888J1935N670
5346B573606j0069j3939N3212k3064j1340l4732p781L873j1469l237k09r587j9801
5333B485463j5551m4789m4166l8231q4812m0349m4166q1647R438q5767p5590j3990
$$ plain form
5418 3031205 2880451 2793092 2737050 2672540 2661094 2593531 2597994 2590752 2522440 2500096 2472192 2459844
5406 2459844 2471072 2504111 2501233 2520835 2538461 2514989 2546252 2581455 2603732 2622427 2646656 2686540
5394 2686540 2684349 2766587 2813330 2786132 2837430 2844176 2870769 2874691 2835926 2794310 2780782 2801039
5382 2801039 2760034 2699744 2703701 2681079 2622290 2568606 2565762 2542674 2470483 2468132 2427565 2393720
5370 2393720 2367750 2382928 2356110 2386715 2353064 2351951 2349351 2339941 2295843 2323885 2339061 2348529
5358 2348529 2345145 2347692 2418216 2448635 2473750 2513081 2556763 2557127 2574889 2556001 2567936 2573606
5346 2573606 2563537 2549598 2602810 2579746 2568406 2533674 2525893 2529766 2518297 2515060 2514851 2505264 2485463
5333 2485463 2469912 2425123 2380957 2342726 2257914 2217565 2173399 2091752 2101190 2015423 1939833 1925843
5321A925843n6021r0690l8404m0153n8545j9772k2098m7604l9960n6143m3606
5310A412847J8226r350n8382k6538n5732n75k4254l3947l6827j8963j7595m5256
5298A103654j0756J8711J1286m6916J123j619l801l8581q163K7134N31n2063j6476
5285I84064j05K1786l2419m3454n8434L8434K7718k0802m133K993k6485k1617
5273H67546J5257j735l0208p276J9422l0767j4559k420r9k2544m2476J3993J4778
5260G78912n3229J7484M8142l0978j3102l6361k7835J7332m571j2013J034K930
5248F87745r190J3148J4993M040k4496j3027J608n215R620J3805l283k3551K715
5235F68912k5808L3232m0020J0692L5707j1820M466k837j1604l858p812j412J2916
$$ plain form
5321 1925843 1869822 1779132 1740728 1700575 1642030 1622258 1600160 1552556 1512596 1456453 1412847
5310 1412847 1431073 1421723 1363341 1336803 1281071 1280496 1256242 1222295 1185468 1166505 1148910 1103654
5298 1103654 1092898 1111609 1122895 1075979 1077102 1075483 1071682 1033101 1024938 1052072 1052603 1000540 984064
5285 984064 983959 1005745 973326 929872 871438 909872 937590 916788 912655 915648 889163 867546
5273 867546 882803 881068 850860 843584 863006 832239 817680 815260 815161 792617 750141 764134 778912
5260 778912 725683 743167 791309 760331 747229 710868 683033 700365 695794 683781 684815 687745
5248 687745 678555 691703 706696 710736 686240 673213 674821 669606 679226 693031 689748 666197 668912
5235 668912 643104 676336 636316 647008 682715 670895 675361 672524 660920 657062 649250 647838 660754
5222F60754K2531j7542J7264k5624j3717n677k9055L1827j571J3616R218J3104
5210F75128j4642j0172K8214M376k1322p34k6991K8692K8132J2283R753M4414
5198G57131l2626J5128L284j9470q658O672j6657M7542k0687R888K265j702J5741
5185G57851M464M906k825M9511j6357l406N147n636l423m3509L884M0210L8288
5172H29105K1302L649r934M5013K5593P281L2992k6732j5202L1754M3721P7721
5160A066263L5938N4183R9154R3334P1672K0783O8050O7417M5861J12787J11734
5149A847176J39648J59438K05267K33055J24440N8626J5154j7819j29166p9694
5139B556125k0051p091l2021j38538j23370j22666j97986j07083j20445r3424
$$ plain form
5222 660754 683285 665743 683007 657383 643666 637989 608934 640761 639190 652806 662024 675128
5210 675128 660486 650314 678528 682904 661582 660848 633857 662549 690681 702964 712717 757131
5198 757131 724505 739633 742917 723447 714789 721461 704804 752346 731659 741547 743812 742110 757851
5185 757851 762315 767221 764396 813907 797550 794144 799291 793655 790232 746723 750607 790817 829105
5172 829105 850407 854056 844122 889135 914728 922009 955001 928269 913067 944821 988542 1066263
5160 1066263 1102201 1156384 1255538 1348872 1420544 1441327 1509377 1576794 1622655 1735442 1847176
5149 1847176 1986824 2146262 2351529 2584584 2709024 2767650 2782804 2764985 2635819 2556125
5139 2556125 2536074 2528983 2496962 2358424 2235054 2112388 1914402 1807319 1686874 1593450
5129A593450p9349q5553P153j3277n0684o624o480m8170n1409K3800j6422j0964
5117A255471j7353l0490j4103j979M5170M346l5090m1768m8833j9854j7020R214
5105A087711J1412l6475k7833k9200k7460J1310n296l2531j2377R619j4328p152
5093I27400R025m95k1670K9029J63l5579k2512M5996J3679m3784R110J2325N815
5080I28502O293M1889n850J6370M3300k272J9171J4836J7337J2035P01L4416q59
5067A125869N9775L1308l2645l0521L2030P6607M431k3957K4224J1518N003L5681
5055A319323j3218l8276L1204N8829K2900K6140K6690J4553O6313L947P273M7349
5043A573027N5134J8668j3104P4951O735J3060O9516O8850M4889M2745J05611
$$ plain form
5129 1593450 1514101 1428548 1435701 1422424 1371740 1365116 1358636 1310466 1259057 1282857 1266435 1255471
5117 1255471 1238118 1207628 1193525 1191546 1236716 1241062 1205972 1164204 1115371 1095517 1078497 1087711
5105 1087711 1099123 1062648 1034815 1005615 978155 989465 984169 951638 939261 948880 934552 927400
5093 927400 936425 935930 914260 943289 943452 907873 885361 931357 945036 901252 910362 922687 928502
5080 928502 934795 976684 970834 987204 1030504 1028232 1047403 1062239 1079576 1091611 1092312 1126728 1125869
5067 1125869 1185644 1216952 1184307 1153786 1185816 1262423 1266854 1242897 1267121 1278639 1283642 1319323
5055 1319323 1306105 1267829 1299033 1357862 1380762 1406902 1433592 1448145 1514458 1518405 1525678 1573027
5043 1573027 1628161 1646829 1633725 1708676 1715411 1728471 1797987 1866837 1911726 1954471 2060082
5032B060082K9284K9219K9293L9770Q2536O1324N9384k865J2813P5343O5358K4856
5020B566397J7278K9728J28O6152R1340L5467M5058N0854N3728L7302Q6400Q3391
5008C163223Q4429O3201Q3505P4583L9043P2256K1704O564l3023p5861o2033n3069
4996C384522q9529j17139q3597j59237j17300j03287j41562j04859p2196r4342
4986B301474j19556r0461m2401p4507m0399n5417l4003m5213m4943n934j2013
4975A736627k6958p5681L2446N789k4300j3320L911l4478k3987r40R290K0863
4963A609262k470J3919J1578L2717j8170J9750J0021m1685N9465K859n0370j5462
4951A631414Q4030N6117J9131k292L6474l3079K413J03129K7179J2817m037L4513
$$ plain form
5032 2060082 2089366 2118585 2147878 2187648 2270184 2331508 2390892 2388027 2400840 2476183 2541541 2566397
5020 2566397 2583675 2613403 2613531 2679683 2771023 2806490 2851548 2902402 2956130 2993432 3079832 3163223
5008 3163223 3247652 3310853 3394358 3468941 3507984 3580240 3601944 3608508 3575485 3499624 3437591 3384522
4996 3384522 3294993 3177854 3094257 2935020 2817720 2714433 2572871 2468012 2395816 2301474
4986 2301474 2181918 2091457 2049056 1974549 1934150 1878733 1844730 1799517 1754574 1748640 1736627
4975 1736627 1709669 1633988 1666434 1672223 1647923 1634603 1638514 1604036 1580049 1579109 1588399 1609262
4963 1609262 1606792 1620711 1632289 1665006 1646836 1666586 1676607 1634922 1694387 1697246 1646876 1631414
4951 1631414 1715444 1771561 1790692 1788400 1824874 1791795 1794208 1897337 1924516 1937333 1933296 1967809
4939A967809N1424L1119K1816M3402N0957O788Q0546N6710M6703O6795N1984O3679
4927B539732P5636J02504P2599R4765J11206O8005M0290K6971M8212R385j2294
4916C177011j1655K1077n2424m9481q9526m5915o7826j02671p9360o1623m3725
4905B593882p6046n1080k0838j7465p0780m3477K1346m7219l7169j6801k3210
4894B211143O4324O065M367L3529k4218j7066K0265k1856J5983m0034L1055r825
4882B273732M1483q876L219J8857P9227J6588L4063L6787L8952M4260K2918M8793
4870B650003M3761Q3058O4267J15481L4662K5193M6220K1459K9734P4817M1751
4859C230406J1661N2701l352K7294O433P0462M1211K5515L8148P489P4113O5844
$$ plain form
4939 1967809 2019233 2050352 2072168 2115570 2166527 2173315 2253861 2310571 2357274 2424069 2476053 2539732
4927 2539732 2615368 2717872 2790471 2885236 2996442 3064447 3104737 3131708 3179920 3189305 3177011
4916 3177011 3165356 3186433 3134009 3084528 2995002 2949087 2881261 2778590 2699230 2637607 2593882
4905 2593882 2517836 2466756 2445918 2428453 2357673 2314196 2335542 2288323 2251154 2234353 2211143
4894 2211143 2275467 2281532 2285899 2319428 2295210 2278144 2298409 2276553 2292536 2252502 2283557 2273732
4882 2273732 2315215 2306339 2309558 2328415 2407642 2424230 2458293 2495080 2534032 2578292 2601210 2650003
4870 2650003 2693764 2776822 2841089 2956570 2991232 3016425 3062645 3084104 3113838 3188655 3230406
4859 3230406 3242067 3294768 3291416 3318710 3325143 3395605 3436816 3462331 3500479 3507968 3582081 3647925
4847C647925J3965K4333K5799L7215M6587K5603N5569R771J03024L6062M0416
4836D066269K3977N0504L4142O8805N3895P0300N6499M6784N9696N6386P6767
4825D664024N1475L1354O4296J00987P4901N3181J02613N3285M6710Q2321N2881
4814E378028R2264N3522Q0441N7529P6702Q7958O1708O1023R0757O2110J28508
4803F230550O5026J20431J07650P3391Q7062Q9002Q5539O0272O6210J08841J42624
4792G236598J16237J53532J22256J39050J06132J45117J28956J60925J89923K29508
4782H728234J80303J89043K09166K01161K38458K16144K04887K16382K86851K76695
4772A0947324K94575L30141L34695L48190L50321L59625M33297M19159M28808
$$ plain form
4847 3647925 3661890 3686223 3712022 3749237 3795824 3821427 3876996 3886767 3989791 4025853 4066269
4836 4066269 4090246 4140750 4174892 4243697 4297592 4367892 4424391 4471175 4530871 4587257 4664024
4825 4664024 4715499 4746853 4811149 4912136 4987037 5040218 5142831 5196116 5242826 5325147 5378028
4814 5378028 5470292 5523814 5604255 5661784 5738486 5826444 5888152 5949175 6039932 6102042 6230550
4803 6230550 6295576 6416007 6523657 6597048 6684110 6773112 6858651 6918923 6985133 7093974 7236598
4792 7236598 7352835 7506367 7628623 7767673 7873805 8018922 8147878 8308803 8498726 8728234
4782 8728234 8908537 9097580 9306746 9507907 9746365 9962509 10167396 10383778 10670629 10947324
4772 10947324 11241899 11572040 11906735 12254925 12605246 12964871 13398168 13817327 14246135
4763A4246135M75244M53158M72991M43919N07125N07502M97438N04070N23066
4754A8630648N30289N35949N74642N80938O31782O26320O14686O83196O95432
4745B4103882P32301P67529P94873Q48728Q63087R60790R76294R97366J033958
4736C2078808J044760J084430J044054J121856J168122J145543J200335J335903
4728D1223811J408184J477054J510742J599008J706763J815433J974509K074303
4720E4789807K195208K370753K520217K749153K987650L259545L555410L901415
4712G8329158M296817M794989N296058N807148O587317P335091Q112584Q889245
4704A29448407R701676J0283172J0948593J1658115J2578360J3818036J5119371
$$ plain form
4763 14246135 14721379 15174537 15647528 16091447 16598572 17106074 17603512 18107582 18630648
4754 18630648 19160937 19696886 20271528 20852466 21484248 22110568 22725254 23408450 24103882
4745 24103882 24836183 25603712 26398585 27247313 28110400 29071190 30047484 31044850 32078808
4736 32078808 33123568 34207998 35252052 36373908 37542030 38687573 39887908 41223811
4728 41223811 42631995 44109049 45619791 47218799 48925562 50740995 52715504 54789807
4720 54789807 56985015 59355768 61875985 64625138 67612788 70872333 74427743 78329158
4712 78329158 82625975 87420964 92717022 98524170 105111487 112446578 120559162 129448407
4704 129448407 139150083 149433255 160381848 172039963 184618323 198436359 213555730
4697B13555730J6458296J7404643J7547005J6436819J3903651J0104735N600973
4690C11011852J078203l018432o175348q470121j0259280j2184569j4478307j6457143
4682B41046855j7806850j8167556j7509654j6176432j4477731j2747188j1144051
4675A33017393r726724q452746p389225o441784n633722m917710m348384l842884
4667H2264214l363225k960909k596257k252862k038313j728030j497175j339503
4659F4487940j131785r60285q20178o79521n14768l88305k92665k11747j36573
4650E9352113m0058R2354K02437L03978L96447N08863O27855P49923Q63757R98414
4640F4056083J127993J281693J424066J585484J712345J951021K155935K423539
$$ plain form
4697 213555730 230014026 247418669 264965674 281402493 295306144 305410879 311011852
4690 311011852 312090055 309071623 302896275 294426154 284166874 271982305 257503998 241046855
4682 241046855 223240005 205072449 187562795 171386363 156908632 144161444 133017393
4675 133017393 123290669 114837923 107448698 101006914 95373192 90455482 86107098 82264214
4667 82264214 78900989 75940080 73343823 71090961 69052648 67324618 65827443 64487940
4659 64487940 63356155 62395870 61575692 60896171 60381403 59993098 59700433 59488686 59352113
4650 59352113 59312055 59404409 59606846 59910824 60307271 60816134 61443989 62193912 63057669 64056083
4640 64056083 65184076 66465769 67889835 69475319 71187664 73138685 75294620 77718159
4632G7718159K756911L067592L423197L849224M306284M790525N362059O066210
4624A11340161O691904P346026Q034438Q670737R176613R769217J0495010J1270393
4616A82794499J2242245J3189134J4024880J4410438J4249151J3124576J1037592
4609B75072515Q282204M977867J631674j533767m267885o401259q182663r858995
4601B59719691j1593771j3310891j4756764j5659260j5894555j5375152j4449506
4594A58679792j3248408j1928382j0629197r418457q421089p472035o658646n999302
4586H4904276n332506m789902m303486l911262l578403l221375k970517k726490
4578E4070335k560510k347723k137291j999663j885688j754755j631989j521508
$$ plain form
4632 77718159 80475070 83542662 86965859 90815083 95121367 99911892 105273951 111340161
4624 111340161 118032065 125378091 133412529 142083266 151259879 161029096 171524106 182794499
4616 182794499 195036744 208225878 222250758 236661196 250910347 264034923 275072515
4609 275072515 283354719 288332586 289964260 288430493 284162608 277761349 269578686 259719691
4601 259719691 248125920 234815029 220058265 204399005 188504450 173129298 158679792
4594 158679792 145431384 133503002 122873805 113455348 105034259 97562224 90903578 84904276
4586 84904276 79571770 74781868 70478382 66567120 62988717 59767342 56796825 54070335
4578 54070335 51509825 49162102 47024811 45025148 43139460 41384705 39752716 38231208
4570C8231208j455162j357494j314244j216737j201913j098331j042011j016600
4562B8528716r47772q85061q84724q35550p23345p33567p03275o98949o50922
4553B1465551o42327o07894n59232n64407n21244n08395m70237m56486m31605
4544A6703724m14253l94674l96200l92901l61412k97522k80973l19460l05100
4535A3541229k33128k49087k77505k38974k12659k32664k20982j98628k16679
4526A1460923k21630j54838j79854k12857j64994j70555j81908j51743j24062
4517I898482j67686j64842k02316j14214j08894j13786j49932j22965j27596j85658
4507H440593r8535j15141j43882j14940j18840j75839j83668j06818j44500j84000
$$ plain form
4570 38231208 36776046 35418552 34104308 32887571 31685658 30587327 29545316 28528716
4562 28528716 27580944 26695883 25811159 24975609 24252264 23518697 22815422 22116473 21465551
4553 21465551 20823224 20215330 19656098 19091691 18570447 18062052 17591815 17135329 16703724
4544 16703724 16289471 15894797 15498597 15105696 14744284 14446762 14165789 13846329 13541229
4535 13541229 13308101 13059014 12781509 12542535 12329876 12097212 11876230 11677602 11460923
4526 11460923 11239293 11084455 10904601 10691744 10526750 10356195 10174287 10022544 9898482
4517 9898482 9730796 9565954 9363638 9249424 9140530 9026744 8876812 8753847 8626251 8440593
4507 8440593 8342058 8226917 8083035 7968095 7849255 7673416 7489748 7382930 7238430 7054430
4497G054430j47167j01712j62108j57409j12161j01569j31473j00148j10974j11954
4487E817755r8860n2237p9347j09134q9406p3734p4423r1811j30697p2795l1104
4476D914207p4838p6462j01626m8701k4326q2583o8796p7997n6691r8894j3482
4465D189811m7225m7063n7537p8419m567j9620o3454n2344l6394o9428j6264k4684
4453C672812q6250n6946l2801m2899p390p6645o1054m7455k5251J5704k6131r8321
4441C127373n5176n7815j0741j7643k299m5686m9088j7325J8821J819P771L7652
4429B937663K1983J3066l401q561L412o428R436P838J0971k0442J6198l2176m7916
4416B901643N0307J4608p0860j6252l6266k6706M324J305j3844j6816j0209l7628
$$ plain form
4497 7054430 6907263 6805551 6643443 6486034 6373873 6272304 6140831 6040683 5929709 5817755
4487 5817755 5718895 5666658 5587311 5478177 5388771 5315037 5240614 5148803 5018106 4945311 4914207
4476 4914207 4839369 4762907 4661281 4612580 4588254 4505671 4436875 4358878 4302187 4203293 4189811
4465 4189811 4142586 4095523 4037986 3959567 3955000 3935380 3871926 3819582 3783188 3713760 3697496 3672812
4453 3672812 3586562 3529616 3496815 3453916 3446526 3369881 3308827 3261372 3236121 3251825 3225694 3127373
4441 3127373 3072197 3014382 3003641 2985998 2983699 2938013 2888925 2871600 2890421 2892240 2900011 2937663
4429 2937663 2959646 2972712 2969311 2960750 2964162 2957734 2967170 2975008 2985979 2965537 2981735 2949559 2901643
4416 2901643 2951950 2966558 2895698 2879446 2843180 2816474 2820798 2822103 2808259 2791443 2781234 2743606
4404B743606K5995K6084N717J83J6259m3674l7045L1904L8487N0901M2034O192
4392B906643j3255P015M3510P1510R0585L9803O3419Q9774P4315P1710J26808
4381C571837R3057N0835J13997J07233O1063J5934m879j0009m2157n8438m4161
4370C854312o9368r4269r6711r5839r4162j21952j35315q6012o3135p8383p9299
4359B839867p3987n5812p0196m1178n2400k7972l3422n5499j8227p007K7381p354
4347B424194K795J1472j6802L769j4296j9999N223q658O030P319M8186p174n190
4334B436869k5497r369L2892l715J3271p389l8204k4578L9318J2760j1466k9423
4322B385469j2210j456j5195r930j5848m497K1525L401l592J1902J9640M3186
$$ plain form
4404 2743606 2769601 2795685 2801402 2801585 2817844 2774170 2737125 2769029 2807516 2858417 2900451 2906643
4392 2906643 2893388 2900403 2943913 3015423 3106008 3145811 3209230 3299004 3373319 3445029 3571837
4381 3571837 3664894 3715729 3829726 3936959 3998022 4013956 4009077 3999068 3956911 3898473 3854312
4370 3854312 3784944 3690675 3593964 3498125 3403963 3282011 3146696 3060684 2997549 2919166 2839867
4359 2839867 2765880 2710068 2639872 2598694 2546294 2518322 2484900 2429401 2411174 2404167 2431548 2424194
4347 2424194 2426989 2438461 2421659 2425428 2411132 2391133 2396356 2387698 2393728 2401047 2449233 2442059 2436869
4334 2436869 2411372 2402003 2434895 2431180 2444451 2437062 2398858 2374280 2413598 2426358 2414892 2385469
4322 2385469 2373259 2371803 2356608 2346678 2330830 2326333 2347858 2351259 2347667 2359569 2379209 2422395
4310B422395J6932L3058R07N5024M7526j1381R4545N6693Q2230O2932O6107O2833
4298B989801J06918J13148Q9507P2880P7321O7932O340M3990J3931j4628k7902
4287C539238q265j7354j15972o9876n8445p9486r3831n8289P946n6579q2077n7200
4275B849810l5652j3271k1137q713r262p9461m1084J2963j1330M159K4959L0719
4263B702700n97k0605k4358M9014K3953P178J4985O295k2168K6438J4560O7199
4251B844594k7821n587j4898J6518N017K3078L5777j9534M9252j9283j646J3686
4239B899153N8667L6931O958k5219r06N7255p854k5571P468P533O0044k7776K3505
4226C070188J7128N6772L9042M5036J0817M1395M0965K2777j5964K5621L2294
$$ plain form
4310 2422395 2439327 2472385 2473292 2528316 2575842 2564461 2659006 2715699 2797929 2860861 2926968 2989801
4298 2989801 3096719 3209867 3299374 3372254 3449575 3517507 3523847 3567837 3581768 3567140 3539238
4287 3539238 3530973 3513619 3397647 3327771 3269326 3189840 3096009 3037720 3045666 2989087 2907010 2849810
4275 2849810 2814158 2800887 2779750 2771037 2761775 2682314 2641230 2654193 2642863 2647022 2671981 2702700
4263 2702700 2702103 2681498 2657140 2706154 2730107 2737285 2752270 2758565 2736397 2762835 2777395 2844594
4251 2844594 2816773 2811186 2796288 2812806 2817823 2840901 2876678 2857144 2906396 2887113 2885467 2899153
4239 2899153 2957820 2994751 3001709 2976490 2975584 3032839 3024985 2999414 3006882 3014415 3074459 3046683 3070188
4226 3070188 3087316 3144088 3183130 3228166 3238983 3280378 3321343 3344120 3328156 3353777 3386071
4215C386071K0532N89J9657K6073P72j6937j5294l120J7813p676k3916l6188J6820
4202C385196J0101n8776o851j3675k6073P173o038l9935j6323n8445l3424K6994
4190C169924J7269k5744N5881L8691k8279j5672J9110K9144k5669M2308L9591
4179C316554L196L0604L6137J7830K3347Q212l2009M8548o44L0950K4700L620
4167C511045L4497j1727K8809J1513L0727M5553M9898L4213L1145J2564J6064
4156C794301k0880L0297N3391M3345K0516q184M8799m605K8170R687P0717m771
4144D060783M3017L4705m546K7301O1707O0448M048L3730M1578L2806M6602P4000
4132D516179K5694O3779Q8238N7942L7154Q2649Q9898J14522J02749R7068O7159
$$ plain form
4215 3386071 3406603 3407192 3426849 3452922 3453694 3436757 3421463 3418343 3436156 3428480 3404564 3368376 3385196
4202 3385196 3395297 3336521 3329670 3315995 3289922 3297095 3291057 3251122 3234799 3176354 3142930 3169924
4190 3169924 3187193 3161449 3217330 3256021 3227742 3212070 3231180 3260324 3234655 3276963 3316554
4179 3316554 3319750 3350354 3386491 3404321 3427668 3435880 3403871 3452419 3451775 3482725 3507425 3511045
4167 3511045 3545542 3533815 3562624 3574137 3604864 3650417 3700315 3734528 3765673 3778237 3794301
4156 3794301 3773421 3803718 3857109 3900454 3920970 3912786 3961585 3956980 3985150 3994837 4065554 4060783
4144 4060783 4103800 4138505 4133959 4161260 4222967 4283415 4287463 4321193 4362771 4395577 4442179 4516179
4132 4516179 4541873 4605652 4693890 4751832 4788986 4871635 4961533 5076055 5178804 5275872 5343031
4121E343031R2860J32196J10070J01080Q3509J43989J23793J59561J28044J35435
4111F553568J66108K23204K12500J17552J82964K18876K38655K09347J51888J91562
4101H466224J48792J19255Q9420J25453P2499N6036Q8406P1667M8776L9831M3076
4090I369435O2461J2830M421M83J247j2160p268K6581k1952k1009k5555j9074
4078I370440n518k5438l9291k6399L5031k1197k5793M9655M6982O5364N2665J04762
4066I581263R2452Q9939J26631J67194K54605K50747K71650L13057K59171K30140
4056A1636849J57654R3625K4169r3538j24319l7459q6110o4520j37918j68896
4046A1199537k15933k33049j24252j72070j93039j26137n0850n3730n9417q5322
$$ plain form
4121 5343031 5435891 5568087 5678157 5779237 5862746 6006735 6130528 6290089 6418133 6553568
4111 6553568 6719676 6942880 7155380 7272932 7455896 7674772 7913427 8122774 8274662 8466224
4101 8466224 8615016 8734271 8823691 8949144 9021643 9077679 9166085 9237752 9286528 9326359 9369435
4090 9369435 9431896 9444726 9449147 9449630 9450877 9438717 9431449 9458030 9436078 9415069 9389514 9370440
4078 9370440 9364922 9339484 9300193 9273794 9308825 9287628 9261835 9311490 9358472 9423836 9476501 9581263
4066 9581263 9673715 9763654 9890285 10057479 10312084 10562831 10834481 11147538 11406709 11636849
4056 11636849 11794503 11888128 11912297 11818759 11694440 11656981 11570871 11506351 11368433 11199537
4046 11199537 10983604 10750555 10626303 10454233 10261194 10135057 10084207 10030477 9971060 9885738
4036I885738m3657m9128j8503O255o6758p700j9004k3162j2564M521l1112j2832
4024I612094m9455n8690l9505n9022m7253l4552r0553m2389m2299q2215p7294
4013H988867q4241k2658N471m3435k8862k7318l8985K3842j7135L9335L9640O0592
4001H895113L1726Q6563Q0679N6221J16766R6390J09604J10487J11031J52380
3991I846960J42724J07186K28194J84912K10829J99656J86200K20132J70913K08917
3981A1706623K16518K45857K82349K98443K88267L84046L05794L28510L79641
3972A4436048L84665L97057L84055M32485L76757L07320K87794K19519J39681
3963A7365381K4080p0528r5277j88498k94300k91110l88974m31746l96769m83711
$$ plain form
4036 9885738 9842081 9792953 9774450 9780705 9713947 9706247 9687243 9664081 9651517 9656038 9624926 9612094
4024 9612094 9562639 9503949 9464444 9405422 9358169 9323617 9233064 9190675 9148376 9066161 8988867
4013 8988867 8904626 8881968 8887439 8844004 8815142 8787824 8748839 8772681 8755546 8794881 8834521 8895113
4001 8895113 8926839 9013402 9094081 9150302 9267068 9363458 9473062 9583549 9694580 9846960
3991 9846960 9989684 10096870 10325064 10509976 10720805 10920461 11106661 11326793 11497706 11706623
3981 11706623 11923141 12168998 12451347 12749790 13038057 13422103 13727897 14056407 14436048
3972 14436048 14820713 15217770 15601825 16034310 16411067 16718387 17006181 17225700 17365381
3963 17365381 17389461 17318933 17223656 17035158 16740858 16449748 16060774 15629028 15232259 14748548
3953A4748548m37277m32010m29503m61640m42083m03309l49997k89576l10332
3944A1192821l28515k77329k37084k65648k24514j73184j75701k07518k08747
3935I094581j69865j69364j17230q2020j35373j33943j14685m3728o5977q5626
3925G976770o9040l3390m3952o7941k8169m9979k9787p55p1898l0633K3426o8293
3913G506359L6328L6040Q763L5120J0887J1658J5640M3319P5433L9943L3339O4293
3901G917122J06014N1517Q6425Q7935O2383J46381P9018R7861J44336J19374J26717
3890I025083J23851J17460J36664J76033J21117J73997J71762J25649P9131K9590
3880A0280337K8104K6133J2368r1144o0793j13786r3356j19160j44907j87048
$$ plain form
3953 14748548 14311271 13879261 13449758 12988118 12546035 12142726 11792729 11503153 11192821
3944 11192821 10864306 10586977 10349893 10084245 9859731 9686547 9510846 9303328 9094581
3935 9094581 8924716 8755352 8638122 8556102 8420729 8286786 8172101 8128373 8062396 7976770
3925 7976770 7907730 7874340 7830388 7762447 7734278 7684299 7654512 7653757 7581859 7551226 7574652 7506359
3913 7506359 7542687 7578727 7587490 7622610 7633497 7645155 7660795 7704114 7779547 7819490 7852829 7917122
3901 7917122 8023136 8074653 8161078 8249013 8311396 8457777 8536795 8634656 8778992 8898366 9025083
3890 9025083 9148934 9266394 9403058 9579091 9700208 9874205 10045967 10171616 10250747 10280337
3880 10280337 10308441 10334574 10346942 10255798 10195005 10081219 9987863 9868703 9723796 9536748
3870I536748j95367j96505j68216k32425j84545j67173j92595k26968k06539j72200
3860G594215j87979j29103j36090j96088j50566j33673j60972j30956j35880j01040
3850F131868j05152j30606q8278j31650j16691m5600j17210j19988n0866r0045
3840E135782o1961p0804j08849q1922m5447l6640j11903m8140q1314n7720o3882
3829D367200l8504j8155m9180l7397m1067o0781m4619n9786j2949J7801l7391
3818C985172m1572l933r863o1724r125j2809k5786L9743K1724m1200o1845k1251
3806C757531m4016k2864L1677M3433m765R632J7028K4248K559K2403J9165k543
3794C853488J8804J8559J8368K5477J7074N893j8129j1774k8975m0475k7047o6274
$$ plain form
3870 9536748 9341381 9144876 8976660 8744235 8559690 8392517 8199922 7972954 7766415 7594215
3860 7594215 7406236 7277133 7141043 6944955 6794389 6660716 6499744 6368788 6232908 6131868
3850 6131868 6026716 5896110 5807832 5676182 5559491 5513891 5396681 5276693 5225827 5135782
3840 5135782 5073821 5003017 4894168 4812246 4766799 4730159 4618256 4570116 4488802 4431082 4367200
3829 4367200 4328696 4310541 4261361 4223964 4182897 4122116 4077497 4017711 4004762 4022563 3985172
3818 3985172 3943600 3939667 3929804 3868080 3858955 3846146 3820360 3860103 3881827 3840627 3778782 3757531
3806 3757531 3713515 3690651 3722328 3765761 3760996 3770628 3787656 3811904 3814463 3836866 3856031 3853488
3794 3853488 3872292 3890851 3909219 3934696 3951770 3957663 3939534 3927760 3898785 3858310 3831263 3764989
3782C764989j9603O053l0194n1846p229n8815j2911m472k5345l169Q211J6606
3770C582275p57J4988L5855M473K3623K5900L6684N4645L1889K8414M7009P4316
3758C959314O0737m567L6290M8957K340N2288L1168J2129P041p606j8445n1039
3746D128607m4863k3623k7843m3349n7493l6388n2190n0518o8806n5913j07761
3735C559860p3836l9965n6582q5442l1052j9050o6208r4831q4160r430l6714o2106
3723B900484j0502l9431j9062l4964q2578l2260J986j4344l6729l0884m9398l4750
3711B517568K428l5312m466m4459l587j5736l8595j1748k0091o743k8257j6359
3699B294643p010m561n7464J239K1713m0824l3195j0043j0760M4919m6884l4928
$$ plain form
3782 3764989 3745386 3751439 3721245 3669399 3662170 3603355 3590444 3585972 3560627 3557458 3565669 3582275
3770 3582275 3581518 3596506 3632361 3636834 3660457 3686357 3723041 3777686 3809575 3837989 3884998 3959314
3758 3959314 4020051 4015484 4051774 4100731 4103071 4155359 4186527 4198656 4205697 4198091 4179646 4128607
3746 4128607 4083744 4060121 4032278 3988929 3931436 3895048 3842858 3792340 3723534 3667621 3559860
3735 3559860 3486024 3446059 3389477 3304035 3272983 3253933 3187725 3092894 3008734 2999304 2962590 2900484
3723 2900484 2889982 2850551 2831489 2796525 2713947 2681687 2683673 2669329 2632600 2601716 2552318 2517568
3711 2517568 2519996 2484684 2480218 2435759 2432172 2416436 2377841 2366093 2346002 2339259 2311002 2294643
3699 2294643 2287633 2283072 2225608 2226847 2248560 2207736 2174541 2164498 2153738 2198657 2151773 2116845
3687B116845k3379J6535o18l711j2091k0425J5696R10r708k4244j5545J2269J2276
3674B064810n888o648K5758R432j2875l3358K0021N5146N3470j6610l2625k3054
3662B097579L7090k659J6377r13k4831r103p86M3547J344l1151Q189l4468J364
3649B101579K9511q600k0477m8844J7067J9643o1302n1661K275k9776l0086m0058
3637A879271l5882k3646J2413j2034r913l7764j3683k8283k7006J2921J2988j977
3625A727405l650l092J7942p0615m1371q226M535j6947k620J4666j0690k7824
3613A579513k2577r512J7067p511n7954K3082j5484L386J3648m1658J9064J4767
3601A515831l2504J4138M584j6442j6358n0254J3801J1722j9614m5322k4219m602
$$ plain form
3687 2116845 2093466 2110001 2109383 2105672 2093581 2073156 2088852 2089762 2080054 2055810 2040265 2052534 2064810
3674 2064810 2058922 2052274 2078032 2087464 2074589 2041231 2061252 2116398 2169868 2153258 2120633 2097579
3662 2097579 2134669 2132010 2148387 2147474 2122643 2113540 2112754 2156301 2157645 2126494 2134683 2100215 2101579
3649 2101579 2131090 2122490 2102013 2053169 2070236 2089879 2028577 1976916 1979191 1949415 1919329 1879271
3637 1879271 1843389 1819743 1832156 1820122 1810209 1772445 1758762 1730479 1703473 1716394 1729382 1727405
3625 1727405 1723755 1720663 1738605 1667990 1626619 1618393 1622928 1605981 1603361 1618027 1607337 1579513
3613 1579513 1556936 1547424 1564491 1556980 1499026 1522108 1506624 1510010 1523658 1482000 1501064 1515831
3601 1515831 1483327 1497465 1502049 1485607 1469249 1418995 1432796 1444518 1424904 1379582 1355363 1350761
3589A350761n000K967m8912J1909K6416N852k6076k9554J8449k1419J5132l0647
3577A269878m4966J571J9910K7982l2289m680K698j8796L0216k428j7369L967
3565A235694P373J2877J3722q072j9795l388j159j2666j1238j1543j334m550r839
3552A186082J1900J0084p774O055n438L092J4411k1415j2447L698M4554J9800
3540A252602k9118q1l3588K2950M3217k6240J7726J7147k4524j6472L2920J5617
3528A272156K3795q171L4865l173n853k450L121J5240L1403N054l4493K0534J0112
3515A362140K7429Q304j1729J4130K0198K4251L5237M9148o334k1053N0232J9669
3503A571622q11K31K8665j6046l826K5312J9706L3393J4829k6878K174J8034Q126
$$ plain form
3589 1350761 1345761 1348728 1299816 1311725 1338141 1343993 1317917 1288363 1306812 1285393 1300525 1269878
3577 1269878 1224912 1226483 1246393 1274375 1242086 1237406 1240104 1221308 1251524 1249096 1231727 1235694
3565 1235694 1243067 1255944 1269666 1261594 1241799 1238411 1237252 1224586 1213348 1201805 1200471 1195921 1186082
3552 1186082 1197982 1208066 1200292 1206347 1200909 1204001 1218412 1196997 1184550 1188248 1232802 1252602
3540 1252602 1223484 1223403 1189815 1212765 1255982 1229742 1247468 1264615 1240091 1223619 1256539 1272156
3528 1272156 1295951 1287780 1322645 1319472 1313619 1311169 1314290 1329530 1360933 1365987 1331494 1352028 1362140
3515 1362140 1389569 1397873 1386144 1400274 1420472 1444723 1479960 1529108 1522774 1501721 1551953 1571622
3503 1571622 1570811 1571042 1599707 1583661 1579835 1605147 1624853 1658246 1673075 1646197 1648371 1666405 1674531
3490A674531K0718J211j0813J2756M5194N357M8748o231L70L391l6104J0083O0151
3477A829362K1700k594k1261k866L4258J0717j987J8897O080j697P80J3202L0405
3464A934996O587K6146J4567J877j7824L9405k1669m2859k1226L0992n732n0440
3452A894820J009k3378O666J0211j986o151j0655m2484k8552k410j1633k1441
3440A764016J729k4194P533k7687J1464k8760k2135m8104l7853j1617q208O917
3428A583101m6099k1821l4136R329l2246k5480k5889o307m7367l1218O245j3839
3416A314273k2823l495o301M132J2877n0071k908J1275k9032j3118j0673j358
3404A202778j5325p69o800J1692k8098o0399j9225L1667l6636O24k4369o6l7772
$$ plain form
3490 1674531 1695249 1696460 1685647 1698403 1743597 1748954 1797702 1791471 1791841 1795232 1759128 1769211 1829362
3477 1829362 1851062 1848468 1827207 1824341 1858599 1869316 1867329 1886226 1892306 1890609 1891389 1904591 1934996
3464 1934996 1941583 1967729 1982296 1984173 1966349 2005754 1984085 1941226 1920000 1950992 1945260 1894820
3452 1894820 1895829 1872451 1879117 1889328 1887342 1881191 1870536 1828052 1799500 1797090 1785457 1764016
3440 1764016 1765745 1741551 1749084 1721397 1732861 1704101 1681966 1633862 1596009 1584392 1576184 1583101
3428 1583101 1537002 1515181 1481045 1490374 1458128 1432648 1406759 1400452 1353085 1321867 1328112 1314273
3416 1314273 1291450 1287955 1281654 1285786 1298663 1248592 1245684 1256959 1227927 1214809 1204136 1202778
3404 1202778 1187453 1186684 1179884 1191576 1163478 1103079 1083854 1115521 1078885 1079509 1055140 1055074 1017302
3391A017302J2849Q410o705O012l9185j1190m483K4842Q688j3659q453N974l7840
3378I62562L1019K4432K8864k0281l6013q477J1796j9798k984l3170N4321J254
3366I93525n4405L628j6350K4112J320j8379k618J044j8177r904m450J726J4954
3353I16026j9877Q887k5779p068K0657k5621l118J2886k623j8591M2595j462J1655
3340I08567k404m4919N549O1427m29k8741J6971N269J6130K0594k940j6018j227
3327I37829K0432K1113p863j5181j3402k3184K7827M3932K9994M150J8242K1651
3315A065540r212J3788k4598M0135Q173K7990J6856J118M543K2567K6941J3070
3303A206911j4877J4434J0583J0556K3333O237O652K8089L5257k3594K5130L3324
$$ plain form
3391 1017302 1030151 1038561 1031856 1037868 998683 987493 983010 1007852 1016540 1002881 994428 1000402 962562
3378 962562 993581 1018013 1046877 1026596 990583 982106 993902 974104 971120 937950 992271 993525
3366 993525 939120 942748 926398 950510 951830 933451 930833 931877 913700 903796 899346 901072 916026
3353 916026 896149 905036 879257 872189 892846 867225 864107 876993 874370 855779 898374 896912 908567
3340 908567 906163 861244 866793 928220 927791 899050 916021 921290 937420 958014 955074 939056 937829
3327 937829 958261 979374 971511 956330 942928 919744 947571 991503 1021497 1025647 1043889 1065540
3315 1065540 1056328 1070116 1045518 1085653 1093826 1121816 1138672 1139790 1144333 1166900 1193841 1206911
3303 1206911 1192034 1206468 1217051 1227607 1250940 1257177 1263829 1291918 1327175 1303581 1328711 1362035
3291A362035P883j4462J9238J8368j670J3003j3071R3133L6650k5406K6705J3393
3279A535799K7360J1352L3541L0136L4957L1980M5241J2099L4368K132N0630N0429
3267A900024L4711L3801M5367L847M3198J22260M7181M3059Q7762L7756P4884
3256B473850O1603j0779J2604Q8700M3789K9728O395K8485N0975M1902r319J9644
3244B837577K8423N9583J4598K3150K9971M4893R2789M1269J03945L7655M7177
3233C361030O4494M6930J9788O1211K4355J02535Q4556K6291P0115M6010L9541
3222C946856R9349K3879R1335R5493J09129P1244P9080J03922R3884N3461J20431
3211D888063J44454J30081R0724R1267J66600J38811J78782J39886J17471J37479
$$ plain form
3291 1362035 1369918 1355456 1374694 1393062 1391392 1404395 1391324 1484457 1521107 1495701 1522406 1535799
3279 1535799 1563159 1574511 1608052 1638188 1673145 1705125 1750366 1762465 1796833 1798965 1849595 1900024
3267 1900024 1934735 1968536 2013903 2017750 2060948 2183208 2230389 2273448 2361210 2398966 2473850
3256 2473850 2535453 2524674 2537278 2625978 2669767 2699495 2705890 2734375 2785350 2827252 2817933 2837577
3244 2837577 2866000 2925583 2940181 2963331 2993302 3038195 3130984 3172253 3276198 3313853 3361030
3233 3361030 3425524 3472454 3492242 3553453 3577808 3680343 3764899 3791190 3861305 3907315 3946856
3222 3946856 4046205 4070084 4161419 4256912 4366041 4437285 4516365 4620287 4714171 4767632 4888063
3211 4888063 5032517 5162598 5253322 5344589 5511189 5650000 5828782 5968668 6086139 6223618
3201F223618J59249J19971O9341Q9340J32839J17433J75283J38782J12254J24914
3191G463024J47531Q9388J43047J85089K06803J79703J71445K00753K59527K57029
3181I303339K56410L12744L44945K83762K57926M22554M55696M54371M54274N37479
3171A3083500N64409O38981O54360O58755P13264P76434Q28001Q82544R26379
3162A9726627R38776J015096R86401R16332Q07647O40407L14202M0015k40732
3153B5144771n16823p32257r44542j059325j170404j281832j344416j340613j255366
3144A5499193j176868j064317r41126q52210p96055o78702n83589n26820m81013
3135H398493m52469l71863l18923k70904k77077k59617k19847k16188k14569k10472
$$ plain form
3201 6223618 6382867 6502838 6572179 6661519 6794358 6911791 7087074 7225856 7338110 7463024
3191 7463024 7610555 7699943 7842990 8028079 8234882 8414585 8586030 8786783 9046310 9303339
3181 9303339 9559749 9872493 10217438 10501200 10759126 11181680 11637376 12091747 12546021 13083500
3171 13083500 13647909 14286890 14941250 15600005 16313269 17089703 17917704 18800248 19726627
3162 19726627 20665403 21680499 22666900 23583232 24390879 25031286 25345488 25385503 25144771
3153 25144771 24627948 23895691 22951149 21891824 20721420 19439588 18095172 16754559 15499193
3144 15499193 14322325 13258008 12316882 11464672 10668617 9989915 9406326 8879506 8398493
3135 8398493 7946024 7574161 7255238 6984334 6707257 6447640 6227793 6011605 5797036 5586564
3125E586564j26366j03738j52949j35922j19211j43952j92714r7557j20926j13573
3115D279656j21684j00802j07567r9972j06751p2067m8839q4319r7639j26433
3105C313583o4184o7016r5920n8993p3963q2180m1957r0865o6717l7742p7188
3094B556858o4934l1892n1312n2867n435m0549m3042m5547k3722j9203o7614m4607
3082B066134K7254J4715o1310j2739j9256l5057l4068l4211k1523l8072j9381
3071A832486l4630l1318k562n511J2713l6750k359l3651k2750l5731Q197l4337
3059A613797m043Q003J8639j7938j2146Q016l2949J3446M3185K7048J3405k2235
3047A656228P927K9701K2204Q436l3447N5289n5560o7948l9526j2222J8197o55
$$ plain form
3125 5586564 5460198 5356460 5203511 5067589 4948378 4804426 4611712 4514155 4393229 4279656
3115 4279656 4157972 4057170 3949603 3849631 3742880 3670813 3621974 3537655 3440016 3313583
3105 3313583 3249399 3182383 3086463 3027470 2953507 2871327 2829370 2738505 2671788 2634046 2556858
3094 2556858 2491924 2460032 2408720 2355853 2350418 2309869 2266827 2221280 2197558 2178355 2110741 2066134
3082 2066134 2093388 2108103 2046793 2034054 2014798 1979741 1945673 1911462 1889939 1851867 1832486
3071 1832486 1797856 1766538 1763976 1758465 1771178 1734428 1732069 1698418 1675668 1639937 1648134 1613797
3059 1613797 1609754 1617757 1636396 1618458 1606312 1614328 1581379 1594825 1638010 1665058 1678463 1656228
3047 1656228 1664155 1693856 1716060 1724496 1691049 1746338 1690778 1622830 1583304 1571082 1589279 1588624
3035A588624o1323n3713l2456p2554n0384l1531k9016j4986R006l6462q745l0347
3023A176113k4873J4625k1051q955k7939K3011l7804k9625L8991j8743l2636n7594
3011I93520l952J7159r426k8738K6556j9521m5648P125k5074K437m5747j5016
2999H53675j6114J5115m857j0263o423L378m014m7401j1603J1281J5129l1524
2987G66379o886J4920O165J162l1105j2758k88l1505J6431j007l0954j8662m3168
2974F28724K3487J2218K0755r880k3865K3853J3521k2282L358o29k8518n233k8844
2961F06665j2786N207L876K478J4955l8174M524K3279O478k5709l0951P213O901
2948E73956j9114L6618L6264q552k0817j0051J749r934o9277q457K6364K1798
$$ plain form
3035 1588624 1527301 1473588 1441132 1368578 1318194 1286663 1257647 1242661 1251667 1215205 1206460 1176113
3023 1176113 1151240 1165865 1144814 1135859 1107920 1130931 1093127 1063502 1102493 1083750 1051114 993520
3011 993520 989568 1006727 997301 968563 995119 975598 929950 937075 912001 914438 868691 853675
2999 853675 837561 852676 847819 837556 831133 834511 830497 783096 771493 782774 797903 766379
2987 766379 759493 774413 780578 781740 750635 737877 737589 706084 722515 721508 690554 671892 628724
2974 628724 652211 664429 685184 675304 651439 675292 688813 666531 669889 669260 640742 635509 606665
2961 606665 593879 599086 602962 605440 620395 582221 586745 610024 616502 590793 559842 567055 573956
2948 573956 554842 591460 627724 619172 598355 588304 590053 580119 510842 502385 528749 550547
2936E50547j5403j0738M6728l7687M206r736j1971j5302L3717n967K0990n12m6254
2923E02618J0137L0623j9033J3682N8783j5151n3761M6723j469k2061K2094K8918
2911F02103K378j5334J9571k8962m6689K6382J0938m553o380J8280R835l0263
2899E57306K6969J3261q880k5232K4434K9948J8130M2406K317j7383r248k28K1059
2886F74859Q107l169L9617m570j0860k3671k2857M0897j4514o854o178L3514J1582
2873G15903M2996M7176k86m5336M4294J8697L351M7172k3049k6104N1315K0187
2861H96316J9371J7969K0377L1855R513J9408L7131P9708N0280K1377K5240L6722
2849A265267R0546L2294L4474K2755P0386N0173M9943L7896J9178Q3163P0667
$$ plain form
2936 550547 535144 524406 571134 533447 537653 527917 515946 500644 534361 528394 549384 548872 502618
2923 502618 512755 543378 524345 538027 596810 581659 527898 574621 573152 551091 573185 602103
2911 602103 604481 589147 608718 579756 533067 559449 570387 565834 559454 577734 587569 557306
2899 557306 584275 597536 588656 563424 587858 617806 635936 678342 680659 663276 654028 653800 674859
2886 674859 682966 679797 719414 714844 703984 680313 657456 698353 683839 676985 670807 704321 715903
2873 715903 758899 806075 805789 760453 804747 823444 826795 873967 850918 824814 876129 896316
2861 896316 915687 933656 954033 985888 995401 1014809 1051940 1131648 1181928 1203305 1228545 1265267
2849 1265267 1355813 1388107 1422581 1445336 1515722 1565895 1615838 1653734 1672912 1756075 1826742
2838A826742J6269K1585K6106p166Q690O228K2011L3749K1826J724K7494J8489
2826B023747P19M8662K1919O9386J9228L3667Q0197L3094J36095R0102N1674L6623
2814B645113P8319L7823L8480n7127j02845k1794o0732r7162q0386r6108j07913
2803B175668q1560l1682p1593q1694l9314n8181q60m6087m4422K5152J1367l032
2791A753762p064J8497j4518l5956K517J6965o13j0717l2986n898l3428j9700
2779A630861n1957m3503l3511n6124o7672n0156m2365m4006r3188p968l1427n9840
2767A049144l2774j7281j6344r827j9575o4598n5157q891j7844n246j2139m8867
2755G40601k6118L9236n2133m0336P304l9090k0593k7300k0963j8633Q935l9034
$$ plain form
2838 1826742 1843011 1864596 1890702 1883536 1892226 1898454 1920465 1954214 1976040 1977764 2005258 2023747
2826 2023747 2024466 2073128 2095047 2164433 2183661 2217328 2297525 2330619 2466714 2556816 2608490 2645113
2814 2645113 2723432 2761255 2799735 2742608 2639763 2617969 2557237 2460075 2379689 2283581 2175668
2803 2175668 2094108 2062426 1990833 1909139 1869825 1811644 1810784 1764697 1720275 1745427 1756794 1753762
2791 1753762 1746698 1765195 1750677 1714721 1717238 1734203 1733590 1722873 1689887 1683989 1650561 1630861
2779 1630861 1578904 1535401 1501890 1445766 1378094 1327938 1285573 1241567 1148379 1140411 1108984 1049144
2767 1049144 1016370 999089 982745 972918 953343 888745 833588 824697 806853 801607 789468 740601
2755 740601 714483 753719 701586 661250 668554 629464 608871 581571 560608 541975 550910 511876
2743E11876n085l0781j8411Q168K8280k9671j0533n4796j0341Q271J699J079L5191
2730D34946j9015n5790j5322l409K8216j3150m9908L4968M587l0105J7317P645
2718C40980J935j7179m201k6494K506k2437k019R901k119k8891J9333L7471j6042
2705B92744L4005k2577n9021m168K6250j9204J6727n829l0790m741J5625K1701
2693B60722k0114J9513k8488l3310J8204l221m769m9505j2813K4115m0731K5954
2681A55557j7146M6683J8239k7524J9194l0468j652M011J8465k6182m3604J7687
2669A33260L1433j0413Q710m1722L36K2922L073p384l8281K7867J6193n538j4836
2656A25620L5802k9765m4010L2308j3715j9039j7113K5372K5537j8196r640k6754
$$ plain form
2743 511876 506791 476010 457599 465767 494047 464376 453843 399047 388706 396977 398676 399755 434946
2730 434946 415931 360141 344819 341410 369626 356476 306568 341536 346123 316018 333335 340980
2718 340980 342915 325736 321535 295041 297547 275110 273091 282992 280873 251982 271315 308786 292744
2705 292744 326749 304172 245151 240983 267233 248029 264756 258927 228137 223396 239021 260722
2693 260722 240608 260121 231633 198323 216527 213306 208537 159032 146219 170334 129603 155557
2681 155557 138411 185094 203333 175809 195003 164535 162883 166894 185359 159177 115573 133260
2669 133260 164693 154280 162990 121268 121604 144526 147599 140215 101934 129801 145994 140456 125620
2656 125620 161422 131657 87647 119955 106240 87201 70088 95460 120997 102801 93161 66407
2644F6407M1064L0602j7868k9067j5213K9736N116J0836K0610m3169l199J0324
2632A06179L7088l6844n0788M8563O654m0974k3754O7715m6802l9505L85N329
2620C3246K271K2891k8379M5110J6778k0290J2093l192L2570j2141J2635J485
2608A15077l9613j0514j520L329J1830r214M564o293j2475K0741j393k6407J4183
2595F2295q686q247k9583L7438K2992k29j5183l1615j7156J9849K9580p867K2058
2582G5646l1862k6809J8116J4907k7201p876k2152L0896L331M832J5296j5763
2570C1361P015L7637K0197N164j309J245k1066l8959m285L4903q129k0580K4420
2557F7614R00L1493j0048m8368j6423L655j4612J9608j7842J8656N005L4645j0209
$$ plain form
2644 66407 107471 138073 120205 91138 75925 105661 110777 121613 142223 99054 95855 106179
2632 106179 143267 106423 55635 104198 110852 69878 46124 113839 67037 27532 27917 33246
2620 33246 35517 58408 30029 75139 91917 71627 83720 80528 113098 100957 113592 115077
2608 115077 75464 64950 63430 66759 78589 69375 73939 67646 55171 75912 74519 48112 62295
2595 62295 53609 45362 15779 53217 76209 75980 60797 29182 12026 31875 61455 53588 75646
2582 75646 43784 16975 35091 49998 22797 14921 -7231 23665 26996 31828 47124 31361
2570 31361 38376 76013 96210 101374 100065 101310 80244 41285 37000 71903 63774 43194 67614
2557 67614 68514 100007 89959 41591 25168 28823 14211 33819 15977 34633 39638 74283 64074
2544F4074M54J8786o008j8792k3360q276J4060J8066J7084r945L2711j8268j5103
2531F5483o593k1439K3866j6682o885j0111k1887J7327k3257J097p144M0015J7522
2518E1312l0735J2133l1316l7779J4862k299k207l479J1829J2354j6481K0802
2506a004M6205k453n0759L0664J0019J0015l0398k6823l445r644K7829P335N753
2493A3294l9644j6817L3243L7264L301l6478Q333j6507N093m672J5200J5207J6942
2480C3759k1898k3397j9511K7643K0834k6539j5679J1443j2752K9776P728J4563
2468B5970q859j5014m2448L5697n994j9203K9007L182k1037K0102Q739m0291K2430
2455g719O24K3093m050J2745l2370k8962L4684N1j0415J6301K0014l9165j4225
$$ plain form
2544 64074 64528 83314 77306 58514 35154 26878 40938 59004 76088 66143 98854 80586 65483
2531 65483 58890 37451 61317 44635 37750 27639 5752 23079 -178 919 -6225 33790 51312
2518 51312 20577 32710 1394 -36385 -21523 -23822 -26029 -29508 -17679 -5325 -21806 -1004
2506 -1004 45201 42748 -8011 22653 32672 42687 12289 -14534 -17979 -27623 206 7541 13294
2493 13294 -26350 -43167 -9924 27340 30641 -5837 2496 -14011 -8918 -13590 1610 16817 33759
2480 33759 11861 -11536 -31047 -3404 17430 -9109 -24788 -13345 -26097 3679 11407 25970
2468 25970 17111 2097 -40351 -4654 -10648 -29851 -844 2338 -18699 1403 10142 -30149 -7719
2455 -7719 -7095 15998 11948 24693 -7677 -36639 -1955 -1904 -12319 3982 23996 -15169 -29394
2442b9394K1912n630J1790k2129J7072k3254r737J1028k9931K7378K2211l5212
2430d3896J1160M3944k1666j6081k4855M2105K3515k9807k6816K118J3207R02
2418b6170k6872k8168O0001J5606J512k3806m097O604j3695o099K9107K6197K222
2405A2342j5429N197L4225j8815k1119k8288k5012L1935K8280j710J5740L9941
2393E7287m7385k8586l7346L4674J9785j1413Q186j9524N4447r535o533K6001
2381D0058l9838l2495J6986L833J6121m1600Q47j3712L7252J7891l6051K2212
2369h496J4295j510o048k612m2436l454K2709K8130o273m5280j5889O9525L3050
2356C5711l5128n289m934j6007J5912p892J8838k033k3265q600j7372K9987j5888
$$ plain form
2442 -29394 -7482 -13112 -1322 -23451 -6379 -29633 -39370 -28342 -58273 -30895 -8684 -43896
2430 -43896 -32736 11208 -10458 -26539 -51394 -9289 14226 -15581 -42397 -40279 -27072 -26170
2418 -26170 -53042 -81210 -21209 -5603 -4091 -27897 -31994 -25390 -39085 -45184 -16077 10120 12342
2405 12342 -3087 2110 36335 17520 -3599 -31887 -56899 -24964 3316 1606 17346 57287
2393 57287 9902 -18684 -56030 -21356 -1571 -12984 -4798 -24322 30125 20590 14057 40058
2381 40058 220 -32275 -15289 -11456 4665 -36935 -36088 -49800 -12548 5343 -30708 -8496
2369 -8496 5799 4289 -1759 -4371 -46807 -50261 -27552 578 -5695 -50975 -66864 2661 35711
2356 35711 583 -4706 -9640 -25647 -9735 -17627 1211 -822 -24087 -32687 -50059 -20072 -35960
2343c5960k5962L1346O253K1968K962l075j9707N019l537j9058J1992J2583j2181
2330b7357n527M8945p346K8090j8226l5277L9723l0239q447l152K2127j8065k781
2317a7532m0972j989J1678K9521l4039M8742K2801j1347n6016k0195M7250J358
2305b0740K5772n326N9025k1274l003l1529J0945K0261j7183j7729O774J7703
2293B3696k4862J8118k331q82K4980o2190R870K8410K8727J6538l4593j6795M3752
2280E2438K7769J3930m6414j121J5456m445o612j7651n3655K1333m688l8696N6145
2267A3789n238L803j6038j7466M872J1902R255o9258M2127j8695M473M4535k0808
2254a2747n7974J0899L9442m603L1920L843l5373K3986K313l7857L5489J5406
$$ plain form
2343 -35960 -61922 -30576 -24323 -2355 607 -2468 -22175 -17156 -20693 -39751 -27759 -15176 -27357
2330 -27357 -32884 16061 8715 36805 18579 -16698 23025 -7214 -15661 -18813 3314 -14751 -17532
2317 -17532 -58504 -60493 -48815 -19294 -53333 -4591 18210 6863 -49153 -69348 -22098 -20740
2305 -20740 5032 -294 58731 37457 34454 2925 13870 34131 16948 -781 5993 23696
2293 23696 -1166 16952 14621 13739 38719 -23471 -13601 14809 43536 60074 25481 8686 52438
2280 52438 80207 94137 47723 46602 62058 57613 51001 33350 -20305 1028 -3660 -42356 13789
2267 13789 8551 12354 -3684 -21150 -16278 -4376 4879 -64379 -22252 -40947 -36474 8061 -12747
2254 -12747 -70721 -59822 -20380 -24983 6937 10780 -24593 -607 1706 -36151 -662 14744
2242A4744j7143M035j2741J4877P738l0756k0439J2920K6251Q917j1832l7939
2230d1368J4252o951P770K1339l7598j7739K1365M1737j0420k4528J4853l121
2218b0409j9217L56K3621k0682R863J0382l7416L2831N531j1579J0825j4609O163
2205b4340k5896M7698j3401j8971R214k0535L2935o246K4936j5462m7675J8206
2193c9537K245J5074J4595M5369n3960k8825L9542m684K577J5799j5611l0071
2181c7487J760J2536j5123J2852K6116r588Q37Q546N646P851j6167l855k4082
2168c0158J1099j073R236K4233P911j1801k2850K8263L7488j2459N325m5346J7074
2155A6942J2847o565J0938N905m378J0574l1010R97M2283J1173r003l2034L5618
$$ plain form
2242 14744 -2399 1636 -11105 3772 11510 -19246 -39685 -26765 -514 8403 -3429 -41368
2230 -41368 -27116 -34067 -26297 -4958 -42556 -60295 -38930 2807 -7613 -32141 -17288 -20409
2218 -20409 -39626 -39270 -15649 -36331 -26468 -16086 -53502 -20671 -15140 -26719 -15894 -30503 -24340
2205 -24340 -50236 -2538 -15939 -34910 -25696 -46231 -13296 -19542 5394 -10068 -57743 -39537
2193 -39537 -37292 -22218 -7623 37746 -16214 -45039 -5497 -10181 -7604 8195 -7416 -37487
2181 -37487 -35727 -23191 -38314 -25462 654 -8934 -8097 449 6095 13946 -2221 -6076 -30158
2168 -30158 -19059 -20132 -10896 13337 21248 9447 -13403 14860 52348 39889 45214 -132 16942
2155 16942 29789 23224 34162 40067 35689 46263 15253 16250 58533 69706 60703 28669 64287
2142F4287l720j3098k9523j4880M8711K6996q047j5155J4358k0938j627j0081
2130C7283p207J1121J2309L134J5721l5636j1905M8726j0121J0840k5050k4830
2118B4385K9654P715k5525M6606m361l0445j4568K8864R851J4832j044J9371l4252
2105G1083L1834O102j4894n84k1372M223K0493k5640K9143k229J2267L4495K5113
2092A70034k2270J9135j8284O508M2402m577R393j3515j5262K656k532PK3327
2079A97022M0500L0535J1827J4803R39l41M5659j229p65K1301j866N3094K2364
2066D33843K7733J1260j9372M8291M0853M0823L4853J3423N915J7204K6651k6586
2054F54891M5636M5027M9956K4361L4199J9957P5439L7725N4689L0946O5585Q9176
$$ plain form
2142 64287 60567 47469 17946 3066 51777 78773 70726 55571 69929 48991 47364 37283
2130 37283 30076 41197 53506 56640 72361 36725 24820 73546 63425 74265 49215 24385
2118 24385 54039 61754 36229 82835 78474 48029 33461 62325 72176 87008 85964 105335 71083
2105 71083 102917 109019 94125 93541 72169 76392 96885 71245 100388 98159 110426 144921 170034
2092 170034 147764 166899 148615 155123 197525 192948 202341 188826 173564 176220 173688 173695 197022
2079 197022 237522 268057 279884 294687 295626 295285 340944 339715 338950 360251 358385 411479 433843
2066 433843 461576 472836 453464 501755 542608 583431 618284 631707 637622 654826 681477 654891
2054 654891 700527 745554 795510 819871 854070 874027 949466 987191 1041880 1072826 1138411 1227587
2042A227587K5982P6866J29252P0160O8279J24007J65239J23646J70114K29508
2032B410640K16764K26247L04747L14759L20380K45069K63614L27401M73160N47777
2022E650558P24480P96047J127722J152119J024548M49636k41058o40477r25424
2013I118151l68229j12566l04575p49219q14933q56438q85419p10580m82972l73396
2003C459824l29088k63802k62790k36933j40112j26323j30067j58274j25565o6880
1993A619990r4652q8664q5720p2073p1724q0929n0536q3916n5120j8363k0806
1982H97487p6127R458j3117m0569q2769j0364j6177j575k0990p0916k6544J9739
1970E67536k2242j9780K1252l3079k3175j1207n4446l2809M546R236J1260n5513
$$ plain form
2042 1227587 1253569 1330435 1459687 1529847 1598126 1722133 1887372 2011018 2181132 2410640
2032 2410640 2627404 2853651 3158398 3473157 3793537 4038606 4302220 4629621 5102781 5650558
2022 5650558 6375038 7171085 8298807 9450926 10475474 10925110 10684052 10043575 9118151
2013 9118151 8749922 8637356 8332781 7583562 6768629 5912191 5026772 4316192 3833220 3459824
2003 3459824 3130736 2866934 2604144 2367211 2227099 2100776 1970709 1812435 1686870 1619990
1993 1619990 1525338 1436674 1350954 1278881 1207157 1126228 1075692 991776 936656 918293 897487
1982 897487 821360 830818 817701 777132 694363 683999 667822 666247 645257 574341 547797 567536
1970 567536 545294 525514 546766 513687 490512 479305 424859 392050 396596 405832 417092 361579
1958C61579P09k0682J3905J0331m3728k2624M173L2043m5102l8235J098K7774
1946B81241N2417k3282L49l1331K927j158j7380j4023n129r906m2425P1214K885
1933B66399Q375m1641p7894L9623J1508k738j5502M6348k2507k5316k6366J9801
1921A80090l5900N848J8437k4349N677l108k3237m1096L2366K0838j0203L0427
1909A55790o446l9674L8969J664k9103j9611N729P832o898l3193O379R973l533
1896H7878K8096j9001l438l8334L3093J0092k0443l457m6232J5144J516L4113
1884G9027j8731j351O177j8770L1398L4191K513P729J1515l2401j8752j6116R458
1871G5887j2858J9636Q1p068J42j4754J2167p393j4956n309q849L1937j7975k9572
$$ plain form
1958 361579 362288 341606 355511 365842 322114 299490 303663 335706 290604 252369 253467 281241
1946 281241 333658 310376 310725 279394 282321 281163 263783 249760 244631 234725 192300 263514 266399
1933 266399 274774 233133 155239 194862 206370 203632 188130 234478 211971 186655 160289 180090
1921 180090 144190 150038 168475 144126 149803 146695 123458 82362 114728 135566 125363 155790
1909 155790 149344 109670 148639 150303 121200 101589 107318 115150 108252 75059 81438 91411 87878
1896 87878 115974 96973 93535 55201 88294 98386 77943 74486 28254 43398 44914 79027
1884 79027 60296 58945 65122 46352 77750 111941 114454 122183 133698 101297 82545 66429 75887
1871 75887 63029 82665 82746 75678 75820 61066 73233 65840 50884 45575 36726 68663 50688 21116
1857B1116K8130j9125l1427N4926K193l6137P660K1192k4450K6273M358k1823
1845C2886N6705k3588k2333Q885j5015o634K111K1460J4931j1110l3437p598L0101
1832D7364l3746N1382k1452k4962R366J78j3273n789J5382L8707O430n003J733
1819F6317k4475Q20k721P441k1853P465j3007k5727M4725M526l2932L1361M3733
1806H5673p051J1386j3215j2144K2009k9722k9112M0111k2968j6843j684J4995
1794D1435o018q186O267N042K3173K5691m3018j8517m618m0131j4K6541P394J1032
1780B6073J4234M4122k3811o0700j5314J9374J3280O905n914m886N775k0799N4009
1767E2348k9416J17L6337j7579O229m3379Q731M3437R823k3556j0449J1672j0524
$$ plain form
1857 21116 49246 30121 -1306 53620 55813 19676 27336 48528 24078 50351 54709 32886
1845 32886 89591 66003 43670 52555 37540 30906 33017 54477 69408 58298 24861 17263 47364
1832 47364 13618 65000 43548 18586 27952 28130 14857 9068 24450 63157 69587 64584 66317
1819 66317 41842 42662 39941 47382 25529 32994 19987 -5740 38985 43511 10579 41940 85673
1806 85673 78622 90008 76793 64649 86658 56936 27824 67935 44967 28124 26440 41435
1794 41435 35417 27231 33498 38540 61713 87404 44386 25869 21251 -18880 -18894 7647 15041 26073
1780 26073 40307 84429 60618 -82 -15396 3978 17258 24163 18249 13363 19138 -1661 52348
1767 52348 22932 23049 59386 41807 48036 4657 13388 56825 66648 43092 32643 44315 33791
1754C3791O781j313j9829L8051L7770r56k9547o161M4721R993j392j1557K0214
1741A20566p4512J6588l3104N1374k3474q714k6406r633J4960k4002J6070L4940
1729E4653K4963J8954j5510k1779j9698O92j5905R884M0793p9202J8093j97J4375
1716C0116N221o616m2795j0644L1077M354K7329J5452l621r193l0804J0713L35
1703B0924j4714L4865j6974j5539M319J9603O297k8930N929K4473N863r109j216
1690C5791k6319P297m997R318k6404K7478l873j7479q428j1297J2990r87j4013
1677b0923J7282P301m2301J0355J2952L5679j4829j1350j1203K0481l8664L7172
1665A952n363j9282M0056p658k964O330J1042m612L0515l1174l3259Q519j0405
$$ plain form
1754 33791 40572 39259 19430 57481 95251 94295 64748 58587 103308 113301 111909 100352 120566
1741 120566 46054 62642 29538 80912 57438 48724 22318 12685 27645 3643 19713 54653
1729 54653 79616 98570 83060 61281 41583 42275 26370 36254 77047 -2155 15938 15741 30116
1716 30116 35337 28721 -14074 -24718 6359 10713 38042 53494 49873 40680 9876 20589 20924
1703 20924 6210 41075 24101 8562 12881 32484 38781 9851 15780 40253 46116 37007 35791
1690 35791 9472 16769 11772 21090 -5314 22164 18291 812 -7616 -18913 -5923 -6910 -20923
1677 -20923 -3641 3660 -38641 -28286 -15334 20345 5516 -5834 -17037 3444 -35220 1952
1665 1952 -3411 -22693 17363 9705 6741 13071 24113 19501 50016 18842 -14417 -5898 -16303
1652a6303L9364M7895n6026j1395j770n202j7771k3005m321L1711j1405O20J7338
1639a0270J1050k1672j2701J6788N4834l8094J4310R636L089p263j1164K0564
1627B9107r36L2179j7773k6896k9037M061J9925L3099j9321j8985N175K3910j168
1614C3340k3850n336l0426l4327K5429L8352Q960j7717j0595K62n9332L7731M5472
1601G963k5411N0998M463o5650M557M1272o970k529K4534K7775j5242n4978j467
1588a0685K0678J8871Q941j8027l6665P795K9977Q755k1658j2811K7730m1669
1576a8768K8901J5716k6055j2645p572L3670Q909K3588J96l42k7931k6229M6M613
1562c903j7878r913L3041j9449J4078M3332j6447K0788j7564j9915P794j4731
$$ plain form
1652 -16303 23061 70956 14930 3535 1765 -3437 -21208 -44213 -48534 -16823 -28228 -27608 -10270
1639 -10270 780 -20892 -33593 -16805 38029 -65 14245 23881 26970 19707 8543 29107
1627 29107 28171 60350 42577 15681 -13356 -9295 10630 43729 24408 5423 10598 34508 33340
1614 33340 9490 4154 -26272 -60599 -35170 3182 12142 -5575 -16170 -15908 -75240 -37509 7963
1601 7963 -17448 33550 38013 -27637 -23080 18192 11222 8693 33227 61002 45760 -9218 -10685
1588 -10685 9993 28864 37805 19778 -16887 -9092 20885 29640 7982 -4829 22901 -18768
1576 -18768 10133 25849 -206 -12851 -20423 13247 22156 45744 45940 45598 17667 -8562 -8516 -3903
1562 -3903 -21781 -31694 1347 -18102 -4024 39308 22861 43649 26085 6170 13964 -767
1550g67L5132n1485j2309j4005R006k0873J8725J1247k2175J1698L1958j2931
1538a6779j6092J563J827k3256J5728J3343M204L9407j6908l1042L9627L7879
1526D9501M414o203m7397K8834q604r479l1719K909K5853k4466k3237M4427K3103
1513B7936k9554J1115K758k5735O217K4133l1223k4469M361J7169p519L6367j2392
1500h36k1210k470K2201J7688J8681l7761j5127J5683k6895K6162K2620J4975
1488C3711j8077k0683n345N101O681L2962p133k9241K6011n394m3741K8286m8759
1475d5621K0429K9083K5644L607N76L929O689j6252J9020j9475j5752n744L250
1462I383J4545n5664K1756J0654N0768j7442k7345j8963j0418K972m300K3010
$$ plain form
1550 -767 34365 -17120 -29429 -43434 -34428 -55301 -36576 -25329 -47504 -35806 -3848 -16779
1538 -16779 -32871 -31308 -29481 -52737 -37009 -23666 -19462 19945 3037 -28005 11622 49501
1526 49501 53915 47712 315 29149 20545 11066 -20653 -17744 8109 -16357 -39594 4833 27936
1513 27936 -1618 9497 12255 -13480 -7263 16870 -14353 -38822 -34461 -17292 -24811 11556 -836
1500 -836 -22046 -24516 -2315 15373 34054 -3707 -18834 -3151 -30046 -3884 18736 33711
1488 33711 15634 -5049 -10394 -5293 1388 34350 27217 -2024 23987 18593 -25148 3138 -45621
1475 -45621 -25192 3891 29535 33142 33718 37647 44336 28084 47104 27629 11877 6133 9383
1462 9383 23928 -31736 -9980 674 51442 34000 6655 -12308 -22726 -19754 -24054 -1044
1450a044N2282k439n2226L1168m358k5205j3841l607O32J2753k6888J9208o610
1437b0175J8167N724j0658K5365n4888L6130L194P845J5233j9257J8663k1340
1425D003L9992m352l8580k0198p323K8842Q912j125J966R729L853k7669K4229
1412B2279j2346K646o766j3647Q088l0658k396j0746J174q461L3583J4053j7924
$$ plain form
1450 -1044 51238 48799 -3427 27741 23383 -1822 -15663 -19270 -18638 -5885 -32773 -13565 -20175
1437 -20175 -2008 3716 -6942 18423 -36465 -335 2859 10704 25937 6680 25343 4003
1425 4003 43995 39643 1063 -19135 -26458 2384 11296 10171 12137 21866 25719 -1950 22279
1412 22279 9933 12579 5813 -7834 254 -30404 -32800 -43546 -42372 -50833 -17250 -3197 -21121
$$ [...]
##END NTUPLES=NMR SPECTRUM
##END=
