##TITLE=1H_TG-2358-1
 CDCl3
 8 sc, 
 28.09.2022
##JCAMPDX= 6.0         $$ Bruker NMR JCAMP-DX V2.0
##DATA TYPE= NMR SPECTRUM
##DATA CLASS= NTUPLES
##ORIGIN= UXNMR, Bruker Analytische Messtechnik GmbH
##OWNER= root
$$ XWIN-NMR		Version 3.5
$$ Wed Sep 28 14:16:32 2022 Russian Standard Time (UT+4h)  she@DPX200
##.OBSERVE FREQUENCY= 200.1313499994
##.OBSERVE NUCLEUS= ^1H
##.ACQUISITION MODE= SIMULTANEOUS
##.ACQUISITION SCHEME= undefined
##.AVERAGES= 8
##.DIGITISER RES= 18
##SPECTROMETER/DATA SYSTEM= spect
##.PULSE SEQUENCE= zg30
##.SOLVENT NAME= CDCl3
##.SHIFT REFERENCE= (INTERNAL, CDCl3, 0, 15.7645)
##AUDIT TRAIL= $$ (NUMBER, WHEN, WHO, WHERE, WHAT)
$$ ##TITLE= Audit trail, XWIN-NMR		Version 3.5
$$ ##JCAMPDX= 5.01
$$ ##ORIGIN= Bruker BioSpin GmbH
$$ ##OWNER= she
$$ F:/spectra/data/she/nmr/H-F/1/pdata/1/auditp.txt
$$ ##AUDIT TRAIL=  $$ (NUMBER, WHEN, WHO, WHERE, WHAT)
(   1,<2022-09-28 14:15:06.51 +0400>,<she>,<DPX200>,
      <created by zg, POWCHK disabled, PULCHK disabled
       configuration hash MD5:
       00 E9 B6 7A A2 85 ED C7 34 08 36 98 17 FE 4E 26
       data hash MD5: 16K
       35 CA C8 86 49 11 FF 4E 37 E6 88 81 99 3E F5 04>)
(   2,<2022-09-28 14:15:11.82 +0400>,<she>,<DPX200>,
      <Start of raw data processing
       efp BC_mod = 2 LB = 0.24 FT_mod = 6 PKNL = 1 PHC0 = -18046.68 PHC1 = 28.00069 SI = 16K 
       data hash MD5: 16K
       14 4C 61 A2 04 1F C0 3F 21 79 13 F8 4C 17 26 ED>)
(   3,<2022-09-28 14:15:35.34 +0400>,<she>,<DPX200>,
      <pk PHC0 = 12.30816 PHC1 = -17.2 
       data hash MD5: 16K
       92 EC 61 13 26 26 EE 95 2C D2 8E C4 D1 51 40 02>)
(   4,<2022-09-28 14:15:39.12 +0400>,<she>,<DPX200>,
      <abs ABSG = 5 
       data hash MD5: 16K
       72 4A 4A DE 5C 60 FA BD 66 BD 49 B5 F3 D1 D6 0C>)
$$ ##END=
$$ 
$$ hash MD5
$$ 0E 12 14 1A 45 49 84 53 3B EB 2C E2 84 09 8E DF
##$RELAX= 
##$RELAX= 
##$RELAX= 
##$RELAX= 
##$RELAX= 
##$RELAX= 
$$ Bruker specific parameters
$$ --------------------------
##$DU= <F:/spectra>
##$EXPNO= 1
##$NAME= <H-F>
##$PROCNO= 1
##$TYPE= <nmr>
##$USER= <she>
##$AMP= (0..31)
100 100 100 100 100 100 100 100 100 100 100 100 100 100 100 100 100 100 
100 100 100 100 100 100 100 100 100 100 100 100 100 100 
##$AQSEQ= 0
##$AQ_mod= 1
##$AUNM= <au_zg>
##$AUTOPOS= <>
##$BF1= 200.13
##$BF2= 200.13
##$BF3= 200.13
##$BF4= 200.13
##$BF5= 200.13
##$BF6= 200.13
##$BF7= 200.13
##$BF8= 200.13
##$BYTORDA= 1
##$CFDGTYP= 0
##$CFRGTYP= 5
##$CHEMSTR= <none>
##$CNST= (0..31)
1 1 145 1 1 1 1 1 1 1 1 1 1 1 1 1 1 1 1 1 1 1 1 1 1 1 1 1 1 1 1 1 
##$CPDPRG= <>
##$CPDPRG1= <>
##$CPDPRG2= <>
##$CPDPRG3= <>
##$CPDPRG4= <mlev>
##$CPDPRG5= <mlev>
##$CPDPRG6= <mlev>
##$CPDPRG7= <mlev>
##$CPDPRG8= <mlev>
##$CPDPRGB= <>
##$CPDPRGT= <>
##$D= (0..31)
0 1.2 0 0 0 0 0 0 0 0.06 0 0.03 0 0 0 0 0.0002 0 0 0 0 0 0 0 0 0 0 0 0 
0 0 0 
##$DATE= 1664360106
##$DBL= (0..7)
120 120 120 120 120 120 120 120 
##$DBP= (0..7)
150 150 150 150 150 150 150 150 
##$DBP07= 0
##$DBPNAM0= <>
##$DBPNAM1= <>
##$DBPNAM2= <>
##$DBPNAM3= <>
##$DBPNAM4= <>
$$ [...]
##$SUBNAM3= <"">
##$SUBNAM4= <"">
##$SUBNAM5= <"">
##$SUBNAM6= <"">
##$SUBNAM7= <"">
##$SUBNAM8= <"">
##$SUBNAM9= <"">
##$SW= 18.0517283424941
##$SWIBOX= (0..15)
0 0 2 0 0 0 0 0 0 0 0 0 0 0 0 0 
##$SW_h= 3612.71676300578
##$TD= 16384
##$TD0= 1
##$TE= 0
##$TE2= 300
##$TE3= 300
##$TEG= 300
##$TL= (0..7)
0 120 120 120 120 120 120 120 
##$TP= (0..7)
150 150 150 150 150 150 150 150 
##$TP07= 0
##$TPNAME0= <>
##$TPNAME1= <>
##$TPNAME2= <>
##$TPNAME3= <>
##$TPNAME4= <>
##$TPNAME5= <>
##$TPNAME6= <>
##$TPNAME7= <>
##$TPOAL= (0..7)
0.5 0.5 0.5 0.5 0.5 0.5 0.5 0.5 
##$TPOFFS= (0..7)
0 0 0 0 0 0 0 0 
##$TUNHIN= 0
##$TUNHOUT= 0
##$TUNXOUT= 0
##$USERA1= <user>
##$USERA2= <user>
##$USERA3= <user>
##$USERA4= <user>
##$USERA5= <user>
##$V9= 5
##$VALIST= <valist>
##$VCLIST= <CCCCCCCCCCCCCCC>
##$VD= 0
##$VDLIST= <DDDDDDDDDDDDDDD>
##$VPLIST= <PPPPPPPPPPPPPPP>
##$VTLIST= <TTTTTTTTTTTTTTT>
##$WBST= 1024
##$WBSW= 4
##$XGAIN= (0..3)
0 0 0 0 
##$XL= 0
##$YL= 0
##$YMAX_a= 358110
##$YMIN_a= -568866
##$ZGOPTNS= <>
##$ZL1= 120
##$ZL2= 120
##$ZL3= 120
##$ZL4= 120
##$ABSF1= 15.82952
##$ABSF2= -2.222331
##$ABSG= 5
##$ABSL= 3
##$ALPHA= 0
##$AQORDER= 0
##$ASSFAC= 0
##$ASSFACI= 0
##$ASSFACX= 0
##$ASSWID= 0
##$AUNMP= <proc_1d>
##$AZFE= 0.1
##$AZFW= 0.1
##$BCFW= 0
##$BC_mod= 2
##$BYTORDP= 0
##$COROFFS= 0
##$CY= -3
##$DATMOD= 1
##$DC= 0
##$DFILT= <>
##$DTYPP= 0
##$F1P= 0
##$F2P= 0
##$FCOR= 1
##$FTSIZE= 16384
##$FT_mod= 6
##$GAMMA= 0
##$GB= 0
##$INTBC= 1
##$INTSCL= 3.70164e-10
##$ISEN= 128
##$LB= 0.24
##$LEV0= 0
##$LPBIN= 0
##$MAXI= 10000
##$MC2= 0
##$MEAN= 0
##$ME_mod= 0
##$MI= 1.114404
##$NCOEF= 0
##$NC_proc= -5
##$NLEV= 6
##$NOISF1= 3.799351
##$NOISF2= 2.8
##$NSP= 0
##$NTH_PI= 0
##$NZP= 0
##$OFFSET= 15.76452
##$PC= 1
##$PHC0= -18034.37
##$PHC1= 10.80069
##$PH_mod= 1
##$PKNL= yes
##$PPARMOD= 0
##$PSCAL= 0
##$PSIGN= 0
##$REVERSE= no
##$SF= 200.130001404204
##$SI= 16384
##$SIGF1= 3
##$SIGF2= 2
##$SINO= 5.538805
##$SIOLD= 16384
##$SREGLST= <1H.CDCl3>
##$SSB= 0
##$STSI= 16384
##$STSR= 0
##$SW_p= 3612.71676300578
##$SYMM= 0
##$S_DEV= 0
##$TDeff= 16384
##$TDoff= 0
##$TI= <>
##$TILT= no
##$TM1= 0
##$TM2= 0
##$TOPLEV= 0
##$USERP1= <user>
##$USERP2= <user>
##$USERP3= <user>
##$USERP4= <user>
##$USERP5= <user>
##$WDW= 1
##$XDIM= 16384
##$YMAX_p= 436496436
##$YMIN_p= -246465
$$ End of Bruker specific parameters
$$ ---------------------------------
##NTUPLES= NMR SPECTRUM
##VAR_NAME=  FREQUENCY,     SPECTRUM/REAL,   SPECTRUM/IMAG
##SYMBOL=    X,             R,               I
##VAR_TYPE=  INDEPENDENT,   DEPENDENT,       DEPENDENT
##VAR_FORM=  AFFN,          ASDF,            ASDF
##VAR_DIM=   16384,         16384,           16384
##UNITS=     HZ,            ARBITRARY UNITS, ARBITRARY UNITS
##FACTOR=    0.220516191357247, 1,           1
##FIRST=     3154.95334798995, 0,            0
##LAST=      -457.763415015831, 0,           0
##MIN=       -457.763415015831, -246465,     0
##MAX=       3154.95334798995, 436496436,    0
$$ Real data points
##PAGE= N=1
##DATA TABLE= (X++(R..R)), XYDATA
$$ [...]
7956a903k3812J0110k6726l0252J01857j7339n6062K8832k1651R6580N8662l3752
$$ -1903 -25715 -15605 -42331 -72583 29274 11935 -44127 -15295 -36946 59634 118296 84544
7944H4544p4869K5169N0851k7858J9319J1045j9609O8544R024n2777p887O6659
$$ 84544 9675 34844 85695 57837 77156 88201 68592 137136 146160 93383 85496 152155
7932A52155N4537K2513j72266q9399O535L4126R8726o79L1763Q7760l3351r4971
$$ 152155 206692 229205 56939 -32460 -25925 8201 106927 106248 138011 225771 192420 97449
7920I7449n9493M5518p4728m7662P4889j3864l1180n8655N9381N6483n3400k1589
$$ 97449 37956 83474 8746 -38916 35973 22109 -9071 -67726 -8345 48138 -5262 -26851
7908b6851N8040J8147o651j00220L1346m3173N6817l004l4769K5233J8261J2396
$$ -26851 31189 49336 42685 -57535 -26189 -69362 -12545 -15549 -50318 -25085 -6824 5572
7896E572K6612p3465j4292R538k3889M0164M1978k4566k9370K1685K4806o3747
$$ 5572 32184 -41281 -55573 -46035 -69924 -29760 12218 -12348 -41718 -20033 4773 -58974
7884e8974q7j1357K1462J6598K4282K3951M997N8481r8020j16389N7776m30k8643
$$ -58974 -59061 -70418 -48956 -32358 -8076 15875 20872 79353 -18667 -135056 -77280 -77710 -106353
7871a06353J46587r6742j859K6365K8371k7348J6658K2400q0129J3993J6478M0277
$$ -106353 40234 -56508 -58367 -32002 -3631 -30979 -14321 8079 -72050 -58057 -41579 -1302
7859a302N696j05636J2642L6936M4730n445J7224K0861j32501o8588M0034M2893
$$ -1302 4394 -101242 -88600 -51664 -6934 -12379 4845 25706 -106795 -175383 -135349 -92456
7847i2456m3735R3966M813L3836m1489L2639R9450j6103j55759j17015J7960N9866
$$ -92456 -136191 -42225 -37412 -3576 -45065 -12426 87024 70921 -84838 -201853 -183893 -124027
7835a24027Q7418j0274m1320M4506K0871j5218L6831o236j1802L1217J1054j3253
$$ -124027 -36609 -46883 -88203 -43697 -22826 -38044 -1213 -7449 -19251 11966 23020 9767
7823I767j7745l6995P2765o0763k6134j2449k193k5769R118J04919O2673j25946
$$ 9767 -7978 -44973 27792 -32971 -59105 -71554 -73747 -99516 -90398 14521 77194 -48752
7811d8752l2980L9745k0191O4387R68k3106j0585j5820J5987N7443n2286J1656
$$ -48752 -81732 -41987 -62178 2209 3177 -19929 -30514 -46334 -30347 27096 -25190 -13534
7799a3534k8965j5893L7304o7959l5690N0360L3039l2176O5416n6400L2427o18
$$ -13534 -42499 -58392 -21088 -89047 -124737 -74377 -41338 -73514 -8098 -64498 -32071 -32689
7787c2689j147m4722L1123P4690q1998k7253M6987J04271o8826q619k491K7610
$$ -32689 -33836 -78558 -47435 27255 -54743 -81996 -35009 69262 436 -8183 -10674 16936
7775A6936J05599o2679j26365N7084J1513n8590j0577K0796O5320l1301o7103
$$ 16936 122535 59856 -66509 -9425 2088 -56502 -67079 -46283 19037 -12264 -79367
7764g9367L1213j3934l3770n8640P6535p214o0872n141n2736Q1442J7928K3304
$$ -79367 -48154 -62088 -95858 -154498 -77963 -85177 -146049 -151190 -203926 -122484 -104556 -81252
7752h1252L6257j7063k2624K5387m6223K5941M932m8885M5382R570O3342j4664
$$ -81252 -44995 -62058 -84682 -59295 -105518 -79577 -74645 -123530 -78148 -68578 -5236 -19900
7740a9900m3137M7546K7987q2848j7309R5693j9722j0631N469q1475j1713N0390
$$ -19900 -63037 -15491 12496 -70352 -87661 8032 -11690 -22321 -16852 -98327 -110040 -59650
7728e9650k0837r9392n864M4614J07562K1891m2147L1516j16230N6637J12408
$$ -59650 -80487 -179879 -185743 -141129 -33567 -11676 -53823 -22307 -138537 -81900 30508
7717C0508o5049j8083O313r5648O0307J21479n7275K618M9565n2092j4372k3371
$$ 30508 -34541 -52624 -46311 -141959 -81652 39827 -17448 -14830 34735 -17357 -31729 -55100
7705e5100n1156J953N657M7721O426m1911Q638P3094p0463L0940L1028L0344k7693
$$ -55100 -106256 -104303 -98646 -50925 -44499 -86410 -77772 -4678 -75141 -44201 -13173 17171 -10522
7692a0522o1830M2926k8058L8350J6422j5880n5989L9239K1561N3673l6404l9825
$$ -10522 -72352 -29426 -57484 -19134 -2712 -18592 -74581 -35342 -13781 39892 3488 -36337
7680c6337J7678M661k6483j2292q883K8218L101l1477J0600m2908j6319K9216
$$ -36337 -18659 -13998 -40481 -52773 -61656 -33438 -30337 -61814 -51214 -94122 -110441 -81225
7668h1225j8143K2623O742o835l4223J6170K9113j7683K1174j2233L8809P2025
$$ -81225 -99368 -76745 -70003 -76838 -111061 -94891 -65778 -83461 -62287 -74520 -35711 36314
7656C6314o5888p8141N3003M9375Q821q0440n418L8001L2820k2121k4744K6395
$$ 36314 -29574 -107715 -54712 -5337 3484 -76956 -82374 -44373 -11553 -33674 -58418 -32023
7644c2023n7281M4295j1267l6175l3558M0048K6781m9139J21490k4487m7725L2408
$$ -32023 -89304 -45009 -56276 -92451 -126009 -85961 -59180 -108319 13171 -11316 -59041 -26633
7632b6633q058l0366N012K2332R0885j7947J289j9470K0166l0072l019m0428J1939
$$ -26633 -34691 -65057 -60045 -37713 53172 35225 36514 17044 37210 7138 4119 -36309 -24370
7619b4370k3008P963J0738J043k1912j5335k9018q099K6062N4366K9176o0212
$$ -24370 -47378 -39415 -28677 -27634 -49546 -64881 -93899 -101998 -75936 -21570 7606 -52606
7607e2606k9145M8427j8019l9756K4291o9719l6892J3007N6462p323l6913n445
$$ -52606 -81751 -33324 -51343 -91099 -66808 -136527 -173419 -160412 -103950 -111273 -148186 -153631
7595a53631m1521R1189j6917J4570j7391K3561j46325Q0J40707K6587L1436q0018
$$ -153631 -195152 -103963 -120880 -106310 -123701 -100140 -246465 -246385 -105678 -79091 -47655 -127673
7583a27673O4078L7247m7267l7757O1698O321o6333K4724M9660J9781J0638p0291
$$ -127673 -63595 -26348 -73615 -111372 -49674 -43353 -109686 -84962 -35302 -15521 -4883 -75174
7571g5174M0840l9044O3428q730l0016l4927M6243n0915k0912M0931O1866J3044
$$ -75174 -34334 -73378 -9950 -18680 -48696 -83623 -37380 -88295 -109207 -68276 -6410 6634
7559F634n4656L2954J032J4841n634p1633L5089k0322L3378n592N1592n9537m6833
$$ 6634 -48022 -15068 -14036 805 -4829 -76462 -41373 -61695 -28317 -33909 17683 -41854 -88687
7546h8687K9445q920N1378O342O0774n2606o2318M064k0489J2539L0877R1818
$$ -88687 -59242 -68162 -16784 -10442 50332 -2274 -64592 -60528 -81017 -68478 -37601 54217
7534E4217m6470m8777P884k1254Q0830l2259l0414k9328j2961M0381k0623O5960
$$ 54217 7747 -41030 -33146 -54400 26430 -5829 -36243 -65571 -78532 -38151 -58774 7186
7522G186P034m1107J5899J9890l002j2866n6949K0298M5434k436N1910J0197l6523
$$ 7186 14220 -26887 -10988 8902 5900 -6966 -63915 -43617 1817 -619 51291 61488 24965
7509B4965j0696K9851J8628J7178k3739m4338N1293M1311L248j0221q5572l277
$$ 24965 14269 44120 62748 79926 56187 11849 63142 104453 107701 97480 11908 8631
7497H631J9938r8710R3940k8943J8529o9244L557O443J8946Q7747q0967p2539
$$ 8631 28569 -70141 23799 -5144 13385 -55859 -52302 -45859 -26913 60834 -20133 -92672
7485i2672N6622Q2619m4887m407q22r793K6586M6432r7239m0681J141R839J4565
$$ -92672 -36050 46569 1682 -2725 -3547 -13340 13246 59678 -37561 -78242 -77101 -67262 -52697
7472e2697M0203n3934L829N5927m3106J2796L4823L1122L3015m8856M3245o8504
$$ -52697 -12494 -66428 -62599 -6672 -49778 -36982 -2159 28963 61978 13122 56367 -12137
7460a2137L0259q7224k4517M1429o681q8950O135Q3886N5378j1803J6685R004
$$ -12137 18122 -69102 -93619 -52190 -58871 -147821 -141686 -57800 -2422 -14225 2460 11464
7448A1464l6816o1214O619M786Q5635J9985p5976m0077j3310N2147N8033R760
$$ 11464 -25352 -86566 -79947 -75161 10474 30459 -45517 -85594 -98904 -46757 11276 21036
7436B1036M9728n4023M7984P3005m5719o2539r611n6469M9291L9989M3174o1452
$$ 21036 70764 16741 64725 137730 92011 29472 19861 -36608 12683 52672 95846 34394
7424C4394P595P0828l2517k2686k4706N2062l0146n2003M7553N4471m9382j03033
$$ 34394 41989 112817 80300 57614 32908 84970 54824 2821 50374 104845 55463 -47570
7412d7570j7935J34313j9281k8784J6549K6685l4171J053L1046R635k0816j0652
$$ -47570 -65505 68808 49527 20743 37292 63977 29806 30859 61905 71540 50724 40072
7400D0072n4485Q3670K1420K182j5228K560L132J5469j10339J9520J02296K110
$$ 40072 -14413 69257 90677 92859 77631 80191 83323 98792 -11547 7973 110269 112379
7388A12379l326n8436L0341k3627j8780P8020j0864o1902k5779P3522m0506k0368
$$ 112379 109053 50617 80958 57331 38551 116571 105707 43805 18026 91548 51042 30674
7376C0674J6048n6824k6401R2381M2540q872K3264K0667k804m287l157j12606
$$ 30674 46722 -10102 -36503 55878 98418 89546 112810 133477 130673 126386 123229 10623
7364A0623J2050Q9703o8883k48M8053r3102m4163P8674p2486K2952P1053m1412
$$ 10623 22673 112376 43493 43245 91298 -1804 -45967 32707 -39779 -16827 54226 12814
7352A2814M3448K7376l0036p7377L921R7977n8026N5120O085o4170R537K9948
$$ 12814 56262 83638 53602 -23775 -19854 78123 20097 75217 81302 17132 26669 56617
7340E6617P1228j6207n7936r246j2395L2958J8693m7995l2363j1591J3541P1613
$$ 56617 127845 111638 53702 44456 32061 65019 83712 35717 3354 -8237 5304 76917
7328G6917l1287l7560O0594K2492o1777J879M641L6603m0533l5946L4354L5389
$$ 76917 45630 8070 68664 91156 29379 31258 35899 72502 31969 -3977 30377 65766
7316F5766K710q87j0792l9880p856j5719M9847M1863m5262k7831k0817l5290Q3323
$$ 65766 68476 67589 56797 16917 9061 -6658 43189 85052 39790 11959 -8858 -44148 39175
7303C9175N3085k7501j3683L6574p6265k0486j1588J4161P8774J9219K5060j0279
$$ 39175 92260 64759 51076 87650 11385 -9101 -20689 -6528 72246 91465 116525 106246
7291A06246n6489L0839L360M692l8969j5879p751k9910Q109l4977J2971N2142
$$ 106246 49757 80596 83956 88648 49679 33800 26049 -3861 4248 -30729 -17758 34384
7279C4384l8274L2509N6595P982j2023l556q5715J0684J0989j4006N0547M1943
$$ 34384 -3890 28619 85214 93196 81173 77617 -8098 2586 13575 -431 50116 92059
7267I2059j09087q239J5523K6184q458N951n4390O6750J088k8936K5524k4402
$$ 92059 -17028 -25267 -9744 16440 7982 13933 -40457 26293 27381 -1555 23969 -433
7255d33j7531n7189K2415P6932q698l9113K2019O7083l759p9606N871J01819k2169
$$ -433 -17964 -75153 -52738 24194 15496 -23617 -1598 65485 61726 -17880 -12009 89810 67641
7242F7641l2105M7515m756M5167j21241J5148J6090k5743o9359m3656O4296J01377
$$ 67641 35536 83051 78295 123462 2221 17369 33459 7716 -61643 -105299 -41003 60374
7230F0374j9223J854n6522r936L1517k645m3535O163L6476N835l4907J6230J1636
$$ 60374 41151 43005 -13517 -23453 8064 5419 -38116 -31953 4523 10358 -24549 -8319 3317
7217C317m1003L810J4495J7873J0955M558k2284j9382L1292O0280o4511R991l6761
$$ 3317 -37686 -33876 -19381 -1508 9447 14005 -8279 -27661 3631 63911 -600 9391 -27370
7204b7370R864N0980n2417R326o596k2030N6770l0315K0671J1317k2601J5032
$$ -27370 -17506 33474 -18943 -9617 -16213 -38243 18527 -11788 8883 20200 -2401 12631
7192A2631J1047j826M5351k348R759r2515k1343J01498m3244k0666N6777L6831
$$ 12631 23678 21852 67203 64855 74614 -17901 -39244 62254 19010 -1656 55121 91952
7180I1952P7598L1653n3093R443l9531l658O6585l1251p6880P6379O085j2946
$$ 91952 169550 201203 148110 157553 118022 114364 180949 149698 72818 149197 155282 142336
7168A42336l6432r7932L6306N307k5672L7238M2054J05311o7972p770N533J05130
$$ 142336 105904 7972 44278 49585 23913 61151 103205 208516 140544 132774 138307 243437
7156B43437P974j8717m2070k8156J9419m1241J9711j9626r615N4677J9642K329
$$ 243437 251411 232694 190624 162468 181887 140646 160357 140731 131116 185793 205435 207764
7144B07764n2988J7005L6253O4734R6030q1427O1685J7001p58K4633n384n0682
$$ 207764 154776 171781 208034 272768 368798 287371 349056 366057 365299 389932 384548 333866
7132C33866j4966Q7600Q7780r3844Q7095N8185k8688O3433m8J34219J44882R3158
$$ 333866 318900 406500 494280 400436 487531 545716 517028 580461 580413 714632 859514 952672
7120I52672P6024J86661K58885K52146K40922L80882L88005K87238Q2878j91513
$$ 952672 1028696 1215357 1474242 1726388 1967310 2348192 2736197 3023435 3106313 2914800
7110B914800l67760l57543l63418l89837k39938j43757r8353J6671j14431j11783
$$ 2914800 2547040 2189497 1826079 1436242 1196304 1052547 954194 970865 856434 744651
7100G44651L2546n8937K2100m6087o3828p6560n3925p6704k0972k4392k2307o5149
$$ 744651 777197 718260 740360 694273 630445 553885 499960 423256 402284 377892 355585 290436
7088B90436k9123l6938n1801N9860M8360m3483k1259L4070p8572M1702K2436l9239
$$ 290436 261313 224375 172574 232434 280794 237311 216052 250122 171550 213252 235688 196449
7076A96449k9058m7366Q399M7413p6055o338L0641P873p2902L2319m6677M2304
$$ 196449 167391 120025 128424 175837 99782 93444 124085 131958 59056 91375 44698 87002
7064H7002N1492o1510j9346J0292K9758k7905L6962J6309O0712K7554l3418j7104
$$ 87002 138494 76984 57638 67930 97688 69783 106745 123054 183766 211320 177902 160798
7052A60798R471q775O278J2875m3571M170R1637J9226R351p0788K3927j3551m7942
$$ 160798 170269 161494 167772 180647 137076 141246 232883 252109 261460 190672 214599 201048 153106
7039A53106j01189J5914J9748j0307j0093K3724m6198L2737J7775n9283J9993
$$ 153106 51917 67831 87579 77272 67179 90903 44705 77442 95217 35934 55927
7028E5927K9374n5357k1834O3248m2262K8834J28602m0847n0681j00704M3124
$$ 55927 85301 29944 8110 71358 29096 57930 186532 145685 95004 -5700 37424
7017C7424j81l5063Q8520l8695M01l4166L6019P636k3074m2278M3763r650Q811
$$ 37424 37243 2180 90700 52005 52406 18240 54259 61895 38821 -3457 40306 30656 39467
7004C9467R7492K2349p3162q5980N1863M3110P832N5912j6524O423n7918k6256
$$ 39467 136959 159308 86146 166 52029 95139 102971 158883 142359 148782 90864 64608
6992F4608j7845O7068l6289l4458K2477O9924k2800l8408j09J9551L1526K2387
$$ 64608 46763 113831 77542 43084 65561 135485 112685 74277 74168 93719 125245 147632
6980A47632M028M3010m0776j9171j0202j1524N4287l1375j24537M6349M0894Q1253
$$ 147632 151660 194670 153894 134723 124521 112997 167284 135909 11372 57721 98615 179868
6968A79868N8921m7752l1029O129P1024k0966l9473O2380P190J456o3505m0833
$$ 179868 238789 191037 160008 166137 237161 216195 176722 239102 246292 247748 184243 143410
6956A43410K7765m7254O0672m3230L5159K9014O3247M0471o036j10520j4652M9160
$$ 143410 171175 123921 184593 141363 176522 205536 268783 309254 303218 192698 178046 227206
6944B27206Q466N0858Q430p8895Q235J8538L5496L4547K9145r8391P5471r671
$$ 227206 235672 286530 294960 216065 224300 242838 278334 312881 342026 243635 319106 309435
6932C09435r5566N467M308j3343P3299Q590p8924l4654r62k174J1945O650m4522
$$ 309435 213869 219336 223644 210301 283600 292190 213266 178612 177650 175476 187421 194071 149549
6919A49549p095K2694K9622j490P7656j08420n3946m190q763K080N8794O1091
$$ 149549 142454 165148 194770 193280 270936 162516 108570 104380 95617 97697 156491 217582
6907B17582j09535M9716P4658j7818L6804J0364j4199l2572k083R2854M1720J03663
$$ 217582 108047 157763 232421 214603 251407 261771 247572 215000 212917 305771 347491 451154
6895D51154J21738O2354k5884q2116q4592j85552k0613n7487r4998l4186K0359
$$ 451154 572892 635246 609362 527246 442654 257102 236489 179002 84004 49818 70177
6884G0177J06041n6549M9104J801j28064O031l2753O9339P6410q2414k6428k5570
$$ 70177 176218 119669 168773 170574 42510 48541 15788 85127 161537 79123 52695 27125
6872B7125m7411J46388M6409r1074m8905K2228k1952j9328q2098Q8697L6170J6611
$$ 27125 -20286 126102 172511 81437 32532 54760 32808 13480 -68618 20079 56249 72860
6860G2860o5109m9748Q4738K419M1689m8192L5029k2282j0349p037k7299K3277
$$ 72860 7751 -41997 42741 45160 86849 38657 73686 51404 41055 34018 6719 29996
6848B9996J2488n8182J7251L8251N4576k0193O5261q1539k4389Q8271p6376J6288
$$ 29996 42484 -15698 1553 39804 94380 74187 139448 57909 33520 121791 45415 61703
6836F1703j6509j9578M7441l1552l4708M9976k3697Q605L7354J6955j876Q1480
$$ 61703 45194 25616 73057 41505 6797 56773 33076 41681 79035 95990 94114 175594
6824A75594O4130r1917j14413M3655k8410P217N2537K1310k9619K4910n9911j8052
$$ 175594 239724 147807 33394 77049 48639 55856 108393 129703 100084 124994 65083 47031
6812D7031M8559M6929j7014p629m6454n4007M4033l003r6671J3305M2405N5581
$$ 47031 95590 142519 125505 117876 71422 17415 61448 58445 -38226 -24921 17484 73065
6800G3065K8674j05729J4822O3159R022J7815l7353K8275O2069p7076J9918l714
$$ 73065 101739 -3990 10832 73991 83013 100828 63475 91750 153819 76743 96661 92947
6788I2947j4274N3326m4656n4586j2563M6269l200l2958J08074n7383o122l0211
$$ 92947 78673 131999 87343 32757 20194 66463 63263 30305 138379 80996 74874 44663
6776D4663j5213m8578j8091R6480J3520m492j4186K4923K6524n5068r771J6252
$$ 44663 29450 -19128 -37219 59261 72781 68289 54103 79026 105550 50482 40711 56963
6764E6963k2249K8637P2577k0600j2743l6650n9712k4778N4490J1758k9884l4642
$$ 56963 34714 63351 135928 115328 102585 65935 6223 -18555 35935 47693 17809 -16833
6752a6833p6756K6258P4197N3589K1012O9894k7357N72o9654m7203R7696J9978
$$ -16833 -93589 -67331 6866 60455 81467 151361 124004 124576 54922 7719 105415 125393
6740A25393m9330o7512l3677j184J3851j7038M7238J1495k6639Q6950m0176k2489
$$ 125393 76063 8551 -25126 -26310 -12459 -29497 17741 29236 2597 89547 49371 26882
6728B6882q4774O0691L0001n2942M0725N77l509K1214N2193k412J641q6151K8631
$$ 26882 -57892 2799 32800 -20142 20583 21160 17651 38865 91058 88646 90287 4136 32767
6715C2767M1531L0024l6072j9422j2451L3298Q558m4375j9393J3525M8525M6048
$$ 32767 74298 104322 68250 48828 36377 69675 78233 33858 14465 27990 76515 122563
6703A22563r1906N325j5945j6089N8011M5840j4848M0979k5513p2850k4438J15776
$$ 122563 30657 35982 20037 3948 61959 107799 92951 133930 108417 35567 11129 126905
6691A26905j5689j1849m8880j2658P1518J7916K5925o5091p250k5717k3073M9804
$$ 126905 111216 99367 50487 37829 109347 127263 153188 88097 80847 55130 32057 81861
6679H1861N4380j568m4299N974l1018l6835k611Q6575p3311J01712J934m6277
$$ 81861 136241 134673 90374 96348 65330 28495 25884 112459 39148 140860 142794 96517
6667I6517J2951j9914O6136k9420J5679p8059J3455P746P3558P7892L3512p3464
$$ 96517 109468 89554 155690 126270 141949 63890 77345 85091 158649 236541 270053 196589
6655A96589n9965l8120N5757l2337J05816J6514L7013J9254p5640k2784P3116
$$ 196589 136624 98504 154261 121924 227740 244254 281267 300521 224881 202097 275213
6644B75213q6851n578L6078k6263o902k5591m2145J35438M9455o1207p7467j6151
$$ 275213 188362 182784 218862 192599 185697 160106 117961 253399 302854 241647 164180 148029
6632A48029L3971j8611k6671N9308O1360K7411M1565q838k7396o131L2115l770
$$ 148029 182000 163389 136718 196026 257386 284797 326362 317524 290128 283997 316112 312342
6620C12342j1117m023j02290P7232O3830p8767n3954O9269N0207l8145K9525N2203
$$ 312342 301225 297202 194912 272144 335974 257207 203253 272522 322729 284584 314109 366312
6608C66312J7548n7134M415O4991J8198p3556o3283p65L8280N255J9724l8441
$$ 366312 383860 326726 331141 396132 414330 340774 277491 276726 315006 320261 339985 301544
6596C01544q533n4099j421N6899L2990Q174N4573M3326K4474J9434p4415j4999
$$ 301544 293011 238912 237491 294390 327380 335554 390127 433453 457927 477361 402946 387947
6584C87947o725n1827M5288P3769m4775n1650l0057N6219J422K9150L1979K1318
$$ 387947 381222 329395 374683 448452 403677 352027 321970 378189 379611 408761 440740 462058
6572D62058P7618r1026k4049L3096L1697N2337L0650j6694J2802K2096o2792O940
$$ 462058 539676 448650 424601 457697 489394 541731 572381 555687 568489 590585 527793 534733
6560E34733L9163l1963p8833o8218k4433n8487k0926l8487j3491M5391K9484j48953
$$ 534733 573896 541933 463100 394882 370449 311962 291036 252549 239058 284449 313933 164980
6548A64980N2410M5712k5503k7310k6763j4134j5644k1749J8687J1284J06901
$$ 164980 217390 263102 237599 210289 183526 169392 153748 131999 150686 161970 268871
6537B68871k1792k4362m5196n9957j0249M5666K8515Q7391O516l7839O830m3181
$$ 268871 247079 222717 177521 117564 107315 152981 181496 268887 275403 237564 244394 201213
6525B01213J6457N1798m8503k1957p293j176N0423o3620N1810k4767j9959K8954
$$ 201213 217670 269468 220965 199008 191715 190539 240962 177342 229152 204385 184426 213380
6513B13380j7936l6967l7323l2230j5587L675n293j6857m4368R2432n5397p284
$$ 213380 195444 158477 121154 88924 73337 77012 71719 54862 10494 102926 47529 40245
6501D0245M2925j9008J0067M1691K5955j19489L9448k0888N0724j433k0316k4633
$$ 40245 83170 64162 74229 115920 141875 22386 61834 40946 91670 90237 69921 45288
6489D5288l0801M0111o5394k3532O6807J800N8707J1277O9221K1617j57208o6549
$$ 45288 14487 54598 -10796 -34328 32479 34279 92986 104263 173484 195101 37893 -28656
6477b8656L3203j904Q1895o077p904J6041j8061P401j4404j3939q274j09p749
$$ -28656 4547 2643 84538 78461 70557 86598 68537 75938 61534 47595 39321 39212 31463
6464C1463l1068K3193K6010L3492k1221o1765O111L1765N7757j6464K9350K1108
$$ 31463 395 23588 49598 83090 61869 104 6215 37980 95737 79273 108623 129731
6452A29731j7965q943j8261p870M849L9855M193j00256P2475k265K2596n8095
$$ 129731 111766 102823 84562 76692 81541 121396 125589 25333 97808 95543 118139 60044
6440F0044N8487l1056L405n754l3165O1049J4612o0617n7483r730o484N9024n809
$$ 60044 118531 87475 90880 85126 51961 113010 127622 67005 9522 -208 -6692 52332 46523
6427D6523j6465l738Q8139p7137K0707L9472o6562J831L5045n7569p221r09P5670
$$ 46523 30058 26320 114459 37322 58029 97501 30939 32770 67815 10246 3025 2116 77786
6414G7786j37161l715J010N1111L2937J6787K5780M7577p8354k1541J1638M0796
$$ 77786 -59375 -63090 -62080 -10969 21968 38755 64535 112112 33758 12217 23855 64651
6402F4651K5132j3694K5120o1647p2m81j8099n0323N6539N4365p9395K3006J1575
$$ 64651 89783 76089 101209 39562 39490 39009 20910 -29413 27126 81491 2096 25102 36677
6389C6677J4205K5524j1147n182q2468j7380J01006o7950n8343O8642Q8708J8110
$$ 36677 50882 76406 65259 60077 -22391 -39771 61235 -6715 -65058 3584 92292 110402
6377A10402O419j378m3895K3009n362r5818m0550R6307j9093K6314k4226K5129
$$ 110402 116821 115443 71548 94557 89195 -6623 -47173 49134 30041 56355 32129 57258
6365E7258J1328o0312K7926j7769l8194O1904N271K2740L879m0716k4497P3485
$$ 57258 68586 8274 36200 18431 -19763 42141 47412 70152 74031 33315 8818 82303
6353H2303J3656j5253j09606M4302K2561L2103K0053o6886m3445M5689Q1389j7930
$$ 82303 95959 80706 -28900 15402 37963 70066 90119 23233 -20212 25477 106866 88936
6341H8936k4778L9946M0841r8233N935J7123k5399N3111j5793K8615k4839l6396
$$ 88936 64158 104104 144945 46712 52647 69770 44371 97482 81689 110304 85465 49069
6329D9069O0981L5783M0432m9767j23453k8007l3111K7623J2797N6400M1735l6816
$$ 49069 110050 145833 186265 136498 13045 -14962 -48073 -20450 -7653 48747 90482 53666
6317E3666l232k9261Q3895J02126m7302m220l1113K8641j9309k2851O1952L090
$$ 53666 50434 21173 105068 207194 159892 155672 124559 153200 133891 111040 172992 176082
6305A76082L5598k8522k9649m967M9657k1565k3661k7109K3726L9463q30K6749
$$ 176082 211680 183158 153509 148542 198199 176634 152973 125864 149590 189053 188223 214972
6293B14972N360Q8836K5453P1432K7713k8463k8339O058j10541q0676k6629j99
$$ 214972 220332 309168 334621 406053 433766 405303 376964 383022 272481 191805 165176 164977
6281A64977n2065P014P9484J5756J3470r4469k6544O2016M9325M4481l3590l8527
$$ 164977 112912 119926 199410 215166 228636 134167 107623 169639 218964 263445 229855 191328
6269A91328K9382L3512k464l1199L4190j3912K6382N9463j2833L8928R89k0510
$$ 191328 220710 254222 251758 220559 254749 240837 267219 326682 313849 352777 353766 333256
6257C33256N6565P0J21789N4114N0539O1163R1431j3190M8978q0562j22971n5259
$$ 333256 389821 389891 511680 565794 616333 677496 768927 755737 804715 724153 601182 545923
6245E45923m5217J5994j15504q0927j5695m5283k0318r143J1792O1362l4315o038
$$ 545923 500706 516700 401196 320269 304574 259291 238973 229830 241622 302984 268669 262631
6233B62631n5472L5562J4043M6515o323j37518J994L8483n1545O2596q986J04792
$$ 262631 207159 242721 256764 303279 296956 159438 161432 199915 148370 210966 201980 306772
6221C06772o9287j1986Q8422K9114J9348j3867M6573Q7367J04062l9435p5138
$$ 306772 237485 225499 313921 343035 362383 348516 395089 482456 586518 547083 471945
6210D71945r5032p217k1969j15194J2630M2233q1908N3607o9210J20885m4725
$$ 471945 376913 369696 347727 232533 245163 287396 205488 259095 189885 310770 266045
6199B66045j06146j5592K613k7542J1874M5128J1843j8982n0696j1630P3549m2099
$$ 266045 159899 144307 146920 119378 131252 176380 188223 169241 118545 106915 180464 138365
6187A38365l0662N2682r802n8227j0092l5258R4073l5121n7194Q6587O5280k2772
$$ 138365 107703 160385 150583 92356 82264 47006 141079 105958 48764 135351 200631 177859
6175A77859l4986n4623J09609j3600m0027M151l8346M0642k1168O224P0265N847
$$ 177859 142873 88250 197859 184259 144232 148383 110037 150679 129511 135735 206000 211847
6163B11847o9477m2030R936Q595K9140R846p6286j5733J8627K3422O8182N1317
$$ 211847 142370 100340 110276 118871 148011 157857 81571 65838 84465 107887 176069 227386
6151B27386p0224k8851m2846N2870n3566L9150M1274P513k0670l3764q4306O2354
$$ 227386 157162 128311 85465 138335 84769 123919 165193 172706 152036 118272 33966 96320
6139I6320J27648Q673J13648J0296j007q2302N1252m5032n2063N8784l1499N72
$$ 96320 223968 232641 346289 356585 355578 273276 324528 279496 227433 286217 254718 255290
6127B55290j1027J6655M9008R2918m2739P4322K4308M4051J09461P048o2330m7340
$$ 255290 244263 260918 309926 402844 360105 434427 458735 502786 612247 619295 556965 509625
6115E09625n4045p8988m6031k6744K8381J1797K4414R340q5589K1074J3027K2660
$$ 509625 455580 376592 330561 303817 332198 343995 368409 377749 292160 313234 326261 348921
6103C48921J391J5740O874L4583Q964J28336m7200r359J03709J43396l7097L4386
$$ 348921 350312 366052 372926 407509 416473 544809 497609 488250 591959 735355 698258 732644
6091G32644l5868q7613j56773j4469N4555m2431M7020q4400m572J03622K7176
$$ 732644 696776 609163 452390 437921 492476 450045 497065 412665 408093 511715 538891
6080E38891l439R9518k9194n0321o7962k9116j5092k5336r12j3301J658j738m7013
$$ 538891 535452 634970 605776 555455 487493 458377 443285 417949 417037 403736 405394 403656 356643
6067C56643l6410q9607N5311O212j4477P3185L1751L7090q4444o0650O208Q1045
$$ 356643 320233 230626 285937 292149 277672 350857 382608 419698 335254 274604 280812 361857
6055C61857Q0610M3019j0486l2061m9386O3275n5695j8704j8928l0147k8610J8533
$$ 361857 442467 485486 475000 442939 393553 456828 401133 382429 363501 333354 304744 323277
6043C23277L0874j9202N1582l3894l1735k0837P2450j6560j025j8444K1244K1712
$$ 323277 354151 334949 386531 352637 320902 300065 372515 355955 354930 336486 357730 379442
6031C79442k9467K2230j1307j1846p0165J1341Q1779j8394K2347n4397P9382k4376
$$ 379442 349975 372205 360898 349052 278887 290228 372007 353613 375960 321563 400945 376569
6019C76569o9100k6006J00575J5944r8570M1273O4231O4771M3061m7637q8446
$$ 376569 307469 281463 382038 397982 299412 340685 404916 469687 512748 465111 376665
6008C76665k4446L5969K2539M1353o9032N6353O2541r443L7655L1837j09524K748
$$ 376665 352219 388188 410727 452080 383048 439401 501942 492499 530154 561991 452467 455215
5996D55215J16932o328r2587L9589M5958k7917J7313M1037l8841N3152l8205M8775
$$ 455215 572147 565819 473232 512821 558779 530862 548175 589212 550371 603523 565318 614093
5984F14093L2443p9846j1999J8572M288J901L5582K6950J8842N1010K2985m483
$$ 614093 646536 566690 554691 573263 577551 579452 615034 641984 660826 711836 734821 730338
5972G30338n8492J31702k7521n9085P1650J4595K9898K2868m704k3202J04807
$$ 730338 671846 803548 776027 716942 788592 803187 833085 855953 851249 828047 932854
5961I32854J258p1905q003J2684J13098O8380l8426J8535L4494O4676q0479r139
$$ 932854 934112 862207 854204 866888 979986 1048366 1009940 1028475 1062969 1127645 1047166 1038027
5949A038027Q8166Q4678N8734J2165q83k025m0461j7979M4802R2944L5260Q8264
$$ 1038027 1126193 1210871 1269605 1281770 1280887 1278862 1238401 1220422 1265224 1358168 1393428 1481692
5937A481692O0925O8575K9693p9982M7176J62689N8282N1059j12477J02965J52967
$$ 1481692 1542617 1611192 1640885 1560903 1608079 1770768 1829050 1880109 1767632 1870597 2023564
5926B023564N8700M1878N1699M2622P6840J13855J21593J22810J56855J30028
$$ 2023564 2082264 2124142 2175841 2218463 2295303 2409158 2530751 2653561 2810416 2940444
5916B940444J73728K47708K22636L09390L39736L47992K95038J63981J21465N8073
$$ 2940444 3114172 3361880 3584516 3893906 4233642 4581634 4876672 5040653 5162118 5220191
5906E220191m0484j63552j18404j22905j19994k08915k35588k45136k29979k28224
$$ 5220191 5179707 5016155 4897751 4774846 4654852 4445937 4210349 3965213 3735234 3507010
5896C507010l56946k69856k27362k07888j38697j37496j49580j16991o4794j4264
$$ 3507010 3150064 2880208 2652846 2444958 2306261 2168765 2019185 1902194 1837400 1823136
5886A823136K0077p172o3878j18301j67278r6238k9505K8873r8931j19702N4793
$$ 1823136 1843213 1836041 1772163 1653862 1486584 1390346 1360841 1389714 1290783 1171081 1225874
5875A225874J7351p4515p9780n168m6893k0391m1162j9097m1839n38J0543k1309
$$ 1225874 1243225 1168710 1088930 1083762 1036869 1016478 975316 956219 914380 913842 924385 903076
5863I03076l1519l1543L216j1580K4121N6290m7445m6434n8986L9197O1468O956
$$ 903076 871557 840014 843230 831650 855771 912061 864616 818182 759196 798393 859861 866817
5851H66817o4270k6899l8826p586O0841l9072Q784J4137N5243k1082l2470n1200
$$ 866817 802547 775648 736822 729236 790077 751005 759789 773926 829169 808087 775617 724417
5839G24417l789j580N5063K6493l7996o5861k5807K7906K516N2874J4895q0268
$$ 724417 720628 719048 774111 800604 762608 696747 670940 698846 701362 754236 769131 688863
5827F88863j8731R4781M1875m2227k6388K4687O0391p53N1252j8989k6423o7708
$$ 688863 670132 764913 806788 764561 738173 762860 823251 822498 873750 854761 828338 760630
5815G60630L586L230k7108p1755l7636P3058l270O795O3738k3734J6158J7588
$$ 760630 764216 767446 740338 668583 630947 704005 700735 707530 771268 747534 763692 781280
5803G81280J0893m917L8025P2382k4948K3651L6560j1796K8337J10611N5419o1879
$$ 781280 792173 787256 825281 897663 872715 896366 932926 921130 949467 1060078 1115497 1053618
5791A053618N1770J45898K14808K14557K36285K91142K41504P9369j82362l26160
$$ 1053618 1105388 1251286 1466094 1680651 1916936 2208078 2449582 2528951 2346589 2020429
5781B020429k01731j64789l06689k11429j09585o1414p2168l1878n39l6997K80
$$ 2020429 1818698 1653909 1347220 1135791 1026206 964792 892624 860746 860207 823210 823490
5770H23490n6493K6439J0511L2215r5905m0162N5283o2492p3320O5740J8287n3622
$$ 823490 766997 793436 803947 836162 740257 700095 755378 692886 619566 685306 703593 649971
5758F49971q4009k863N4257k0123n9258k1372O1996j6308l0022j3531M4872l6147
$$ 649971 565962 563099 617356 597233 537975 516603 578599 562291 532269 518738 563610 527463
5746E27463k0959m556k2330k1419p8645M4980Q3699K4820J359j645J3979K859
$$ 527463 506504 501948 479618 458199 379554 424534 508233 533053 534412 532767 546746 549605
5734E49605K6268o0202K4482o8626j2266k0563n575K3918L0510Q8606n1893n8089
$$ 549605 575873 515671 540153 471527 459261 438698 433123 457041 487551 576157 524264 466175
5722D66175k7682O462L2162m5955k575Q0742m8766q9331m1250P2578m6218n0847
$$ 466175 438493 444955 477117 431162 428587 509329 460563 371232 329982 402560 356342 305495
5710C05495J02018K5237r436n0168J10546j7099k8176L591n1236l8693N379O6184
$$ 305495 407513 432750 423314 373146 483692 466593 438417 442008 390772 352079 357458 423642
5698D23642N426m154o1718K5633L5629m7807m6154M2394K7163R569J6105M9577
$$ 423642 429068 424914 363196 388829 424458 376651 330497 372891 400054 409623 425728 475305
5686D75305J5274o7770j9498O6346L554m9004K987l4953N6621O0237k3272j42210
$$ 475305 490579 422809 403311 469657 473211 424207 427194 392241 448862 509099 485827 343617
5674C43617K5963L5474k2620J5156K63j0267m1852R712J0336l4492l938j2297
$$ 343617 369580 405054 382434 397590 397853 387586 345734 355446 365782 331290 327352 315055
5662C15055K6384J49882L4543o1740j4611L7248l323j1404q275Q68L1258k7546
$$ 315055 341439 491321 525864 464124 449513 486761 483438 472034 463759 464627 495885 468339
5650D68339l0340n3500p740L6011M5903l7857L0954K6401j10466J0910M5992L2600
$$ 468339 437999 384499 376759 412770 458673 420816 451770 478171 367705 378615 424607 457207
5638D57207p9561k3511L7239k0782J9566J7083N1277L7201k2487L9719L1790r0656
$$ 457207 377646 354135 391374 370592 390158 407241 458518 495719 473232 512951 544741 454085
5626D54085J1868K8877K3652K469L6072J0390K0832l6913Q2220m941K6236J5079
$$ 454085 465953 494830 518482 520951 557023 567413 588245 551332 633552 628611 654847 669926
5614F69926L3073k1940j4394j7766m7049O1944j5292j7288k2342k3553m5087K4552
$$ 669926 702999 681059 666665 648899 601850 663794 648502 631214 608872 585319 540232 564784
5602E64784L4591P2930J1391m0991M7301Q0255j1300o5723n4031L8597Q0526O4730
$$ 564784 599375 672305 683696 642705 690006 770261 758961 693238 639207 677804 758330 823060
5590H23060m3586J4513l3273L9175l3993K7472O0212P9228L4369l4074N6702k7793
$$ 823060 779474 793987 760714 799889 765896 793368 853580 932808 967177 933103 989805 962012
5578I62012P4979O0967k5743j9135L5424R4729k3582O886n2916o953J356J04144
$$ 962012 1036991 1097958 1072215 1053080 1088504 1183233 1159651 1166537 1113621 1106668 1108024 1212168
5566A212168J10492o1428j15338R4550k41p728k0659k1002J2655K1272j2063k6452
$$ 1212168 1322660 1261232 1145894 1240444 1240203 1232475 1211816 1190814 1203469 1224741 1212678 1186226
5554A186226Q4876K6187J7910K582l9395k56K0300R4591M3205L3716R8770J35134
$$ 1186226 1271102 1297289 1315199 1317781 1278386 1278130 1298430 1393021 1436226 1469942 1568712 1703846
5542A703846J43099K5982O5614M5283J22975J72969J57776K91885M05694L93867
$$ 1703846 1846945 1872927 1938541 1983824 2106799 2279768 2437544 2729429 3135123 3528990
5532C528990M61038L32958q3358l37654m99788m10552l77224k96521k22064j03191
$$ 3528990 3990028 4322986 4239628 3901974 3402186 2991634 2614410 2317889 2095825 1992634
5522A992634o4736m5292j5929P2843k5665p9017k2662K7181J27867J52769J18633
$$ 1992634 1927898 1882606 1866677 1939520 1913855 1834838 1812176 1839357 1967224 2119993 2238626
5511B238626P2565m218j57184j26820k9563l7166j21887n2472j5381O2045L5116
$$ 2238626 2311191 2306973 2149789 2022969 1993406 1956240 1834353 1781881 1766500 1828545 1863661
5500A863661J05398K9499K8794J42303L5360j35014p9043M572m0149m2901J15968
$$ 1863661 1969059 1998558 2027352 2169655 2205015 2070001 1990958 1995530 1955381 1912480 2028448
5489B028448J24894M1062l1472l3776n3867j12438o6361J0718M1716k753J0763
$$ 2028448 2153342 2194404 2162932 2129156 2075289 1962851 1896490 1907208 1948924 1946171 1956934
5478A956934o7318m8719p0519j53688l42j03294K1251n1166q6292n7777k682J6183
$$ 1956934 1889616 1840897 1770378 1616690 1616348 1513054 1534305 1483139 1396847 1339070 1336388 1352571
5466A352571O841m3129k5088N9266O4241k2505N6186K5740K8044k0769M5967J0866
$$ 1352571 1359412 1316283 1291195 1350461 1414702 1392197 1448383 1474123 1502167 1481398 1527365 1538231
5454A538231L1200J3112M0218L6235Q7092J30050J08817L5785L9721m533P3627
$$ 1538231 1569431 1582543 1622761 1658996 1746088 1876138 1984955 2020740 2060461 2055928 2129555
5443B129555J02545J33348J67165M4156J74247J27538Q5112Q4717J40030J55545
$$ 2129555 2232100 2365448 2532613 2576769 2751016 2878554 2963666 3048383 3188413 3343958
5433C343958K04144J52669J79359J09713O1882J49569M3296r984k1574K7720k7935
$$ 3343958 3548102 3700771 3880130 3989843 4051725 4201294 4244590 4234606 4213032 4240752 4212817
5422D212817q5240m5253j4678n7886o567k1767j07421K7877l2517J8594l5459
$$ 4212817 4127577 4082324 4067646 4009760 4003193 3981426 3874005 3901882 3869365 3887959 3852500
5411C852500j7037j01149r4700m8536n7166n3373j57947j16489j79664j95595
$$ 3852500 3835463 3734314 3639614 3591078 3533912 3480539 3322592 3206103 3026439 2830844
5401B830844j75375j99390p1298j51969j49499j11728k7286j20200j64706l4481
$$ 2830844 2655469 2456079 2384781 2232812 2083313 1971585 1944299 1824099 1659393 1624912
5391A624912L97j00443k3782o9376m5673j29027k9155M251k3347j3004L1748K9989
$$ 1624912 1625309 1524866 1501084 1431708 1386035 1257008 1227853 1232104 1208757 1195753 1227501 1257490
5379A257490k3194L4447M2026k9325l837j3086p8370n7730j4157k2766l9283k0969
$$ 1257490 1234296 1268743 1310769 1281444 1277607 1264521 1186151 1128421 1114264 1091498 1052215 1031246
5367A031246j08563p0442K3933J6798M9571r612o0827R41m2024m3564N4926K974
$$ 1031246 922683 852241 876174 892972 942543 932931 872104 873045 831021 787457 842383 845357
5355H45357J447n7460l872K8970L890l981L2165l2587j9229j02947M126K8470
$$ 845357 846804 789344 785472 814442 818332 814351 846516 813929 794700 691753 695879 724349
5343G24349k91N759O3229M296r0530M4438n295j0635o0373q5591M8561Q8153r24
$$ 724349 724058 729817 793046 797342 706812 751250 745955 735320 674947 589356 637917 726070 725146
5330G25146j6391L9854K565l7092j4222k688m4798P598l5695n1282J03198M5162
$$ 725146 708755 748609 751174 714082 699860 697172 652374 659972 624277 572995 676193 721355
5318G21355k8110o5339M5884J4067L5337m7601Q7539J7279o1247l6145L8413j260
$$ 721355 693245 627906 673790 687857 723194 675593 763132 780411 719164 683019 721432 720172
5306G20172J8357r0483j0287L440J4712J00886K7942J055j3670K6485L2723m4643
$$ 720172 738529 648046 637759 641199 655911 756797 784739 785794 772124 798609 831332 786689
5294G86689m9701J7551j951k34J2816k7939M0046k9920N9482k9506l1439O4393
$$ 786689 736988 754539 752588 752354 765170 737231 777277 747357 806839 777333 745894 810287
5282H10287Q9683m1909j0296m7987M3487M9868m3315j4643k4504N6172R3187L6086
$$ 810287 899970 858061 847765 799778 843265 893133 849818 835175 810671 866843 960030 996116
5270I96116k7967l5680k4768L5484Q8292q258p3649M8540Q2640r8388q3936O5541
$$ 996116 968149 932469 907701 943185 1031477 1023219 949570 998110 1080750 982362 898426 963967
5258I63967M7538J9814O3450l6569k9504O4984l6673J07233l7691J8652M3483
$$ 963967 1011505 1031319 1094769 1058200 1028696 1093680 1057007 1164240 1126549 1145201 1188684
5247A188684K6104P2767k1378n997P3842M6721O5493l7872J34366L2799k6830
$$ 1188684 1214788 1287555 1266177 1260180 1334022 1380743 1446236 1408364 1542730 1575529 1548699
5236A548699j1946Q0638N9560M4746J06432M4938R9205J35787N641L6551Q3823
$$ 1548699 1536753 1617391 1676951 1721697 1828129 1873067 1972272 2108059 2113700 2150251 2234074
5225B234074Q1580J29660J26760J67914J17613J04855J68997L13137K22942J63696
$$ 2234074 2315654 2445314 2572074 2739988 2857601 2962456 3131453 3444590 3667532 3831228
5215C831228M01168O17985O06593P27491Q57663R71903R86142R65627R03645O12026
$$ 3831228 4232396 4850381 5456974 6184465 7042128 8014031 9000173 9965800 10869445 11481471
5205A1481471L2603j55794l81921q57923j118409j041464j006872q97973q63248
$$ 11481471 11514074 11358280 10976359 10118436 9000027 7958563 6951691 6053718 5190470
5196E190470o03484m04525l81158k76140k74931k13275j80607j55882j64641m1325
$$ 5190470 4586986 4182461 3801303 3525163 3250232 3036957 2856350 2700468 2535827 2494502
5186B494502k6467m2294j00831m385o5056q7584j8968R7124O1380P8551k3100
$$ 2494502 2468035 2425741 2324910 2320525 2255469 2167885 2148917 2246041 2307421 2385972 2362872
5175B362872n0531k3415L1823J575r5188l3127L9668r1175N6701O5331j7458k1031
$$ 2362872 2312341 2288926 2320749 2322324 2227136 2194009 2233677 2142502 2199203 2264534 2247076 2226045
5163B226045K2309K6598j06713o3064j529l2314j6618Q5130M039l7303N014p6708
$$ 2226045 2248354 2274952 2168239 2105175 2103646 2071332 2054714 2139844 2143883 2106580 2111594 2034886
5151B034886L5607m1447n0221L268L0245k5064j03771l6615l0774L4782m6682
$$ 2034886 2070493 2029046 1978825 1982093 2012338 1987274 1883503 1846888 1816114 1850896 1804214
5140A804214J916o0148q1290j22702r6639L7706l7691k5824k1479k3003j9838
$$ 1804214 1806130 1745982 1664692 1541990 1445351 1483057 1445366 1419542 1398063 1375060 1355222
5129A355222p8546n0932r1764J03360J401m8008L4495L2383l8452J3287M1331
$$ 1355222 1276676 1225744 1133980 1237340 1238741 1190733 1225228 1257611 1219159 1232446 1273777
5118A273777j7300k8000J9331P6191L2159p3783o6446o046K2103o7375o0494P0686
$$ 1273777 1256477 1228477 1247808 1323999 1356158 1282375 1215929 1209883 1231986 1164611 1104117 1174803
5106A174803Q729l1648k7493L8317L8529k2053M6541m7454R8N9809j1673M8686
$$ 1174803 1183532 1151884 1124391 1162708 1201237 1179184 1225725 1178271 1178369 1238178 1226505 1275191
5094A275191J9198J1483K3711O3932m4391L3160k8092r7023l271O6618O6846k1895
$$ 1275191 1294389 1305872 1329583 1393515 1349124 1382284 1354192 1257169 1253898 1320516 1387362 1365467
5082A365467K07790R4948N6560J86492J16409J16017L35286L25652L20214L50732
$$ 1365467 1573257 1668205 1724765 1911257 2027666 2143683 2478969 2804621 3124835 3475567
5072C475567L0865j71309l01266l43586l13833j60394j36291j89424o1541q8289
$$ 3475567 3506432 3335123 3033857 2690271 2376438 2216044 2079753 1890329 1828788 1740499
5062A740499m1521K839o4792n7136p0240o5073N6302J0754J8628J6228l4825R6523
$$ 1740499 1698978 1701817 1637025 1579889 1509649 1444576 1500878 1511632 1530260 1546488 1511663 1608186
5050A608186p3567L9651J033o8891m8477m1444N3366P1237n7089o6776J73396
$$ 1608186 1534619 1574270 1575303 1506412 1457935 1416491 1469857 1541094 1484005 1417229 1590625
5039A590625o7432l2532n114k0833N1696p956o0197L3762J00035M9158r0008k6556
$$ 1590625 1523193 1490661 1485547 1464714 1516410 1508454 1448257 1482019 1582054 1631212 1541204 1514648
5027A514648L7542l9050j3711K2744k9799j1405M0847L3015p589R6289K0733M8055
$$ 1514648 1552190 1513140 1499429 1522173 1492374 1480969 1521816 1554831 1547242 1643531 1664264 1712319
5015A712319N8774k3503O8110J74405N7227P8262K23738K00709J31635K85905
$$ 1712319 1771093 1747590 1815700 1990105 2047332 2125594 2349332 2550041 2681676 2967581
5005B967581L33375J84083N9557q8811r7212l04851k96045k25167j53330o7948
$$ 2967581 3300956 3485039 3544596 3455785 3358573 3053722 2757677 2532510 2379180 2311232
4995B311232q7084j21917o6411K7549O5713K3312j3804q9756q416n2335K3138
$$ 2311232 2224148 2102231 2035820 2063369 2129082 2152394 2138590 2048834 2040418 1988083 2011221
4984B011221p6609M1470k3404N2954K5436p4342l3170K7953J20487Q2391l2019
$$ 2011221 1934612 1976082 1952678 2005632 2031068 1956726 1923556 1951509 2071996 2154387 2122368
4973B122368l584k9450k4022m543M0332K1789p7385k6774p099J1691o2727L4112
$$ 2122368 2118784 2089334 2065312 2060769 2101101 2122890 2045505 2018731 2011632 2023323 1960596 1994708
4961A994708K3783J8642N0353k1190N0228J7573p9203N5756P6175j9127J3105
$$ 1994708 2018491 2037133 2087486 2066296 2116524 2134097 2054894 2110650 2186825 2167698 2180803
4950B180803J48803R1567J32608J43258J55743l847m5147q4530l5884j8609l0134
$$ 2180803 2329606 2421173 2553781 2697039 2852782 2848935 2803788 2719258 2683374 2664765 2634631
4939B634631l0327M665k7795K0849j2618J4556O2854N9262J76331O115J1669k7985
$$ 2634631 2604304 2608969 2581174 2602023 2589405 2603961 2666815 2726077 2902408 2908523 2920192 2892207
4927B892207J07179Q3765O309M1535O5439M0870j8205j833N9304M8452l5127k155
$$ 2892207 2999386 3083151 3089460 3130995 3196434 3237304 3219099 3217266 3276570 3325022 3289895 3287740
4915C287740r427K9388q624O0970J70780k3021q8701K3752Q027O0467N7217L7527
$$ 3287740 3278313 3307701 3299077 3360047 3530827 3507806 3419105 3442857 3450884 3511351 3568568 3606095
4903C606095P86P5158O8535m7505O2942K1790Q1188M2547Q6016K5976J8931L1546
$$ 3606095 3606881 3682039 3750574 3703069 3766011 3787801 3868989 3911536 3997552 4023528 4042459 4074005
4891D074005J02313M837M0228J24424N7507l294j7422J00622O4249J01184J1760
$$ 4074005 4176318 4181155 4221383 4345807 4403314 4400020 4382598 4483220 4547469 4648653 4660413
4880D660413R8099K53329J00737J53933J77517J52825O5871P0435R6494j8911
$$ 4660413 4758512 5011841 5112578 5266511 5444028 5596853 5662724 5733159 5829653 5810742
4870E810742q964L9623K7063J6913Q9323J32231J34051L0066L4773J40583K20867
$$ 5810742 5801778 5841401 5868464 5885377 5974700 6106931 6240982 6271048 6305821 6446404 6667271
4859F667271Q6412J43191J05149Q3856K09264J53344K33919J67624P3458K36668
$$ 6667271 6753683 6896874 7002023 7085879 7295143 7448487 7682406 7850030 7923488 8160156
4849H160156J41518K10944J17619J44971L33842K35769J72717K90743K76620J91074
$$ 8160156 8301674 8512618 8630237 8775208 9109050 9344819 9517536 9808279 10084899 10275973
4839A0275973J74896K55774J99461J70579K65953K47764K28172L44212K97324
$$ 10275973 10450869 10706643 10906104 11076683 11342636 11590400 11818572 12162784 12460108
4830A2460108L15835J85953K53917L25622L25363J75723K80133K85404K84367
$$ 12460108 12775943 12961896 13215813 13541435 13866798 14042521 14322654 14608058 14892425
4821A4892425L04163L00113L45528L16274K85976K79609L65778L38380L04420
$$ 14892425 15196588 15496701 15842229 16158503 16444479 16724088 17089866 17428246 17732666
4812A7732666M25792N11364N12729M37166N36826N37148P11146P65663P91601
$$ 17732666 18158458 18669822 19182551 19619717 20156543 20693691 21404837 22170500 22962101
4803B2962101Q64360Q58136J005075J037279R35871J026768J132048J140017J064647
$$ 22962101 23826461 24684597 25689672 26726951 27662822 28689590 29821638 30961655 32026302
4794C2026302J083029J240947J451488J539944J670522J621762J706212J858035
$$ 32026302 33109331 34350278 35801766 37341710 39012232 40633994 42340206 44198241
4786D4198241J998315J966636K048864K201583K292414K582493K841256L204620
$$ 44198241 46196556 48163192 50212056 52413639 54706053 57288546 60129802 63334422
4778F3334422L759703M408204N203482O503164P766600R478058J1486342J3775535
$$ 63334422 67094125 71502329 76705811 83208975 90975575 100453633 111939975 125715510
4770A25715510J6715444K0904273K6213802L3384094M3315255N2921772N7891704
$$ 125715510 142430954 163335227 189549029 222933123 266248378 319170150 377061854
4763C77061854M6261347J3173235j8506721m8591151o4159279n6940077m4589190
$$ 377061854 423323201 436496436 417989715 369398564 305239285 248299208 203710018
4756B03710018l3582677k4771939j7946790j3743983j0920159r136013p914250
$$ 203710018 170127341 145355402 127408612 113664629 102744470 93608457 85694207
4749H5694207p096589o150386n147138m212018l532283k987699k607599k352311
$$ 85694207 78597618 72447232 67300094 63088076 59555793 56568094 53960495 51608184
4741E1608184k066505j691978j524298j326659j062915p84222o90462k73167j67532
$$ 51608184 49541679 47849701 46325403 44998744 43935829 43151607 42461145 42187978 42020446
4732D2020446j37751l7704m719l9763Q9912M9097K00538J79407K94747M87256
$$ 42020446 41882695 41844991 41840272 41800509 41890421 41939518 42140056 42319463 42614210 43101466
4722D3101466P08655Q63336R61508J081103J210565J242251J312422J370136J513709
$$ 43101466 43810121 44673457 45634965 46716068 47926633 49168884 50481306 51851442 53365151
4713E3365151J602758J763900J936776K157744K514449K779926L296677M156143
$$ 53365151 54967909 56731809 58668585 60826329 63340778 66120704 69417381 73573524
4705G3573524M962879O149233P366468R468563J1715530J4196974J7685090K2195811
$$ 73573524 78536403 84685636 92052104 101520667 113236197 127433171 145118261 167314072
4697A67314072K7506220L5401104M5015325N1070759M8031462K4760164k31068
$$ 167314072 194820292 230221396 275236721 326307480 374338942 399099106 398868038
4690C98868038j4187097l9054263n7645337n3226093m2164383l2709694k4520718
$$ 398868038 384680941 345626678 287981341 234755248 192590865 159881171 135360453
4683A35360453j8038287j4018528j1359226r335106q016737o861711o050120n204717
$$ 135360453 117322166 103303638 91944412 82609306 74592569 67730858 61680738 56476021
4675E6476021m334466l755847l185068k946354k565650k253475k133484j915350
$$ 56476021 52141555 48385708 45200640 42254286 39688636 37435161 35301677 33386327
4667C3386327j615230j504872j351283j232020j089007r82498j041287j015366
$$ 33386327 31771097 30266225 28914942 27682922 26593915 25611417 24570130 23554764
4659B3554764q39970r43760r57401q20042q79638o63034o78642o17394n57064
$$ 23554764 22714794 21771034 20813633 19993591 19113953 18450919 17772277 17154883 16597819
4650A6597819m94729l97118m81300l80720l68174m01410l18957l15119k44422
$$ 16597819 16103090 15705972 15224672 14843952 14475778 14074368 13755411 13440292 13195870
4641A3195870l07681l85881l62589l02826k57537k30433k74320k41720k16768
$$ 13195870 12888189 12502308 12139719 11836893 11579356 11348923 11074603 10832883 10616115
4632A0616115k32766j79037k62900l14447k38669k27007k91268j22641k23905
$$ 10616115 10383349 10204312 9941412 9626965 9388296 9161289 8870021 8747380 8523475
4623H523475k80914j94985R93j51771j94750j52899j31283k26919j72757k27295
$$ 8523475 8242561 8047576 8048569 7896798 7702048 7549149 7417866 7190947 7018190 6790895
4613F790895p4336r2871q0240j33008j69224r7956k29912j51529j73783j32374
$$ 6790895 6716559 6623688 6543448 6410440 6241216 6143260 5913348 5761819 5588036 5455662
4603E455662j09154m1409j24185n2694p2560o3166r9905n746n5206j40683l1907
$$ 5455662 5346508 5305099 5180914 5128220 5055660 4992494 4892589 4886843 4831637 4690954 4659047
4592D659047q7521m7294l552n5948o7281j03551q2139p5593j52531j29150j16042
$$ 4659047 4571526 4524232 4520680 4464732 4397451 4293900 4211761 4136168 3983637 3854487 3738445
4581C738445n3208K5730L409j7595K8180J06225J05303L128L5291M9847o7495
$$ 3738445 3685237 3710967 3714376 3696781 3724961 3831186 3936489 3939617 3974908 4024755 3957260
4570C957260m0318o9614r5459J1223j21634j12837k803n4608j00562N413l642
$$ 3957260 3916942 3847328 3751869 3763092 3641458 3528621 3525818 3471210 3370648 3376061 3372419
4559C372419N0788n0021p5426M186l9340j8902o3863J5478K9415j13306n8825
$$ 3372419 3423207 3373186 3297760 3301946 3262606 3243704 3179841 3195319 3224734 3111428 3052603
4548C052603O0052j2768o9850p599K2929K1995j17330K9874l9570q2515R608n1200
$$ 3052603 3112655 3099887 3030037 3022438 3045367 3067362 2950032 2979906 2940336 2857821 2867429 2816229
4536B816229r8212M9237j08518j04713P1134m0490J3073l8756N087k3068n63J55430
$$ 2816229 2718017 2767254 2658736 2554023 2625157 2584667 2597740 2558984 2564071 2541003 2540440 2695870
4524B695870m5818K4924J0509N6262K941l5381R6115p9693j32252N3326l2674
$$ 2695870 2650052 2674976 2685485 2741747 2744688 2709307 2805422 2725729 2593477 2646803 2614129
4513B614129l9492l8264j05702l5518L6279M209J06539P7713K8716Q5956R9446
$$ 2614129 2574637 2536373 2430671 2395153 2431432 2435641 2542180 2619893 2648609 2734565 2834011
4502B834011R2982n3743n7912n5960N4149j6810k6894k2711j2142J4138j1007
$$ 2834011 2926993 2873250 2815338 2759378 2813527 2796717 2769823 2747112 2734970 2749108 2738101
4491B738101L549P7907j4528j2176k473k851k6793Q1792N11J4484K2172K4956
$$ 2738101 2741650 2819557 2805029 2792853 2790380 2787529 2760736 2842528 2843039 2857523 2879695 2904651
4479B904651M8632J6753J9441J23386m9948J06826r275O3106R6101k3528N8964
$$ 2904651 2953283 2970036 2989477 3112863 3062915 3169741 3160466 3223572 3319673 3296145 3355109
4468C355109J7172K2682o5019j2607J11065N6211N0028N0113J44951K28139K38344
$$ 3355109 3372281 3394963 3329944 3317337 3428402 3484613 3534641 3584754 3729705 3957844 4196188
4457D196188K44753L24012L73670L92464L60683L33080J61967N1469k2517j28672
$$ 4196188 4440941 4764953 5138623 5531087 5891770 6224850 6386817 6438286 6415769 6287097
4447F287097m05408m92085m44208m42528k95079k52522j61846j36212r6341j58644
$$ 6287097 5881689 5389604 4945396 4502868 4207789 3955267 3793421 3657209 3560868 3402224
4437C402224j38437o1047k0302m6928o2164k7192j01263l6436L8808m115j18556
$$ 3402224 3263787 3202740 3182438 3135510 3073346 3046154 2944891 2908455 2947263 2943148 2824592
4426B824592L0174R4559p9239J5897K8337J781m7387K4828L099j799j1258k2036
$$ 2824592 2854766 2949325 2870086 2885983 2914320 2916101 2868714 2893542 2896641 2894842 2883584 2861548
4414B861548o0818J8680n8621J4558k080p9911j2646K309k0137L4393R0150m6348
$$ 2861548 2800730 2819410 2760789 2775347 2773267 2693356 2680710 2683019 2662882 2697275 2787425 2741077
4402B741077K9259M823l0110O0782l8160l3400O0665L1990o5446P162J02358K3603
$$ 2741077 2770336 2775159 2745049 2805831 2767671 2734271 2794936 2826926 2761480 2768642 2871000 2894603
4390B894603J074M2324J7316R5580p266Q4484N5828J45154K12887P1708J96024
$$ 2894603 2895677 2938001 2955317 3050897 3043631 3128115 3183943 3329097 3541984 3613692 3809716
4379C809716K98529L63720K71931J43725p3755p4084k55881k92695k51324j82091
$$ 3809716 4108245 4471965 4743896 4887621 4813866 4739782 4483901 4191206 3939882 3757791
4369C757791o8172j51755l0707l2897P5769L8486Q6639Q6077Q7520O7377J19147
$$ 3757791 3689619 3537864 3507157 3474260 3550029 3588515 3675154 3761231 3848751 3916128 4035275
4358D035275j28788j25974k03586j90918n3887p7049n7251q3258j33672M4017
$$ 4035275 3906487 3780513 3576927 3386009 3332122 3255073 3197822 3114564 2980892 3024909
4348C024909N5566q4910k0540m791J9204L9025k9179J2925m048K3689Q7903m9614
$$ 3024909 3080475 2995565 2975025 2970234 2989438 3028463 2999284 3012209 3008161 3031850 3119753 3070139
4336C070139l7355j0589K1341o226p888M0780M2647R249J23503P8952J17595J42419
$$ 3070139 3032784 3022195 3043536 3037310 3029422 3070202 3112849 3122098 3245601 3324553 3442148 3584567
4324C584567P0516J13219J60060M0720M068l6802j97898j60214o7027j07636j34533
$$ 3584567 3655083 3768302 3928362 3969082 3973150 3936348 3738450 3578236 3511209 3403573 3269040
4313C269040j10776n3445o2998L9784m1041m0690L8958N0772j1210M967r4843
$$ 3269040 3158264 3104819 3041821 3081605 3040564 2999874 3038832 3089604 3078394 3083361 2988518
4302B988518P1105n2039m8985m884j4902n9060K2880M5462M5517O8596j4012k1443
$$ 2988518 3059623 3007584 2958599 2953715 2938813 2879753 2902633 2948095 2993612 3062208 3048196 3026753
4290C026753N7639L0377j6964M3429q1752J23794R4306Q646M0107L2443J17897
$$ 3026753 3084392 3114769 3097805 3141234 3059482 3183276 3277582 3286228 3326335 3358778 3476675
4279C476675J16532J30503J67628J91733L40237L69156K58839Q5333o2059k45363
$$ 3476675 3593207 3723710 3891338 4083071 4423308 4792464 5051303 5136636 5074577 4829214
4269D829214k76827l70044k63357k13555j11807p6937o077j20564n6418j7977
$$ 4829214 4552387 4182343 3918986 3705431 3593624 3516687 3510610 3390046 3333628 3315651
4259C315651p1290K8384r509n698n3522K4675K4766p245P813M0252K2028L6838
$$ 3315651 3244361 3272745 3263236 3257538 3204016 3228691 3253457 3246212 3254025 3294277 3316305 3353143
4247C353143P2415Q0892R8971K44330J13958J75379K56938K47415L27599K13068
$$ 3353143 3425558 3506450 3605421 3849751 3963709 4139088 4396026 4643441 4971040 5184108
4237E184108J45209M3073j62392k21280j60854k18200j38672o8656k6553L4729
$$ 5184108 5329317 5372390 5209998 4988718 4827864 4609664 4470992 4402336 4375783 4410512
4227D410512l8028q3092j47269j64372j50168j42719j2690n4093j16510k417m8580
$$ 4410512 4372484 4289392 4142123 3977751 3827583 3684864 3672174 3618081 3501571 3499154 3450574
4216C450574q888J2792o291o5458k675J32423N8202M3206J32780J23998O6950
$$ 3450574 3441686 3454478 3448187 3382729 3380054 3512477 3570679 3613885 3746665 3870663 3937613
4205C937613P0631L4083O8814N1719p4215n5297O7111r1322m798R9616L4088O0768
$$ 3937613 4008244 4042327 4111141 4162860 4088645 4033348 4100459 4009137 4004339 4103955 4138043 4198811
4193D198811O7721o443L6700O6316K4055J05412J09196K2372J469J27282K7237
$$ 4198811 4266532 4260089 4296789 4363105 4387160 4492572 4601768 4624140 4625609 4752891 4780128
4182D780128J02337L2726J18439J32220J97102J78922K21314J54433J63389J53693
$$ 4780128 4882465 4915191 5033630 5165850 5362952 5541874 5763188 5917621 6081010 6234703
4172F234703M9450j7898l0348j6888n8677l9669j22975n108M9095Q235M5535P2989
$$ 6234703 6284153 6266255 6235907 6219019 6160342 6120673 5997698 5992590 6041685 6049920 6095455 6168444
4160F168444N8619L3789R1117Q3184M9313L754L3096J49221J77140Q5955R1490
$$ 6168444 6227063 6260852 6351969 6435153 6484466 6488220 6521316 6670537 6847677 6933632 7025122
4149G025122O8123N6681K3365J20845K25086J51195K39741J85245K71098K10408
$$ 7025122 7093245 7149926 7173291 7294136 7519222 7670417 7910158 8095403 8366501 8576909
4139H576909L63985L55988N15735N14979O22683P07926P49474J134730J330076
$$ 8576909 8940894 9296882 9812617 10327596 10950279 11658205 12407679 13542409 14872485
4130A4872485J155348J029337M64096l12424r51426j389269j471327j178445r34098
$$ 14872485 16027833 17057170 17521266 17208842 16257416 14868147 13396820 12218375 11284277
4121A1284277o29598m30019k72805l09193k78445k42467k97051l95820l41255
$$ 11284277 10654679 10224660 9951855 9642662 9364217 9121750 8824699 8428879 8087624
4112H087624j14966k09554k29912r0729l4636k2515m147k9684O3435l6389P3913
$$ 8087624 7972658 7763104 7533192 7442463 7407827 7385312 7381165 7351481 7414916 7378527 7452440
4101G452440N9334J44562N8874Q5735M6959O5741J63049Q9906K17876J77102J71552
$$ 7452440 7511774 7656336 7715210 7800945 7847904 7913645 8076694 8166600 8384476 8561578 8733130
4090H733130L00721L46152L86600N11017M87802O51073P42163Q56031J139821
$$ 8733130 9033851 9380003 9766603 10277620 10765422 11416495 12158658 13014689 14154510
4081A4154510J376394J655550J668037J423406J113004P84064j25227j114724
$$ 14154510 15530904 17186454 18854491 20277897 21390901 22174965 22049738 20935014
4073B0935014j425734j662980j859798j822512j444110j136613q10662o37262
$$ 20935014 19509280 17846300 15986502 14163990 12719880 11583267 10772605 10135343
4065A0135343n48423o14299m52733k70816k55371k24039j40858k27424k79057
$$ 10135343 9586920 8972621 8519888 8249072 7993701 7769662 7628804 7401380 7122323
4056G122323k23063k63365j00309k56492j73650j18612j59627k9409j45104j63253
$$ 7122323 6899260 6635895 6535586 6279094 6105444 5986832 5827205 5797796 5652692 5489439
4046E489439j47057q3261n8546j72461l0230j20678o2897r4077n1114j17287M973
$$ 5489439 5342382 5259121 5200575 5028114 4997884 4877206 4814309 4720232 4669118 4551831 4556804
4035D556804m7068j39357M0309n0017n6999J1683n7714M906j4273k427l8632l6933
$$ 4556804 4509736 4370379 4410688 4360671 4303672 4315355 4257641 4262547 4248274 4245847 4207215 4170282
4023D170282l8471q2853n8967P043m89k2852J7169k065j0952n1109n2814j9843
$$ 4170282 4131811 4048958 3989991 3997034 3996545 3973693 3990862 3988797 3977845 3926736 3873922 3854079
4011C854079p4839m3762L2254J2841l0545k3649o4855Q453l988m1609M8468N8508
$$ 3854079 3779240 3735478 3767732 3780573 3750028 3726379 3661524 3669977 3665989 3624380 3672848 3731356
3999C731356j15622Q468p4525j6972L9947n124M099k2660m4030J0517J9530n9708
$$ 3731356 3615734 3624202 3549677 3532705 3572652 3567528 3571627 3548967 3504937 3515454 3534984 3475276
3987C475276j2902P4855L7775o1065j6249o0888J1371M0740K0180M7662P8497
$$ 3475276 3462374 3537229 3575004 3513939 3497690 3436802 3448173 3488913 3509093 3556755 3635252
3976C635252O7166k756k3333K0316n6489k5638q721q0033j03841j1415J7723J02337
$$ 3635252 3702418 3699662 3676329 3696645 3640156 3614518 3605797 3525764 3421923 3410508 3428231 3530568
3964C530568L0772M061L0536N1393j14512p4416m6343p2848m8156J0426q4230
$$ 3530568 3561340 3565401 3595937 3647330 3532818 3458402 3412059 3339211 3291055 3301481 3217251
3953C217251l0708R2960k5797k3282N0912n1459K1062L3911j085L4102n4194o2814
$$ 3217251 3186543 3279503 3253706 3230424 3281336 3229877 3250939 3284850 3283765 3317867 3263673 3200859
3941C200859J0900r152M8160q468r885j4086J1146O9013M9299q9542q1844L4571
$$ 3200859 3211759 3202607 3250767 3242299 3232414 3218328 3229474 3298487 3347786 3258244 3176400 3210971
3929C210971p2253L4375P182Q448M6200o8793o594K8524o036L5792K6757K2305
$$ 3210971 3138718 3173093 3180275 3188723 3234923 3166130 3159536 3188060 3182024 3217816 3244573 3266878
3917C266878j7124J2227N1739K232M9039M7549M5507r1109l3847j5824m7865j4987
$$ 3266878 3249754 3261981 3313720 3315952 3364991 3412540 3458047 3366938 3333091 3317267 3269402 3254415
3905C254415P0128k7665J2932K2813N6102m9152N90j0459K756J3581r9957J319
$$ 3254415 3324543 3296878 3309810 3332623 3388725 3339573 3340163 3329704 3332460 3346041 3246084 3247403
3893C247403k3889P8941K936o1787J321L7383j0462N0268N6780J7511n4745k2396
$$ 3247403 3223514 3302455 3305391 3243604 3244925 3282308 3271846 3322114 3378894 3396405 3341660 3319264
3881C319264M4226P6535Q861j4289j28848l5927J02974k689p0938J1707J9533
$$ 3319264 3363490 3440025 3448886 3434597 3305749 3269822 3372796 3370107 3299169 3310876 3330409
3870C330409L9294l4892Q621R5104O0430R4518J21527K2606P6774N9234K5603
$$ 3330409 3369703 3334811 3343432 3438536 3498966 3593484 3715011 3737617 3814391 3873625 3899228
3859C899228m0014j08262j57105j34514L1447J3442p0109k6889o7136p2428J18569
$$ 3899228 3859214 3750952 3593847 3459333 3490780 3504222 3434113 3407224 3340088 3267660 3386229
3848C386229K0836n6250L7629k1111m493j1316p476R000n652k7970p364k2502
$$ 3386229 3407065 3350815 3388444 3367333 3362840 3351524 3344048 3353048 3347396 3319426 3312062 3289560
3836C289560p5202L4427L4879k1682l3605k4872K4650k2657R9381O7167j6628
$$ 3289560 3214358 3248785 3283664 3261982 3228377 3203505 3228155 3205498 3304879 3372046 3355418
3825C355418q7308R9221M5774q3073L1600J1848r3250K8976O6684o7976K3698
$$ 3355418 3268110 3367331 3413105 3330032 3361632 3373480 3280230 3309206 3375890 3307914 3331612
3814C331612L3144r943J9905n4517l843P7066M1143l3686j222j3797l4060N7120
$$ 3331612 3364756 3354813 3374718 3320201 3316358 3393424 3434567 3400881 3399659 3385862 3351802 3408922
3802C408922R4400L1663j1543N0346K4442Q2634O2399P6329J17728N5338l6996
$$ 3408922 3503322 3534985 3523442 3573788 3598230 3680864 3743263 3819592 3937320 3992658 3955662
3791C955662N8734n8318n4560o9971p3938r3523l9548r7796p9932K490O9888L7678
$$ 3955662 4014396 3956078 3901518 3831547 3757609 3664086 3624538 3526742 3446810 3449300 3519188 3556866
3779C556866k0132p154m8961m7957K3210P0354J4014K9494o147m8701l3175L7357
$$ 3556866 3536734 3529580 3480619 3432662 3455872 3526226 3540240 3569734 3563587 3514886 3481711 3519068
3767C519068k3753J4803P718N6820l2720o4689J4206J3042k4614O1396K1830r570
$$ 3519068 3495315 3510118 3517836 3574656 3541936 3477247 3491453 3504495 3479881 3541277 3563107 3553537
3755C553537m0116m2754N6329k8309K0164O2376P6792r375j2145P7713P0531r3034
$$ 3553537 3513421 3470667 3526996 3498687 3518851 3581227 3658019 3648644 3636499 3714212 3784743 3691709
3743C691709m8795K9483L6243N0072J12374K6587M3199L6123J41826j0560j38745
$$ 3691709 3642914 3672397 3708640 3758712 3871086 3897673 3940872 3976995 4118821 4108261 3969516
3732C969516n0737L2157N2117L971j01475N7278J18985Q9623M451l5020P9533
$$ 3969516 3918779 3950936 4003053 4007024 3905549 3962827 4081812 4171435 4175886 4140866 4220399
3721D220399J3187Q7843M5614j3415o0230j2878K8870Q0156n1097L5536K1711
$$ 4220399 4233586 4321429 4367043 4353628 4293398 4280520 4309390 4389546 4338449 4373985 4395696
3710D395696K4480R996K691m7767J9762j706n4594O0471O9987p7794q5231O4813
$$ 4395696 4420176 4430172 4432863 4385096 4404858 4403152 4348558 4409029 4479016 4401222 4315991 4380804
3698D380804P7625Q2361m062L1406J3307Q9933O0680L5303J6920k010J11035O2069
$$ 4380804 4458429 4540790 4536728 4568134 4581441 4671374 4732054 4767357 4784277 4782267 4893302 4955371
3686D955371P1644P5001Q59L3562j1565m805N461j4672O6789O5847Q3498Q8616
$$ 4955371 5027015 5102016 5102875 5136437 5124872 5120067 5125528 5110856 5177645 5243492 5326990 5415606
3674E415606J68281O5906l8002R559M4105L0592j5851q5431L1910L8509m6935
$$ 5415606 5583887 5649793 5611791 5621350 5665455 5696047 5680196 5594765 5626675 5665184 5618249
3663E618249k2751j3569Q372K7327K8516L5898l567k4268P1300L6072N0893J06660
$$ 5618249 5595498 5581929 5590301 5617628 5646144 5682042 5678475 5654207 5725507 5761579 5812472 5919132
3651E919132k4029j6718M1763J7756P1643q045J1370K8782M0601J32715n1178
$$ 5919132 5895103 5878385 5920148 5937904 6009547 6001502 6012872 6041654 6082255 6214970 6163792
3640F163792J1309K1464K4385L3930M0806k2138L4640J04128P5421M1687l3739
$$ 6163792 6175101 6196565 6220950 6254880 6295686 6273548 6308188 6412316 6487737 6529424 6495685
3629F495685L8841K2572N3909n599q230J3958M3246M0121K4509l9903N5769K8665
$$ 6495685 6534526 6557098 6611007 6605408 6597178 6611136 6654382 6694503 6719012 6679109 6734878 6763543
3617F763543N8577l4883N487l9228l5580J29652j0355j06465Q019L644L1622M1736
$$ 6763543 6822120 6787237 6792724 6753496 6717916 6847568 6837213 6730748 6738767 6742411 6774033 6815769
3605F815769M4839J7855n031j1416p1362N8478Q6566P8863l5311M7204J22616
$$ 6815769 6860608 6878463 6873432 6862016 6790654 6849132 6935698 7014561 6979250 7026454 7149070
3594G149070J0892N706P3496j0227J12349M948K1530N2397L8062L9040J4528L33
$$ 7149070 7159962 7165668 7239164 7228937 7341286 7346234 7367764 7420161 7458223 7497263 7511791 7512124
3582G512124j00232M2764k5575m2034n5660J9865M8971j6010m1105l1483R5854
$$ 7512124 7411892 7454656 7429081 7387047 7331387 7351252 7400223 7384213 7343108 7311625 7407479
3571G407479p208j09238n1135k6797O2538q4622j2087K9628K901n009K6291r120
$$ 7407479 7400271 7291033 7239898 7213101 7275639 7191017 7178930 7208558 7211459 7206450 7232741 7223621
3559G223621N5788K6926m9502L6497k6160m556M2492O2589J08642N1577J0039
$$ 7223621 7279409 7306335 7256833 7293330 7267170 7262614 7305106 7367695 7476337 7527914 7537953
3548G537953J4224p8986q6960l7637R1114j1010L3731L548m5553m550M062N2211
$$ 7537953 7552177 7473191 7386231 7348594 7439708 7428698 7462429 7465977 7420424 7415874 7419936 7472147
3536G472147O385n9065J1119M4693l992K7701l8945N1187K756J94N2122O3781
$$ 7472147 7478532 7419467 7430586 7475279 7471287 7498988 7460043 7511230 7513986 7514180 7566302 7630083
3524G630083L4894K843l2051j6356K6424P1368J35375l0663N6349l6514L5912
$$ 7630083 7664977 7667820 7635769 7619413 7645837 7717205 7852580 7821917 7878266 7841752 7877664
3513G877664l2613L9352Q2484j9544J02089j6254l0838o6833l2915K9049K208
$$ 7877664 7845051 7884403 7966887 7947343 8049432 8033178 8002340 7935507 7902592 7931641 7933849
3502G933849M722J8609M785p3010N5406R1847L887j2788O129K302R9276J3176
$$ 7933849 7938571 7957180 7961965 7888955 7944361 8036208 8040095 8027307 8033436 8035738 8135014 8148190
3490H148190n1663M3376Q5173l6236O234O1844k8024k4765R4713n584m6074L9511
$$ 8148190 8096527 8139903 8225076 8188840 8195074 8256918 8228894 8204129 8298842 8293258 8247184 8286695
3478H286695N998o8914J3079L9568j0647N575J0653M8918k2118J9953N0868O0015
$$ 8286695 8292693 8223779 8236858 8276426 8265779 8271354 8282007 8330925 8308807 8328760 8379628 8439643
3466H439643j6375J37930J8240M2342K3285l0860K3834m8437R8968M0603k3337
$$ 8439643 8423268 8561198 8579438 8621780 8645065 8614205 8638039 8589602 8688570 8729173 8705836
3455H705836k1429l9545P0284J19465M8386L432M2564j16253k8359P0610J3940
$$ 8705836 8684407 8644862 8715146 8834611 8882997 8886429 8928993 8812740 8784381 8854991 8868931
3444H868931p78P9193R4692k5820K0419j0644P6484M1834J60224K6919Q8789J70310
$$ 8868931 8868153 8947346 9042038 9016218 9036637 9025993 9102477 9144311 9304535 9331454 9420243 9590553
3432I590553N2970Q6927K2291L328O9896R3470N0610R1884o8573M5244M2233p9088
$$ 9590553 9643523 9730450 9752741 9756069 9825965 9919435 9970045 10061929 9993356 10038600 10080833 10001745
3420A0001745j55704j34304m2748q064j0468m03K5255k7441n5056n4018K9829
$$ 10001745 9846041 9711737 9668989 9660925 9650457 9650054 9675309 9647868 9592812 9538794 9568623
3409I568623J11935L7264r569k5566J8097J02935N4143Q7212K2803O2417J60729
$$ 9568623 9680558 9717822 9708253 9682687 9700784 9803719 9857862 9945074 9967877 10030294 10191023
3398A0191023J9919p0O2502O7436j4652L2682Q2454J09919k8330J14118O646k049
$$ 10191023 10210942 10210872 10273374 10340810 10326158 10358840 10441294 10551213 10522883 10637001 10643647 10641598
3386A0641598O962K4901P9892k1779j5147L4443K0692J87746P7652J33041P4370
$$ 10641598 10648560 10673461 10753353 10731574 10716427 10750870 10771562 10959308 11036960 11170001 11244371
3375A1244371Q2120J06686J41960J84241k5191n2662m1102m1566J4702J03597
$$ 11244371 11326491 11433177 11575137 11759378 11734187 11681525 11640423 11598857 11613559 11717156
3365A1717156R8196J16079J17704J17808J5695J08393J14745J28281J09510J67220
$$ 11717156 11815352 11931431 12049135 12166943 12182638 12291031 12405776 12534057 12643567 12810787
3355A2810787J0692J3684J89171K05457R0361J54948J71982J96934J93994J46182
$$ 12810787 12821479 12835163 13024334 13229791 13320152 13475100 13647082 13844016 14038010 14184192
3345A4184192J06172R2548J11220R7624O372M8638M1635N1231N1160J39932J32032
$$ 14184192 14290364 14382912 14494132 14591756 14598128 14646766 14688401 14739632 14790792 14930724 15062756
3334A5062756K08718J52376J97306K07637K18575K88736K74048L75842L37666
$$ 15062756 15271474 15423850 15621156 15828793 16047368 16336104 16610152 16985994 17323660
3325A7323660L37987L74746J54087n396m8047p9789j9614l674R4097P8100M2797
$$ 17323660 17661647 18036393 18190480 18185084 18137037 18057248 18037634 18033960 18128057 18206157 18248954
3314A8248954Q1798J0907J23396L3182J33700K14593J03312J62903K00536K16251
$$ 18248954 18330752 18341659 18465055 18498237 18631937 18846530 18949842 19112745 19313281 19529532
3304A9529532K24611K94600K52342K29035K97694K20350J83986K98498J69185
$$ 19529532 19754143 20048743 20301085 20530120 20827814 21048164 21232150 21530648 21699833
3295B1699833J65920J88225J46506J63172K81000K93465J71071K62081K73951
$$ 21699833 21865753 22053978 22200484 22363656 22644656 22938121 23109192 23371273 23645224
3286B3645224K16076K41343J84214K19867K74333K05399K78606L41356L22745
$$ 23645224 23861300 24102643 24286857 24506724 24781057 24986456 25265062 25606418 25929163
3277B5929163L13647L90510L51578L74278M47361L76933L27925M24704N24808
$$ 25929163 26242810 26633320 26984898 27359176 27806537 28183470 28511395 28936099 29460907
3268B9460907M58412N18407L79307M28384M19019M37319M74640M28600M90071
$$ 29460907 29919319 30437726 30817033 31245417 31664436 32101755 32576395 33004995 33495066
3259C3495066L97564N71778N57050N72341O38026P14424O66580P44473Q99602
$$ 33495066 33892630 34464408 35021458 35593799 36231825 36946249 37612829 38357302 39256904
3250C9256904Q32098R78752R82834J063558J130898J128797J047793P90534N94570
$$ 39256904 40089002 41067754 42050588 43114146 44245044 45373841 46421634 47212168 47806738
3241D7806738O43794Q39292R45340J004361J205244J318093J551631J587828J718050
$$ 47806738 48450532 49289824 50235164 51239525 52444769 53762862 55314493 56902321 58620371
3232E8620371K014530K186834K388386K719360L012769L145319L445636L838630
$$ 58620371 60634901 62821735 65210121 67929481 70942250 74087569 77533205 81371835
3224H1371835M026745M197423M237327M417059M293563L779976L218959K285252
$$ 81371835 85398580 89596003 93833330 98250389 102543952 106323928 109542887 111828139
3216A11828139Q24280j017506l003952m737365n693946o048515o048406n674435
$$ 111828139 112652419 111634913 108630961 103893596 98199650 92151135 86102729 80428294
3208H0428294n146432m594654m022486l563972l182445k838017k526671k267972
$$ 80428294 75281862 70687208 66664722 63100750 59918305 57080288 54553617 52285645
3200E2285645k063100j793176j650992j486598j456406j251342j104155j025242
$$ 52285645 50222545 48429369 46778377 45291779 43835373 42584031 41479876 40454634
3192D0454634q72997q37505q98081p92487p61357p12174o46662o12146n96218
$$ 40454634 39581637 38744132 37846051 37053564 36292207 35580033 34933371 34321225 33725007
3183C3725007o63617o18130n56265n80185p21111m73338n13948n65202n14858
$$ 33725007 33061390 32443260 31886995 31306810 30585699 30112361 29598413 29033211 28518353
3174B8518353n14548m57763n09181m16355m33026m43374l20001l93587k74098
$$ 28518353 28003805 27546042 27036861 26620506 26187480 25744106 25424105 25030518 24756420
3165B4756420k94988l63941l53676l55397j58028k40522k63165k72585k94249
$$ 24756420 24461432 24097491 23743815 23388418 23230390 22989868 22726703 22454118 22159869
3156B2159869k63651k20882k26180j78904k02525k64583j97480j97675k23615
$$ 22159869 21896218 21675336 21449156 21270252 21067727 20803144 20605664 20407989 20184374
3147B0184374k03960k17598j86832j83918k03327j69809k03834j67340j40990
$$ 20184374 19980414 19762816 19575984 19392066 19188739 19018930 18815096 18647756 18506766
3138A8506766j36744k07599j66312k22284j26952j11067j42603k09570l8342j15508
$$ 18506766 18370022 18162423 17996111 17773827 17646875 17535808 17393205 17183635 17145293 17029785
3128A7029785j05876j19556j23749j10497j48725o1076j52904j15444m8476o7550
$$ 17029785 16923909 16804353 16680604 16570107 16421382 16360306 16207402 16091958 16043482 15975932
3118A5975932m7207j19750k01892j82826r7217o4086p8099j45512j15015q6381
$$ 15975932 15928725 15808975 15607083 15424257 15327040 15262954 15184855 15039343 14924328 14837947
3108A4837947j11845k6080r8196j18551j03332r7247o1379j07500j07427r0112
$$ 14837947 14726102 14700022 14601826 14483275 14379943 14282696 14221317 14113817 14006390 13916278
3098A3916278l4596j1932j26202k2956p8720r6192j0402p1319j31189j01385m9883
$$ 13916278 13881682 13869750 13743548 13720592 13641872 13545680 13535278 13463959 13332770 13231385 13181502
3087A3181502m7044n2658j20246j00326q8589j22160q2915m6524p3524p5134p4941
$$ 13181502 13134458 13081800 12961554 12861228 12772639 12650479 12567564 12521040 12447516 12372382 12297441
3076A2297441N736j96330m7024n2012n5065q3496l2475j04347j21069J5588j1199
$$ 12297441 12303177 12106847 12059823 12007811 11952746 11869250 11836775 11732428 11611359 11626947 11615748
3065A1615748P9396l6891j23855p6385J1476j829n1421n1193k7643l6586n5620
$$ 11615748 11695144 11658253 11534398 11458013 11469489 11467660 11416239 11365046 11337403 11300817 11245197
3054A1245197K1636M6587j40067l5805L1708J6076p616n0496k3772o8885r5843
$$ 11245197 11266833 11313420 11173353 11137548 11169256 11185332 11177716 11127220 11103448 11034563 10938720
3043A0938720k2290K198M332j32312p6994p9912q489k3832l2503l6319l5979j31445
$$ 10938720 10916430 10918628 10922960 10790648 10713654 10633742 10625253 10601421 10568918 10532599 10496620 10365175
3031A0365175k5771J67M7610n4025j2522k134k75m3136M1236R192q5920q7395
$$ 10365175 10339404 10339571 10387181 10333156 10320634 10318500 10318225 10275089 10316325 10325517 10239597 10152202
3019A0152202J627O363r7483j9599K336l2354r792n3996n2735j8571k4533m696
$$ 10152202 10153829 10160192 10062709 10043110 10045446 10013092 10003300 9949304 9896569 9877998 9853465 9848769
3007I848769M89l90L1542j0841O4965L536l8489m5498l147K5619l793J2596L6154
$$ 9848769 9849258 9848868 9880410 9869569 9934534 9938070 9899581 9854083 9850936 9876555 9872762 9885358 9921512
2994I921512M1l6234M9128R1693J7474j415J11914j0589J71382K308P8300K1272
$$ 9921512 9921553 9885319 9934447 10026140 10043614 10042199 10154113 10143524 10314906 10317214 10395514 10416786
2982A0416786o249N5884N4783Q2490J52746J7485O7189N3469J22832R0959N9643
$$ 10416786 10410537 10466421 10521204 10603694 10756440 10773925 10841114 10894583 11017415 11108374 11168017
2971A1168017M9996J25600O2988J09452K05279M1677L9537P4707J03730K05427
$$ 11168017 11218013 11343613 11406601 11516053 11721332 11763009 11802546 11877253 11980983 12186410
2961A2186410J06101J05066K01433O686M0453J94509K33336K38702J96327R8018
$$ 12186410 12292511 12397577 12599010 12605696 12646149 12840658 13073994 13312696 13509023 13607041
2951A3607041J10249J54497J66127P8947Q2997j5795J02288J48379J19762R3008
$$ 13607041 13717290 13871787 14037914 14116861 14199858 14184063 14286351 14434730 14554492 14647500
2941A4647500J54677J43299J29242R9686J22698J34205J21367J18794J58195K26252
$$ 14647500 14802177 14945476 15074718 15174404 15297102 15431307 15552674 15671468 15829663 16055915
2931A6055915K14468K10712K02604K53582K09095L27477L70615L07353M16114
$$ 16055915 16270383 16481095 16683699 16937281 17146376 17473853 17844468 18151821 18567935
2922A8567935M32615L79462L26813J88431J90095K82223K81114K57724L94958
$$ 18567935 19000550 19380012 19706825 19895256 20085351 20367574 20648688 20906412 21301370
2913B1301370M26702N00438M64146M56307L88925N52870N57702M70258M23798
$$ 21301370 21728072 22228510 22692656 23148963 23537888 24090758 24648460 25118718 25542516
2904B5542516L95434L52861K40262K03884K22030K92411K16661K97867K73527
$$ 25542516 25937950 26290811 26531073 26734957 26956987 27249398 27466059 27763926 28037453
2895B8037453L65058K89704M59920M06506M46984M65918M14206N86031P02784
$$ 28037453 28402511 28692215 29152135 29558641 30005625 30471543 30885749 31471780 32174564
2886C2174564P70545Q70687J002683J184878J345482J291794J448601J503656
$$ 32174564 32945109 33815796 34818479 36003357 37348839 38640633 40089234 41592890
2878D1592890J321413J053779M38660j05781n28757r22295j225781j305524j215481
$$ 41592890 42914303 43968082 44406742 44300961 43772204 42849909 41624128 40318604 39103123
2869C9103123j068824p93830o29488l95294j97938j6483l9650J19111L66290L69051
$$ 39103123 38034299 37240469 36610981 36215687 36017749 36001266 35961616 36080727 36447017 36816068
2859C6816068N38024N49798N63618N46670N37679M82668L81968L27203L25539
$$ 36816068 37354092 37903890 38467508 39014178 39551857 40034525 40416493 40743696 41069235
2850D1069235K94893J22809k2402l21783o38485q95648j029347j120273j186632
$$ 41069235 41364128 41486937 41464535 41142752 40504267 39608619 38579272 37458999 36272367
2841C6272367j226385j204883j070276q60058p90995o91425n69661m13549k23122
$$ 36272367 35045982 33841099 32770823 31910765 31119770 30428345 29858684 29445135 29222013
2832B9222013k40023k37195r5289j72323k28139k36740l89472m71172n32452o06320
$$ 29222013 28981990 28744795 28649506 28477183 28249044 28012304 27622832 27151660 26619208 26012888
2822B6012888o72467o95912p33450p60313p79205p44268p21007o41375n30645
$$ 26012888 25340421 24644509 23911059 23150746 22371541 21627273 20906266 20264891 19734246
2813A9734246n33950o47280n61076l70037m66384m31176l75894l11269l42754
$$ 19734246 19200296 18553016 17991940 17621903 17155519 16724343 16348449 16037180 15694426
2804A5694426k38043j96534k69438k83710k07224k41542k46716j87544l47325
$$ 15694426 15456383 15259849 14990411 14706701 14499477 14257935 14011219 13823675 13476350
2795A3476350k43644k08867l17190k30251k54050k49026k49066k06266j45911
$$ 13476350 13232706 13023839 12706649 12476398 12222348 11973322 11724256 11517990 11372079
2786A1372079k20053k32645r0339j88323j73670j43354k38390j41002k61597j72032
$$ 11372079 11152026 10919381 10829042 10640719 10467049 10323695 10085305 9944303 9682706 9510674
2776I510674j94422j92434j71221j94199j54589o7172j46226j27298j69586j29495
$$ 9510674 9316252 9123818 8952597 8758398 8603809 8536637 8390411 8263113 8093527 7964032
2766G964032j60429j13765j07258m3571r4366j26056m6317j04738j37798j35011
$$ 7964032 7803603 7689838 7582580 7539009 7444643 7318587 7272270 7167532 7029734 6894723
2756F894723q7050r2075j46948j70587Q238j67222j90925j12814k4844j20148
$$ 6894723 6807673 6715598 6568650 6398063 6406301 6239079 6048154 5935340 5910496 5790348
2746E790348j84045p1670o9950n9664p9872q0201q4851p4313j06852l8304q0363
$$ 5790348 5606303 5534633 5464683 5405019 5325147 5244946 5160095 5085782 4978930 4940626 4860263
2735D860263o1400l4378m1613k0180k13976L957q3464n3982M428l1699p3667j41940
$$ 4860263 4798863 4764485 4722872 4702692 4488716 4492673 4409209 4355227 4359655 4327956 4254289 4112349
2723D112349j55326j49412m3893M7780m7088j52472r9543q4730o2368l130o674
$$ 4112349 3957023 3807611 3763718 3811498 3764410 3611938 3512395 3427665 3365297 3362167 3355493
2712C355493r2647n9971m1740J4138p4767j7823o6260l1175l0392o1148l7806
$$ 3355493 3262846 3202875 3161135 3175273 3100506 3082683 3016423 2985248 2954856 2893708 2855902
2701B855902p6043j6167K0271m2311k1133r0028j6655p114r2489q2036l2283k5325
$$ 2855902 2779859 2763692 2783963 2741652 2720519 2630491 2613836 2606722 2514233 2432197 2399914 2374589
2689B374589m3779k7034r3002L7560M359m3150N582j06682o9455j2182k2336k631
$$ 2374589 2330810 2303776 2210774 2248334 2252693 2209543 2215125 2108443 2038988 2026806 2004470 2001839
2677B001839O5234k823k5411m5535p2365O222l2503R679l3466j14921o9961J0326
$$ 2001839 2067073 2064250 2038839 1993304 1920939 1927161 1894658 1904337 1870871 1755950 1685989 1696315
2665A696315J2802L7949j9576n6148J3837O5686j8656l7177K6537k2499m2095
$$ 1696315 1709117 1747066 1727490 1671342 1685179 1750865 1732209 1695032 1721569 1699070 1656975
2654A656975o313r5728n5871k6780L8729j1116L9002M2240j37498p2418O1543
$$ 1656975 1650662 1554934 1499063 1472283 1511012 1499896 1538898 1581138 1443640 1371222 1432765
2643A432765k5950j3455Q9686l0259l3887m3537m9669l0513m7760J6612Q911k9578
$$ 1432765 1406815 1393360 1483046 1452787 1418900 1375363 1325694 1295181 1247421 1264033 1272944 1243366
2631A243366n511N1446m1545l5222J7236K6814n8097j3743P1956n6347l4423k6045
$$ 1243366 1237855 1289301 1247756 1212534 1229770 1256584 1198487 1184744 1256700 1200353 1165930 1139885
2619A139885j9202l1295r222k7918L1676r1312p881L4706Q9276K2946j0893l047
$$ 1139885 1120683 1089388 1080166 1052248 1083924 992612 984731 1019437 1108713 1131659 1120766 1117719
2607A117719n9090j2851M8639L9210k2128j18678j7889P1923l3967k3531O5376
$$ 1117719 1058629 1045778 1094417 1133627 1111499 992821 974932 1046855 1012888 989357 1054733
2596A054733m8244j3524M4032J836k5224l320O432n9297P0761m1777r915R570
$$ 1054733 1006489 992965 1036997 1038833 1013609 1010289 1016721 957424 1028185 986408 976493 986063
2584I86063l9793m796O1688j02584L6777J4006M526o9300n2123n6441o4292R0337
$$ 986063 946270 941474 1003162 900578 937355 951361 955887 886587 834464 778023 713731 804068
2572H04068M0232M0961l1585N232N5961N1932r4616j04898L5622j0385j7625R733
$$ 804068 844300 885261 853676 858908 914869 966801 872185 767287 802909 792524 774899 784632
2560G84632P3288K9923r1826o1212M1553n4493j08488N9920J5153k8845N0625
$$ 784632 857920 887843 796017 734805 776358 721865 613377 673297 688450 659605 710230
2549G10230L6460j7916p0190k9174Q0777r333l7071K5373M4124p6635p6876K0886
$$ 710230 746690 728774 658584 629410 710187 700854 663783 689156 733280 656645 579769 600655
2537F00655q1721M7986O0887J0043m2521k1884j0660L4965p143k9980j4714n7549
$$ 600655 518934 566920 627807 637850 595329 573445 562785 597750 590607 560627 545913 488364
2525D88364n8966k2330P8474M1449M601j389m8084O1937L4131r6723q541j3563
$$ 488364 429398 407068 485542 526991 531592 530203 482119 544056 578187 481464 472923 459360
2513D59360n3320o502O2807q400k8869n0108J1258J2916L2966N7401n8059r6424
$$ 459360 406040 399538 462345 453945 425076 374968 386226 399142 432108 489509 431450 335026
2501C35026P2076m1890N1278K3038j46757l9506N7066j9153m1652N4597M9721
$$ 335026 407102 365212 416490 439528 292771 253265 310331 291178 249526 304123 353844
2490C53844O6933L9600j30540j07379K7607J672p259K4527N8671L3482l3812o0407
$$ 353844 420777 460377 329837 222458 250065 251737 244478 269005 327676 361158 327346 266939
2478B66939M4153O2284r7440Q775M0139q912k1300k1080k7259j0213O492q1692
$$ 266939 311092 373376 275936 284711 324850 315938 294638 273558 246299 236086 242578 160886
2466A60886l4078K7273l4360N2994M1534K4435q0735k8927k9982J8381O7431o2846
$$ 160886 126808 154081 119721 172715 214249 238684 157949 129022 99040 117421 184852 122006
2454A22006N868K5652M1294l3838k7471J4448M6448K9945r155J2043q5687P142
$$ 122006 127874 153526 194820 160982 133511 147959 194407 224352 215197 227240 141553 148695
2442A48695r135j1506m6540J7173P647l0179J6145M9755K7906k5603M890k2012
$$ 148695 139560 128054 81514 98687 106334 76155 92300 142055 169961 144358 149248 127236
2430A27236l172k4514L4500j1100L0498j0551n6915o556P2932p1139o5758q428
$$ 127236 124064 99550 134050 122950 153448 142897 85982 79426 152358 81219 15461 7033
2418G033M3501N1008P2819k8349l4065J7489J4945m6013L0705n4565J474N953
$$ 7033 50534 101542 174361 146012 111947 129436 144381 98368 129073 74508 75982 81935
2406H1935r04k6565J2960M1743J3002n53n3925K8248L3789m3445N3626K4083r621
$$ 81935 81031 54466 67426 109169 122171 121618 67693 95941 129730 86285 139911 163994 154373
2393A54373p7091O6746J4297j3562M3976p6482m5685n7179K2595K6556L1549P9875
$$ 154373 77282 144028 158325 144763 188739 112257 66572 9393 31988 58544 90093 169968
2381A69968j07584M3547O7622q3792m6783J9371o780p807L8822l2863J6800k5597
$$ 169968 62384 105931 173553 89761 42978 62349 55569 47762 86584 53721 70521 44924
2369D4924P2279l464M298o0895P861o2554M6262m698L9272q7494J6554K7921o6380
$$ 44924 117203 113739 118037 57142 65003 2449 48711 44013 83285 -4209 12345 40266 -26114
2356b6114M8537m892K4009O2926m1562j9689l2639K9377Q4259j8211N091J8907
$$ -26114 22423 17531 41540 104466 62904 43215 10576 39953 124212 106001 111092 129999
2344A29999Q524p90j5494r553j3115n9160M0180j3998J2823m1080K6697J5886
$$ 129999 138523 137733 122239 112686 99571 40411 80591 66593 79416 38336 65033 80919
2332H0919m2590j5013M6214k5009m3431l19J1616J3771l440K9515k4287N3427
$$ 80919 38329 23316 69530 44521 1090 771 12387 26158 22718 52233 27946 81373
2320H1373J1472o9469l325N3910L9748j9012l8982r7908M52m454J01671Q2708
$$ 81373 92845 23376 20051 73961 113709 94697 55715 -42193 -41741 -46195 55476 138184
2308A38184j20902l2102m037l9604O4588R6642k7970j6854n0967L020j0573j6763
$$ 138184 17282 -14820 -18857 -58461 6127 102769 74799 57945 6978 9998 -575 -17338
2296a7338J9417O3903N0765n2080o5447M0849K0027k9538M1008l5772k7680j6864
$$ -17338 2079 65982 116747 64667 -780 40069 60096 30558 71566 35794 8114 -8750
2284h750L0227j1670M544M30J3302j8682L5752R822M039n2192k002J37364j04090
$$ -8750 21477 9807 14351 14781 28083 9401 45153 54975 59014 6822 4820 142184 38094
2271C8094k6309J598k059j1362P6615o6033P6263L1732l0660p80Q519Q633R833
$$ 38094 11785 13383 11324 -38 76577 10544 86807 118539 87879 87099 95618 104251 114084
2258A14084k9976o3853Q4612l1874j1741j5360m2175N5576R1972p7605J1105N4799
$$ 114084 84108 20255 104867 72993 61252 45892 3717 59293 151265 73660 84765 139564
2246A39564K0583L1609k6805J0591n5188M4032j3831j2987J0715m3754L6092o4529
$$ 139564 160147 191756 164951 175542 120354 164386 150555 137568 148283 104529 140621 76092
2234G6092J6284M5326k1082j6990J5419k1766R206k1811l512j5293Q4033J3309
$$ 76092 92376 137702 116620 99630 115049 93283 102489 80678 77166 61873 145906 159215
2222A59215p9908p2840M3744R2831o9598p1206Q5717M6868l3075k8283R8664M4527
$$ 159215 79307 6467 50211 143042 73444 2238 87955 134823 101748 73465 172129 216656
2210B16656p5574r350k8819J687L4711N7643K4218k7484P565L9947n1094P2675
$$ 216656 141082 131732 102913 104600 139311 196954 221172 193688 201253 241200 190106 262781
2198B62781k9837k0419m617k5118P9224m832R627j1220K2664o6948k0590K4464
$$ 262781 232944 212525 207908 182790 262014 257182 266809 255589 278253 211305 190715 215179
2186B15179Q3407m8459m0820q212J6672J21443j4560l8822P0078j4674m489p7
$$ 215179 298586 250127 209307 201095 217767 339210 324650 285828 355906 341232 336743 336666
2174C36666J3151j9427K2544L8373q4290k7201l9839J03421O2012M2461p5642
$$ 336666 349817 330390 352934 391307 307017 279816 239977 343398 405410 447871 372229
2163C72229N508K2126Q0232J3731q8967O4068O284P0593n501l9202O2914L2535
$$ 372229 377737 399863 480095 493826 404859 468927 475211 545804 540303 501101 564015 596550
2151E96550K5133J1274J5827O115J09320M9976O4868Q8158p2208n0600J6048L6026
$$ 596550 621683 632957 648784 654899 764219 814195 879063 967221 895013 844413 860461 896487
2139H96487q346n5479q33K4344Q1517O037l9326J09633j4384k0007n72N5917J24141
$$ 896487 888141 832662 831829 856173 937690 943727 904401 1014034 999650 979643 979071 1034988 1159129
2126A159129j4417j0192J32730J01328o117L4338J9475M5527K6672K0258M019
$$ 1159129 1144712 1134520 1267250 1368578 1362461 1396799 1416274 1461801 1488473 1508731 1512750
2115A512750J72718K28625N4772k9695M0321Q4911J85856P3786K1481P3142J23303
$$ 1512750 1685468 1914093 1968865 1939170 1979491 2064402 2250258 2324044 2345525 2418667 2541970
2104B541970J70291J74724J13369R7596J77036J72024J37278K14369K68938L06123
$$ 2541970 2712261 2886985 3000354 3097950 3274986 3447010 3584288 3798657 4067595 4373718
2094D373718K63889M28576M69036L92354K22093L12494M26525O08081P25982J053991
$$ 4373718 4637607 5066183 5535219 5927573 6149666 6462160 6888685 7496766 8222748 9276739
2084I276739J328354J723236K213587K778164L469240M601716N503566N336169
$$ 9276739 10605093 12328329 14541916 17320080 20789320 25391036 30894602 36230771
2076C6230771J802476n209973o523675n240343m178369l141953k231945j632257
$$ 36230771 38033247 32823274 26299599 21059256 16880887 13738934 11506989 9874732
2068I874732j305815r44097o90352n07279n24541l21402k99102l17957m60916
$$ 9874732 8568917 7624820 6934468 6427189 5902648 5581246 5282144 4964187 4503271
2059D503271m49926l33945k98236l00343j56350k43457k58765j71457j33317j03730
$$ 4503271 4053345 3719400 3421164 3120821 2964471 2721014 2462249 2290792 2157475 2053745
2049B053745j37436j9584M323p4155j35863j02750k5765j26898o1571J8847m3046
$$ 2053745 1916309 1896725 1901048 1826893 1691030 1588280 1562515 1435617 1374046 1392893 1349847
2038A349847j20781p9253q1224m4868N0540N945j69443n2020J6375o2311j2329
$$ 1349847 1229066 1149813 1068589 1023721 1074261 1080206 910763 858743 875118 812807 800478
2027H00478M2806K1898l0028J884p185r1302n6237L5011J4803p243r6400o6562
$$ 800478 843284 865182 835154 837038 829853 738551 682314 717325 732128 724885 628485 561923
2015E61923P1272p3288q645q964n0182o2532J249M2682M0548q8176K998q939O670
$$ 561923 633195 559907 551262 542298 492116 429584 430833 473515 514063 425887 428885 419946 426616
2002D26616J0629l937k7443M6658m8238p1241r143Q182O7783l4778o7736L2557
$$ 426616 437245 433308 405865 452523 404285 333044 323901 332083 399866 365088 297352 329909
1990C29909j8324r2596L8110M499j3576K5267m4240k9040J6760K3501q4769M0693
$$ 329909 311585 218989 257099 261598 248022 273289 229049 200009 216769 240270 155501 196194
1978A96194M270l8540k0127k9183q0024J19339p3438K2813P0821J5719L7198r5321
$$ 196194 200464 161924 141797 112614 32590 151929 78491 101304 172125 187844 225042 129721
1966A29721J1164p6336O7642K7514p9350N146P2413o5691j7490O729L7303N427
$$ 129721 140885 64549 132191 159705 80355 85501 157914 92223 74733 81462 118765 124192
1954A24192l3694n6984k9382J65021J5819j06831q42O9694J4726k1944j1270m5411
$$ 124192 90498 33514 4132 169153 184972 78141 77299 146993 161719 139775 128505 83094
1942H3094M694l7767M405K6233L281p5813K5156K038M4528o877J4049L7646k5113
$$ 83094 87788 50021 54426 80659 83940 8127 33283 35321 79849 72972 87021 124667 99554
1929I9554K8083r2047L7934J0088p6738J6595K5187m5831n1673P0026m4004k8814
$$ 99554 127637 35590 73524 83612 6874 23469 48656 2825 -48848 21178 -22826 -51640
1917e1640R565L3097L4160J6885o4905L5303J6574l0823q1635R7784M2332M582
$$ -51640 -42075 -8978 25182 42067 -22838 12465 29039 -1784 -83419 14365 56697 61279
1905F1279L5175J0014j4832n1242o7954m0364J05513L4371k8958p4401j31201
$$ 61279 96454 106468 91636 40394 -27560 -67924 37589 71960 43002 -31399 -162600
1894a62600J6543P3539M7519K5121M1775k8404p69Q884k6017j2737p929L1949
$$ -162600 -146057 -72518 -24999 122 41897 13493 12724 21608 -4409 -17146 -25075 6874
1882F874Q1179k7560J765O296p3612L6583P6080q1709R70m3383K5557M5459q936
$$ 6874 88053 60493 62258 68554 -5058 31525 107605 25896 26866 -16517 9040 54499 45563
1869D5563M0148r8546l8968M3359L8106l0198j6488N6971o6800L302P9321l3337
$$ 45563 85711 -12835 -51803 -8444 29662 -536 -17024 39947 -26853 -23551 55770 22433
1857B2433K3508j1062L2679l9124m6744j4458K377L6928M2633J4353j7534k5006
$$ 22433 45941 34879 67558 28434 -18310 -32768 -30391 6537 49170 63523 45989 20983
1845B0983K2706k8275k9941j0059j9683r0906J22501L8015k8526j5895j2463n9327
$$ 20983 43689 15414 -14527 -24586 -44269 -135175 -12674 25341 -3185 -19080 -31543 -90870
1833i0870K6515M8112P8681M5661l4294j4218n327K1258j294n3555K0936N4883
$$ -90870 -64355 -16243 62438 108099 73805 59587 54260 75518 74224 20669 41605 96488
1821I6488n4063j32532M8595M3443p9264M8794J20537L440p3815p478N6776M8205
$$ 96488 42425 -90107 -41512 1931 -77333 -28539 91998 95438 21623 14145 70921 119126
1809A19126l6507N142P3955l0679M0280k9801m4958k0919p8147m8353M4419P347
$$ 119126 82619 87761 161716 131037 171317 141516 96558 75639 -2508 -50861 -6442 905
1797I05L5069m1970r1193K7060J4249j9883J1515j8249m4376j3389M3142R1110
$$ 905 35974 -5996 -97189 -70129 -55880 -75763 -64248 -82497 -126873 -140262 -97120 -6010
1785f010M0274m0721o3474N2653q149K7662N2741j3432j01579j2000N8750l364
$$ -6010 34264 -6457 -69931 -17278 -25427 2235 54976 41544 -60035 -72035 -13285 -16649
1773a6649J3368K5940n2010n123l4047Q966P9965K2795l5960n2438N7689k4003
$$ -16649 -3281 22659 -29351 -34474 -68521 -59555 20410 43205 7245 -45193 12496 -11507
1761a1507P8304m3608o7166O9084m0159n2910J9937K0946j9932l7625L6707r0282
$$ -11507 66797 23189 -43977 25107 -15052 -67962 -48025 -27079 -47011 -84636 -47929 -138211
1749a38211R839L7707N475M5606o3571L8134O6426k107M02O069l6955J2306K5003
$$ -138211 -128372 -90665 -85190 -39584 -103155 -65021 1405 -702 -300 5769 -31186 -18880 6123
1736F123O1269k3975r0184l5971N1707n1585P0525k1152l8283M8914L9459o3100
$$ 6123 67392 43417 -46767 -82738 -31031 -82616 -12091 -33243 -71526 -22612 16847 -46253
1724d6253K385M0452m6065m0968N3756Q450M0344N923R733j6442l7557r190J4966
$$ -46253 -43868 -3416 -49481 -90449 -36693 -28243 12101 18024 27757 11315 -26242 -35432 -20466
1711b0466l1878J160k0456n3807L9631L9961K4377k3176m1805r416O3652Q9945
$$ -20466 -52344 -51184 -71640 -125447 -85816 -45855 -21478 -44654 -86459 -95875 -32223 57722
1699E7722Q885q8088n9877Q679P5630O3611n4241l4482r791O9798o859n0676O5243
$$ 57722 66607 -21481 -81358 -72679 2951 66562 12321 -22161 -31952 37846 30987 -19689 45554
1686D5554m2138r7730K2599L9864m3281K495L3686K6233J2364p7945O1487P6887
$$ 45554 3416 -94314 -71715 -31851 -75132 -72637 -38951 -12718 -354 -78299 -16812 60075
1674F0075N2183l0389o1435o4673J3488j6250p4470k528K7292K9604j8057M8322
$$ 60075 112258 81869 20434 -44239 -30751 -47001 -121471 -123999 -96707 -67103 -85160 -36838
1662c6838p62j096Q1347p5314L4814K9558p6440K685M8059M3547l2791k5854l2490
$$ -36838 -37600 -38696 42651 -32663 2151 31709 -44731 -42046 6013 49560 16769 -9085 -41575
1649d1575N2663k5145m2234l3810l0363j1625N9192L6678j2001j9353n641N0569
$$ -41575 11088 -14057 -56291 -90101 -120464 -132089 -72897 -36219 -48220 -67573 -73214 -22645
1637b2645L5145j23125J9161O6887M1422m9639O746l8432k2312M8154N3608K1650
$$ -22645 12500 -110625 -91464 -24577 16845 -32794 -26048 -64480 -86792 -38638 14970 36620
1625C6620k3540Q141K6889n3476m1142O6181J8140p0851k7296j3523K1298r924
$$ 36620 13080 21221 48110 -5366 -46508 19673 37813 -33038 -60334 -73857 -52559 -62483
1613f2483J4040M3976r65k7521P0146n9146j06523K5918K9617m8882N9462m1742
$$ -62483 -48443 -4467 -5432 -32953 37193 -21953 -128476 -102558 -72941 -121823 -62361 -104103
1601a04103J2464J0193K3665K2803k7630L93j35919K7795N1370L911m640J1847
$$ -104103 -91639 -81446 -57781 -34978 -62608 -62215 -198134 -170339 -118969 -115058 -119698 -107851
1589a07851J8575J09131o5043l1077m1077J0216Q7150l9028l6976J7401Q9273
$$ -107851 -89276 19855 -45188 -76265 -117342 -107126 -19976 -59004 -95980 -78579 10694
1578A0694J9222n7998p2661M9484J0175j7971N1789l8344k3732N8313o657O7500
$$ 10694 29916 -28082 -100743 -51259 -41084 -59055 -7266 -45610 -69342 -11029 -17686 49814
$$ [...]
##END NTUPLES=NMR SPECTRUM
##END=
