##TITLE=1H_TG-2357
 CDCl3
 8 sc, 
 18.08.2022
##JCAMPDX= 6.0         $$ Bruker NMR JCAMP-DX V2.0
##DATA TYPE= NMR SPECTRUM
##DATA CLASS= NTUPLES
##ORIGIN= UXNMR, Bruker Analytische Messtechnik GmbH
##OWNER= root
$$ XWIN-NMR		Version 3.5
$$ Thu Aug 18 11:07:14 2022 Russian Standard Time (UT+4h)  she@DPX200
##.OBSERVE FREQUENCY= 200.1313499994
##.OBSERVE NUCLEUS= ^1H
##.ACQUISITION MODE= SIMULTANEOUS
##.ACQUISITION SCHEME= undefined
##.AVERAGES= 8
##.DIGITISER RES= 18
##SPECTROMETER/DATA SYSTEM= spect
##.PULSE SEQUENCE= zg30
##.SOLVENT NAME= CDCl3
##.SHIFT REFERENCE= (INTERNAL, CDCl3, 0, 15.7326)
##AUDIT TRAIL= $$ (NUMBER, WHEN, WHO, WHERE, WHAT)
$$ ##TITLE= Audit trail, XWIN-NMR		Version 3.5
$$ ##JCAMPDX= 5.01
$$ ##ORIGIN= Bruker BioSpin GmbH
$$ ##OWNER= she
$$ F:/spectra/data/she/nmr/H-F/1/pdata/1/auditp.txt
$$ ##AUDIT TRAIL=  $$ (NUMBER, WHEN, WHO, WHERE, WHAT)
(   1,<2022-08-18 11:05:57.43 +0400>,<she>,<DPX200>,
      <created by zg, POWCHK disabled, PULCHK disabled
       configuration hash MD5:
       00 E9 B6 7A A2 85 ED C7 34 08 36 98 17 FE 4E 26
       data hash MD5: 16K
       59 29 F8 0E B2 E6 A5 3C 6A 05 A8 DD 94 A2 C0 D6>)
(   2,<2022-08-18 11:05:59.95 +0400>,<she>,<DPX200>,
      <Start of raw data processing
       efp BC_mod = 2 LB = 0.24 FT_mod = 6 PKNL = 1 PHC0 = -18047.11 PHC1 = 22.80068 SI = 16K 
       data hash MD5: 16K
       36 53 18 2F 0E 6C B4 93 9D 7F 84 E6 54 AC FA 7E>)
(   3,<2022-08-18 11:06:27.70 +0400>,<she>,<DPX200>,
      <pk PHC0 = 5.265374 PHC1 = -10.6 
       data hash MD5: 16K
       AE 3C C9 76 A4 D3 D8 B4 D1 02 85 09 40 E4 7D 1E>)
(   4,<2022-08-18 11:06:31.18 +0400>,<she>,<DPX200>,
      <abs ABSG = 5 
       data hash MD5: 16K
       96 87 60 3B A9 93 14 82 87 51 9F 33 72 74 FA 93>)
$$ ##END=
$$ 
$$ hash MD5
$$ DE A6 02 29 60 6C D0 7D 4C 1F 58 AE 80 9E BC 42
##$RELAX= 
##$RELAX= 
##$RELAX= 
##$RELAX= 
##$RELAX= 
##$RELAX= 
$$ Bruker specific parameters
$$ --------------------------
##$DU= <F:/spectra>
##$EXPNO= 1
##$NAME= <H-F>
##$PROCNO= 1
##$TYPE= <nmr>
##$USER= <she>
##$AMP= (0..31)
100 100 100 100 100 100 100 100 100 100 100 100 100 100 100 100 100 100 
100 100 100 100 100 100 100 100 100 100 100 100 100 100 
##$AQSEQ= 0
##$AQ_mod= 1
##$AUNM= <au_zg>
##$AUTOPOS= <>
##$BF1= 200.13
##$BF2= 200.13
##$BF3= 200.13
##$BF4= 200.13
##$BF5= 200.13
##$BF6= 200.13
##$BF7= 200.13
##$BF8= 200.13
##$BYTORDA= 1
##$CFDGTYP= 0
##$CFRGTYP= 5
##$CHEMSTR= <none>
##$CNST= (0..31)
1 1 145 1 1 1 1 1 1 1 1 1 1 1 1 1 1 1 1 1 1 1 1 1 1 1 1 1 1 1 1 1 
##$CPDPRG= <>
##$CPDPRG1= <>
##$CPDPRG2= <>
##$CPDPRG3= <>
##$CPDPRG4= <mlev>
##$CPDPRG5= <mlev>
##$CPDPRG6= <mlev>
##$CPDPRG7= <mlev>
##$CPDPRG8= <mlev>
##$CPDPRGB= <>
##$CPDPRGT= <>
##$D= (0..31)
0 1.2 0 0 0 0 0 0 0 0.06 0 0.03 0 0 0 0 0.0002 0 0 0 0 0 0 0 0 0 0 0 0 
0 0 0 
##$DATE= 1660806356
##$DBL= (0..7)
120 120 120 120 120 120 120 120 
##$DBP= (0..7)
150 150 150 150 150 150 150 150 
##$DBP07= 0
##$DBPNAM0= <>
##$DBPNAM1= <>
##$DBPNAM2= <>
##$DBPNAM3= <>
##$DBPNAM4= <>
$$ [...]
##$SUBNAM2= <"">
##$SUBNAM3= <"">
##$SUBNAM4= <"">
##$SUBNAM5= <"">
##$SUBNAM6= <"">
##$SUBNAM7= <"">
##$SUBNAM8= <"">
##$SUBNAM9= <"">
##$SW= 18.0517283424941
##$SWIBOX= (0..15)
0 0 2 0 0 0 0 0 0 0 0 0 0 0 0 0 
##$SW_h= 3612.71676300578
##$TD= 16384
##$TD0= 1
##$TE= 0
##$TE2= 300
##$TE3= 300
##$TEG= 300
##$TL= (0..7)
0 120 120 120 120 120 120 120 
##$TP= (0..7)
150 150 150 150 150 150 150 150 
##$TP07= 0
##$TPNAME0= <>
##$TPNAME1= <>
##$TPNAME2= <>
##$TPNAME3= <>
##$TPNAME4= <>
##$TPNAME5= <>
##$TPNAME6= <>
##$TPNAME7= <>
##$TPOAL= (0..7)
0.5 0.5 0.5 0.5 0.5 0.5 0.5 0.5 
##$TPOFFS= (0..7)
0 0 0 0 0 0 0 0 
##$TUNHIN= 0
##$TUNHOUT= 0
##$TUNXOUT= 0
##$USERA1= <user>
##$USERA2= <user>
##$USERA3= <user>
##$USERA4= <user>
##$USERA5= <user>
##$V9= 5
##$VALIST= <valist>
##$VCLIST= <CCCCCCCCCCCCCCC>
##$VD= 0
##$VDLIST= <DDDDDDDDDDDDDDD>
##$VPLIST= <PPPPPPPPPPPPPPP>
##$VTLIST= <TTTTTTTTTTTTTTT>
##$WBST= 1024
##$WBSW= 4
##$XGAIN= (0..3)
0 0 0 0 
##$XL= 0
##$YL= 0
##$YMAX_a= 73912
##$YMIN_a= -152761
##$ZGOPTNS= <>
##$ZL1= 120
##$ZL2= 120
##$ZL3= 120
##$ZL4= 120
##$ABSF1= 15.74358
##$ABSF2= -2.30827
##$ABSG= 5
##$ABSL= 3
##$ALPHA= 0
##$AQORDER= 0
##$ASSFAC= 0
##$ASSFACI= 0
##$ASSFACX= 0
##$ASSWID= 0
##$AUNMP= <proc_1d>
##$AZFE= 0.1
##$AZFW= 0.1
##$BCFW= 0
##$BC_mod= 2
##$BYTORDP= 0
##$COROFFS= 0
##$CY= -3
##$DATMOD= 1
##$DC= 0
##$DFILT= <>
##$DTYPP= 0
##$F1P= 0
##$F2P= 0
##$FCOR= 1
##$FTSIZE= 16384
##$FT_mod= 6
##$GAMMA= 0
##$GB= 0
##$INTBC= 1
##$INTSCL= 0
##$ISEN= 128
##$LB= 0.24
##$LEV0= 0
##$LPBIN= 0
##$MAXI= 10000
##$MC2= 0
##$MEAN= 0
##$ME_mod= 0
##$MI= 1.114404
##$NCOEF= 0
##$NC_proc= -7
##$NLEV= 6
##$NOISF1= 3.799351
##$NOISF2= 2.8
##$NSP= 0
##$NTH_PI= 0
##$NZP= 0
##$OFFSET= 15.73257
##$PC= 1
##$PHC0= -18041.84
##$PHC1= 12.20068
##$PH_mod= 1
##$PKNL= yes
##$PPARMOD= 0
##$PSCAL= 0
##$PSIGN= 0
##$REVERSE= no
##$SF= 200.130007798563
##$SI= 16384
##$SIGF1= 3
##$SIGF2= 2
##$SINO= 5.538805
##$SIOLD= 16384
##$SREGLST= <1H.CDCl3>
##$SSB= 0
##$STSI= 16384
##$STSR= 0
##$SW_p= 3612.71676300578
##$SYMM= 0
##$S_DEV= 0
##$TDeff= 16384
##$TDoff= 0
##$TI= <>
##$TILT= no
##$TM1= 0
##$TM2= 0
##$TOPLEV= 0
##$USERP1= <user>
##$USERP2= <user>
##$USERP3= <user>
##$USERP4= <user>
##$USERP5= <user>
##$WDW= 1
##$XDIM= 16384
##$YMAX_p= 417381066
##$YMIN_p= -2134628
$$ End of Bruker specific parameters
$$ ---------------------------------
##NTUPLES= NMR SPECTRUM
##VAR_NAME=  FREQUENCY,     SPECTRUM/REAL,   SPECTRUM/IMAG
##SYMBOL=    X,             R,               I
##VAR_TYPE=  INDEPENDENT,   DEPENDENT,       DEPENDENT
##VAR_FORM=  AFFN,          ASDF,            ASDF
##VAR_DIM=   16384,         16384,           16384
##UNITS=     HZ,            ARBITRARY UNITS, ARBITRARY UNITS
##FACTOR=    0.220516191357247, 1,           1
##FIRST=     3148.55929565553, 0,            0
##LAST=      -464.157467350248, 0,           0
##MIN=       -464.157467350248, -2134628,    0
##MAX=       3148.55929565553, 417381066,    0
$$ Real data points
##PAGE= N=1
##DATA TABLE= (X++(R..R)), XYDATA
$$ [...]
7088D361646J2927m7036k65770l52584l06671o1714J48394N0201J94103l7518
7078C695978l2827Q6932j03848j32867l31395l31886l1434l483k47148k33770
7068B334252l62918p0925K70868j62525j70105p276q4359r3133M4680l9887p2255
7057A586417r1618J0338K3854j38515q9499J93604J33321l0668j26854k34455
7047A235925k42677J53791j25098L22562M5634l36051l67524J06158j52668n5283
7037E84769J23753J24449M0299j32180k34J31226L1177J2383k88285N947P4967
7026G08271l22755q7762m186L9332J92938J25932j10983K6787q2470Q852J71357
7015F65313N7011p9896J308q3293P643J23840l1162k37866L8946K6626k9071J39802
$$ y = [4361646, 4374573, 4327537, 4061767, 3709183, 3402512, 3340798, 3489192, 3539393, 3733496, 3695978, 3663151, 3750083, 3646235, 3513368, 3181973, 2850087, 2818653, 2815170, 2568022, 2334252, 1971334, 1900409, 2171277, 2008752, 1838647, 1831371, 1747012, 1653879, 1698559, 1658672, 1586417, 1494799, 1505137, 1528991, 1390476, 1300977, 1494581, 1627902, 1597234, 1470380, 1235925, 993248, 1147039, 1021941, 1344503, 1390137, 1054086, 686562, 792720, 640052, 584769, 708522, 832971, 873270, 741090, 740856, 872082, 903259, 915642, 627357, 633304, 708271, 385516, 297754, 293568, 332900, 525838, 651770, 540787, 567574, 485104, 493956, 665313, 722324, 642428, 643736, 560443, 568086, 691926, 660764, 422898, 461844, 488470, 459399, 599201]
7003E99201N2985j87890j89218K10737O0388j63779J24943L6932j72628m7562
6993C24109J21149K6561j07463k1152K5146n2335J15727k7264j40070J59081r7781
6982C25708r4165N9570j23152N5238j3287O7044K2877k23985J66121j27068l3989
6971H0912J45182k35089J68415P3266L6190o8017L9103k0375n2261q4652J29301
6960B11975m8434q0585M3830r0844j40514J8802J75167j5594K36598j86634j50068
6949b6301R6239K2510M822j49837N8013J78435J0145j35056l3427n3867J2905
6938a5419p4431p8676o5000L869J88512L8397j73735J9264K01243j14962k09827
6927b80765K75518J85344P0009j60041j49394l1135J56255J36603O9231j53907
$$ y = [599201, 652186, 464296, 275078, 485815, 546203, 382424, 507367, 544299, 371671, 324109, 445258, 471819, 364356, 343204, 368350, 316015, 431742, 404478, 264408, 423489, 325708, 231543, 291113, 167961, 223199, 209912, 276956, 299833, 75848, 241969, 114901, 80912, 226094, -8995, 159420, 232686, 268876, 200859, 239962, 219587, 167326, 82674, 211975, 163541, 82956, 126786, 35942, -104572, -85770, 89397, 73803, 310401, 123767, -26301, 69938, 92448, 97270, -52567, 5446, 183881, 194026, 58970, 25543, -28324, -15419, -89850, -168526, -233526, -229657, -41145, -2748, -176483, -157219, 44024, -70938, -280765, -5247, 180097, 250106, 90065, -59329, -90464, 65791, 202394, 271625, 117718]
6917A17718p7885Q7762Q1829K2724o9461m4846m9139M9344K0451j45195L4997
6906B8299j47245K6144P5462j31148k6422R9829J39542j07852l5058K15850p3034
6895F4367r1890J62111j92925K6349J34727J34549j56873j93941K10244K1145
6885A17863m648l672k23973P6254J24089n4819m2715J28609m9838Q5283k28756
6874g6323K42820j6931K17l8077n4154q7525j60890p7233R9506J60600r7167J70076
6862F4919J60115J15156j01121n9397j80145k42819R2746P2696J77242J24871
6852B24263j39102j22412O8686j09073R8424J08665o1804N9358j07660l9797J532
6841a8920L6173k6749K04100j7296j61529L0312q1644l7298L3735N7219J44249
$$ y = [117718, 39833, 127595, 209424, 232148, 162687, 117841, 68702, 118046, 138497, -6698, 28299, -118946, -92802, -17340, -148488, -174910, -75081, 64461, -43391, -78449, 137401, 64367, -27523, 134588, -58337, -31988, 102739, 237288, 80415, -113526, 96718, 117863, 113215, 109543, -114430, -38176, 85913, 31094, -11621, 116988, 67150, 152433, -76323, 166497, 149566, 149783, 111706, 57552, -29973, -190863, -268096, -168590, -7990, -105157, 64919, 225034, 340190, 239069, 179672, -473, -243292, -150546, -77850, 99392, 224263, 85161, -37251, 31435, -77638, 20786, 129451, 67647, 127005, 19345, -20452, -18920, 17253, -9496, 194604, 177308, 15779, 46091, -35553, -72851, -39116, 18103, 162352]
6830A62352k6016O2369o5070k21274p1277K6730J24119J79264j25789n3084q9359
6819i7035j07780K86519P9700j82620P7429J76733m1396q1469O3501k13761J76166
6808A35987J12588k38449m2945K06479k15186J342J4790R5873J82018M469k36625
6797B0341j4185K27394m5517J0431n2977o6643O5818K86184j53527k17254j64312
6786a04247J08965R1123K61007K5991j45323k31830N5365J02739m6728o6391n3649
6775b978K77574J92868l8234j68177Q2524N257j71025l7283k8303L1142J02936
6764B46301K31436k26480r4300J64968O1703p6695n6409p6407n8305J49159L0844
6753B95815k190j99658j57391O8600K43936l6448j42972J1210J3254O8359k0226
$$ y = [162352, 136336, 198705, 133635, -87639, -158916, -132186, -8067, 171197, 45408, -7676, -97035, -204815, 81704, 161404, -21216, 56213, 232946, 191550, 110081, 173582, -40179, 135987, 248575, 10126, -32819, 173660, -41526, -40184, -25394, 70479, 252497, 256966, 20341, 6156, 233550, 188033, 198464, 145487, 78844, 144662, 430846, 277319, 60065, -104247, 4718, 95841, 356848, 382839, 237516, 5686, 61051, 163790, 117062, 50671, -2978, 274596, 467464, 429230, 261053, 343577, 348834, 177809, 140526, 112223, 143365, 246301, 477737, 251257, 156957, 321925, 383628, 306933, 250524, 174117, 115812, 264971, 295815, 293625, 93967, -63424, 5176, 249112, 212664, 69692, 80902, 94156, 162515, 142289]
6742A42289q5567J4259n6264N4319j0811O8181J24660R2473J36858J65533k51870
6731C94060j18741J8436J56957j9721m740L03660j44626O2582j88111j73222K50076
6720E36610j20494k52226J4072J2791O3673K4771k6942l5525N0175k15196J8694
6709G0403N6603j5394l9914N2257j8137l6819P6056L4307j1677p1103q750m0139
6697D7693P8547O6846O0495j65308R2911r1687l18416J02725L11026K8515r4828
6686A18519j11932O3017K00923q8735r9371Q7218K3762O5690p5100k014K6737
6675B08714n3577j48992j9736K14720k34997J03794K19654j61550J33533M4393
6665C05956j72480j27478K5470J17047O7830o1584N4074M1167m6907M4031j1335
$$ y = [142289, 56722, 70981, 14717, 69036, 58225, 126406, 251066, 343539, 480397, 645930, 394060, 275319, 293755, 450712, 430991, 426251, 729911, 585285, 647867, 459756, 286534, 536610, 416116, 163890, 177962, 190753, 254426, 279197, 252255, 216730, 266905, 51709, 70403, 127006, 111612, 71698, 123955, 105818, 68999, 145055, 179362, 167685, 96582, 87832, 47693, 126240, 193086, 253581, 88273, 181184, 89497, -228919, -126194, 184832, 213347, 118519, 6587, 69604, 270527, 181792, 82421, 169639, 193401, 259091, 183991, 181977, 208714, 155137, 6145, -13591, 201129, -33868, 69926, 289580, 128030, 261563, 305956, 133476, 5998, 31468, 148515, 216345, 154761, 208835, 250002, 203095, 247126, 235791]
6654B35791J45037k98260j61981J78763J02528L9702l3615j66063J3565Q3123
6644A38590l8587j7065l3872R6574N208J16819O0120j22180n8150Q6104j85372
6633D8189l0089L7136R3808J47529o0673j98107q443J40387m719o4557j18461
6622a8000J59673K25649j86676j48568L1321K10458j47333j93882Q0469M3721
6612E6832N7924P1166l7412M2090O711j4739r0893j16811J22504p0234J22751
6601A49889P3798j58427j8975R3512j3871j26713R100J34361K19993l4431j01626
6590B26610l642p0620r3728j43491J75828Q6228L7388n3436P8725n3934P6832
6579B62760M665o2309J4766l84176R4629L9519M5881l4847M4364K96484q5012
$$ y = [235791, 380828, 82568, -79413, 99350, 201878, 241580, 207965, 41902, 55467, 138590, 100003, 82938, 49066, 145640, 150848, 267667, 327787, 205607, 147457, 233561, 48189, 18100, 55236, 149044, 296573, 235900, 37793, 29350, 169737, 165018, 100461, -18000, 141673, 367322, 180646, 32078, 63399, 273857, 126524, -67358, 13111, 56832, 114756, 185922, 148510, 190600, 197311, 182572, 91679, -25132, 97372, 27138, 149889, 223687, 65260, 46285, 139797, 125926, -787, 8313, 142674, 362667, 328236, 226610, 222968, 152348, 58620, -84871, 90957, 177185, 214573, 161137, 239862, 185928, 262760, 267425, 205116, 219882, -164294, -69665, -30146, 15735, -19112, 25252, 321736, 236724]
6568B36724j04354q258L46746j73515m4679L7468j99665o6209M6669J36791p2776
6557A34942P6752N1639j20182M8871N8207j8060m7072L7258j71639K32295k14220
6546F8791J57635K39332k55091J4293l3376J6289J3542j65063K35588J65255k80518
6535A76677j9266r0615J96576k0012Q9563k9646p3140p0353J3716j593J18860
6524B90767j10054k12674K99562K21039j0568m4303l39672R1013J00906L6400
6514C22416J25564l02544J1259Q7249J21018q302j36613L6390r4595J75265R6976
6503D34083o1502K291n2590n3046o6067j06857o5062J02183Q6824j00680j7931
6492A01646J66980l2491j2082J13707P4667Q8402m0611Q2644q1576K9371j46145
$$ y = [236724, 132370, 124112, 470858, 297343, 252664, 290132, 90467, 24258, 70927, 207718, 134942, 211694, 263333, 143151, 192022, 250229, 232169, 185097, 222355, 50716, 283011, 68791, 226426, 465758, 210667, 224960, 191584, 207873, 221415, 56352, 291940, 457195, 176677, 157411, 66796, 263372, 243360, 332923, 303277, 230137, 159784, 173500, 171907, 290767, 180713, -31961, 267601, 488640, 478072, 433769, 94097, 185110, 286016, 322416, 447980, 145436, 156695, 243944, 364962, 356660, 220047, 256437, 161842, 337107, 434083, 372581, 374872, 322282, 269236, 203169, 96312, 31250, 133433, 220257, 119577, 101646, 268626, 236135, 224053, 337760, 412427, 500829, 460218, 542862, 461286, 490657, 344512]
6481C44512K0390P0761j28226j32800m5846Q3094J01913R4617r6954R2164j28709
6470B74916k7862J3306p544J61713P4441j63372o9181j02917l5190K27118Q0435
6459D25863k03331n6503M8759J93526l0043n7739J68294n7252j7072r3229j23488
6448A97785j61516P8086J28947J16039J89446K3821J25965j03001J8523k03282
6438D10813k24359J57645j0387J57379l149L7095p6432k21774K00491M4247K24905
6427F96474O319l5474k68284M6184l084N6758N0323j29786j0267j30504K05948
6416D84607N5208j4001o9005j26537j14068K31608K15331K1913k00276J12475
6406E97255L5038q2413p4890l6810p3658J9625K1318J49067L551j19655M0730
$$ y = [344512, 364902, 435663, 307437, 174637, 128791, 211885, 313798, 408415, 311461, 403625, 274916, 247054, 260360, 252816, 414529, 488970, 325598, 256417, 153500, 118310, 345428, 425863, 222532, 166029, 214788, 408314, 378271, 320532, 488826, 431574, 414502, 321273, 197785, 36269, 114355, 243302, 359341, 548787, 572608, 698573, 595572, 614095, 410813, 186454, 344099, 333712, 491091, 487942, 525037, 448605, 226831, 427322, 471569, 696474, 702793, 667319, 399035, 445219, 442135, 498893, 549216, 419430, 409163, 278659, 484607, 539815, 525814, 456809, 330272, 216204, 447812, 663143, 685056, 484780, 597255, 632293, 549880, 474990, 438180, 364522, 384147, 405465, 554532, 558083, 438428, 479158]
6395D79158J26650J5855m9834m7153Q6833J32235n8213j61362K12197N6411k02679
6384E90098j0649k3580o2938k7899J5327p4196K25900q4499m0654J15461k5758
6373E96613j54669J16045m6846N0211N5281l12866J86213J97762k31727R0822
6363E46839J1982r3560n4008j07752L04948r2721k10305O809J19126O1587j32925
6352C60020O7420J20164j17715j2391K59364l0466r3041O500L4996l8611j32148
6341D24092J86313L44036p8431k87952k68658J99640J48572o2581K3732J16237
6331G45000q5008k4371j41768J92756l9285k51570K8667J36076R237J46156k8569
6320F87321p9218j09771J58622M3853k82410r271j6233K70285Q988Q6153k24223
$$ y = [479158, 605808, 621663, 571829, 524676, 611509, 743744, 685531, 524169, 736366, 792777, 590098, 579449, 555869, 492931, 465032, 480359, 406163, 632063, 547564, 506910, 622371, 596613, 441944, 557989, 511143, 561354, 616635, 303769, 489982, 687744, 456017, 546839, 558821, 465261, 411253, 303501, 608449, 515728, 305423, 312232, 431358, 492945, 360020, 427440, 547604, 429889, 417498, 676862, 646396, 553355, 559855, 594851, 556240, 424092, 610405, 954441, 876010, 588058, 319400, 519040, 667612, 605031, 628763, 745000, 659992, 635621, 493853, 686609, 647324, 395754, 424421, 560497, 569734, 715890, 687321, 608103, 498332, 656954, 700807, 418397, 409126, 392893, 663178, 672166, 758319, 534096]
6309E34096J52317N568k106l6836N1441J63970j41417m687N8793j34852J23832
6298G70119l7755P355R9736p2730r7353J7373l1912N969P6404R4564J5027q0828
6286G65969J4304j17847J84317L3445j82314J51666r544K947O0004J6100j50043
6275G69004j0279r271L15455n8055k10727R9150P573Q239j21586M3195K27559
6264A060257L6931o6937j46584K8699J37961L3745J30876m2718j27269l1394J57229
6253A170796j89279j06388L0754r3517r3436K43403P5980j40452O0932r4065j6790
6242H47938L90608j49706J47349j81572O4540n210k35465O0181J74092J06071
6232A218826j51682J23283Q7918O8364j05972q951j6874m8501K37141k2148K9155
$$ y = [534096, 686413, 691981, 689875, 653039, 704480, 868450, 727033, 722346, 781139, 646287, 770119, 732364, 739719, 839455, 766725, 669372, 686745, 654833, 660802, 737206, 831770, 846797, 765969, 780273, 662426, 846743, 880188, 697874, 849540, 839996, 842943, 902947, 919047, 769004, 758725, 749454, 1064909, 1006854, 796127, 895277, 902850, 911089, 789503, 832698, 1060257, 1097188, 1030251, 883667, 912366, 1050327, 1084072, 1214948, 1172230, 1044961, 1013567, 1170796, 981517, 875129, 905883, 812366, 718930, 962333, 1038313, 897861, 958793, 864728, 847938, 1238546, 1088840, 1236189, 1054617, 1119157, 1113947, 878482, 938663, 1112755, 1218826, 1067144, 1190427, 1278345, 1346709, 1240737, 1231786, 1214912, 1166411, 1403552, 1381404, 1410559]
6221A410559J79581p3763p4449O7594J3666J5406Q2279j38859P3518K01695j75394
6210A581833M4067J50634j18333j81617k5073J28872P7497O2017k3660k9979Q8763
6199A755021J91445N9417k24297j5006K96177n6212q9905K86211N6433j12473
6189B146811o3066k0843J64429R2835m7793M5492j58280R8318K66273O1866K6198
6178B612240r6079J03355J6869J90065J26561J88462j369p0548J52926O3015j00948
6167C184549Q7122J36044j1117j03470J45688J91332J7556J54667J36589o2845
6157C876115M1652L82173L43272j0121j43595J62175J55445L27305J84386J86983
6147E505790K66214M6792K47806J41652N8389K61844L31894L90052M78942K28528
$$ y = [1410559, 1590140, 1516377, 1441928, 1509522, 1523188, 1538594, 1620873, 1482014, 1555532, 1757227, 1581833, 1625900, 1776534, 1658201, 1476584, 1451511, 1580383, 1657880, 1719897, 1696237, 1666258, 1755021, 1946466, 2005883, 1781586, 1766580, 2062757, 2006545, 1916640, 2202851, 2259284, 2146811, 2083745, 2062902, 2227331, 2320166, 2272373, 2317865, 2159585, 2257903, 2524176, 2586042, 2612240, 2516161, 2619516, 2636385, 2826450, 2953011, 3141473, 3140104, 3069556, 3222482, 3285497, 3184549, 3271671, 3407715, 3396598, 3293128, 3438816, 3630148, 3647704, 3802371, 3938960, 3876115, 3917767, 4299940, 4643212, 4633091, 4489496, 4651671, 4807116, 5134421, 5318807, 5505790, 5772004, 5818796, 6066602, 6208254, 6266643, 6528487, 6860381, 7250433, 7729375, 7957903]
6137G957903L88311K82446L90924P27441O63767M47118P01087J082426J381858
6128A4023281J277984J794280K389426L054529L961682M416828M421711K614215
6120C7953936o84139l360515l833833l056670j612024l95283M50876J681305K558842
6111B9702495L412425L581484J486391j450564m328137n252417m119487l269703
6103A9762487k474356j583111j249331r36259p27252m64490n80520l06566l15586
6094A1125016k66624j32728n5724J32449P3102J79756R0691P1939J43295N10266
6084A1871438M56740N00538N17330R03015Q25803J024570J454899J636556K236332
6075B1427221K773255L407730M534154N592586N899103M390926P97546l351533
$$ y = [7957903, 8346214, 8628660, 9019584, 9747025, 10410792, 10857910, 11558997, 12641423, 14023281, 15301265, 17095545, 19484971, 22539500, 26501182, 30918010, 35339721, 37953936, 37269797, 33909282, 30075449, 27018779, 25406755, 25011472, 25462348, 27143653, 29702495, 33114920, 36696404, 38182795, 36732231, 32404094, 27151677, 23032190, 19762487, 17288131, 15705020, 14455689, 13519430, 12792178, 12327688, 11747168, 11440602, 11125016, 10858392, 10725664, 10669940, 10802389, 10875491, 11055247, 11145938, 11217877, 11361172, 11871438, 12328178, 12828716, 13346046, 14249061, 15074864, 16099434, 17554333, 19190889, 21427221, 24200476, 27608206, 32142360, 37734946, 43634049, 48024975, 48822521, 45470988]
6067D5470988n257106m384865l092853j456948k15991J407855K885920L994583
6059C9351583M678806L276396m02871m819442o798285o526371n091823l690451
6051A9977542k943663j893499j537993j453957r55717q53377q09383n43191n27436
6042H459326p30624n54065m41803m39701k60996k73967k17930j23017j00982l19476
6032D996765j05768m80163j45926Q389j99160j98296J8871m20625j07109K26532
6022C593510j67205j6767p0998k66645q5201L5939n6270j6809j63208l7533j13249
6011B635564j09148j34925j06787l7731r3057K7432j26467O6666k2027j13443
6001A986077K18686K7618j79540o4788r738o8052p0939k8758K4228J74469N0304
$$ y = [45470988, 40213882, 35829017, 32736164, 31279216, 31063225, 32471080, 35357000, 39351583, 44030389, 47306785, 46903914, 42084472, 35286187, 28759816, 23667993, 19977542, 17033879, 15140380, 13602387, 12148430, 11192713, 10339336, 9529953, 8986762, 8459326, 7728702, 7174637, 6732834, 6293133, 6032137, 5758170, 5540240, 5417223, 5316241, 4996765, 4890997, 4410834, 4264908, 4273297, 4074137, 3875841, 3894712, 3474087, 3366978, 3593510, 3426305, 3409538, 3338540, 3071895, 2986694, 3022633, 2966363, 2949554, 2786346, 2748813, 2635564, 2526416, 2391491, 2284704, 2246973, 2153916, 2181348, 2054881, 2121547, 2099520, 1986077, 2204763, 2232381, 2052841, 1988053, 1978315, 1910263, 1839324, 1810566, 1834794, 2009263, 2059567]
5990B059567l23829N5901L7194n9295r138J58602J32605j87851j98512K477j370
5979A666351O7278L9016o2446M719p5208j02592o4015j2347k310q8993M3166p1511
5967A341108J87993J15229J13802k01167m1896P9544K9515o6923p9137M9476q699
5956A518845J25643K3397k0798m4078j01392j4299p0288O4753J01946n2449R4954
5945A626234l5179N721N3243M5328l3162K11764P5022N3671K664o9219J12510
5934B048597J33739l2654j02042N3102n2403l0424j18530J95870l4113Q3529J79236
5923B323907R6686j9299j34347n3704K53771L27229J41306J93227p8149J08121
5913C158748j16638j51978j62697k77927j60451j57325M3036L0558O462l2610
$$ y = [2059567, 1735738, 1791639, 1828833, 1769538, 1760400, 1919002, 2051607, 1863756, 1665244, 1667721, 1666351, 1733629, 1772645, 1710199, 1714918, 1639710, 1537118, 1473103, 1460756, 1458446, 1369453, 1412619, 1341108, 1529101, 1644330, 1758132, 1556965, 1515069, 1594613, 1624128, 1557205, 1478068, 1527544, 1518845, 1644488, 1667885, 1647087, 1603009, 1501617, 1487318, 1417030, 1481783, 1583729, 1531280, 1626234, 1591055, 1596776, 1650019, 1695347, 1662185, 1873949, 1948971, 2002642, 2005306, 1936087, 2048597, 2182336, 2149682, 2047640, 2100742, 2048339, 2017915, 1899385, 2095255, 2061142, 2144671, 2323907, 2420593, 2401294, 2266947, 2213243, 2467014, 2794243, 2935549, 3128776, 3050627, 3158748, 3042110, 2890132, 2727435, 2449508, 2289057, 2131732, 2174768, 2205326, 2211788, 2179178]
5903B179178N0119K53229j20199n3127j03752k2662j13026q3542p6852j83650
5893A725716J5096J9415K70876J6959L3042J91208k0244L49426J15665m07491
5883B309668j60681L2721j41121j28190N4044p1455j03643J1841J1456j48969
5873A665671M0032P5020K13626j01746R2695k8251k93868O0109J28330K54231
5863B105849p6416J00790O9644M1127j19116J30605L23098J72790K3334J87775
5853B959480j03490R6730k10775l69638J62585q8541j7787l9984K43998j07045
5843B525533l24365N4223P5273q1704J21474J24045j46868o1043J15800N261J19569
5832B527198O4259J635Q3070j05585J57057J82501Q1016M2443K0618N1872N1520
$$ y = [2179178, 2229297, 2482526, 2362327, 2309200, 2205448, 2182786, 2069760, 1986218, 1909366, 1725716, 1740812, 1760227, 2031103, 2048062, 2081104, 2272312, 2252068, 2601494, 2717159, 2309668, 2148987, 2181708, 2040587, 1912397, 1966441, 1894986, 1791343, 1803184, 1814640, 1665671, 1705703, 1780723, 1994349, 1892603, 1985298, 1957047, 1663179, 1723288, 1851618, 2105849, 2029433, 2130223, 2199867, 2240994, 2121878, 2252483, 2575581, 2748371, 2771705, 2959480, 2855990, 2952720, 2741945, 2372307, 2534892, 2446351, 2428564, 2388580, 2632578, 2525533, 2201168, 2255391, 2330664, 2248960, 2370434, 2494479, 2347611, 2286568, 2402368, 2407629, 2527198, 2591457, 2593092, 2676162, 2570577, 2727634, 2910135, 2991151, 3033594, 3054212, 3106084, 3157604]
5821C157604K81668o4655k4955O7575m3785j75898o5231K06243M2529J62763n1649
5810C492209K11833J67792k6773k106Q1107K12905J07222J40281J03243J35002
5800D622715n5001K88522P9530K62791L49972n579J19146R6046L13254J18275
5790F189671K83294Q0759J01989K32328N86796L07384J41898M56670M54065O84371
5780I519225P38127P14492J031350R63742R85601J448143J904913K324784K798217
5771B2428594L715168M700908N385192N233016J999743k701525n288975n830986
5763B9641135m823157l522645k421397j614607j057730p53883n46651m70767k39116
5754A4191182j0210L9037M98820N89292M83654Q62059J295028J663246K033052
$$ y = [3157604, 3439272, 3374617, 3349662, 3417237, 3373452, 3197554, 3132323, 3338566, 3381095, 3543858, 3492209, 3704042, 3871834, 3845061, 3842955, 3924062, 4136967, 4244189, 4384470, 4487713, 4622715, 4567714, 4856236, 4935766, 5198557, 5548529, 5542950, 5662096, 5758142, 6071396, 6189671, 6472965, 6553724, 6655713, 6888041, 7474837, 7782221, 7924119, 8380789, 8834854, 9519225, 10257352, 10971844, 12003194, 12966936, 13952537, 15400680, 17305593, 19630377, 22428594, 26143762, 30844670, 36229862, 41462878, 43462621, 40761096, 35472121, 29641135, 24817978, 21295333, 18873936, 17259329, 16201599, 15447716, 14901065, 14430298, 14191182, 14180972, 14220009, 14718829, 15308121, 15791775, 16653834, 17948862, 19612108, 21645160]
5745B1645160K627385L572706M647894N737730N564635L348760j153218n467923
5737D0523129o528562n732456m141587k902237k051498j556329j098354q13578
5729A5698528o28145m10008j03201J04O36319N78940P40709J155796J771216K110549
5719B1550807K655269L633013M081586K587101q21597l654456m596090l984859
5711B1450774k893593k197298j616705j153799q58628n14049m79808m34208q0252
5702A1222434l34650L3445N38275J44008M30760Q70324J167370J238389J367268
5693A6677623K294769L249421L886032M471912L466031O34552l230593n294573
5685B6155174m922616l934775l049597k086647j357005j164302r22733o61003
$$ y = [21645160, 24272545, 27845251, 32493145, 38230875, 43795510, 47144270, 45991052, 40523129, 33994567, 28262111, 24120524, 21218287, 19166789, 17610460, 16512106, 15698528, 15070383, 14660375, 14557174, 14557278, 15193597, 15772537, 16513246, 17669042, 19440258, 21550807, 24206076, 27839089, 31920675, 34507776, 33686179, 30031723, 25435633, 21450774, 18557181, 16359883, 14743178, 13589379, 12730751, 12216702, 11736894, 11302686, 11222434, 10887784, 10921229, 11459504, 11603512, 12034272, 12904596, 14071966, 15310355, 16677623, 18972392, 22221813, 26107845, 30579757, 34045788, 34680340, 31449747, 26155174, 21232558, 17297783, 14248186, 12161539, 10804534, 9640232, 8717499, 8056496]
5677H056496p20507n32960p50387l45576k79484k68329n40139m09010L6946j6389
5667D230661k67914k19906j9658r3970k11332L6823l63995k38220k2444j51892
5657B678153O5771j96101o5538k6004j87223r890K06797k36334J9875n6267M8418
5646B241657p1558q5237j20792j81202n2081L0112q5647L7636J14133R1054r4160
5635A823915j04139M1875k16229o1346O6381j06856M3627O3922N9701q6984j15808
5624A408059j1346j60672J5049N360R3667j75789J59994k01014M6311M844j58454
5613A026009R7442K6550K8853J49604J55205j33179j31517j08758k5316L13967
5603A398860M9575j79738P2647J31991j37219P446j57946j36208k25343J45634
$$ y = [8056496, 7335989, 6803029, 6052642, 5707066, 5427582, 5159253, 4619114, 4210104, 4247050, 4230661, 3962747, 3742841, 3723183, 3629213, 3417881, 3454704, 3090709, 2852489, 2830045, 2678153, 2743924, 2547823, 2482285, 2456281, 2269058, 2259168, 2465965, 2229631, 2249506, 2193239, 2241657, 2170099, 2084862, 1964070, 1782868, 1730787, 1760899, 1675252, 1712888, 1827021, 1918075, 1823915, 1719776, 1761651, 1545422, 1484076, 1550457, 1443601, 1487228, 1551150, 1610851, 1523867, 1408059, 1396713, 1236041, 1251090, 1256450, 1350117, 1174328, 1334322, 1133308, 1179619, 1184463, 1026009, 1123451, 1150001, 1178854, 1328458, 1483663, 1350484, 1218967, 1110209, 1084893, 1398860, 1448435, 1268697, 1341344, 1473335, 1336116, 1343562, 1185616, 1049408, 824065, 969699]
5593I69699J93874m0191R3490r04J2898K0221N2882L9846j67057K21052O4413
5582A460223j00757J65513j18584J80783n2742q974k25332J78529M2323K1380
5572A542362L9304J25266r8159n0829o4524Q9208L01716j30934k45844O862n3886
5561A460542J77723Q9494M5309K6564P2344J50585M7352M4315N8114L3659r8874
5550B107127l3064J28J29901k82926k20589k1000l1371M5737j55870k05132J19700
5539A452641L8156M9694R1717J11809j02616o8638K04779L51678L05130k5664
5529B408686M069j77191j65008K5490r2369j00203k13314M1522p705j00230J21447
5518A745194o461j40330J6832m0144J6175r7934J49332J29372K1829n7841K25847
$$ y = [969699, 1163573, 1123382, 1216872, 1215968, 1228866, 1249087, 1301969, 1341815, 1174758, 1395810, 1460223, 1359466, 1524979, 1406395, 1587178, 1534436, 1525462, 1300130, 1478659, 1520982, 1542362, 1581666, 1706932, 1608773, 1557944, 1493420, 1582628, 1884344, 1753410, 1507566, 1514428, 1460542, 1638265, 1727759, 1773068, 1799632, 1871976, 2022561, 2069913, 2114228, 2172342, 2206001, 2107127, 2074063, 2074191, 2204092, 1921166, 1700577, 1679577, 1648206, 1693943, 1538073, 1332941, 1452641, 1490797, 1540491, 1632208, 1744017, 1641401, 1572763, 1777542, 2129220, 2434350, 2408686, 2412755, 2235564, 2070556, 2096046, 2003677, 1903474, 1690160, 1731682, 1723977, 1623747, 1745194, 1738733, 1598403, 1615235, 1575091, 1591266, 1493332, 1642664, 1772036, 1793865, 1736024, 1961871]
5507A961871K6026L2837l2230R8824R7416p7893n0205J2704L51194j02295k35755
5496B082494l66800p418Q672L82089k70705k41332R980j51298Q0271J49053J4786
5485A689792j52193M3178J87156p7429p3061O6631M9037R5756p0461n880l2487
5474A720039J44929J14114j4226j50496m500P2124j44255K56742j39997j00922
5464A753552O6257p1593J65897K36389j33563j33266R7637J91829L03271K78120
5454B754530R8246R2319J19461K96850M43220M64714N39686L48014M3089k74609
5444D925520L6895p7443j03119k02391K33423L68226K5919k08750l59714l69225
5434D269341k59128l90168k17122K04K39093r0005K05787L75121N3264m7984j51402
$$ y = [1961871, 1987897, 2020734, 1988504, 2087328, 2184744, 2106851, 2056646, 2069350, 2420544, 2318249, 2082494, 1715694, 1708276, 1716948, 2099037, 1828332, 1587000, 1596980, 1445682, 1525953, 1675006, 1689792, 1537599, 1580777, 1767933, 1690504, 1617443, 1684074, 1733111, 1828867, 1758406, 1752526, 1720039, 1864968, 1979082, 1964856, 1814360, 1809860, 1881984, 1737729, 1994471, 1854474, 1753552, 1819809, 1748216, 1914113, 2150502, 2016939, 1883673, 1981310, 2173139, 2476410, 2754530, 2852776, 2945095, 3064556, 3361406, 3804626, 4269340, 4809026, 5157040, 5200129, 4925520, 4962415, 4884972, 4781853, 4579462, 4812885, 5181111, 5207030, 4998280, 4638566, 4269341, 4010213, 3620045, 3402923, 3403127, 3642220, 3552215, 3758002, 4133123, 4186387, 4138403, 3987001]
5423C987001l20514k93158l11022j32515J34194j995R2641R5608J72137K82533
5413C704910J34500m0389m20894l26272j81130l5464J25107q0697j70688p1753
5403B637230q2099o9569J09514j12802N7033M1890j39601q9433J02942J28408
5393B583513j22363J89168O7038J9165K46974L2306j3418N5426K39708j94401
5383C103116M4886Q3052N1068m6188J47147L9083O9365J16782L15472K33833J59778
5372D317394L03093M83924K81120O50393O71178Q85094J081423J384047J803487
5363A1861153J597128J189207m09533j482312j856694j664015j178159q59763
5355G197012n27969m32346m23279q0531k05535m1739J68514K25408K37829L73152
$$ y = [3987001, 3666487, 3373329, 3062307, 2929792, 3063986, 3061991, 3154632, 3250240, 3422377, 3704910, 3839410, 3799021, 3378127, 3051855, 2870725, 2835261, 2960368, 2879671, 2708983, 2637230, 2555131, 2485562, 2595076, 2482274, 2539307, 2581197, 2441596, 2352163, 2455105, 2583513, 2461150, 2650318, 2717356, 2736521, 2983495, 3015801, 3002383, 3057809, 3297517, 3103116, 3148002, 3231054, 3282122, 3235934, 3383081, 3422164, 3491529, 3608311, 3923783, 4157616, 4317394, 4620487, 5104411, 5385531, 6035924, 6707102, 7592196, 8673619, 10057666, 11861153, 13458281, 14647488, 14237955, 12755643, 10898949, 9234934, 8056775, 7197012, 6669043, 6236697, 5813418, 5732887, 5527352, 5485613, 5654127, 5879535, 6117364, 6490516]
5345F490516J25965K71369R28038J167684J357035J930914K171392J575426L00657
5336A6318996j157191k461637k507681j880019j388713r44784o67469n73215m93835
5327D244452k33817J7956n2601l65325j16922m2073l94499j26156J06200j7107
5317C020108k90570L7216r4721O4396j14823j31211k15058Q4169R129L2987O2439
5306B464061j61402Q4477J5143j46443J7094r1969k30903J8088J44924R0379j52856
5295B050593M5329j22951j2041k4224K16234j87811j07636k3504J87139K65794
5285B286922j73114q327J50771p2481M2222Q6935j10752k03883J28060K88723
5275B415076L7340L381k0020p2827R0336n2680o1484J90106N3661j05294Q0956
$$ y = [6490516, 6616481, 6887850, 7815888, 8983572, 10340607, 12271521, 14442913, 16018339, 16318996, 15161805, 12700168, 10192487, 8312468, 6923755, 5978971, 5311502, 4738287, 4244452, 4010635, 4028591, 3975990, 3610665, 3493743, 3451670, 3057171, 2931015, 3037215, 3020108, 2729538, 2766754, 2672033, 2736429, 2621606, 2490395, 2275337, 2359506, 2368635, 2401622, 2464061, 2302659, 2387136, 2402279, 2255836, 2272930, 2180961, 1950058, 1968146, 2113070, 2203449, 2050593, 2095922, 1972971, 1960930, 1936706, 2152940, 1965129, 1857493, 1833989, 2021128, 2286922, 2113808, 2105481, 2256252, 2183771, 2225993, 2312928, 2202176, 1998293, 2126353, 2415076, 2452416, 2455797, 2435777, 2362950, 2453286, 2400606, 2339122, 2529228, 2582889, 2477595, 2558551]
5264B558551J3417J59789M6756O0142L072o5708J97137N5808J49J05901M0020
5253C175034N9542L3817p6379j19517N8372J22914N8080k32981J06713J49157
5243C334752J9187K49374j07627O3058K55343J01958j26824K01041N1600N4304
5233D096166j9817N5847q5987l1390J43224K84845J15768n7263J36932j4907J66316
5222D789734J27192q2777n1027K77039J78013J59823K13689N4036J59418j47871
5212E677269J93678K51843J69070J78428K89199J79681J18984M52386O35324J82350
5202H328212J46006N75317O11929O19377O89373P90755J081706J398233J284488
5193A5525396J529082J332305L93529m61372p79195J21738J34437M54270J471650
$$ y = [2558551, 2571968, 2731757, 2778513, 2838655, 2841727, 2776019, 2973156, 3028964, 3029113, 3135014, 3175034, 3234576, 3268393, 3192014, 3072497, 3130869, 3253783, 3311863, 3078882, 3185595, 3334752, 3353939, 3603313, 3495686, 3558744, 3814087, 3916045, 3789221, 3990262, 4041862, 4096166, 4076349, 4132196, 4046209, 4014819, 4158043, 4442888, 4558656, 4501393, 4638325, 4623418, 4789734, 4916926, 4834149, 4783122, 5060161, 5238174, 5397997, 5611686, 5665722, 5825140, 5677269, 5870947, 6122790, 6291860, 6470288, 6759487, 6939168, 7058152, 7510538, 8145862, 8328212, 8474218, 9049535, 9661464, 10280841, 10970214, 11760969, 12842675, 14240908, 15525396, 17054478, 18386783, 18780312, 18318940, 17539745, 17661483, 17795920, 18250190, 19721840]
5184A9721840J611750J973588K843136K959580K197381N87228j246522j017601
5176B9630380l21334J062244J570387J093942J52019j14241K72850J189453J555872
5167C6091572J032552P85609Q94470O54660P22245P59740K32989j655620k782938
5158C6735279k484046j374912j32666J171170K305588K363777J228992k03889
5150C9609293n96675q82580j388022j671804j078231j235387j436336j183055
5142C0137203m84490l00210p76550j331986j061255j11189P38684R68696P63133
5133B8542036n24419k896134l152454k496564k052872j339412p30358l71203J31451
5124A5110071M26039O70443J39202q30939j340974j618079j443382j191605p75581
$$ y = [19721840, 21333590, 23307178, 26150314, 29109894, 31307275, 31894503, 30647981, 29630380, 29309046, 30371290, 31941677, 33035619, 33187638, 33073397, 33346247, 34535700, 36091572, 37124124, 37909733, 38804203, 39458863, 40181108, 40940848, 41173837, 39518217, 36735279, 34251233, 32876321, 32743655, 33914825, 36220413, 38584190, 39813182, 39609293, 39012618, 38130038, 36742016, 35070212, 33991981, 32756594, 31320258, 30137203, 29652713, 29352503, 28575953, 27243967, 26182712, 26071523, 26810207, 27778903, 28542036, 28017617, 25121483, 21969029, 19472465, 17419593, 16080181, 15349823, 14978620, 15110071, 15536110, 16206553, 16345755, 15514816, 14173842, 12555763, 11112381, 9920776, 9145195]
5115I145195q69354o93376m20920l12561j60523k76685m24496l27352k96347j09525
5105E254056N3536j24712j35123j40726j55610K5581p2508k00702K466L7696K363
5094D546317n8744m6032J24637J17147L00035k23253K7520k19535p5788o51k8171
5083D463482k391q7153k1280J96991J01147J42235M8110m0140k51476l8892L31304
5072D841937J41931O0124j861j93138J86030L12501J26930l0685J39221p9306
5062E503684o6694K69210j00814J2002K4504J4892J48778K00756N0956j01763
5052E955511k83392j23460m7131K8593K75064j05696o5614j26237n75390k77631
5042D654617j19218J03358P218j17117K25856L31433r7570O6572m41332l71018
$$ y = [9145195, 8275841, 7582465, 7161545, 6848984, 6688461, 6411776, 5987280, 5659928, 5363581, 5254056, 5307592, 5182880, 5047757, 4907031, 4751421, 4777002, 4704494, 4503792, 4506258, 4543954, 4546317, 4487573, 4441541, 4566178, 4683325, 4983360, 4760107, 4787627, 4568092, 4492304, 4491653, 4463482, 4461091, 4373938, 4352658, 4549649, 4650796, 4793031, 4841141, 4801001, 4549525, 4510633, 4841937, 4983868, 5043992, 5042131, 4848993, 5035023, 5347524, 5474454, 5443769, 5582990, 5503684, 5436990, 5706200, 5605386, 5617388, 5641892, 5656784, 5805562, 6006318, 6057274, 5955511, 5672119, 5548659, 5501528, 5530121, 5805185, 5699489, 5633875, 5507638, 4932248, 4654617, 4535399, 4638757, 4645975, 4528858, 4754714, 5086147, 4988577, 5055149, 4613817, 4242799]
5032D242799k04803j14564j02668j32661Q884m0351j92938l0089q5673m9764j40870
5021C157302K1636l56340j90976j40637k0289k1153Q788J89519L23908m36k8852
5010B942470L6855j83380l12616j52407r7636j17070L1942j25052m6259L3347
5000B010194r4286j72061k3138o5820J51137P6892R3108O6545j13131J31788l6706
4989B024522j3963j11851Q318j14025J18161J44997j29160q2669P1173Q2357j3632
4978A984228k6577k67337R5524j35500L1968J01713m6119O330J12093K1056p9643
4967A797736j1800O7422j15875k628K4315J28767r9250O719q4228l5m1317l2795
4955A637031k01077J65337Q1375r4714l89M0528q3539J46993L7588j00913N7474
$$ y = [4242799, 4037996, 3923432, 3820764, 3688103, 3696987, 3656636, 3463698, 3433609, 3347936, 3298172, 3157302, 3178938, 2822598, 2631622, 2490985, 2470696, 2449543, 2458331, 2647850, 2971758, 2971322, 2942470, 2979325, 2795945, 2483329, 2330922, 2233286, 2116216, 2148158, 2023106, 1976847, 2010194, 1915908, 1743847, 1720709, 1654889, 1806026, 1882918, 1976026, 2042571, 1929440, 2061228, 2024522, 2010559, 1898708, 1907026, 1793001, 1911162, 2056159, 1926999, 1844330, 1915503, 1997860, 1984228, 1957651, 1690314, 1785838, 1650338, 1682306, 1784019, 1737900, 1744230, 1856323, 1877379, 1797736, 1785936, 1853358, 1737483, 1734855, 1759170, 1887937, 1788687, 1795406, 1711178, 1711143, 1669826, 1637031, 1435954, 1601291, 1682666, 1587952, 1587563, 1628091, 1544552, 1691545, 1729133, 1628220, 1685694]
4944A685694R4832j25228P1387J8271q5292k4185J28608j1583k18144k4147j68869
4933A341344R6635J58629L9607K86042N9717q3945O6574q1172j5974O8332J62516
4922B098305K4315k6301m5284P3463m418K6480l73158j7488J19555J52982k24469
4911A803982L1768P5122J20765m3989m1589j6717L1499Q7810L2959j27547J4690
4900A968753K63746N7536k12966P5372l3383j16862J20114N6008J02729q6322
4890B194725r980J13408q7349m5399J517o6091P6916O0012L41409J02285J32569
4879B814022l7530K27953q9078j93778L8392J85857j62252j42201J53171j3340
4869B781216J02831O1570j36234J85166K84697l0244j44897L3882J51594o1747
$$ y = [1685694, 1780526, 1655298, 1726685, 1744956, 1659664, 1635479, 1764087, 1752504, 1534360, 1510213, 1341344, 1437979, 1596608, 1636215, 1922257, 1981974, 1898029, 1964603, 1883431, 1867457, 1935789, 2098305, 2122620, 2096319, 2051035, 2124498, 2120080, 2146560, 1773402, 1755914, 1875469, 2028451, 1803982, 1835750, 1910872, 2031637, 1987648, 1946059, 1929342, 1960841, 2048651, 2081610, 1954063, 1968753, 2232499, 2290035, 2077069, 2152441, 2119058, 2002196, 2122310, 2178318, 2281047, 2194725, 2184745, 2298153, 2210804, 2165405, 2166922, 2100831, 2177747, 2237759, 2579168, 2681453, 2814022, 2776492, 3004445, 2915367, 2721589, 2759981, 2945838, 2783586, 2641385, 2794556, 2781216, 2884047, 2945617, 2809383, 2994549, 3279246, 3249002, 3104105, 3137987, 3289581, 3227834]
4859C227834n9785Q3330p8891p4561R8870J49514o6463j24075M3183K25508K21034
4848C645498J86630j21465J30765R0709K3126j09243J65387J51118j837J58469
4838D319157k90348J29562J5583m814J34477j48582J97510J69003J81604J94295
4828D897447J53378K56293j79380j75505M9318K33740K87838L39947K1312j95340
4818E689048M9809R8554J50672M5387P0010J75880J58984J1329K18348N12185
4808G180206L40769L06320J7943J3039L09984O2067K03902L43966J35408L90338
4798I303942K65341M05402K03547N08137M83999L63932O71254N99190P76627J432239
4788A5013610J313135J248169J458772K103870J722631J027234R78826Q56533
$$ y = [3227834, 3168049, 3251379, 3172488, 3097927, 3196797, 3346311, 3279848, 3155773, 3198956, 3424464, 3645498, 3832128, 3710663, 3841428, 3932137, 3955263, 3846020, 4011407, 4162525, 4160688, 4319157, 4028809, 4158371, 4173954, 4169140, 4303617, 4155035, 4352545, 4521548, 4703152, 4897447, 5050825, 5307118, 5127738, 4952233, 5001551, 5235291, 5523129, 5863076, 5884388, 5689048, 5738857, 5837411, 5988083, 6033470, 6103480, 6279360, 6438344, 6449673, 6668021, 7180206, 7520975, 7827295, 7845238, 7858277, 8168261, 8230328, 8434230, 8778196, 8913604, 9303942, 9569283, 9974685, 10178232, 10686369, 11170368, 11534300, 12205554, 12804744, 13581371, 15013610, 16326745, 17574914, 19033686, 21137556, 22860187, 23887421, 24866247, 25722780]
4780B5722780R83356K044858L317366M646221N246321L819503J59022m454579
4772D1484848n517634m395328l096613j672479q86980j62028K54319O33735J077917
4763B7719757J819414K481999K981485M116414N615491P265426Q370506Q104153
4755F8474645N373170J791494j535270o173203r759105r424035p202331n142612
4747C6402753l631372k503216j353203j043060l50817M86829R71848J755256K326792
4738C3061810L212195M323424N411451N375308K939525k596469p177024p330896
4730C7219324o158041m404936l124956k225147j567687j051679l88173k00094
4722A8098611L20697N39902J6324m46776m35082n35568r58747j477352j436529
$$ y = [25722780, 26706136, 28750994, 32068360, 36714581, 41960902, 45780405, 45939427, 41484848, 35967214, 31571886, 28475273, 26802794, 25915814, 25753786, 26008105, 26641840, 27719757, 29539171, 32021170, 35002655, 39119069, 44734560, 51999986, 60370492, 68474645, 73847815, 75639309, 74104039, 67930836, 58171731, 48747696, 41545365, 36402753, 32771381, 30268165, 28914962, 27871902, 27521085, 28007914, 28979762, 30735018, 33061810, 36274005, 40597429, 46008880, 51384188, 54323713, 51727244, 44550220, 37219324, 31061283, 26656347, 23531391, 21306244, 19738557, 18686878, 18298705, 18098611, 18419308, 18959210, 18975534, 18528758, 18093676, 17558108, 16599361, 15122009, 13685480]
4713A3685480j337761j308397r28031o81065n33462m30693l79439l16221l21489
4704G448922k96806k11930j75890l45874j98784p2265m0869o7382j2041l86933
4694E640148m4346O7l27209k9878Q620J69817m7932j23059K759j75385J88587
4683E262189Q7560k12383k14096J32316K22154l84k74217j16149O8356L24492
4673E279838j42686P092J84106q2982O8204P3243m6020p4359L42587L23283j20372
4662E811934J74370J80820M75947K42832N5608R419J21750l0053j93934l63660
4652F485033j97448q7335j50745J78164k30487Q3885J39541k5705n609Q5042J45941
4641F420277N3958J61351Q9710m4936J25246M57873K82089K09834K03733J85308
$$ y = [13685480, 12347719, 11039322, 10111291, 9430226, 8896764, 8466071, 8086632, 7770411, 7448922, 7152116, 6940186, 6764296, 6418422, 6219638, 6147373, 6106504, 6039122, 6027081, 5640148, 5595802, 5595869, 5268660, 5238782, 5247402, 5417219, 5369287, 5246228, 5248987, 5073602, 5262189, 5349749, 5137366, 4923270, 5055586, 5277740, 5277356, 5003139, 4886990, 4955346, 5279838, 5137152, 5144244, 5328350, 5245368, 5313572, 5386815, 5340795, 5266436, 5609023, 5932306, 5811934, 5986304, 6167124, 6643071, 6885903, 6941511, 6950930, 7072680, 7042627, 6848693, 6485033, 6287585, 6200250, 6049505, 6227669, 5997182, 6081067, 6220608, 6194903, 6189294, 6274336, 6420277, 6474235, 6635586, 6725296, 6680360, 6805606, 7263479, 7545568, 7755402, 7959135, 8144443]
4631H144443M27075K75148J93963J00499K35036P3295j93109p3593L1950j15796
4621I098911J51891K59624J37666M60746K30352J95834M12668L37687N40967L39767
4611A2166113M57593N38565P53451P12626P43960J042288J516410J342525J488791
4602B0762322K026981K897667L199192M470081N310232O183523N924418L083818
4594E3858234r98487m604064m983785l593698k009118k72092J274239K800848
4586D1472077M125825M760369M468314J897739k111069m908440m850178l604912
4578D1249725j317149O33217K082266L545339K851178N59981k541478m528007
4570D2535072m504531l238881j706524k27721J107974K277661L112234L339986
$$ y = [8144443, 8571518, 8846666, 9040629, 9141128, 9376164, 9449459, 9256350, 9182757, 9214707, 9098911, 9250802, 9510426, 9648092, 10108838, 10339190, 10535024, 10947692, 11285379, 11826346, 12166113, 12623706, 13162271, 13915722, 14628348, 15372308, 16414596, 17931006, 19273531, 20762322, 22789303, 25686970, 28886162, 33356243, 38666475, 44849998, 50774416, 53858234, 52859747, 48255683, 43271898, 39678200, 37669082, 37396990, 38671229, 41472077, 45597902, 50358271, 54826585, 56724324, 54613255, 49704815, 44854637, 41249725, 39932576, 40565793, 42648059, 46193398, 49044576, 49604557, 47063079, 42535072, 38030541, 34791660, 33085136, 32857415, 33965389, 36243050, 39355284, 42695270]
4562D2695270K294669q41523l907034n515845n191805m042593l013742j922391
4554B0555006j158917q67626j080204j139465r76721j300767j000939n76825m01103
4545A2052439k77066k75429J47310Q0382k05092n02971n88547p03674o50925l98211
4535H678216j54373Q1308P2658K39618K18804P2464m50996o65790n64360k98906
4525G228643o00385k19675n6077k35723k84145j82048Q427l51419j25839j76195
4515E005564l1536j45744j10226j05703K3973q3486N0056j77450j61969P3866
4505D337345p5623j70913m8774L48856J29964l9039j69175O7938J52164r4452
4495D438291o7339R3658j27453n9480K71140K61417J95021K49308j27042K03740
$$ y = [42695270, 44989939, 44148416, 40241382, 34725537, 29533732, 25491139, 22477397, 20555006, 19396089, 18528463, 17448259, 16308794, 15332073, 14031306, 13030367, 12453542, 12052439, 11775373, 11499944, 11647254, 11727636, 11522544, 11019573, 10431026, 9727352, 9076427, 8678216, 8523843, 8605151, 8677809, 8917427, 9136231, 9208695, 8757699, 8091909, 7527549, 7228643, 6628258, 6408583, 6352506, 6116783, 5832638, 5650590, 5659017, 5307598, 5181759, 5005564, 4974028, 4828284, 4718058, 4612355, 4636328, 4552842, 4602898, 4425448, 4263479, 4337345, 4261722, 4090809, 4042035, 4390891, 4520855, 4481816, 4312641, 4380579, 4532743, 4438291, 4370952, 4464610, 4337157, 4277677, 4548817, 4810234, 5005255, 5254563, 5127521, 5331261]
4485E331261J26848k3672m1887k13540k61999l10041k81576p9057l9917q6121
4475D120299r9950j21904k18559J28590j41139N5060K37957j0118j8578J3894
4465C945552k2614j25763n6281j84473Q5224j09682q1156K71499k30068O9700
4455C561938M4533K50432J82537j6286K79442K20200J94784K55770L14930m3961
4445E244319j45601l38560l86757k51105j08473l60699k08170m1345O6760L0707
4435C501076k19387j45721J34536m0733r24o6296j60342M6284J722q6854j49126
4424B814235p1133P0926O0541r0604j16402J00659N6882j50787R5902K15775j72544
4413B813450J64555L2778j13977n4665J59309K44498j19169r6065K2800j46592
$$ y = [5331261, 5458109, 5434437, 5392550, 5179010, 4917011, 4606970, 4325394, 4246337, 4206420, 4120299, 4020349, 3898445, 3679886, 3808476, 3667337, 3722397, 3960354, 3950236, 3931658, 3945552, 3922938, 3797175, 3740894, 3556421, 3641645, 3531963, 3450807, 3722306, 3492238, 3561938, 3606471, 3856903, 4039440, 4023154, 4302596, 4522796, 4717580, 4973350, 5288280, 5244319, 5098718, 4760158, 4373401, 4122296, 4013823, 3653124, 3444954, 3403609, 3470369, 3501076, 3281689, 3135968, 3270504, 3229771, 3228847, 3162551, 3002209, 3048493, 3050215, 2963361, 2814235, 2743102, 2814028, 2874569, 2783965, 2667563, 2768222, 2825104, 2674317, 2770219, 2985994, 2813450, 2978005, 3010783, 2896806, 2842141, 3001450, 3245948, 3126779, 3030714, 3053514, 2906922]
4403B906922O468K08763j00724O7937j81377j26809J40664J83094K1557j87201
4393B939294m7391j33221J59353N9506q0765J51643j7794q655j39919P503M4762
4382B934316Q22K5880O920J63142J67884o833K6626o0112k429r7775J28730J74882
4370C462053m8470J8202O8853J26018O7699p4108j07743K31527O3919j11016k77223
4359C419711j89096J64834J05339J83893J4219j3981k0482M2937K38286N701m5921
4348C905440P0885Q9883o6640J07363l4852j51773j41568J16830P2253r2106M9765
4337C925480K67975J60115M7944J08263L39056K66106L72286L32003L29586L05965
4327F454779J70728l75880l30322l70828m5286J9000L5214j30628o8769K1801
$$ y = [2906922, 2913390, 3122153, 3021429, 3089366, 2907989, 2781180, 2921844, 3104938, 3126495, 2939294, 2891903, 2758682, 2918035, 2977541, 2896776, 3048419, 3030625, 3021970, 2882051, 2889554, 2934316, 2935138, 2961018, 2967938, 3131080, 3298964, 3292131, 3318757, 3258645, 3256216, 3158441, 3287171, 3462053, 3413583, 3431785, 3500638, 3626656, 3694355, 3620247, 3512504, 3744031, 3807950, 3696934, 3419711, 3230615, 3395449, 3500788, 3684681, 3698900, 3684919, 3664437, 3707374, 3945660, 3951361, 3905440, 3976325, 4066208, 3999568, 4106931, 4072079, 3920306, 3778738, 3895568, 3967821, 3875715, 3925480, 4193455, 4353570, 4401514, 4509777, 4848833, 5114939, 5487225, 5819228, 6148814, 6454779, 6625507, 6249627, 5919305, 5548477, 5503191, 5522191, 5557405, 5426777, 5358008, 5379809]
4317E379809k72970j58474j46609K21921N9575J22805j18627n8967J85088J11878
4307E325429J43337M34043J81320L90435M96222J30127K74151K87936J65187j87820
4297G640367j12079k02443l48848n24212k10702j18880k58769j00848k05868l8672
4287E519046N3033J38942Q2355L563j3270J46003n3507J82672N7976J84119r742
4276F291190J02830J67124J08258J25643P1442K59627M06626J88002K56376M91998
4266H469116N59120O18430M30564L0565n30967l11676n51153k40349K4280j37248
4256H360682q5517n6114r1687L5247M21637L53173p1679K9641L26934m8492J2910
4245I186735J06924K78055J18295J14895O0864j79118J16261p1118J02364k4415
$$ y = [5379809, 5106839, 4948365, 4801756, 5023677, 5083252, 5206057, 5087430, 5028463, 5213551, 5325429, 5468766, 5902809, 6084129, 6474564, 6970786, 7100913, 7375064, 7663000, 7828187, 7640367, 7528288, 7325845, 6976997, 6452785, 6242083, 6123203, 5864434, 5763586, 5557718, 5519046, 5572079, 5711021, 5793376, 5796939, 5783669, 5929672, 5876165, 6058837, 6116813, 6300932, 6291190, 6394020, 6561144, 6669402, 6795045, 6866487, 7126114, 7532740, 7720742, 7977118, 8469116, 9028236, 9646666, 10077230, 10107795, 9576828, 9265152, 8713999, 8473650, 8497930, 8360682, 8275165, 8219051, 8127364, 8162611, 8584248, 8937421, 8865742, 8895383, 9222317, 9173825, 9186735, 9293659, 9571714, 9690009, 9804904, 9865768, 9686650, 9802911, 9731793, 9834157, 9809742]
4235I809742K19052M102N3208J07818K02258K76317K4337K16219R2317K65057
4225A1270427N0078M14585J83511K81253J61927K54029K82270J39757L58894J22184
4215A3518915K09487K33229L15116J45175L48547M54817M14034L58948M56392
4206A6454660M82410M52281L84989L55169O52873L49963M63104N97858Q02100
4197B0995407P17021R51073R38355J164798J247401J218049J162225J260651J255840
4188C0910820J173574J147200J159879J474383J510613J565125J876234J921681
4180D2739509K098828K274878K500550K763346L278176L877960M340318M462321
4172F8335886N113277O058921P620155R229983J1564833J4281423J7527588K1785390
$$ y = [9809742, 10028794, 10032896, 10086104, 10193922, 10396180, 10672497, 10696834, 10913053, 11005370, 11270427, 11320505, 11735090, 11918601, 12199854, 12361781, 12615810, 12898080, 13037837, 13396731, 13518915, 13728402, 13961631, 14276747, 14421922, 14770469, 15225286, 15639320, 15998268, 16454660, 16937070, 17389351, 17774340, 18129509, 18782382, 19132345, 19595449, 20193307, 20995407, 21712428, 22663501, 23601856, 24766654, 26014055, 27232104, 28394329, 29654980, 30910820, 32084394, 33231594, 34391473, 35865856, 37376469, 38941594, 40817828, 42739509, 44838337, 47113215, 49613765, 52377111, 55655287, 59533247, 63873565, 68335886, 73449163, 79508084, 87128239, 96358222, 107923055, 122204478, 139732066, 161517456]
4164A61517456K8260949L7208620M8710806N7138870N5317389K9226976j3286575
4157D04094491n0261463o7567776n8927325m5329732l2709351k3356176j7087531
4150A08855137j3404700j0884137q976281p632518o409076m927746m353424l881389
4142D8385866l803942l140475k838832k496834k149674j894815j814163j408343
4134B8838788j212771j336578j232375j097641j107774r17820j019142q74180
4126B0040507r95728q75874o09357p00038p94926n99801o82550n83234n36155
4117A3662844p77890k47537l76035n37010m91069m16456m70958J53466l91860
4108A0107495k35279m78648l72972j19522l08270m23738k07581j68557N687j17113
$$ y = [161517456, 189778405, 226987025, 275697831, 332836701, 388154090, 417381066, 404094491, 353833028, 286265252, 227337927, 182008195, 149298844, 125942668, 108855137, 95450437, 84566300, 75590019, 67957501, 61548425, 56620679, 52267255, 48385866, 44581924, 41441449, 38602617, 36105783, 33956109, 32061294, 30247131, 28838788, 27626017, 26289439, 25057064, 23959423, 22851649, 21933829, 20914687, 20040507, 19044779, 18168905, 17559548, 16859510, 16064584, 15464783, 14782233, 14198999, 13662844, 12884954, 12637417, 12261382, 11724372, 11233303, 10816847, 10345889, 10499355, 10107495, 9872216, 9393568, 9020596, 8901074, 8592804, 8169066, 7961485, 7792928, 7798615, 7681502]
4098G681502k63003l0503j20182j49182j40179R551m3366k14181j19855k44353
4088F366249L8273q0840n6548j94342j47789j27197p441p2738j21586j21631k67114
4077E207296k9030k12954L8355L1301m01068l14308k36932p0858j91753j93928
4067C626121l2215K31096j35875k00918n2623P4942k7047j71199l05376J10687
4057C117593q9293j42824j22472j03248P0809r4887M2807M8133K06227k19850
4047B712995j84609j21289r1824J75255m8534J1238N2869J05523O4380L3722O252
4036B715978k23418j24883m2739J04485q56J27315N2939o221j13291l45979J0062
4025B153392k5104n9219J44698k48089j4290p4979P6665J13459j16056r9480L2420
$$ y = [7681502, 7418499, 7387996, 7267814, 7118632, 6978453, 6988004, 6944638, 6730457, 6610602, 6366249, 6404522, 6323682, 6267134, 6072792, 5925003, 5797806, 5790365, 5717627, 5596041, 5474410, 5207296, 5178266, 4965312, 5003667, 5034968, 4633900, 4319592, 4082660, 4011802, 3820049, 3626121, 3593906, 3825002, 3689127, 3488209, 3435586, 3510528, 3483481, 3312282, 3006906, 3117593, 3028300, 2885476, 2763004, 2659756, 2730565, 2635678, 2678485, 2726618, 2932845, 2712995, 2528386, 2407097, 2315273, 2490528, 2441994, 2453232, 2506101, 2611624, 2676004, 2709726, 2715978, 2492560, 2367677, 2324938, 2429423, 2428567, 2555882, 2608821, 2602600, 2489309, 2143330, 2153392, 2128288, 2069069, 2213767, 1965678, 1951388, 1876409, 1953074, 2066533, 1950477, 1850997, 1883417]
4014A883417j84930Q9351J00702k8914l7713J11472j22310j15J41426j44333J8312
4003A826365l9930k28147N2664N0220r2537R2545k55363j50804N5218J44926m471
3992A450686R4149J14979k1054j84765J59535R0160J90476L7304j57482m9941
3982A724047K3455q9520j03529l22021J69827N2731K58128J2315j23841k00055
3972A401537P7988N2374k35415N0618r9811k8159J74904J19988j08502K16294
3962A621816M3087L5983j09233J69202P4054m4526k21556j35344k02923M8383
3952A278943m2561Q9882J06572J23769r9639o6292K6147q4698q7701o5489K39439
3941A418372p5416o0958R7731j03498M0655R2853M9101J5365J37787j47779r3890
$$ y = [1883417, 1698487, 1787838, 1888540, 1859626, 1821913, 1933385, 1811075, 1810960, 1952386, 1808053, 1826365, 1786435, 1558288, 1610952, 1661172, 1568635, 1661180, 1405817, 1255013, 1310231, 1455157, 1450686, 1544835, 1659814, 1638760, 1453995, 1613530, 1703690, 1894166, 1931470, 1773988, 1724047, 1747502, 1657982, 1554453, 1232432, 1402259, 1454990, 1713118, 1725433, 1601592, 1401537, 1479525, 1531899, 1296484, 1347102, 1247291, 1219132, 1394036, 1514024, 1405522, 1621816, 1664903, 1700886, 1591653, 1760855, 1834909, 1790383, 1568827, 1433483, 1230560, 1278943, 1236382, 1326264, 1432836, 1556605, 1456966, 1390674, 1416821, 1332123, 1244422, 1178933, 1418372, 1342956, 1281998, 1379729, 1276231, 1316886, 1409739, 1458840, 1474205, 1611992, 1464213, 1370323]
3930A370323K3289L5404j8194j4649K6773j07918Q2296K02797K4049r482k36725
3919A377963j09430M9050M5973K03816j1761p5826J7900o4060M9648Q2303k9632
3908A535944K1220j06986N0217j4272j81822L26200J08976q1878J24730j57952
3898A624377N0443j448j00641L5657n3450M5592m5475O7536O7285j48439K10265
3887A751702K42056j65391k21205O9738J73577K55959M7775k20261N1771j3032
3877A972689J1878J1517O6578J83714J54558L02773J66777L69052K69926J61202
3867C670664J75325l25513m64642l46696j79722k17063k42477N8982n8676p3813
3857A996369p3174N9916M0552K1029J03862n7725j63068R3169K7532J92761k99037
$$ y = [1370323, 1393612, 1429016, 1410822, 1396173, 1422946, 1315028, 1397324, 1600121, 1624170, 1614688, 1377963, 1268533, 1317583, 1363556, 1567372, 1555611, 1479785, 1497685, 1433625, 1483273, 1565576, 1535944, 1557164, 1450178, 1500395, 1486123, 1304301, 1630501, 1739477, 1657599, 1782329, 1624377, 1674820, 1673372, 1572731, 1608388, 1554938, 1600530, 1555055, 1622591, 1689876, 1541437, 1751702, 1993758, 1828367, 1607162, 1676900, 1850477, 2106436, 2154211, 1933950, 1985721, 1972689, 1984567, 1996084, 2062662, 2246376, 2400934, 2703707, 2870484, 3239536, 3509462, 3670664, 3845989, 3520476, 3055834, 2709138, 2529416, 2312353, 2069876, 2128858, 2070182, 1996369, 1923195, 1983111, 2023663, 2044692, 2148554, 2090829, 1927761, 2020930, 2048462, 2241223, 1942186]
3846A942186q2266k2874M4827R691J01287j39522j23629J87058J4953j17380L27179
3835B141510j79608j10481M9450j60128L53721j74039j7712J03101R1831k20332
3825A877313k1564m8191J48920K10523l0984J39989P4669k71158N3171l704l1632
3814B097352K05345l1891k16139j09162J74175J69633M5421P2342l2309p3273
3804B301494k4533J506j18530j1485P9555r6758j00492K02531J17212L3671j2789
3793B371382Q2280j23607J98863o0116J5904K12548k47833M4451M0323k5447M3014
3782B551762k8276J01761J48423j54560L33782p8262p0202Q2145j52596R0629
3772B824606J54353J7124k1031j44198n3961J07339M8173N5994j74243K5520J35151
$$ y = [1942186, 1859920, 1837046, 1881873, 1891564, 1992851, 1853329, 1729700, 1916758, 1931711, 1814331, 2141510, 1961902, 1851421, 1900871, 1740743, 2094464, 1920425, 1902713, 2005814, 2097645, 1877313, 1855749, 1807558, 1956478, 2167001, 2136017, 2276006, 2350675, 2079517, 2132688, 2128984, 2097352, 2302697, 2270806, 2054667, 1945505, 2119680, 2289313, 2334734, 2407076, 2374767, 2301494, 2276961, 2278467, 2159937, 2148452, 2228007, 2131249, 2030757, 2233288, 2350500, 2384171, 2371382, 2453662, 2330055, 2528918, 2468802, 2484706, 2697254, 2449421, 2493872, 2534195, 2508748, 2551762, 2523486, 2625247, 2773670, 2619110, 2952892, 2874630, 2804428, 2886573, 2733977, 2824606, 2978959, 2996083, 2975052, 2830854, 2776893, 2884232, 2932405, 2988399, 2814156, 2839676, 2974827]
3761B974827J36214K32512n9205o7987j80661J73189J85648J6588K0755p3494
3751C358386K03029j01780J2802J39285O5132k7503p9807J97077Q3724q5449j3569
3740C751327j00760k9669L34515J07747P919o2464Q8716o199J76573j36008J6485
3729D148182J24662j21402J86668J08450M7089q4874J83192n1897j7032J46496
3719D669534J56302K4445Q8027L5435J61857J13540M4788L31774Q7481J04944
3709E818127K19744M7331K09985J10273M37503K63152R5626L2853K05769M56826
3699G897189N1501J71630M22726L31744O8517M55792O74349N75443L15679M52600
3689A1417170O59746P38162O71865J025654J264872J706283K181772K393505K724783
$$ y = [2974827, 3111041, 3343553, 3284348, 3216361, 3035700, 3208889, 3394537, 3411125, 3431880, 3358386, 3561415, 3459635, 3472437, 3611722, 3676854, 3649351, 3569544, 3766621, 3850345, 3764896, 3751327, 3650567, 3620898, 3955413, 4063160, 4071079, 4008615, 4097331, 4091132, 4267705, 4131697, 4148182, 4272844, 4151442, 4338110, 4446560, 4493649, 4408775, 4591967, 4540070, 4523038, 4669534, 4825836, 4850281, 4938308, 4973743, 5135600, 5249140, 5293928, 5625702, 5713183, 5818127, 6037871, 6085202, 6295187, 6405460, 6842963, 7106115, 7201741, 7234594, 7440363, 7897189, 7948690, 8120320, 8543046, 8874790, 8943307, 9399099, 10073448, 10648891, 10964570, 11417170, 12076916, 12815078, 13486943, 14512597, 15777469, 17483752, 19665524, 22059029, 24783812]
3680B4783812L709919N184691O452912P485904O913171M775738J652472m913044
3672E6045575r888429q878679o832954m870278l618836k695064j788815j504667
3664A5967853j425667j242400j071291q75049m71074k16658o70914n07372m61964
3655I025464k89424k78258k24705k99509k31122o6682j94961k3790q9153l93635
3645F934225R617L0928m16665o9251q2425m1278r7537k59186o7723k949q5539
3634E852217J637m3593P6163j39062k27026p65j15521o7652j52175o1738J83666
3623E306151J46521j58878k24120J95519p1886j75307l0846p7500K7603j70859
3613D766398k0582Q6462M8624j07329L1029o2078O0980j89324k0430N3621j3491
$$ y = [24783812, 28493731, 33678422, 40131334, 47617238, 54530409, 59306147, 60958619, 56045575, 46157146, 37278467, 30445513, 25575235, 21956399, 19261335, 17472520, 15967853, 14542186, 13299786, 12228495, 11353446, 10882372, 10665714, 9994800, 9487428, 9025464, 8736040, 8457782, 8233077, 7933568, 7702446, 7635764, 7440803, 7417013, 7327860, 6934225, 6943842, 6974770, 6558105, 6488854, 6406429, 6365151, 6267614, 6008428, 5940705, 5937756, 5852217, 5853854, 5810261, 5886424, 5747362, 5520336, 5519571, 5404050, 5336398, 5184223, 5122485, 5306151, 5452672, 5293794, 5069674, 5265193, 5193307, 5018000, 4987154, 4909654, 4937257, 4766398, 4745816, 4832278, 4880902, 4773573, 4804602, 4742524, 4803504, 4614180, 4593750, 4647371, 4633880]
3602D633880J17995j4645R4739m2979j23545L2887M3303r7835L1739q1759Q2949
3591D676729K0118j94188j8780Q0279k78536K90760l281Q2468O320p9349P3866
3580D656406Q9308k23420j80470j4517R9381j495n6896R1096Q5780o5603j28156
3569D351414j10915J62489k3852j2503K38517p0728j01410j37495M491K8247l3394
3558D294861M4563L063J60375n3199n6921O7650j51485L6437R6567R2831k20955
3547D313787K55418Q0964q8060r600p2908k5052K3959J24303o3795M6000P3877
3536D658893j98871m3239K02709j05450j70820J3652q9120j10456K7626K72983
3526D457907J76274J26781K0397J51853K395k36770K3101J42685J7596q5223L625
$$ y = [4633880, 4751875, 4737230, 4831969, 4788990, 4665445, 4698332, 4741635, 4643800, 4675539, 4593780, 4676729, 4696847, 4502659, 4483879, 4564158, 4285622, 4576382, 4573101, 4655569, 4661889, 4582540, 4656406, 4745714, 4522294, 4341824, 4327307, 4426688, 4425193, 4368297, 4459393, 4545173, 4479570, 4351414, 4240499, 4402988, 4379136, 4366633, 4605150, 4534422, 4433012, 4295517, 4300008, 4328255, 4294861, 4339424, 4342487, 4502862, 4449663, 4392742, 4460392, 4308907, 4345344, 4441911, 4534742, 4313787, 4569205, 4650169, 4562109, 4552509, 4479601, 4454549, 4478508, 4602811, 4539016, 4585016, 4658893, 4460022, 4416783, 4619492, 4514042, 4343222, 4356874, 4267754, 4157298, 4184924, 4457907, 4634181, 4760962, 4781359, 4933212, 4935607, 4698837, 4721938, 4864623, 4882219, 4796996, 4800621]
3515D800621J44919j36740j19778O3320J11927o51O2480n0591o1972J30776J74359
3504E118670J7219j4428J41285j03368o9273j5021J9449j09536J82289R2755J249
3493E261290j13104j73752O9560J26924R6899o3756o3748K8031J18289J2984j81162
3482E118455N0829J76018J23902m0721q6603J33864P9400j38683j06153m1158
3472E269150P8630J30761M4394R0496k46798N0732J61260P4480l4734k9279O9973
3461E659065P6689K28582k9287M6877J20453K52046K94623j39973k4322j95284
3451F289469j37803k60762J25975K51504k64023k27722Q7649k7936j15170L4959
3441E756140K32416j79664O5250J73725K13500j39682j60429l4039K56069J10300
$$ y = [4800621, 4945540, 4808800, 4689022, 4752342, 4864269, 4863618, 4926098, 4875507, 4813535, 4944311, 5118670, 5135889, 5121461, 5262746, 5159378, 5090105, 5075084, 5094533, 4984997, 5167286, 5260041, 5261290, 5148186, 4974434, 5043994, 5170918, 5267817, 5204061, 5140313, 5168344, 5286633, 5299617, 5118455, 5169284, 5345302, 5469204, 5428483, 5341880, 5475744, 5555144, 5416461, 5310308, 5269150, 5347780, 5478541, 5522935, 5613431, 5366633, 5417365, 5578625, 5653105, 5618371, 5589092, 5659065, 5735754, 5964336, 5935049, 5981926, 6102379, 6354425, 6649048, 6509075, 6484753, 6289469, 6151666, 5890904, 6016879, 6268383, 6004360, 5776638, 5864287, 5836351, 5721181, 5756140, 5988556, 5808892, 5874142, 6047867, 6261367, 6121685, 5961256, 5927217, 6183286, 6293586]
3431F293586K6634J65332K6100K91707j55539M16498L43742K56996J16264p5551
3421G705769j05398k86871k73558l9527m0449j3244j80283j53325j74320M7955
3411F486749K46611Q2722k03309p1865m1932K09331J6237J6381Q2617K31216L81055
3400G435813j3749q8536K60295J62853p5321P179M1408k57353K69656J60309r9867
3389G802687j31435o6326j4438j40529j28616m2472M1752q0573K2836J21532K09614
3378G594032j66263p5302K8574R7526J20051K41025j90890L9905J77300J12729
3368G978687p5062Q2945o9236J49496J24562j13204N6892P7619L48064P844l8048
3357H530559O3683J03626J51058J99666P9410j06610J21875K13621P5313j9781
$$ y = [6293586, 6320220, 6485552, 6511652, 6803359, 6647820, 7064318, 7408060, 7665056, 7781320, 7705769, 7600371, 7313500, 7039942, 7000415, 6959966, 6946722, 6766439, 6613114, 6438794, 6486749, 6733360, 6816082, 6612773, 6540908, 6498976, 6708307, 6724544, 6740925, 6823542, 7054758, 7435813, 7422064, 7333528, 7593823, 7756676, 7681355, 7688534, 7729942, 7472589, 7742245, 7902554, 7802687, 7671252, 7604926, 7590488, 7449959, 7321343, 7278871, 7320623, 7240050, 7262886, 7384418, 7594032, 7427769, 7352467, 7381041, 7478567, 7598618, 7839643, 7648753, 7688658, 7865958, 7978687, 7903625, 7986570, 7917334, 8066830, 8191392, 8078188, 8135080, 8212699, 8560763, 8568607, 8530559, 8594242, 8697868, 8848926, 9048592, 9128002, 9021392, 9143267, 9356888, 9432201, 9412420]
3347I412420j110j2771j05467J02820K1634O3391J01722M9694j03613J63347J64654
3336I856721J48673J67663m650K13971l4400k9587J27565L0391J44933N8548J44888
3325A0824716j1861L1229K57125j4861K06818J66072J28020K19358K86465M15622
3315A2508703O2144J46975n9110q9523K37334J09552L59177L70832J55716K21840
3305A4023640r4468J54288J59435J31821p815K79719n692j5845N05257J98883
3295A5329223K6090K80599M00374l0307K11796M12792J36291O6374N20717K90203
3285A7644152L29228K48445M83058K73063K30829J93845K38567O84399O02945
3276B0928531O70794N24302K62828N92064L18964K43973J88596j2405K75262M49209
$$ y = [9412420, 9411310, 9398539, 9293072, 9395892, 9417526, 9480917, 9582639, 9632333, 9528720, 9692067, 9856721, 10005394, 10173057, 10168407, 10382378, 10347978, 10318391, 10445956, 10476347, 10621280, 10679828, 10824716, 10812855, 10844084, 11101209, 11086348, 11293166, 11459238, 11587258, 11806616, 12093081, 12508703, 12570847, 12717822, 12658712, 12569189, 12806523, 12916075, 13275252, 13646084, 13801800, 14023640, 13929172, 14083460, 14242895, 14374716, 14366901, 14646620, 14640928, 14625083, 15130340, 15329223, 15355313, 15635912, 16036286, 16005979, 16217775, 16630567, 16766858, 16833232, 17353949, 17644152, 17973380, 18221825, 18704883, 18977946, 19208775, 19402620, 19641187, 20325586, 20928531, 21599325, 22123627, 22386455, 22978519, 23297483, 23541456, 23730052, 23717647, 23992909, 24442118]
3266B4442118L53181O34139M96515Q43712R94816P77151R55199J007153R92718
3257C1496702J257683J553768J475332J483729J729568J737572J330414J701743
3249D3766511J710272J736098J296781N75514K30304p7541q07396k020378k615317
3240D3794848k644843k614602k370858j947344j825803j541863j328564j077200
3232B8443771j134870j037119q96044r59559o94481n99540p36522o29716m81225
3223B1274695o22269k98943n46022k67344j92552j15855l60425m54919l22387
3214A8093979l72398m13670m52337m41064j29151k49984j68563m35706l82313
3205A5048793j56799j91848j03505k43489l29714k07736l44925k50300l6085m3315
$$ y = [24442118, 24795299, 25429438, 25925953, 26769665, 27764481, 28541632, 29496831, 30503984, 31496702, 32754385, 34308153, 35783485, 37267214, 38996782, 40734354, 42064768, 43766511, 45476783, 47212881, 48509662, 49085176, 49315480, 49237939, 48430543, 46410165, 43794848, 41150005, 38535403, 36164545, 34217201, 32391398, 30849535, 29520971, 28443771, 27308901, 26271782, 25375738, 24416179, 23721698, 23122158, 22385636, 21755920, 21274695, 20652426, 20353483, 19807461, 19540117, 19347565, 19231710, 18871285, 18416366, 18093979, 17721581, 17307911, 16855574, 16414510, 16285359, 16035375, 15866812, 15431106, 15048793, 14891994, 14700146, 14596641, 14353152, 14023438, 13815702, 13470777, 13220477, 13184392, 13141077]
3195A3141077J4770l80144l22041j60573j86567j00455j7638J5789o0358l22031
3185A1621829L9190j72037k59401j22828K7756q3118o5487k09904k71384m1597
3175A0463019K1598J62537n7435k9052k76443m61268K3293q7643m5110j31633
3165I581863n0554j17729O8129p0033k12057k01160q1319L4031j02599J04928
3155H953500K7989k58919j80211J40672n3298q7954J85056m3635j59434k39019
3145H284747n9054J20402j30394n1162n3885l9925j38561k286L8362j33882j40040
3134G694322P9060J09508j41295k58837K568O9755p1474j75754J0076K2463j72991
3123G167401O1494O9583m9513j3490r9894m293j81265Q9967j14717j39280J16624
$$ y = [13141077, 13155847, 12775703, 12453662, 12293089, 12106522, 12006067, 11988429, 12004218, 11943860, 11621829, 11661019, 11488982, 11229581, 11106753, 11134509, 11051391, 10985904, 10776000, 10504616, 10463019, 10484617, 10647154, 10589719, 10560667, 10284224, 9822956, 9846249, 9758606, 9713496, 9581863, 9531309, 9413580, 9481709, 9411676, 9199619, 8998459, 8917140, 8951171, 8848572, 8953500, 8981489, 8722570, 8542359, 8683031, 8629733, 8541779, 8726835, 8683200, 8523766, 8284747, 8225693, 8346095, 8215701, 8164539, 8110654, 8070729, 7932168, 7929882, 7968244, 7834362, 7694322, 7773382, 7882890, 7741595, 7482758, 7485326, 7555081, 7483607, 7307853, 7317929, 7340392, 7167401, 7228895, 7298478, 7248965, 7235475, 7135581, 7131288, 6950023, 7039990, 6925273, 6785993, 6902617]
3112F902617J44304k56384q0779J32634j8802K52737j588j54787N55k16259j62665
3101F541583J56706j94494m7075K2536n4187O5324M7937j27829Q8234L8880J13281
3090F650896k04589q4080r912q9793L2968Q8020j93908L4673K07558N2102j71710
3079F312225j64242J23938O0983p5022j61333J17931n582J30425l20335k64608
3069E754380J03756K46425k72730k24710P0696K15232N0459O5112Q3818r9632
3059E992806j09567J89527L0658k14706j22785j78473P7260J26498j39436N5107
3049E706889J21680j14787q6601o4508m771o044J14091N0548L6472q2541J55028
3038E825456r033n1255p5676j35156R8584K50818l89562K9078J92479j28755M3276
$$ y = [6902617, 7046921, 6790537, 6709758, 6842392, 6823590, 7076327, 7074739, 6919952, 6920507, 6704248, 6541583, 6698289, 6503795, 6456720, 6479256, 6425069, 6490393, 6538330, 6410501, 6498735, 6537615, 6650896, 6446307, 6362227, 6352315, 6262522, 6295490, 6383510, 6189602, 6224275, 6431833, 6483935, 6312225, 6147983, 6271921, 6332904, 6257882, 6096549, 6214480, 6208898, 6339323, 6018988, 5754380, 5858136, 6104561, 5831831, 5607121, 5677817, 5893049, 5943508, 6008620, 6092438, 5992806, 5883239, 6072766, 6103424, 5888718, 5765933, 5587460, 5664720, 5791218, 5651782, 5706889, 5828569, 5713782, 5627181, 5562673, 5557902, 5551858, 5665949, 5716497, 5752969, 5670428, 5825456, 5816423, 5765168, 5689492, 5554336, 5652920, 5903738, 5514176, 5543254, 5735733, 5606978, 5650254]
3027E650254M8608L5314j14177K21224o3777j47899l7310J19201j70849m1972
3017E498617K01224J44454P077J46345N7432Q8754k1504J07336J88642j97843
3007F220534N8910m8206M5953J30991P2325M7680K46244j5652q3049J03236O5482
2996F844448l121O1256P2903J39466j50748K45608j14253j1800L05204J34182
2986G523145k8309j39129K31630J84520p407L8537K61166K33670P9253K15591
2976H592667Q6308K5264l00582O3621K71010m1382k4269J46575J15043K7005j27225
2965H834035m4602O2804J34179J62267n2608J77395J92268J24315j98531J34312
2955I525834K91982J53654L3513R6576J81276M0926J14692L24394M6129J28895
$$ y = [5650254, 5698862, 5734176, 5619999, 5841223, 5777446, 5629547, 5592237, 5711438, 5540589, 5498617, 5699841, 5844295, 5851372, 5997717, 6055149, 6143903, 6122399, 6229735, 6418377, 6220534, 6279444, 6231238, 6277191, 6408182, 6480507, 6528187, 6774431, 6758779, 6675730, 6778966, 6844448, 6841327, 6902583, 6975486, 7114952, 6964204, 7209812, 7095559, 7083759, 7388963, 7523145, 7494836, 7355707, 7587337, 7771857, 7764450, 7802987, 8064153, 8297823, 8377076, 8592667, 8678975, 8704239, 8403657, 8467278, 8738288, 8696906, 8672637, 8819212, 8934255, 8961260, 8834035, 8789433, 8852237, 8986416, 9148683, 9096075, 9273470, 9465738, 9590053, 9391522, 9525834, 9817816, 9971470, 10004983, 10101559, 10282835, 10323761, 10438453, 10762847, 10808976, 10937871]
2945A0937871J47719L61232M53985L14081m2879J59182L34249L19660L63727L19674
2935A3668501J90946K75747Q7558M24158J65535J92529j26066p100J90956r5929
2925A4966835j2056K68336K15080Q6201K75959J83074J60411L69704L39139L90028
2915A7242711L80631L00050M63927M93644P85555Q23270J055920P01373O98325
2906B2945406Q26531O16131N1579j97203n12073o40248p47553q44089o58657o15525
2896B0224299n73528r7394q2123p1100J5478O5145J03032J92725P0137J60299
2886B0006970N48918L06674J67314L42463J19292J91314K55594J74496L55948
2877B2468983O6318k25459l18620n31059o09380o49627o52864n05032m64655p24654
$$ y = [10937871, 11085590, 11446822, 11900807, 12214888, 12172009, 12331191, 12665440, 12985100, 13348827, 13668501, 13859447, 14135194, 14222752, 14646910, 14812445, 15004974, 14878908, 14871808, 15062764, 14966835, 14954779, 15223115, 15438195, 15524396, 15800355, 15983429, 16143840, 16513544, 16852683, 17242711, 17623342, 17923392, 18387319, 18880963, 19666518, 20489788, 21545708, 22247081, 22945406, 23771937, 24388068, 24439647, 24242444, 23730371, 23090123, 22342570, 21498481, 20839824, 20224299, 19650771, 19553377, 19471254, 19400154, 19415632, 19480777, 19583809, 19776534, 19846671, 20006970, 20555888, 20862562, 21029876, 21372339, 21491631, 21682945, 21938539, 22113035, 22468983, 22535301, 22309842, 21991222, 21460163, 20850783, 20201156, 19548292, 19043260, 18578605, 17853951]
2867A7853951m92044m41177m96721m41960j9387l19921k88821j34573m4791R1546
2857A5266102n9008j23077k06690r7376l68031m60410k30345m93104k90312k57050
2847A2680699l23412m94496n32087l96291n08630k64636k14464j89282l13148
2838I444253j71311l24516j63148p9136o7184j50433j35522k13937k05147n7379
2828G876540k39402q9423j47653J1544j2285k82491k70812k10479j0559p8937
2818F546043L1854j98871j73431j37348k02562r0391j20329j13747k31582p8608
2808E231028P4209n6368l115k83128J04069k20755p4491q5074K4379k59167j66664
2797D284923j13631Q8642O115k03830J76887j04682k5626K1827l39338j86463
$$ y = [17853951, 17361907, 16920730, 16424009, 15982049, 15962662, 15642741, 15353920, 15219347, 15174556, 15266102, 15207094, 15084017, 14877327, 14779951, 14411920, 13951510, 13721165, 13228061, 12937749, 12680699, 12357287, 11862791, 11330704, 10934413, 10425783, 10161147, 9946683, 9757401, 9444253, 9272942, 8948426, 8785278, 8706142, 8638958, 8488525, 8353003, 8139066, 7933919, 7876540, 7637138, 7547715, 7400062, 7411606, 7399321, 7116830, 6846018, 6635539, 6624980, 6546043, 6577897, 6379026, 6205595, 6068247, 5865685, 5775294, 5654965, 5541218, 5309636, 5231028, 5305237, 5248869, 5245754, 4962626, 5066695, 4845940, 4771449, 4686375, 4710754, 4451587, 4284923, 4171292, 4259934, 4266049, 4062219, 4239106, 4134424, 4108798, 4130625, 3791287, 3604824]
2787C604824P6308P7863j28219k36967o0581J8680M6290j95904J9924l7382R6165
2776C281001r8994k30913k6698O9983k87677L5949L4232J05009j70688k24481
2766B486723J30655k4499k35778j0239l2562o1071R5529J08817J017J3095j92755
2755B278932j77017Q7162o6087p3742K7190j39690J8545K9804j58680k751M4390
2744A868056j01467O4437l1172j07276L01280p9299j65091j96452k30798J87926
2734A510144M6407n8200J16454N1672K5318J8133r5937q0989q884j0010n1889
2723A462219l4420j16669r486O6905j1754j56679Q7700j63491j22713J20529j13650
2712A008491J19458j42934j79743N3582r7788l0998J06020m6051n5033J87000
$$ y = [3604824, 3681132, 3758995, 3630776, 3393809, 3333228, 3351908, 3398198, 3202294, 3222218, 3184836, 3281001, 3182007, 2951094, 2924396, 2994379, 2706702, 2742651, 2776883, 2881892, 2711204, 2486723, 2617378, 2592879, 2357101, 2346862, 2314300, 2253229, 2348758, 2457575, 2458592, 2471687, 2278932, 2101915, 2189077, 2122990, 2049248, 2076438, 1936748, 1955293, 1985097, 1826417, 1823666, 1868056, 1766589, 1831026, 1799854, 1692578, 1993858, 1914559, 1749468, 1553016, 1322218, 1510144, 1556551, 1498351, 1614805, 1666477, 1691795, 1709928, 1613991, 1533002, 1524118, 1514108, 1462219, 1427799, 1311130, 1301644, 1368549, 1356795, 1200116, 1287816, 1124325, 1001612, 1122141, 1008491, 1127949, 985015, 805272, 858854, 761066, 730068, 836088, 790037, 735004, 922004]
2702I22004n8660J1992r7316m8020j3842k7218k3493L4171K54672m9002j35837
2691G69451j37335J70952K460O834K07932j17923p2574J60792K553j47587k12759
2680F32796j24712p5319J33058j16073M9432Q8647P2869L53j06863n6451k2892
2669D74845m3303J82181n3133k6601N666R4417r2564J6051K30839K5619j19992
2658F94025j7826J25778l7053l5111j9863j00189k69898L809L07198l707k09342
2647D37821J39851N5830J21187j14988k42494q430L6293L2905O5739k28789Q1029
2636C75954K3906j1051J29886j87775J87817m4387j52387J19814j24781L8602
2626C55598O8716J98057Q9182j27072p1274j20909j5316j9058m3945J36544R9388
$$ y = [922004, 863344, 875336, 778020, 730000, 716158, 688940, 665447, 699618, 954290, 905288, 769451, 632116, 803068, 805528, 812362, 1020294, 902371, 829797, 990589, 993142, 845555, 632796, 508084, 432765, 565823, 449750, 499182, 587829, 660698, 661051, 554188, 497737, 474845, 431542, 613723, 560590, 533989, 539655, 634072, 541508, 557559, 788398, 814017, 694025, 676199, 801977, 764924, 729813, 709950, 609761, 339863, 343672, 650870, 647163, 437821, 577672, 633502, 754689, 639701, 397207, 388777, 425070, 457975, 523714, 294925, 375954, 399860, 388809, 518695, 330920, 518737, 474350, 321963, 441777, 316996, 355598, 424314, 622371, 711553, 584481, 513207, 392298, 376982, 357924, 313979, 450523, 549911]
2615E49911l1067j48094n6660K21634M9254j41983l0751N2635J03246M9713p0168
2604E47670J6148p9479n0603O7354j28849k1345k8534K34531l0056n0776M6737
2593E22798r5908J99475q9008P3280o3330J0474K3580J19027o0538k8445o1816
2582E49589j90144M4321K3132j68586J6196K30459j93087R7960q8806K9324j41673
2571B08685P879L0278K48897r228J6037r3673r2353O9935j0654O1055j28987j2319
2559B95552j6634p6674J1295j12245J42234J34628j9624j2485j16396M6068Q899
2548B84618K9414m8253j3951K0060k5773j18548J46361j69448P8106o8079Q5569
2537B00076J73998j89732K5299Q269N604j8895J46694j05482k43925K10969O4983
$$ y = [549911, 518844, 370750, 314090, 535724, 584978, 442995, 412244, 464879, 568125, 617838, 547670, 563818, 484339, 433736, 501090, 372241, 350896, 322362, 556893, 526837, 476061, 522798, 426890, 626365, 537357, 610637, 547307, 557781, 581361, 700388, 639850, 611405, 549589, 359445, 403766, 426898, 258312, 274508, 504967, 311880, 409840, 321034, 350358, 208685, 216564, 246842, 495739, 486511, 502548, 408875, 316522, 386457, 375803, 436858, 307871, 295552, 278918, 202244, 213539, 101294, 243528, 378156, 358532, 346047, 229651, 275719, 284618, 314032, 265779, 251828, 271888, 246115, 127567, 273928, 104480, 182586, 114507, 200076, 374074, 184342, 209641, 217910, 223514, 204619, 351313, 245831, 1906, 212875, 277858]
2526B77858j10593j05829J32044K6007K128q8003N2461N2392N3968J7594J05597
2515D15624J32709k08494q7566m6908k15154J18011Q4300n8671k61919p1704N4119
2504a45653p1153R3365J77500J33464M5884k1921j68865P595O298M6705j51794
2493d8575Q3982M9846q6167n6299m7039J1827J40336r2642n9372J89982j42317
2482e6438J47038J25456j05915m1224L9952j03477k34400J52171j16746q5494
2472b79077L88556n0526J71165N4522j76686q647j04905K5976l8411N0397j00025
2461f7661j4725k1513Q6827M4745L0890r4196J01777p6134l4916J07404O9144
2450A31642L5347j85947j13920p2703J2233J29101J3102M9383K24389m4564j29423
$$ y = [277858, 167265, 61436, 193480, 219487, 221615, 133612, 186073, 238465, 292433, 310027, 415624, 548333, 339839, 252273, 205365, -9789, 108222, 192522, 133851, -128068, -199772, -145653, -216806, -123441, 54059, 187523, 233407, 211486, 42621, 50216, 56514, 103219, -48575, 35407, 85253, -914, -57213, -104252, -92425, 47911, -44731, -104103, 85879, -56438, 90600, 216056, 110141, 68917, 108869, 5392, -229008, -76837, -193583, -279077, 109479, 58953, 230118, 284640, 107954, 99307, -5598, 20378, -18033, 32364, -67661, -82386, -103899, -17072, 27673, 58563, -35633, 66144, -9990, -44906, 62498, 131642, 166989, -18958, -132878, -205581, -193348, -64247, -51145, -1762, 222627, 178063, 48640]
2439D8640J25654j76215k16648J73522J22400j1339l7113m2476Q3337J88696m5565
2428B12893p0073j44892J81858q2933j6463j1745l5249r8290q1470J10371k2323
2417e8316K620m2659K07458j34333m107N4571J5652P2025o5713o2572j09951Q1248
2405d4077q3150K64831o1923o7495N0846M0411n9696k3227J95848J759K0259q7565
2393A46821q3609j65537J18713J35956j6929N6899J9437j43478o9482j88299J61933
2382b7575J91734o974J88009K4681n0074K9655r410j69019Q250K37721n7851K0468
2370C79615J6663q3082L9098n2062q7534J30157l0959k22090k07392Q9318J04110
2359G5842J36551J1637j68838O9927Q3527J2123k97335o29K65393m6676M6586
$$ y = [48640, 174294, -1921, -218569, -45047, 77353, 66014, 28901, -13575, 69762, 258458, 212893, 142820, -2072, 179786, 96853, 80390, 68645, 33396, -64894, -146364, -35993, -58316, -55696, -98355, 109103, -25230, -29337, 25234, 40886, 112911, 47198, -15374, -125325, -44077, -127227, 137604, 75681, 8186, 59032, 99443, 39747, 16520, 212368, 214127, 234386, 146821, 63212, -102325, 16388, 152344, 135415, 192314, 211751, 68273, -1209, -189508, -27575, 164159, 157185, 345194, 369875, 319801, 349456, 340046, 171027, 179277, 416998, 359147, 379615, 396278, 313196, 352294, 300232, 212698, 342855, 311896, 89806, -117586, -28268, 75842, 212393, 224030, 55192, 125119, 208646, 220769, -76566, -77195, 188198, 141522, 188108]
2348A88108L3599o2568r2649m9219K3659K9506k0924N4917J53576P9897j2231
2337C25671j4758j25171j9189Q8540k51754j01392J34822j10891J83794p713P5930
2326A77889J83555k8382o2144l2596j9860j62045l5448J14150J04341m1944J49552
2315C47068o1497O3583j26773k184l1718J09331j07676k87015P1680L70303n0301
2304B94801k29273l1528R6580j16299R245J8001l5798L54017k5825K6251k8516
2293C31656p3579l3116m7585N6787n9306N7727N5232j77515m5589K07290K2863
2282B94865j10073M4920R1699q8284k89536J68006L89812j81704Q7642R6465k49370
2271B54442n5536J53294P817J1302k21289K60765K7812k8306j17760n2855J96650
$$ y = [188108, 221707, 159139, 66490, 17271, 40930, 70436, 49512, 104429, 258005, 337902, 325671, 310913, 185742, 166553, 255093, 3339, -98053, 36769, -74122, 109672, 101959, 177889, 361444, 333062, 270918, 238322, 218462, 56417, 20969, 135119, 239460, 197516, 347068, 285571, 349154, 222381, 220197, 188479, 297810, 190134, -96881, -25201, 345102, 294801, 65528, 34000, 130580, 14281, 23526, 41527, 5729, 359746, 333921, 360172, 331656, 258077, 224961, 177376, 234163, 174857, 232584, 287816, 110301, 64712, 272002, 294865, 184792, 229712, 321411, 233127, -56409, 111597, 501409, 319705, 407347, 503812, 254442, 198906, 352200, 360017, 371319, 150030, 410795, 438607, 410301, 292541, 239686, 436336]
2260D36336p5863n2729j11244J43603J02827N1771j51537Q6486N3266J87858j69128
2249E01646J5581J23363j12647R4384k1134p329p7791m7468m1482o4834J16742
2238D79031j34404j57667K30101J60907r3803J1969p1146J30750K7476N6531j06188
2227E33557m4108J83816p5008J58150j13321o7108P5369j61963K53231L2538J24644
2216H99797j10380j351O2445p0479J2068K4516q5005J14071n2635P0283R5285
2205I58615O2890N5411q6373O0271L3228K3591m4595Q3046n8059K6388L05136
2194A419549J56967j2013j41234N4191j9388n6002R5442J09324Q9845r1136j33241
2183A472304J8913P2352l125J71613J45997j39225j40198J00704Q0185J02118
$$ y = [436336, 360473, 307744, 196500, 340103, 442930, 494701, 343164, 429650, 482916, 670774, 501646, 517227, 640590, 527943, 622327, 601193, 593864, 516073, 468605, 427123, 362289, 479031, 344627, 186960, 417061, 577968, 484165, 496134, 424988, 555738, 583214, 639745, 533557, 489449, 673265, 598257, 756407, 643086, 575978, 651347, 489384, 742615, 775153, 899797, 789417, 788066, 850511, 780032, 792100, 816616, 731611, 845682, 793047, 863330, 958615, 1021505, 1076916, 990543, 1050814, 1084042, 1107633, 1063038, 1146084, 1088025, 1114413, 1419549, 1576516, 1564503, 1423269, 1477460, 1458072, 1402070, 1497512, 1606836, 1696681, 1605545, 1472304, 1491217, 1563569, 1560444, 1732057, 1878054, 1738829, 1598631, 1699335, 1779520, 1881638]
2173A881638n191M6226P846j15561P0962J70091J32721j01026m4940P9251k327
2162B119690N618m3615P1803O7367K11485J2351j45645J74317J12506J13509P4692
2151B774078J35218p3246L7116J42265l2759L38059l4311J65276K77524K96475
2141D025695K18618J54146J46100K52251M46500K73512Q1389R1797L59549J81669
2131F231226K39802K95509K46838N04842M40246J13599N66554P64499O84791Q92177
2121A0980083J080938J053184P62839P32955L60333J031104J508810J698472K125607
2112B1334325L066370L676122M644322O097640Q315153J1362700J4934484J4288816
2104H7719932P219808j1558741j8708436j4251931j1219769p408343n294674l961854
$$ y = [1881638, 1876447, 1922673, 1930519, 1814958, 1885920, 2056011, 2188732, 2087706, 2042766, 2122017, 2119690, 2125308, 2081693, 2153496, 2220863, 2432348, 2444699, 2299054, 2473371, 2585877, 2699386, 2774078, 2909296, 2836050, 2873166, 3015431, 2982672, 3320731, 3286420, 3451696, 3729220, 4025695, 4244313, 4398459, 4544559, 4796810, 5243310, 5516822, 5598211, 5690008, 6049557, 6231226, 6471028, 6766537, 7013375, 7518217, 7958463, 8072062, 8638616, 9403115, 10087906, 10980083, 12061021, 13114205, 13877044, 14609999, 14970332, 16001436, 17510246, 19208718, 21334325, 24400695, 28076817, 32721139, 38818779, 47133932, 58496632, 73431116, 87719932, 94939740, 83380999, 64672563, 50420632, 39200863, 31792520, 26497846, 22535992]
2096B2535992k932337k029660j878839j263844j457600o31367n59826n97256r32718
2087A0252545r92142q97661o37696o99854k94139l66821k70815l76760j54455
2078E562202l83872k96229k45668p6408l74714l31485k55374j87281r0931n2938
2068C267302j56917o7460j41758l3947j64323k78354k55665J10098j6714l9685
2058B222577j24080j96369l1883k17011J16052N0135k11167O1512j77698K8264
2048A520332q8246l05855m3520K07344N818k08740m5338J58629n5572L7321j08717
2037A073456K23709r0233j59246l3978j58634J1443L4734N0532n0465n6811m6174
2026G98333K7546J4142q5348N308J64265j30168k39242K1840j03067R1021K91922
$$ y = [22535992, 19603655, 17573995, 15695156, 14431312, 12973712, 12342345, 11782519, 11185263, 10252545, 9260403, 8362742, 7725046, 7025192, 6731053, 6364232, 6093417, 5716657, 5562202, 5178330, 4882101, 4636433, 4560025, 4185311, 3853826, 3598452, 3411171, 3320240, 3267302, 3110385, 3042925, 2901167, 2867220, 2702897, 2424543, 2168878, 2278976, 2262262, 2222577, 2098497, 1902128, 1870245, 1653234, 1769286, 1819421, 1608254, 1669766, 1492068, 1520332, 1432086, 1126231, 1082711, 1290055, 1295873, 1087133, 1041795, 1200424, 1144852, 1182173, 1073456, 1297165, 1206932, 1047686, 1013708, 855074, 866517, 901251, 951783, 901318, 844507, 798333, 825879, 840021, 754673, 759981, 924246, 794078, 554836, 576676, 473609, 564630, 856552]
2015H56552J9317j45973j32463O5410p7701l4377J6753J29451j98155O8293k41618
2004C25489R3050Q473k06334K0184o6709O3091L9143r7831K33115j53396j32789
1993A25486K12511k0437k51632l7969L3800l4676K37221j1791O1827k2789P085
1982B98636P560o6095j13462j27417N9203K82888J24898k79136j05278j62073
1972h0276J38819K77036l5623m4747J35326k98413J72540j09505j18416J36415
1962A73156J71733P0356k7208j43714j60655n6307j4365P1934r8199n8863J16021
1951D3889O4887K1335p4323r5796J6658L0281K4592J74330j19320j6226M1698
1940A12005q5126r566J47609R6775k7603j21474j79823J92615M2179n8868O4089
$$ y = [856552, 875869, 729896, 597433, 662843, 585142, 550765, 567518, 696969, 498814, 567107, 325489, 418539, 427012, 220678, 240862, 174153, 237244, 276387, 178556, 411671, 258275, 125486, 337997, 317560, 65928, 27959, 61759, 27083, 264304, 252513, 314340, 291551, 298636, 306196, 240101, 126639, -778, 58425, 341313, 466211, 187075, 81797, -80276, 58543, 335579, 299956, 255209, 390535, 92122, 264662, 155157, 36741, 173156, 344889, 415245, 388037, 244323, 83668, 27361, 12996, 84930, -13269, -72132, 43889, 108776, 130111, 55788, -40008, -23350, 6931, 31523, 205853, 86533, 70307, 112005, 26879, 17313, 164922, 261697, 234094, 112620, -67203, 125412, 167591, 108723, 172812]
1929A72812M2303r800j32918Q6851j09399k27986Q8357J14758j5951j2095K0235
1918A7167l0845j1406J2374p884q4272Q5317J22836L1650o7171n4441n3970j06689
1906a47334M4071J52217p811J09865j14450j00013k68610m561K81067P3536j61316
1895a43339j6723n5251M1528m5983R3535J08686J95139k48336j47028K02841k07115
1884b22046o2333k109K16930J7600j11909J2046p7630P5350J22091J5856r3278
1873a09432L932q0663J66764K8922r4487J37613M9154j06492M6965R6550r3263
1862D5563K1777J16724N2497r3111j46137j8247J49661J07794k2607j08822N534
1851A10626J76500j60786j03231l2835M6824K8263n2285J06310L5703q6983K24299
$$ y = [172812, 215115, 205315, 72397, 159248, 49849, -178137, -89780, 24978, 9027, -3068, 17167, -13678, -25084, -12710, -20594, -104866, -19549, 103287, 134937, 67766, 13325, -40645, -147334, -103263, 48954, 41143, 151008, 36558, -63455, -332065, -336626, -55559, 17977, -143339, -160062, -215313, -173785, -219768, -126233, -17547, 177592, -70744, -217772, -14931, -222046, -284379, -286488, -69558, -51958, -163867, -151821, -229451, -154101, -32010, -16154, -109432, -105500, -186163, -19399, 9523, -84964, 52649, 101803, -4689, 42276, 138826, 45563, 67340, 184064, 236561, 143450, -2687, -20934, 128727, 236521, 213914, 105092, 110626, 287126, 126340, 23109, -9726, 37098, 65361, 13076, 119386, 155089, 68106, 292405]
1840B92405j93346k5617K02242O5981m5501q6861j42301J2650J48239j68814N5713
1829A14790p8974l0705k0440j47779R8396J81734J7591Q320K6963j18556P3300
1818A24640K35513j20129k23987j18489j01091N9326L7077O0917j3863J42677
1808H2591L6912N2721M2139j33845J42376j44184j55467j86988R0485J75314j3711
1797a1657q3381p8859M314N7153j19721J27514j40949J12044R438j96598M1606
1786b79096K6827l1433J85932O7325K6276M0043r4392l2587J1320M2280J83510
1775A46005J43811k44608j44716J06601j57967M4130r2556R9881J42033M769P9063
1764A26446j92772j21077j07075J13902K14605j35148N4639J6447k29539J20494
$$ y = [292405, 99059, 73442, 275684, 341665, 296164, 209303, 67002, 79652, 227891, 59077, 114790, 35816, 5111, -15329, -163108, -64712, 117022, 134613, 142933, 169896, 51340, 124640, 360153, 240024, 16037, -102452, -203543, -144217, -107140, -46223, -60086, 82591, 119503, 172224, 214363, 80518, 222894, 78710, -76757, -263745, -173260, 2054, -11657, -95038, -173897, -169583, -112430, -232151, -104637, -245586, -133542, -124104, -320702, -279096, -252269, -283702, -97770, -30445, -4169, 35874, -58518, -91105, -79785, -37505, 146005, 289816, 45208, -99508, 7093, -150874, -106744, -199300, -99419, 42614, 47383, 126446, -66326, -187403, -294478, -180576, 34029, -101119, -46480, -30033, -259572, -139078]
1754a39078N7212N7182j06558p7916O1125K3357p121M2053q6549j00456M8271
1743b28478R5496r0332O7964Q0789j62879J35766k54338J01847J35308j2600k782
1732a34239k7874j03489K65344K4812k29853L3747J32235J69638j57565k24516
1722b51760k1805K42347m9464j39346J76721J05611r3129k09711J801o0655J47657
1711a51733J33955k66019K35634n7958p1886K530J52508j15672K2589N0718q5303
1700a50637l6109j06822J25827J05292j0675J95779P0278j60238j70795R4006
1690d4094K28112o1950k58643K6740n4074l4443m2362P6899O8834J18047j62950
1679a39884K37428q1192j96041P6288N6009N2742k8465j80812n9763J62790p8955
$$ y = [-139078, -81866, -24684, -131242, -209158, -148033, -124676, -131797, -89744, -176293, -276749, -228478, -132982, -223314, -155350, -74561, -237440, -101674, -356012, -254165, -118857, -131457, -134239, -162113, -265602, -258, 24554, -205299, -171552, -39317, 130321, -27244, -251760, -273565, -31218, -80682, -220028, -43307, 62304, -30825, -240536, -238735, -299390, -151733, -17778, -283797, -48163, -106121, -178007, -175477, -22969, -138641, -116052, -65334, -150637, -186746, -293568, -167741, -62449, -73124, 122655, 192933, 32695, -138100, -44094, 184018, 122068, -136575, -109835, -163909, -198352, -240714, -163815, -94981, 23066, -139884, 97544, 16352, -179689, -103401, -47392, 5350, -23115, -203927, -263690, -100900, -179855]
1668a79855j14530J0699J66081J19019m8916J60244k14231j39595J88842q5345
1658a37587J92338O9521r8525p7123p0361l1317K26574j2221L2053n4764l9897
1647a309j41860K7127K03766k07963k16401P5583J42222J06962K9189N4321N8153
1636A29790j35040j90350q5519N4805K05190m3724O3254M8498j79106J16339J46570
1625A30707j91390o0561j8947M9519Q118J94274l5001j68372R6181k96108j05521
1614c97101J83309J03163K1173j46400O3536n7077o7593n855P4225j72N285N2367
1602a71140J51389Q5605n9932J75O6495K5677p0891N2080k5993K67703o0777p1358
1590A89033p417k00111J65084K41810k41492o1501j20932j91550N8636L5245K43012
$$ y = [-179855, -294385, -283686, -117605, 1414, -47502, 112742, -101489, -241084, -52242, -137587, 54751, 124272, 25747, -51376, -121737, -153054, 73520, 61299, 93352, 38588, -1309, -143169, -116042, 87724, -120239, -336640, -261057, -118835, -11873, 17316, 71637, 129790, -5250, -195600, -281119, -226314, -21124, -64848, -1594, 46904, -132202, -15863, 130707, -60683, -121244, -140191, -90672, -82554, 111720, 76719, -91653, 4528, -291580, -397101, -213792, -110629, -89456, -235856, -172320, -229397, -296990, -302845, -228620, -228792, -223507, -171140, -19751, 65854, 5922, 6097, 72592, 98269, 27378, 79458, 53465, 321168, 260391, 189033, 181616, -18495, 146589, 388399, 146907, 85406, -35526, -227076, -168440, -133195, 109817]
1579A09817r8808l4500Q0735k6759J55188j22126k79958j02549J50556P1090m8872
1568a46186J72495j40526p2903J09238j7251p7982M3790j7177j7750p8031J21949
1557a20334n3498K226J37317M0834K6205j07287P6177m9984l5499p6697k88439
1546d48979J23744J65288J80414L6663R1341r2597L4999j41785r9121K68856m0684
1535G8139K3047k0388R6498j58153L4469J01192Q5930l21997K8932N1254J7239
1524A6162K96844k18728k30838K40128L14426j67063j69152o8530q1175J63025
1514I5099k5342k48604L9000K95019j47725j14480o7812k1164J04700J03136J14895
1503A26722o6774o6594J6979P3113q6119j42477j9896R1123J07349j96922p2738
$$ y = [109817, 11009, -23491, 57244, 30485, 185673, 63547, -216411, -318960, -168404, -97314, -146186, 26309, -114217, -187120, -77882, -95133, -173115, -129325, -146502, -164252, -242283, -120334, -173832, -171606, -34289, 6545, 32750, -74537, 1640, -48344, -83843, -160540, -448979, -325235, -159947, 20467, 57130, 148471, 55874, 90873, -50912, -150033, 118823, 78139, 101186, 80798, 177296, 19143, 53612, 154804, 240734, -81263, -52331, -1077, 16162, 313006, 94278, -136560, 103568, 417994, 250931, 81779, 13249, -67926, 95099, 69757, -178847, -139847, 155172, 7447, -107033, -174845, -196009, -91309, 11827, 126722, 59948, -6646, 10333, 83446, -2673, -145150, -165046, -73923, 33426, -163496, -236234]
1492b36234K26417k4618l6740M3400K9177J28631M1254j28978j02182K7963J34578
1481A02668j51096L0341J32308j33075O7139J14418j12036O0710j02336N6701
1471F5742P8122r4135q895k07841r8459L39484N1627j51341l3771k63833J27759
1460a95541l0812P6064j29895K43176L4927J1577q0242Q4780R7108r6102O3866
1449G8906q0707l2392m6947K5894j49950L03929j09205k3036J28728K7120j46080
1438b3740j21254p9767j0643K38815r9907K2587J37687M493j70115j73986p280
1427b83110R6715J88124J47496o9013j7585j32483j00848J49445p9999Q7711j56068
1416a69615r7653N5480j08285J31853n3987L598R9746J58718O0360k23677J1319
$$ y = [-236234, -9817, -34435, -71175, -27775, 1402, 130033, 171287, 42309, -59873, -31910, 102668, -48428, -18087, 114221, -18854, 48285, 162703, 50667, 111377, 9041, 65742, 143864, 49729, 40834, -167007, -265466, 74018, 125645, -25696, -59467, -323300, -195541, -226353, -150289, -280184, -37008, -2081, 9496, -70746, 14034, 111142, 15040, 78906, -1801, -34193, -81140, -55246, -205196, 98733, -10472, -33508, 95220, 122340, -23740, -144994, -224761, -235404, 3411, -96496, -73909, 63778, 68271, -101844, -275830, -283110, -186395, 1729, 149225, 80212, 62627, -69856, -170704, -21259, -101258, -13547, -169615, -267268, -211788, -320073, -188220, -242207, -238609, -138863, 19855, 80215, -143462, -132143]
1405a32143L9381p52R3698l7751m2904K14707J2020j26661j25815k16793Q387
1394c14626J91384K21248J4704j57054J05345n4553K155J49153M2891l45381j69643
1383c14377K77020n3188j90877p0006J22528J24597J23336J7878k6387J03695
1373A14219j58998j22771J00721K00570l8558J24549O4009k48525m719r1319o6038
1362a26860J44208J05549n432R822m8112r2538j6112j3480K8228J497K06984j23836
1350F9918j46172J65354N5624k08619j23414N0177l3649J15971M6053l6869J17332
1339G1706q8385L0571l0785O7249K4654q103P0595j8710K0778j02188r69o4356
1327b7943R6320r1760m0895J05266J05760o8384m2217r9742j14929j29933J57954
$$ y = [-132143, -92762, -93514, 184, -37567, -80471, 134236, 146256, 19595, -106220, -323013, -314626, -123242, 98006, 112710, -44344, 61001, 6448, 8603, 157756, 200647, -144734, -314377, -37357, -90545, -281422, -351428, -228900, -104303, 19033, 36911, 10524, 114219, -44779, -167550, -66829, 133741, 95183, 219732, 283741, 35216, 30497, -60822, -126860, 17348, 122897, 117465, 127287, 79175, -13363, -29475, -42955, -14727, -13230, 193754, 69918, -76254, 89100, 144724, -63895, -187309, -137132, -170781, -54810, -8757, -45626, 71706, -16679, 13892, -16893, 50356, 75010, 66907, 137502, 118792, 139570, 37382, 36413, -27943, 68377, -23383, -64278, 40988, 146748, 78364, 36147, -63595, -178524, -308457, -150503]
1316a50503J59922p9065j54711q6598L20144j87536j19192O6068J28801Q8180
1306a4490k04795J64630Q9132J0490p9609n1069R8024L8064K9887J29262l2327
1295A77199n3261j25891j21028J37368r6373m5758l2990J4601K94503o1672K9943
1284A16641j04641k3202r3509m603j9630k78126J18320J02297k4680L2431J04380
1273g4322j91913J17753J93032q4230l2616r4345p3346r3775L51594j02278J5807
1262f8639P3742Q5459M7360j33774P791j27503Q5126M4792j9470j11064K72145
1251A55965j52194p8071N1883m2565k9563j05016N7408P7425r3288R5154J89958
1240A27096J06203R1922M2805k81397J0298Q5792r2983l1432K9157k23953r1513
$$ y = [-150503, 9419, -69646, -224357, -310955, 9189, -178347, -297539, -231471, -102670, -14490, -219285, -54655, 34477, 44967, -34642, -85711, 12313, 50377, 80264, 209526, 177199, 123938, -1953, -122981, 14387, -81986, -127744, -160734, -146133, 148370, 86698, 116641, 12000, -11202, -104711, -109314, -128944, -407070, -288750, -186453, -211133, -178702, -74322, -266235, -148482, 44550, -39680, -72296, -166641, -239987, -333762, 17832, -84446, -68639, 5103, 90562, 137922, 4148, 11939, -115564, -30438, 14354, -5116, -116180, 155965, 3771, -74300, -22417, -64982, -94545, -199561, -142153, -64728, -158016, -62862, 127096, 233299, 325221, 368026, 86629, 96927, 182719, 89736, 58304, 87461, -136492, -228005]
1229b28005P8978q2067K38887Q811r1289k037l399n7241K22967O3776j55314p0218
1217g6151k8201P1968J47431j37924j9319j77500J93303J9122N7514M7577l15953
1206b18133P2932K35130j48071r7826J15467M6742M8912P4910L4772j75583M9563
1195C8815K1224O8171j8875P8498J93272j99106l61881n1291J20808P4261k2741
1184e8845O0174P6916L0020n9024J11828j1934l8696j0627K1140k2666M1932N5943
1172A96161j82515j8110M5554O813P0103j54475n2131J15798J05676j43782M8746
1161C7838R8409J751J1195k17456M8933q5676l9387L9646K7219j22925J92705
1150g748K20052j94940n2904j01189j04198K18555J45007q8857m4348J12206j21699
$$ y = [-228005, -149027, -231094, 7793, 16604, -74685, -76722, -80121, -137362, 85605, 149381, -5933, -76151, -104352, -32384, 115047, -22877, -42196, -219696, -26393, -7271, 50243, 97820, -218133, -145201, 89929, -58142, -155968, -40501, 6241, 55153, 130063, 164835, -10748, 38815, 60039, 128210, 109335, 187833, 381105, 181999, -179882, -231173, -110365, -36104, -58845, 1329, 78245, 108265, 49241, 161069, 149135, 110439, 99812, 120952, 98286, 140218, 196161, 13646, -4464, 41090, 47903, 118006, -36469, -88600, 27198, 132874, -10908, 37838, 136247, 137998, 149193, -68263, -19330, -105006, -144393, -104747, -77528, -200453, -7748, 212304, 17364, -35540, -136729, -240927, -22372, 122635, 33778, -10570, 101636, -20063]
1139b0063R5721J50618k25922M0923l0681K4834q8911P3925j01372J29456j61912
1128a13384l814j5314l1360k10525L3908J87357J25886J07407r2408j4699m1833
1117f8779J67174k7663p6067l1445P6989m9477M9032R1429j11313q2571j5834
1106g8525k3115Q6245k22833J7965J31573O6299M8704m0721O5225j78418J17562
$$ y = [-20063, 75658, 226276, 354, 41277, 10596, 35430, -53481, 20444, -80928, 48528, -113384, -117198, -132512, -163872, -374397, -340489, -153132, -27246, 80161, -12247, -26946, -68779, 98395, 70732, -5335, -36780, 40209, -9268, 39764, 131193, 19880, -62691, -78525, -101640, -15395, -238228, -220263, -88690, -22391, 26313, -14408, 50817, -127601, -10039]
$$ [...]
##END NTUPLES=NMR SPECTRUM
##END=
