##TITLE=1H_TG-2357-B1
 CDCl3
 8 sc, 
 30.09.2022
##JCAMPDX= 6.0         $$ Bruker NMR JCAMP-DX V2.0
##DATA TYPE= NMR SPECTRUM
##DATA CLASS= NTUPLES
##ORIGIN= UXNMR, Bruker Analytische Messtechnik GmbH
##OWNER= root
$$ XWIN-NMR		Version 3.5
$$ Fri Sep 30 13:58:13 2022 Russian Standard Time (UT+4h)  she@DPX200
##.OBSERVE FREQUENCY= 200.1313499994
##.OBSERVE NUCLEUS= ^1H
##.ACQUISITION MODE= SIMULTANEOUS
##.ACQUISITION SCHEME= undefined
##.AVERAGES= 8
##.DIGITISER RES= 18
##SPECTROMETER/DATA SYSTEM= spect
##.PULSE SEQUENCE= zg30
##.SOLVENT NAME= CDCl3
##.SHIFT REFERENCE= (INTERNAL, CDCl3, 0, 15.7359)
##AUDIT TRAIL= $$ (NUMBER, WHEN, WHO, WHERE, WHAT)
$$ ##TITLE= Audit trail, XWIN-NMR		Version 3.5
$$ ##JCAMPDX= 5.01
$$ ##ORIGIN= Bruker BioSpin GmbH
$$ ##OWNER= she
$$ F:/spectra/data/she/nmr/H-F/1/pdata/1/auditp.txt
$$ ##AUDIT TRAIL=  $$ (NUMBER, WHEN, WHO, WHERE, WHAT)
(   1,<2022-09-30 13:56:45.67 +0400>,<she>,<DPX200>,
      <created by zg, POWCHK disabled, PULCHK disabled
       configuration hash MD5:
       00 E9 B6 7A A2 85 ED C7 34 08 36 98 17 FE 4E 26
       data hash MD5: 16K
       20 29 D8 9D CB 71 DD 20 88 3E BF 32 BB FA 37 39>)
(   2,<2022-09-30 13:56:48.59 +0400>,<she>,<DPX200>,
      <Start of raw data processing
       efp BC_mod = 2 LB = 0.24 FT_mod = 6 PKNL = 1 PHC0 = -18034.85 PHC1 = 11.80069 SI = 16K 
       data hash MD5: 16K
       65 9B B3 EB FF 13 BF AE 3D 06 CC C9 50 EB 54 F3>)
(   3,<2022-09-30 13:57:11.25 +0400>,<she>,<DPX200>,
      <pk PHC0 = 2.342396 PHC1 = -4 
       data hash MD5: 16K
       EE F6 8F 34 AB 95 3D 84 8E 55 4D C8 1F 31 AC F0>)
(   4,<2022-09-30 13:57:14.82 +0400>,<she>,<DPX200>,
      <abs ABSG = 5 
       data hash MD5: 16K
       4A 69 4C 69 CC 4F E3 BE 98 A1 98 C0 7B 7B 39 85>)
$$ ##END=
$$ 
$$ hash MD5
$$ D6 05 1F C9 D8 75 DB 78 87 ED 2C 22 CE 66 D9 9A
##$RELAX= 
##$RELAX= 
##$RELAX= 
##$RELAX= 
##$RELAX= 
##$RELAX= 
$$ Bruker specific parameters
$$ --------------------------
##$DU= <F:/spectra>
##$EXPNO= 1
##$NAME= <H-F>
##$PROCNO= 1
##$TYPE= <nmr>
##$USER= <she>
##$AMP= (0..31)
100 100 100 100 100 100 100 100 100 100 100 100 100 100 100 100 100 100 
100 100 100 100 100 100 100 100 100 100 100 100 100 100 
##$AQSEQ= 0
##$AQ_mod= 1
##$AUNM= <au_zg>
##$AUTOPOS= <>
##$BF1= 200.13
##$BF2= 200.13
##$BF3= 200.13
##$BF4= 200.13
##$BF5= 200.13
##$BF6= 200.13
##$BF7= 200.13
##$BF8= 200.13
##$BYTORDA= 1
##$CFDGTYP= 0
##$CFRGTYP= 5
##$CHEMSTR= <none>
##$CNST= (0..31)
1 1 145 1 1 1 1 1 1 1 1 1 1 1 1 1 1 1 1 1 1 1 1 1 1 1 1 1 1 1 1 1 
##$CPDPRG= <>
##$CPDPRG1= <>
##$CPDPRG2= <>
##$CPDPRG3= <>
##$CPDPRG4= <mlev>
##$CPDPRG5= <mlev>
##$CPDPRG6= <mlev>
##$CPDPRG7= <mlev>
##$CPDPRG8= <mlev>
##$CPDPRGB= <>
##$CPDPRGT= <>
##$D= (0..31)
0 1.2 0 0 0 0 0 0 0 0.06 0 0.03 0 0 0 0 0.0002 0 0 0 0 0 0 0 0 0 0 0 0 
0 0 0 
##$DATE= 1664531805
##$DBL= (0..7)
120 120 120 120 120 120 120 120 
##$DBP= (0..7)
150 150 150 150 150 150 150 150 
##$DBP07= 0
##$DBPNAM0= <>
##$DBPNAM1= <>
##$DBPNAM2= <>
##$DBPNAM3= <>
##$DBPNAM4= <>
$$ [...]
##$SUBNAM3= <"">
##$SUBNAM4= <"">
##$SUBNAM5= <"">
##$SUBNAM6= <"">
##$SUBNAM7= <"">
##$SUBNAM8= <"">
##$SUBNAM9= <"">
##$SW= 18.0517283424941
##$SWIBOX= (0..15)
0 0 2 0 0 0 0 0 0 0 0 0 0 0 0 0 
##$SW_h= 3612.71676300578
##$TD= 16384
##$TD0= 1
##$TE= 0
##$TE2= 300
##$TE3= 300
##$TEG= 300
##$TL= (0..7)
0 120 120 120 120 120 120 120 
##$TP= (0..7)
150 150 150 150 150 150 150 150 
##$TP07= 0
##$TPNAME0= <>
##$TPNAME1= <>
##$TPNAME2= <>
##$TPNAME3= <>
##$TPNAME4= <>
##$TPNAME5= <>
##$TPNAME6= <>
##$TPNAME7= <>
##$TPOAL= (0..7)
0.5 0.5 0.5 0.5 0.5 0.5 0.5 0.5 
##$TPOFFS= (0..7)
0 0 0 0 0 0 0 0 
##$TUNHIN= 0
##$TUNHOUT= 0
##$TUNXOUT= 0
##$USERA1= <user>
##$USERA2= <user>
##$USERA3= <user>
##$USERA4= <user>
##$USERA5= <user>
##$V9= 5
##$VALIST= <valist>
##$VCLIST= <CCCCCCCCCCCCCCC>
##$VD= 0
##$VDLIST= <DDDDDDDDDDDDDDD>
##$VPLIST= <PPPPPPPPPPPPPPP>
##$VTLIST= <TTTTTTTTTTTTTTT>
##$WBST= 1024
##$WBSW= 4
##$XGAIN= (0..3)
0 0 0 0 
##$XL= 0
##$YL= 0
##$YMAX_a= 76715
##$YMIN_a= -136377
##$ZGOPTNS= <>
##$ZL1= 120
##$ZL2= 120
##$ZL3= 120
##$ZL4= 120
##$ABSF1= 15.74579
##$ABSF2= -2.30606
##$ABSG= 5
##$ABSL= 3
##$ALPHA= 0
##$AQORDER= 0
##$ASSFAC= 0
##$ASSFACI= 0
##$ASSFACX= 0
##$ASSWID= 0
##$AUNMP= <proc_1d>
##$AZFE= 0.1
##$AZFW= 0.1
##$BCFW= 0
##$BC_mod= 2
##$BYTORDP= 0
##$COROFFS= 0
##$CY= -3
##$DATMOD= 1
##$DC= 0
##$DFILT= <>
##$DTYPP= 0
##$F1P= 0
##$F2P= 0
##$FCOR= 1
##$FTSIZE= 16384
##$FT_mod= 6
##$GAMMA= 0
##$GB= 0
##$INTBC= 1
##$INTSCL= 3.70164e-10
##$ISEN= 128
##$LB= 0.24
##$LEV0= 0
##$LPBIN= 0
##$MAXI= 10000
##$MC2= 0
##$MEAN= 0
##$ME_mod= 0
##$MI= 1.114404
##$NCOEF= 0
##$NC_proc= -7
##$NLEV= 6
##$NOISF1= 3.799351
##$NOISF2= 2.8
##$NSP= 0
##$NTH_PI= 0
##$NZP= 0
##$OFFSET= 15.73587
##$PC= 1
##$PHC0= -18032.51
##$PHC1= 7.80069
##$PH_mod= 1
##$PKNL= yes
##$PPARMOD= 0
##$PSCAL= 0
##$PSIGN= 0
##$REVERSE= no
##$SF= 200.130007137926
##$SI= 16384
##$SIGF1= 3
##$SIGF2= 2
##$SINO= 5.538805
##$SIOLD= 16384
##$SREGLST= <1H.CDCl3>
##$SSB= 0
##$STSI= 16384
##$STSR= 0
##$SW_p= 3612.71676300578
##$SYMM= 0
##$S_DEV= 0
##$TDeff= 16384
##$TDoff= 0
##$TI= <>
##$TILT= no
##$TM1= 0
##$TM2= 0
##$TOPLEV= 0
##$USERP1= <user>
##$USERP2= <user>
##$USERP3= <user>
##$USERP4= <user>
##$USERP5= <user>
##$WDW= 1
##$XDIM= 16384
##$YMAX_p= 268715962
##$YMIN_p= -2136580
$$ End of Bruker specific parameters
$$ ---------------------------------
##NTUPLES= NMR SPECTRUM
##VAR_NAME=  FREQUENCY,     SPECTRUM/REAL,   SPECTRUM/IMAG
##SYMBOL=    X,             R,               I
##VAR_TYPE=  INDEPENDENT,   DEPENDENT,       DEPENDENT
##VAR_FORM=  AFFN,          ASDF,            ASDF
##VAR_DIM=   16384,         16384,           16384
##UNITS=     HZ,            ARBITRARY UNITS, ARBITRARY UNITS
##FACTOR=    0.220516191357247, 1,           1
##FIRST=     3149.21984773408, 0,            0
##LAST=      -463.496915271704, 0,           0
##MIN=       -463.496915271704, -2136580,    0
##MAX=       3149.21984773408, 268715962,    0
$$ Real data points
##PAGE= N=1
##DATA TABLE= (X++(R..R)), XYDATA
$$ [...]
7079B962509k49454j90097j71645j3026q3831m2139O2988J72967k36066J45370
$$ 2962509 2713055 2522958 2351313 2338287 2254456 2212317 2275305 2448272 2212206 2357576
7069B357576J28106l06202k47563n8244J55713r8755k359M4234j05312p7573l10250
$$ 2357576 2485682 2179480 1931917 1873673 2029386 1930631 1928272 1972506 1867194 1789621 1479371
7058A479371q980K02784K5429j76109J6497j19082j38013K177o848j36290k07424
$$ 1479371 1470391 1673175 1698604 1522495 1538992 1419910 1281897 1284074 1277226 1140936 933512
7047I33512J805L9700N6236p1254j51699j90211N7420Q3607r7591K8668L6898
$$ 933512 935317 975017 1031253 959999 808300 618089 675509 759116 661525 690193 727091
7036G27091q3669l4252J8101j0965r5362K1958m0435L9700R3945j8083m5296k47103
$$ 727091 643422 609170 627271 616306 520944 542902 502467 542167 636112 618029 572733 325630
7024C25630K2212J65563P4639l9622O9699L5563j90111j641J54138O7970k30366
$$ 325630 347842 513405 588044 548422 618121 653684 463573 461932 616070 684040 453674
7013D53674q687N2808j00573J02779j27263O9216j0015O5723R6140j40551P649
$$ 453674 444987 497795 397222 500001 372738 441954 431939 497662 593802 453251 460900
7002D60900n8149m495k1755O0816j7279j50143k8319q1534o0658P0813O8499K01228
$$ 460900 402751 398256 376501 437317 420038 269895 241576 160042 99384 170197 238696 439924
6990D39924k4012O0775J6243m4776r5996J91684m4936k21386n6793O4641k8643
$$ 439924 415912 476687 492930 448154 352158 543842 498906 277520 220727 285368 256725
6979B56725n6618p0196P5110K174j9431K3957O4872k35793m3185J29529J65899
$$ 256725 200107 129911 205021 207195 187764 211721 276593 40800 -2385 127144 293043
6968B93043p7505r3754p594N3879J16312J4674L8919o2480R4984p1861R6536J47509
$$ 293043 215538 121784 114190 168069 284381 299055 337974 275494 370478 298617 395153 542662
6956E42662j81133k00873k3430j077J13329n8426j852L6497k59470q0046K12802
$$ 542662 361529 160656 137226 136149 249478 191052 189200 225697 -33773 -113819 98983
6945I8983J77557p4711J29975q5170k03205J9802r2288J19726J83452j04292j63107
$$ 98983 276540 201829 331804 246634 43429 63231 -29057 90669 274121 169829 6722
6934F722M5076J03437J03676p0613J05609N4517o2491j3330l1686j56211j70722
$$ 6722 51798 155235 258911 188298 293907 348424 285933 272603 240917 84706 -86016
6923h6016J49009j7806m0265J95302J37717j55933p420P6142r9330N0112R4955
$$ -86016 62993 45187 4922 200224 337941 182008 174588 250730 151400 201512 296467
6912B96467J7244p4232o6869j23922L5295n3180J36674O7585r5649p2803J63493
$$ 296467 313711 239479 172610 48688 83983 30803 167477 235062 139413 66610 230103
6901B30103k34939q78q4476K17497R9451j78758L283Q7009q7463k3522P4384R3386
$$ 230103 -4836 -5714 -90190 127307 226758 48000 51283 138292 50829 27307 101691 195077
6889A95077j73565j75978N9491Q7483n2543J59264K9769j3802p1131l1957J11187
$$ 195077 21512 -154466 -94975 -7492 -60035 99229 128998 115196 44065 12108 123295
6878A23295j03402J60378J9631j81736k15895K45791N9213k3790k54668R5646
$$ 123295 19893 180271 199902 18166 -197729 48062 107275 83485 -171183 -75537
6868g5537P6966j2963J39371j54117m2274j52k8554J84847q4900L4913R8912j20565
$$ -75537 1429 -11534 127837 -26280 -68554 -68706 -97260 87587 2687 37600 136512 15947
6856A5947N8775K09808j26935J2346j86789L9977J60667M2297N0050j37311o3461
$$ 15947 74722 284530 157595 169941 -16848 23129 183796 226093 276143 138832 75371
6845G5371J6855J81082j992j33226P7168j212l1257p2347j00000J20196J16205
$$ 75371 92226 273308 271316 138090 215258 214046 182789 110442 10442 130638 246843
6834B46843r7917n2875o6092N7198M4287k39545j3817J94234K31981k14902j02814
$$ 246843 148926 96051 29959 87157 131444 -108101 -121918 72316 304297 89395 -13419
6823a3419K35932p870K662q4614R997p8035m2338m3304N3612n2249L0667k1715
$$ -13419 222513 214643 217305 132691 142688 64653 22315 -20989 32623 -19626 11041 -10674
6811a0674q7816N3674j32857J69029r9073O1007J95168J60630o0685j95443M8202
$$ -10674 -98490 -44816 -177673 -8644 -107717 -46710 148458 309088 248403 52960 101162
6800A01162j6797k73943L9754O6146J84589P5156l25723j5130O5974K08773m3479
$$ 101162 84365 -189578 -149824 -83678 100911 176067 -149656 -164786 -98812 109961 66482
6789F6482K27596o7905j24400P6771q4614m577M2226N6057j15472O5051o2809
$$ 66482 294078 226173 101773 178544 93930 89353 131579 187636 72164 137215 74406
6778G4406k6988J27407m9936J60142p7079j92868J69203J48000p9411o1875L1060
$$ 74406 47418 174825 124889 285031 207952 15084 184287 332287 252876 191001 222061
6767B22061j65248k3778R0379M9972j20997j68088l59M4436Q3531J37460J6203
$$ 222061 56813 33035 123414 173386 52389 -115699 -116058 -71622 11909 149369 165572
6756A65572R3537j01707j84845m883o406j23410J62924p4372j3932j80162j054
$$ 165572 259109 157402 -27443 -32326 -38732 -162142 782 -73590 -87522 -267684 -268738
6745b68738K71988M1922m5820k33435M3854K7842m1945O4227J80095K9982j0904
$$ -268738 3250 45172 -648 -234083 -190229 -162387 -204332 -140105 39990 69972 59068
6734E9068J9920k3889J36531o8034j07301J32522j15577j38639K63800J89790
$$ 59068 78988 55099 191630 123596 16295 148817 33240 -105399 158401 348191
6724C48191j62019J70089J56628k10405K27492j5982r7134j11592J4430m7764
$$ 348191 186172 356261 512889 302484 529976 513994 416860 305268 319698 271934
6714B71934j49953J2254p6734K8400J3865J30158m9645m8679r4655m1758J60877
$$ 271934 121981 134235 57501 85901 99766 229924 180279 131600 36945 -4813 156064
6703A56064r8488j26170K94146j26699j61249n2257L7164O6261K1137j23431p5136
$$ 156064 57576 -68594 225552 98853 -62396 -114653 -77489 -11228 9909 -113522 -188658
6692a88658J11248J75929J0976p7914n5758O9816k0259P7994K1432o9300J28786
$$ -188658 -77410 98519 109495 31581 -24177 45639 25380 103374 124806 55506 184292
6681A84292R883p3641j25957J20721J51468m281j78781l5260n9133J96194N7928
$$ 184292 194175 120534 -5423 115298 266766 262485 83704 48444 -10689 185505 243433
6670B43433j54899m6817l8363J13054O3537M6617p1576L4439Q6669q6204k54250
$$ 243433 88534 41717 3354 116408 179945 226562 154986 189425 276094 189890 -64360
6659f4360N389J5795Q5730K9309J7618n8184r1852k3472J90242J26577j38864
$$ -64360 -58971 -43176 42554 71863 89481 31297 -60555 -84027 106215 232792 93928
6648I3928j62097k4548K30569J22245j01945j85769K7205l6512j55223R614K86049
$$ 93928 -68169 -92717 137852 260097 158152 -27617 -412 -36924 -192147 -182533 103516
6637A03516M9973k14515K2271J54623J73631l2057k42298n5935N8955P2998l1998
$$ 103516 153489 -61026 -38755 115868 289499 257442 15144 -40791 18164 91162 59164
6626E9164J00249M5120Q9763o2333j08708o3918j21373O1441L22372O5888p6704
$$ 59164 159413 204533 294296 231963 123255 59337 -62036 -595 321777 387665 310961
6615C10961k74818j78598l8355J66580Q8146L9733j20596J8320O4041j14719K024
$$ 310961 36143 -142455 -180810 -14230 73916 113649 -6947 11373 75414 -39305 -37281
6604c7281o8845k947k4100K44118N8307j10007j9067r8939k49221J3973O8978
$$ -37281 -106126 -109073 -133173 110945 169252 59245 40178 -58761 -307982 -294009 -225031
6593b25031J36973N4213p3281K6258J09514m3967j10060j47491N6616K98720N651
$$ -225031 -88058 -33845 -107126 -80868 28646 -15321 -125381 -272872 -216256 82464 88115
6582H8115r4597j09009Q2056J41036N5940M7180J4203j53279R8566o453n7759
$$ 88115 -6482 -115491 -33435 107601 163541 210721 224924 71645 170211 163758 105999
6571A05999M3391p6537J13455R6595j3789l27377j36936L40503K3797j11103m99
$$ 105999 149390 72853 186308 282903 269114 -58263 -195199 145304 169101 57998 57499
6560E7499M4071M4466J6047j9045J22993q0018P4131k15321j49972J40907j48691
$$ 57499 101570 146036 162083 143038 266031 186013 260144 44823 -105149 35758 -112933
6549a12933J05046J33973J62690j26163k22317l4m0811n231J47427J68340k53148
$$ -112933 -7887 126086 288776 162613 -59704 -59738 -100549 -105780 41647 209987 -43161
6538d3161K0871P7181K5263j07339k87327r8460J07521K54599K2233J7832m4340
$$ -43161 -22290 54891 80154 -27185 -314512 -412972 -305451 -50852 -28619 -10787 -55127
6527e5127J47554L5487j11776k8277L3955r2350J81334j25239p7939J00213k5648
$$ -55127 92427 127914 16138 -12139 21816 -70534 110800 -14439 -92378 7835 -17813
6516a7813j34304Q824K0148j8347K6368K60481O4508n8675o4612m4990k7640m0910
$$ -17813 -152117 -143293 -123145 -141492 -115124 145357 209865 151190 86578 41588 13948 -26962
6504b6962m2138R969j26913q655K8325O0790K42319k59j19150N0028K8247O0630
$$ -26962 -69100 -59131 -186044 -194699 -166374 -105584 136735 136476 17326 67354 95601 156231
6492A56231l621M373M1853k8919k19382J32720N3714l0735j60659m9293q0821
$$ 156231 152610 156983 198836 169917 -49465 83255 136969 106234 -54425 -103718 -184539
6481a84539J83189N4529k00922N1870J08692J64340j33804j50585R0154P7984
$$ -184539 -1350 53179 -147743 -95873 12819 177159 43355 -107230 -17076 60908
6471F0908j76962r3750M6507J87575j2326J97164j2617j50425j838q1955p1448
$$ 60908 -116054 -209804 -163297 24278 11952 209116 196499 46074 44236 -37719 -109167
6460a09167K07414M253M2885o5702L9596Q4190J01622q4966j31315j14258J56932
$$ -109167 98247 102500 145385 79683 119279 203469 305091 220125 88810 -25448 131484
6449A31484j07825L015r5614k0314k427J8763J05654M9907n1812J13399j03645
$$ 131484 23659 26674 -68940 -89254 -91681 -72918 32736 82643 30831 144230 40585
6438D0585M1481L8622O250J7298q1773K76473J3932J261n6294k96040R6347R0967
$$ 40585 82066 120688 126938 144236 62463 338936 352868 354129 297835 1795 98142 189109
6426A89109j13322m0845m0479k96231L3863K11421O5911O1026m3371J87420m8647
$$ 189109 75787 34942 -5537 -301768 -267905 -56484 9427 70453 27082 214502 165855
6415A65855r2990J38496L7085j29391n6928j86540K05153O1381k07989N207K45340
$$ 165855 72865 211361 248446 119055 62127 -124413 80740 142121 -65868 -60661 184679
6404A84679p048J0465K3402J38849j58447j86849M1975o5861K14637J11528j40284
$$ 184679 177631 188096 211498 350347 191900 5051 47026 -18835 195802 307330 167046
6393A67046n4993R7681k06749J24J62748M9509r3172M5671R7138j12869J36724
$$ 167046 112053 209734 2985 3109 165857 215366 122194 167865 265003 152134 288858
6382B88858j24493J4198j40593k15486L34608q2876j48131J57979P9175J10836
$$ 288858 164365 178563 37970 -177516 157092 74216 -73915 84064 163239 274075
6372B74075k7402J57993k64870j60847M7237n2905P6958q2398K43300K10832p3461
$$ 274075 246673 404666 139796 -21051 26186 -26719 50239 -32159 211141 421973 348512
6361C48512K0902j69673k13081p8993R3271J22063N6518J16209m2953L8741o9153
$$ 348512 369414 199741 -13340 -92333 938 123001 179519 295728 252775 291516 222363
6350B22363k13150J09571J03091j50603J28279m2458j16322Q3011N6209k05351
$$ 222363 9213 118784 221875 71272 199551 157093 40771 123782 179991 -25360
6340b5360k5551K01949R0312J291L7685k37026J26234J76561j39852k9722M5465
$$ -25360 -50911 151038 241350 242641 280326 43300 169534 346095 206243 176521 221986
6329B21986R8538j40602k2805J56036J02479l21849J45275L9493o9500L1959q9386
$$ 221986 320524 179922 157117 313153 415632 93783 239058 278551 209051 241010 151624
6318A51624Q9838o7766M0463J31341j55214M2655L5994J4398k18841j10052J24410
$$ 151624 241462 173696 214159 345500 190286 232941 268935 283333 64492 -45560 78850
6307G8850J48659Q966J09323Q1012L3089j90948k04683K31555K10644j71857j57509
$$ 78850 227509 236475 345798 426810 459899 268951 64268 295823 506467 334610 177101
6296A77101J5457Q8779P7j15556n308K02166k0203P5327j7341k17307J31666q8968
$$ 177101 192558 281337 281414 165858 160550 362716 342513 417840 400499 183192 314858 225890
6284B25890J959J35477N8329r9478M5794j08699q4634J79062K03125k61778r5516
$$ 225890 227849 363326 421655 322177 367971 259272 174638 353700 556825 295047 199531
6273A99531k9138K14602j62543k0314K37405k0144K4586r2124p0656j74522J99416
$$ 199531 170393 384995 222452 202138 439543 419399 443985 351861 281205 106683 306099
6262C06099m1186J02365n1618o4571L9158o3177O4009N5187o1431J56764M657
$$ 306099 264913 367278 315660 251089 290247 227070 291079 346266 284835 441599 446256
6251D46256j2912L0190R607J7024K860R4523j54902j9273n6187P887k17l5468
$$ 446256 433344 463534 473141 490165 493025 587548 432646 413373 357186 365073 364856 329388
6239C29388J05268r6224l5670p6449J39026J93541j72722R302Q8163K7539o740
$$ 329388 434656 338432 302762 226313 365339 558880 386158 395460 483623 511162 504422
6228E04422j58145j57400Q6301o3950J15032R2812J4779j04727J0272l7118J3396
$$ 504422 346277 188877 275178 211228 326260 419072 433851 329124 339396 302278 315674
6217C15674l3070K07656n4393Q5642j06471l15196J25718L21704k0930l8806j75659
$$ 315674 282604 490260 435867 521509 415038 99842 225560 547264 526334 487528 311869
6206C11869q1891o5649K39062P6598q9393L011J2314K7199k25949L0850J79668
$$ 311869 229978 164329 403391 479989 390596 393607 405921 433120 207171 238021 417689
6195D17689J2885n5308J38343k2273r9948O1302O5981j33498J22570p3716N2151
$$ 417689 430574 375266 513609 491336 391388 452690 518671 385173 507743 434027 486178
6184D86178q0033j65978P3452R3213j30197J56022o8227J01439M4714K7509r0101
$$ 486178 406145 240167 313619 406832 276635 432657 364430 465869 510583 538092 447991
6173D47991q8674r9449J54994n4590p6696K61500j09724Q3496O8257Q0629j96192
$$ 447991 359317 259868 414862 360272 283576 545076 435352 518848 587105 667734 471542
6162D71542J38232N9544o6899j20009J55468K68450p5308r5680n0801K76882O2585
$$ 471542 609774 669318 602419 482410 637878 906328 831020 735340 684539 961421 1024006
6151A024006j18795N2364J57014j01450j8352L76j79749r0997J7209L6577J71290
$$ 1024006 905211 957575 1114589 1013139 994787 995163 815414 724417 741626 778203 949493
6140I49493P5743q8550J19601J87367j2294M9469Q6072M0854j09311l481k4517
$$ 949493 1025236 936686 1056287 1243654 1231360 1280829 1366901 1407755 1298444 1294963 1270446
6129A270446J44019J40870P3879L95328J90384k9021J76049K07045L70248M31326
$$ 1270446 1414465 1555335 1629214 2024542 2214926 2185905 2361954 2568999 2939247 3370573
6119C370573M14934K61992n0554k53681l95844l5836o7844j32253j54136K49561
$$ 3370573 3785507 4047499 3996945 3743264 3347420 3311584 3243740 3111487 2957351 3206912
6109C206912K38786J42771L37171J84870L3224n00836n06781k17900k81386l81066
$$ 3206912 3445698 3588469 3925640 4110510 4143734 3642898 3136117 2918217 2636831 2255765
6099B255765k45968M2729M4497j50701J0640o3881j26500Q7257o2434J08410n9741
$$ 2255765 2009797 2052526 2097023 1946322 1956962 1893081 1766581 1853838 1791404 1899814 1840073
6088A840073j39867j08329P5355p2088P2991K16L28161j3606J8175L30173k31303
$$ 1840073 1700206 1591877 1667232 1595144 1668135 1668351 1996512 1982906 2001081 2331254 2099951
6077B099951K07047J99629J66577K03103J66514K5527L24043K84236M96485N62164
$$ 2099951 2306998 2506627 2673204 2876307 3042821 3068348 3392391 3676627 4173112 4735276
6067D735276O15842l5631j12889l95474l31803j98848k51720L0519L19194M39261
$$ 4735276 5351118 5315487 5202598 4807124 4475321 4276473 4024753 4055272 4374466 4813727
6057D813727L46792M14421J60443Q59l00447o31106p47725m53630k67461k44313
$$ 4813727 5160519 5574940 5735383 5736242 5435795 4804689 4056964 3603334 3335873 3091560
6047C091560j67564p4821j70756l03284m209j03662j26444M5491N2708r5767R9724
$$ 3091560 2923996 2849175 2678419 2375135 2370926 2267264 2140820 2186311 2239019 2143252 2242976
6036B242976J17262j74985j31253J07663Q1330j00179J85910k2041r5293M8997
$$ 2242976 2360238 2185253 2054000 2161663 2242993 2142814 2328724 2306683 2211390 2260387
6026B260387J63800n1425m8153M2310J27055Q6820j06853j9758K18243m7645r963
$$ 2260387 2424187 2372762 2324609 2366919 2493974 2580794 2473941 2454183 2672426 2624781 2614818
6015B614818K5321L6803j85606O0967J41844J44219n74J51438K15740R1614j4113
$$ 2614818 2640139 2676942 2491336 2552303 2694147 2838366 2837792 2989230 3204970 3296584 3282471
6004C282471K39345K45087K5749J66043Q861M618K90846J21568Q4469K10877L27699
$$ 3282471 3521816 3766903 3792652 3958695 3967556 3972174 4263020 4384588 4469057 4679934 5007633
5993E007633k4531K06350J90708K9970J07896N0982M40205M78442R3981M20324
$$ 5007633 4983102 5189452 5380160 5410130 5518026 5569008 6009213 6487655 6581636 7001960
5983G001960L00376K24021N08461J45530L16678J05225K29127J36884K71951J95447
$$ 7001960 7302336 7526357 8034818 8180348 8497026 8602251 8831378 8968262 9240213 9435660
5973I435660j62424J53263K29512K25954O9511J59481L77146L29802M26960M04360
$$ 9435660 9273236 9426499 9656011 9881965 9951476 10110957 10488103 10817905 11244865 11649225
5963A1649225M11552O12211M88398J56167N77557M01453N51996M92185K99885
$$ 11649225 12060777 12672988 13161386 13317553 13895110 14296563 14848559 15340744 15640629
5954A5640629M95416M29852K68373K17787J68662L49366R4968q7592K13897K47478
$$ 15640629 16136045 16565897 16834270 17052057 17220719 17570085 17665053 17577461 17791358 18038836
5944A8038836L12005L16498M79797O89996N13729O18590J152911R94908R08188
$$ 18038836 18350841 18667339 19147136 19837132 20350861 20969451 22122362 23117270 24025458
5935B4025458Q69537R46659J033305Q51729M25170M81710P52687Q14329R53603
$$ 24025458 24894995 25841654 26874959 27726688 28151858 28633568 29386255 30200584 31154187
5926C1154187Q28538J262929J511581J537606J962887K403111K984223L410405
$$ 31154187 31982725 33245654 34757235 36294841 38257728 40660839 43645062 47055467
5918D7055467M194681N369632O354353P409690Q600593Q450975O995090M011641
$$ 47055467 51250148 56619780 62974133 70383823 78984416 87435391 94430481 98442122
5910I8442122r9875l941796o162010o637495o257183n848292n231928m494841
$$ 98442122 98342247 94400451 88238441 81600946 75343763 69495471 64263543 59768702
5902E9768702m287919l851625k986026k214825j896395j302239j549057j598491
$$ 59768702 55480783 51629158 48643132 46428307 44531912 43229673 41680616 40082125
5894D0082125k199869k769254k925248k684190k105450j493747r14002m47105
$$ 40082125 37882256 35113002 32187754 29503564 27398114 25904367 24990365 24543260
5886B4543260o85589p03468r42044j057114j237931j420881j200893j391420j230803
$$ 24543260 23857671 23154203 22212159 21155045 19917114 18496233 17295340 15903920 14673117
5877A4673117p32094q04849p37677o13735l55384n13825o08998n32562m06719
$$ 14673117 13941023 13136174 12398497 11784762 11429378 10915553 10306555 9773993 9367274
5868I367274n60227n82568l09035m52852j80620k03593l93818k61984k08182j43501
$$ 9367274 8807047 8224479 7915444 7462592 7281972 7078379 6684561 6422577 6214395 6070894
5858F070894j35416k18718k20232K9111o8565j44549j44020k66701J05024o9028
$$ 6070894 5935478 5716760 5496528 5525639 5457074 5312525 5168505 4901804 5006828 4937800
5848D937800k86939q4250k54448j37500o4237k80743P720j64239K0686k39256
$$ 4937800 4650861 4566611 4312163 4174663 4110426 3829683 3837403 3673164 3693850 3454594
5838C454594K35627j04568k14083j85430q7779r5543O6959N0430j43177k12864
$$ 3454594 3690221 3585653 3371570 3186140 3098361 3002818 3069777 3120207 2977030 2764166
5828B764166j59667K8438j33852Q7748J71211O3384k20141j05942P3103Q8657
$$ 2764166 2604499 2632937 2499085 2586833 2758044 2821428 2601287 2495345 2568448 2657105
5818B657105r8097k4436q4282j67628L6020l5398P0635J620K8129l74160m0917
$$ 2657105 2559008 2534572 2450290 2282662 2318682 2283284 2353919 2355539 2383668 2009508 1968591
5807A968591R9965j66599J6309J51743K8665k33381j75798N9991L08872J13980
$$ 1968591 2068556 1901957 1918266 2070009 2098674 1865293 1689495 1749486 2058358 2172338
5797B172338n916J64828j6030j15196m0218o5915n1509j53111J75576J24153j9380
$$ 2172338 2166422 2331250 2315220 2200024 2159806 2093891 2042382 1889271 2064847 2189000 2169620
5786B169620k1137P0577p8644r1705J00739J13137J90852j69914j2427J5862K3963
$$ 2169620 2148483 2219060 2140416 2048711 2149450 2262587 2453439 2283525 2271098 2286960 2310923
5775B310923j3559M2559K9936L5127N5026p4166K81179L07070L36866J26440N01098
$$ 2310923 2297364 2339923 2369859 2404986 2460012 2385846 2667025 2974095 3310961 3437401 3938499
5764C938499N47108J51075L18689J71058k45702n76548m17016k53770k25788o3472
$$ 3938499 4485607 4636682 4955371 5126429 4880727 4304179 3887163 3633393 3407605 3344133
5754C344133l29379l26586l08878j80795K08276q7522j332J63614j22497J67664
$$ 3344133 3014754 2688168 2379290 2198495 2406771 2319249 2317917 2481531 2359034 2526698
5744B526698l0762j3219R4764L20326K46349n10L28021M16616P45571M82225J16803
$$ 2526698 2495936 2482717 2577481 2897807 3144156 3143646 3471667 3888283 4633854 5116079 5232882
5733E232882l5938m70770n28842m90152l55864m63113j46791j90551j27723p4239
$$ 5232882 5196944 4726174 4197332 3707180 3351316 2888203 2741412 2550861 2423138 2348899
5723B348899k13991k7622K06313R6744J11586P5033N3917n5915j9000M43288J93192
$$ 2348899 2134908 2107286 2313599 2410343 2521929 2596962 2650879 2594964 2575964 3019252 3212444
5712C212444K74070K56794J00877j27563j12848l56996l57287k81603j63088j82276
$$ 3212444 3486514 3743308 3844185 3716622 3603774 3246778 2889491 2607888 2444800 2262524
5702B262524j34522r2744P9401k10434o8449J40825k3677K23806j35790l7889
$$ 2262524 2128002 2035258 2114659 1904225 1835776 1976601 1952924 2176730 2040940 2003051
5692B003051J15009L59054o4540j62733q361L78534K60926L49681L89757K08145
$$ 2003051 2118060 2477114 2412574 2249841 2241480 2620014 2880940 3230621 3620378 3828523
5682C828523p2135j07495k31034n09389l61522m14771j98375j66338p4734J14005
$$ 3828523 3756388 3648893 3417859 2908470 2546948 2132177 1933802 1767464 1692730 1806735
5672A806735q6164n0889q2782k40363P926R187O7121R2142j0001j61192j92821
$$ 1806735 1720571 1669682 1586900 1346537 1354463 1363650 1430771 1522913 1512912 1351720 1158899
5661A158899O097J53404Q9505o3340J32026O5619l83997j01211J13099q3061m9353
$$ 1158899 1164996 1318400 1407905 1344565 1476591 1542210 1158213 1057002 1170101 1087040 1037687
5650A037687j00362l0678K02416l1938k3592K05406k18381N6039J72908Q0678
$$ 1037687 937325 906647 1109063 1077125 1053533 1258939 1040558 1096597 1269505 1350183
5640A350183j51480o8713J18859M797M3325R6979L2895j31935R6541j46750R1316
$$ 1350183 1198703 1129990 1248849 1253646 1296971 1393950 1426845 1294910 1391451 1244701 1336017
5629A336017j2507n9265K7726o6932K7920L3183J7479J02435L9024J13310j0266
$$ 1336017 1323510 1264245 1291971 1225039 1252959 1286142 1303621 1406056 1445080 1558390 1548124
5618A548124L8624l0440N9762o104J71Q5004m4521J06443j0073j00496J79194
$$ 1548124 1586748 1556308 1616070 1609966 1610137 1695141 1650620 1757063 1746990 1646494 1825688
5607A825688J81376q0381j54265K73141M6889j80603J61412J63721J84930J37290
$$ 1825688 2007064 1926683 1772418 2045559 2092448 1911845 2073257 2236978 2421908 2559198
5597B559198l0865R8668K37112k1796M4899J40501R8976K9034M6528L87648J39185
$$ 2559198 2528333 2627001 2864113 2842317 2887216 3027717 3126693 3155727 3202255 3589903 3729088
5586C729088J10959j45233j7628K91566J07674L140r4927j78770j79364J01508
$$ 3729088 3840047 3694814 3677186 3968752 4076426 4079566 3984639 3805869 3626505 3728013
5576C728013J83017O587Q5772K25500J89085l5099O4533K04412J65102K01213
$$ 3728013 3911030 3917617 4003389 4228889 4417974 4382875 4447408 4651820 4816922 5018135
5566E018135K56271M20629J71608K81601L10935K12402K4428N3962o8967k52912
$$ 5018135 5274406 5695035 5866643 6148244 6459179 6671581 6696009 6749971 6681004 6428092
5556F428092j38956r8749M1922J12532l59553r6789j48197J0592J67085J18772
$$ 6428092 6289136 6190387 6232309 6344841 5985288 5888499 5740302 5750894 5917979 6036751
5546F036751K47849K39403K66185K98191J45724J05065N58056K42353J33021L51009
$$ 6036751 6284600 6524003 6790188 7088379 7234103 7339168 7897224 8139577 8272598 8623607
5536H623607J08539O2579p3969l25886p1092k50698l56538J58208R0491j38622
$$ 8623607 8732146 8794725 8720756 8394870 8323778 8073080 7716542 7874750 7965241 7826619
5526G826619j29087k79456N7175k7817k9838N936J25333M09250R8108L45283L84606
$$ 7826619 7697532 7418076 7475251 7447434 7417596 7423532 7548865 7958115 8056223 8401506 8786112
5515H786112m5258K09336K97504K67229K49364O3549M08332K40976M84394N01544
$$ 8786112 8740854 8950190 9247694 9514923 9764287 9827836 10236168 10477144 10961538 11463082
5505A1463082J23281j29571k84118l31647m32255j57541o1738l64740Q0541Q3206
$$ 11463082 11586363 11456792 11172674 10841027 10408772 10251231 10189493 9824753 9905294 9988500
5495I988500K9086j4156J40627M17454N5035Q7311R0573L22823J73211J70188
$$ 9988500 10017586 10003430 10144057 10561511 10616546 10703857 10794430 11117253 11290464 11460652
5485A1460652N20685L8271n1771J35808l615R6506n0444K70765J42548K87229
$$ 11460652 11981337 12019608 11967837 12103645 12100030 12196536 12146092 12416857 12559405 12846634
5475A2846634M10748L24678M57607M40183O03419M86194N35753P61278P90682
$$ 12846634 13257382 13582060 14039667 14479850 15083269 15569463 16105216 16866494 17657176
5466A7657176J147650J406317J588643J804912K092490K485535L065697L672518
$$ 17657176 18804826 20211143 21799786 23604698 25697188 28182723 31248420 34920938
5458C4920938N096824O266681O379059M950162K171250j083764l327911l112297
$$ 34920938 40017762 46284443 52663502 57613664 59784914 58701150 55373239 52260942
5450E2260942j885077k60274J549689K718275K714052J564249m39255j979073
$$ 52260942 50375865 50115591 51665280 54383555 57097607 58661856 58222601 56243528
5442E6243528k541887k035188j083149m40057L42161J702635K315776K759281
$$ 56243528 53701641 51666453 50583304 50143247 50485408 52188043 54503819 57263100
5434E7263100K430149Q34267j769800m238341m889080m292505k871996j674512
$$ 57263100 59693249 60527516 58757716 54519375 49630295 45337790 42465794 40791282
5426D0791282r15095k73330J26737N82368P58671m5783j453419l009709m268321
$$ 40791282 39876187 39602857 39729594 40311962 41070633 41024850 39571431 36561722 32293401
5417C2293401m232538l858266k592464j977212j746744j375297j259655j083471
$$ 32293401 28060863 24202597 21610133 19632921 17886177 16510880 15251225 14167754
5409A4167754o74926p11142p57575m14550m75213m52842k27279j32376J17201
$$ 14167754 13492828 12781686 12024111 11609561 11134348 10681506 10454227 10321851 10439052
5400A0439052M2289j49262o5514L15518N14432J72909J62836q2507n89622p54677
$$ 10439052 10481341 10332079 10266565 10582083 11096515 11269424 11432260 11349753 10760131 10005454
5390A0005454n66044n45087n49348l46671m61288l49309k79668k59673J22054
$$ 10005454 9439410 8894323 8344975 7998304 7537016 7187707 6908039 6648366 6770420
5381F770420k40666J94997k32806n7723r1731j00647J35396N8095L28378M96579
$$ 6770420 6529754 6724751 6491945 6434222 6342491 6241844 6377240 6435335 6763713 7260292
5371G260292K29759J50671k33742l22738p60093m81111j25960m60883k60531j52491
$$ 7260292 7490051 7640722 7406980 7084242 6324149 5843038 5717078 5256195 4995664 4843173
5361D843173j39475k02089o3618m224j27303O223k74712j66236r3583k95121J37843
$$ 4843173 4703698 4501609 4437991 4433767 4306464 4312687 4037975 3871739 3778156 3483035 3620878
5350C620878J0351M4348j9220o9198j20261J17336L1270L8423j7722r7079P9488
$$ 3620878 3631229 3675577 3656357 3587159 3466898 3584234 3615504 3653927 3636205 3539126 3618614
5339C618614M7911j83745q9260J67740R760j10867K05393j14966q5621q5269K9282
$$ 3618614 3666525 3482780 3393520 3561260 3571020 3460153 3665546 3550580 3464959 3379690 3408972
5328C408972j32064N8832P5878L4920J6763j17182K01561J9372n5959O6190K66551
$$ 3408972 3276908 3335740 3411618 3446538 3463301 3346119 3547680 3567052 3511093 3577283 3843834
5317C843834p0301n3340p9637K2905K26737K19827m7759k09481R5820K68349K50062
$$ 3843834 3773533 3720193 3640556 3663461 3890198 4110025 4062266 3852785 3948605 4216954 4467016
5306D467016m000Q5659k01169K05059K09494P0235K57532j7931J90224K7446R90
$$ 4467016 4463016 4548675 4347506 4552565 4762059 4832294 5089826 5071895 5262119 5289565 5290555
5295E290555J48242K39991r2859J0341J79164R4237K44411N03088R4015j08586
$$ 5290555 5438797 5678788 5585929 5596270 5775434 5869671 6114082 6617170 6711185 6602599
5285F602599J3273K12036K91704L82500J13467N5212K02353J17025r7996J39026
$$ 6602599 6615872 6827908 7119612 7502112 7615579 7670791 7873144 7990169 7892173 8031199
5275H031199N48966K73962K44788J35345J53091M28111N05863J00933L14579K14352
$$ 8031199 8580165 8854127 9098915 9234260 9387351 9815462 10321325 10422258 10736837 10951189
5265A0951189M85135O50642N76569K81752L80218N92404O16273P98010Q27575
$$ 10951189 11436324 12086966 12663535 12945287 13325505 13917909 14534182 15332192 16159767
5256A6159767O52296P86138P31168Q84726R12381J135746R75333J100634J256981
$$ 16159767 16812063 17598201 18329369 19214095 20126476 21262222 22237555 23338189 24595170
5247B4595170J387590J396745J711406J833797K181415K680786K788961L743356
$$ 24595170 25982760 27379505 29090911 30924708 33106123 35786909 38575870 42319226
5239D2319226M516486N233092O389043Q220269J0182103J2326048J4315799J5893920
$$ 42319226 46835712 52068804 58457847 66678116 76860219 89186267 103502066 119395986
5231A19395986J5654370J4012874J0737088N286232j431749n543785r615481j5508855
$$ 119395986 135050356 149063230 159800318 165086550 163654801 158111016 148495535 132986680
5223A32986680j7625318j5787881j4235883j2767011j0346179q090665o288884
$$ 132986680 115361362 99573481 85337598 72570587 62224408 54133743 47844859
5216D7844859m946896l963954l445870l243569k570454k067710j733093j621915
$$ 47844859 42897963 38934009 35488139 32244570 29674116 27606406 25873313 24251398
5208B4251398j351196j228796r69489p42919m71901m21717p52684n81308o57936
$$ 24251398 22900202 21671406 20701917 19958998 19487097 19065380 18312696 17731388 17073452
5199A7073452n07425l60297l61474l54662m27414j07223L3757j07882J9711K51261
$$ 17073452 16566027 16205730 15844256 15489594 15062180 14954957 14988714 14880832 14900543 15151804
5189A5151804o393K88830L05524L81586N12931P42785J425862J898094K196678
$$ 15151804 15145411 15434241 15739765 16121351 16634282 17377067 18802929 20701023 22897701
5180B2897701K363597J596085K02103j197781j111239n36137L39822P21984L11489
$$ 22897701 25261298 26857383 27059486 25861705 24750466 24214329 24554151 25276135 25587624
5171B5587624n30847j715359j934939j539550j219539p96571q93616l64990K19560
$$ 25587624 25056777 23341418 21406479 19866929 18647390 17850819 16957203 16592213 16811773
5162A6811773m2363K06813N07990J239718J499664J883823J136609L98683r60939
$$ 16811773 16769410 16976223 17484213 18723931 20223595 22107418 23244027 23642710 22681771
5153B2681771j822817j256380k38805P22604Q09538P50366k65255j442182k127717
$$ 22681771 20858954 19602574 19363769 20086373 20895911 21646277 21381022 19938840 17811123
5144A7811123k212995j645983j302218p96920p65848n78166o74049p24222l00687
$$ 17811123 15598128 13952145 12649927 11853007 11087159 10508993 9834944 9110722 8810035
5135H810035j62475o7753j81135Q557j30488k73468l07363m45864m15939p9864
$$ 8810035 8647560 8579807 8398672 8407229 8276741 8003273 7695910 7250046 6834107 6754243
5125F754243j62167k69213k33288j17443k17063k74232j39599k20291j07628l73340
$$ 6754243 6592076 6322863 6089575 5972132 5755069 5480837 5341238 5120947 5013319 4639979
5115D639979j91237j12440L0739M616k09249j19522l1730k41764n7706O4068j00406
$$ 4639979 4448742 4336302 4367041 4371657 4162408 4042886 4011156 3769392 3711686 3775754 3675348
5104C675348j23882M694K74575L4507k1839j45672l84513j44617Q5285l21392
$$ 3675348 3551466 3556160 3830735 3865242 3843403 3697731 3313218 3168601 3253886 2932494
5094B932494k69377j58354J66712L38097K2515j58554l92100N2157k11566N3241
$$ 2932494 2663117 2504763 2671475 3009572 3032087 2873533 2481433 2533590 2322024 2375265
5084B375265k44098j01810P0899l764j4007O3111j29602L7583k98512j91662m458
$$ 2375265 2131167 2029357 2100256 2096492 2082485 2145596 2015994 2053577 1755065 1563403 1558945
5073A558945k66525J73918Q7992P0089p4938N9932M3237L4313k48184o0499J44145
$$ 1558945 1292420 1466338 1554330 1624419 1549481 1609413 1652650 1686963 1438779 1378280 1522425
5062A522425J63045j63935o9651K3370j14563J66769O780K6998o8864j65413O4909
$$ 1522425 1685470 1521535 1451884 1475254 1360691 1527460 1534240 1561238 1492374 1326961 1391870
5051A391870J10233l8788l23625R3335m1691j57998J84420L7625n7933K9158m6272
$$ 1391870 1502103 1463315 1139690 1233025 1191334 1033336 1217756 1255381 1197448 1226606 1180334
5040A180334j18733k19698J652M5959L4155n9539j35797R8446L1766J2866j82089
$$ 1180334 1061601 841903 843555 889514 923669 864130 728333 826779 858545 871411 689322
5029F89322j55026J72366J30307J3008j67932O6217J16211J1005k69854J10706
$$ 689322 534296 706662 836969 849977 682045 748262 864473 875478 605624 716330
5019G16330l08883K27109J81519j79531K1424q4188K73976r2537J41912j99986
$$ 716330 407447 634556 816075 636544 657968 573780 847756 755219 897131 697145
5009F97145k78760L25325j61793M7101L96635l3740l12353j51611J21612O6892
$$ 697145 418385 743710 581917 629018 1025653 991913 679560 527949 649561 716453
4999G16453j11412j99517K06696R7906k25097M1432Q2143J30209j01588j10792
$$ 716453 605041 405524 612220 710126 485029 526461 608604 738813 637225 526433
4989E26433r6709O494K25705l7431N5827K3399q4381J08392K2668l1262p6941
$$ 526433 429724 436218 661923 624492 680319 703718 619337 727729 750397 719135 642194
4978F42194j08386o679l9435J33592K02540n6829m4926k79274K3184K66426J00910
$$ 642194 533808 527129 487694 621286 823826 766997 722071 442797 465981 732407 833317
4967H33317P3381j44282j15788o8836l8983J00210k4325J7549k13489J4757K31160
$$ 833317 906698 762416 646628 577792 538809 639019 614694 632243 418754 433511 664671
4956F64671p9787J60626j28255J29355j19205q3869p6274k7491M6596m707J65276
$$ 664671 584884 745510 617255 746610 627405 543536 467262 439771 486367 481660 646936
4945F46936J67192n4717j5101j50880M4145l7615K0873k7851L2420q703J98869
$$ 646936 814128 759411 744310 593430 637575 599960 620833 592982 625402 616699 815568
4934H15568q1738p3146J25146J13273J80066k0047K05236J90368j55134N6760
$$ 815568 733830 660684 785830 899103 1079169 1059122 1264358 1454726 1299592 1356352
4924A356352k9787j71807J58068J98170J02609m49166k70260J9166J42490k62935
$$ 1356352 1326565 1154758 1312826 1510996 1613605 1164439 894179 913345 1055835 792900
4914G92900q6095J62677k13557p813P8360Q3681n7794j25875K0200R1979M0010
$$ 792900 706805 869482 655925 648112 726472 810153 752359 626484 646684 738663 778673
4903G78673j67467l5196K4444k3569K334P158j2932J37271J42466k38896j45597
$$ 778673 611206 576010 600454 576885 579219 586377 573445 710716 853182 614286 468689
4892D68689M2406K00747J87728q7315J02460o0326k5935m4854j84035q7133K33360
$$ 468689 511095 711842 899570 812255 914715 854389 828454 783600 599565 512432 745792
4881G45792j6037q2544K7240J10419j51661N435n7607P773K27212J16376o4303
$$ 745792 729755 647211 674451 784870 633209 638644 581037 588810 816022 932398 868095
4870H68095k47836J99470M2407j27493q1708L7370J51996k4758P4483J04987j26035
$$ 868095 620259 819729 862136 734643 652935 690305 842301 817543 892026 997013 870978
4859H70978j34547j75482L23295j16285k24287J45876J4640m3581o0508K24414
$$ 870978 736431 560949 884244 767959 543672 689548 704188 660607 600099 824513
4849H24513P7901M3064R7894q0395J01079r2672J31172J23779r4003J285k2618
$$ 824513 902414 945478 1043372 962977 1064056 971384 1102556 1226335 1132332 1133617 1110999
4838A110999J79J07235O396J04524J00635R2957K520o9102R307j483j49871L4360
$$ 1110999 1111178 1218413 1224809 1329333 1429968 1522925 1525445 1456343 1465650 1464167 1314296 1348656
4826A348656K03931J22865j8635k55181J08445J42467R5331j43543K30032k9012
$$ 1348656 1552587 1675452 1656817 1401636 1510081 1652548 1747879 1604336 1834368 1805356
4816A805356K19381O9851O6837j30120Q6893n6361N2433N1873m7490P7988J05909
$$ 1805356 2024737 2094588 2161425 2031305 2118198 2061837 2114270 2166143 2118653 2196641 2302550
4805B302550J47929J13780j78520m6836K11652J47166N2871j5542J03083Q8147
$$ 2302550 2450479 2564259 2385739 2338903 2550555 2697721 2750592 2735050 2838133 2926280
4795B926280J07720j03343L84148r130K02459J17233l3481J60797J81656K66676
$$ 2926280 3034000 2930657 3314805 3305675 3508134 3625367 3591886 3752683 3934339 4201015
4785D201015K63482J97962J24780J87908M04900L96030L75122M46040P31570Q40412
$$ 4201015 4464497 4662459 4787239 4975147 5380047 5776077 6151199 6597239 7328809 8169221
4775H169221P37654L08152K12336n1429m32012m81151k10361J55823O1664K96536
$$ 8169221 8906875 9215027 9427363 9375934 8943922 8462771 8252410 8408233 8469897 8766433
4765H766433K84594M32973K99830M78366P16747P40258Q03782Q77007J309896
$$ 8766433 9051027 9484000 9783830 10262196 10978943 11719201 12522983 13399990 14709886
4756A4709886J247001J441290J435275J442802Q21986M03422J29363l5844K5573
$$ 14709886 15956887 17398177 18833452 20276254 21098240 21501662 21631025 21595181 21620754
4747B1620754P3737j52581j44149r3224J2772j57795k78003l74854m6791o5351
$$ 21620754 21694491 21541910 21397761 21304537 21317309 21159514 20881511 20506657 20459866 20394515
4737B0394515j87058K41835K70280M53486M91659J66453n81486q55037m56760
$$ 20394515 20207457 20449292 20719572 21173058 21664717 21831170 21249684 20394647 19937887
4728A9937887j49363l6256j2713k91529q9607k39081m05778k96416n37309r87818
$$ 19937887 19788524 19752268 19739555 19448026 19358419 19119338 18713560 18417144 17879835 16892017
4718A6892017r04535p28118o67681q53082p60067r94467p17841m52002o97533
$$ 16892017 15987482 15259364 14591683 13738601 12978534 11984067 11266226 10814224 10116691
4709A0116691l83141l97819n20205m16939l49670n76979n48478l88046k82088
$$ 10116691 9733550 9335731 8815526 8398587 8048917 7471938 6923460 6535414 6253326
4700F253326k06300j85004l534r8550m48979l7849l26382l60835P3665k03748
$$ 6253326 6047026 5862022 5858488 5759938 5310959 5273110 4946728 4585893 4659558 4455810
4690D455810k0532j33707k28508r563J55992l8976l88496k9665j66620k07492
$$ 4455810 4435278 4301571 4073063 4063500 4219492 4180516 3792020 3762355 3595735 3388243
4680C388243o6250r9130q3015J36739k83372n280j6658J24549J37458k82941j12658
$$ 3388243 3321993 3222863 3139848 3276587 2993215 2987935 2971277 3095826 3233284 2950343 2837685
4669B837685k51498J73967n5334j02566k00156J7541j07825L5945M07856J61811
$$ 2837685 2586187 2760154 2704820 2602254 2402098 2419639 2311814 2347759 2755615 2917426
4659B917426k67426p0203R354L4742K6122j9136J89496P3493k19189q9934K18458
$$ 2917426 2650000 2579797 2589151 2623893 2650015 2630879 2820375 2893868 2674679 2584745 2803203
4648B803203j57540J339J17744O4947o8563r5376R6440O4713K2796k20218L3628
$$ 2803203 2645663 2647002 2764746 2829693 2761130 2665754 2762194 2826907 2849703 2629485 2663113
4637B663113L28642j10825j4613K32729J90781k22009N7534N6955q5312M30349
$$ 2663113 2991755 2880930 2866317 3099046 3289827 3067818 3125352 3182307 3096995 3527344
4627C527344J94935Q9710J09207j8433N0214k4182P6943K32442J04022J64816
$$ 3527344 3722279 3811989 3921196 3902763 3952977 3928795 4005738 4238180 4342202 4507018
4617D507018J82959K86259K39264K59372K90199K15978K06403M76510J56594R2387
$$ 4507018 4689977 4976236 5215500 5474872 5765071 5981049 6187452 6663962 6820556 6912943
4607F912943L85210K79070K16362L98118K91153K29211l855L10970Q5494J8499
$$ 6912943 7298153 7577223 7793585 8191703 8482856 8712067 8708212 9019182 9104676 9123175
4597I123175M26356K74785J79553L97576K26484N0493j32657n67243n59655j04203
$$ 9123175 9549531 9824316 10003869 10401445 10627929 10678422 10545765 9978522 9418867 9314664
4587I314664j04136n8444J64974K57062M16618P89869N35678j06964j05115k35333
$$ 9314664 9210528 9152084 9317058 9574120 9990738 10780607 11316285 11209321 11104206 10868873
4577A0868873l06463k16387R440R8998j210J28469J52385l61312m50407q41811
$$ 10868873 10562410 10346023 10355463 10454461 10453251 10581720 10734105 10372793 9922386 9080575
4567I080575o65736n33621j44314l71057o3213j9831k8134J09381k25732n94155
$$ 9080575 8414839 7881218 7736904 7365847 7302634 7282803 7254669 7364050 7138318 6544163
4557F544163m22739m09998q85092m90220q3378j16789l29340k62341Q354k05322
$$ 6544163 6121424 5711426 4826334 4336114 4252736 4135947 3806607 3544266 3552620 3347298
4547C347298k82598j33386k06899o9565r5334P5968j35273j10372j10857j09939
$$ 3347298 3064700 2931314 2724415 2654850 2559516 2635484 2500211 2389839 2278982 2169043
4537B169043j0641O373L1000J9013k23605j31454P5974m6339K26216M89k22319
$$ 2169043 2158402 2164775 2195775 2214788 1991183 1859729 1935703 1889364 2115580 2116069 1893750
4526A893750l3160j16262m6059J23077p2600k57157r1945L16586j94125N873o820
$$ 1893750 1860590 1744328 1698269 1821346 1748746 1491589 1399644 1716230 1522105 1527978 1521158
4515A521158l0216L795k8750P9779j73554j7362P098m8917K3952j61922j7389
$$ 1521158 1490942 1494737 1465987 1545766 1372212 1354850 1361948 1313031 1336983 1175061 1157672
4504A157672L30190l2317j72376J75040j65837j84099J62819n5913m9369J43974
$$ 1157672 1487862 1455545 1283169 1458209 1292372 1108273 1271092 1215179 1165810 1309784
4494A309784P8944p4909r4090p8060k08789J25326K68454p0663p404k23540o2519
$$ 1309784 1388728 1313819 1219729 1141669 932880 1058206 1326660 1255997 1248593 1025053 962534
4483I62534K3411K7571L6817N7203m7982K8843j48801J69334M2628p2544l25753
$$ 962534 985945 1013516 1050333 1107536 1059554 1088397 939596 1108930 1151558 1079014 753261
4472G53261j46049M50965J50228r0686L041m8207j24538J64297j29364j2215K57033
$$ 753261 607212 1058177 1208405 1117719 1120760 1072553 948015 1112312 982948 970733 1227766
4461A227766O0799O246O786L297k32016r32J9475J05126K5243j59905m9082K38784
$$ 1227766 1288565 1294811 1301597 1304894 1072878 1071946 1091421 1196547 1221790 1061885 1012803 1251587
4449A251587P1821N4337J87059L0430P8658j24M07971J14459r4086O1709j85704
$$ 1251587 1323408 1377745 1564804 1595234 1673892 1673768 2081739 2196198 2102112 2163821 1978117
4438A978117j17672j8825k54291j50621J5159j76259q1379K45348J7306p1854
$$ 1978117 1860445 1841620 1587329 1436708 1451867 1275608 1194229 1439577 1456883 1385029
4428A385029p6100L8034j35710J10413K6493q7785q1404Q8731K1232l0530K33422
$$ 1385029 1308929 1346963 1211253 1321666 1348159 1260374 1178970 1267701 1288933 1258403 1491825
4417A491825o6904o8829q1865n8422n1508p1398K78333j04739j05141L10130N9393
$$ 1491825 1424921 1356092 1274227 1215805 1164297 1092899 1371232 1266493 1161352 1471482 1530875
4406A530875l2681M1931K30998J0161k01666p9107K80485J81108K5121K84198
$$ 1530875 1498194 1540125 1771123 1781284 1579618 1500511 1780996 1962104 1987225 2271423
4396B271423Q4609j93015K21478Q6585J0641K7854K73388j91216j87998j01344
$$ 2271423 2356032 2163017 2384495 2471080 2481721 2509575 2782963 2591747 2403749 2302405
4386B302405k66330p1866n7014k76420m2175M326K6500J165q2776j01674j8845
$$ 2302405 2036075 1964209 1907195 1630775 1588600 1592926 1619426 1620591 1537815 1436141 1417296
4375A417296M9339m4821J255q3841Q0431j67935J41765K09466q7897p7119Q8236
$$ 1417296 1466635 1421814 1423069 1339228 1419659 1251724 1393489 1602955 1515058 1437939 1526175
4364A526175p0412L00045j5915p8826P2114J21374o4356j54626m8575o0514J80672
$$ 1526175 1455763 1755808 1739893 1661067 1733181 1854555 1790199 1635573 1586998 1526484 1707156
4353A707156J22899K8332k10702k04265k17837J74714J37997j46124N9906Q911
$$ 1707156 1830055 1858387 1647685 1443420 1225583 1400297 1538294 1392170 1452076 1460987
4343A460987n8916K1361K6247j33263J01436J0222J01856N422N3280q1595J42169
$$ 1460987 1402071 1423432 1449679 1316416 1417852 1428074 1529930 1535352 1588632 1507037 1649206
4332A649206R2756p7176J44747Q2790j10543l7583K15140L3443K9181j6954J09062
$$ 1649206 1741962 1664786 1809533 1892323 1781780 1744197 1959337 1992780 2021961 2005007 2114069
4321B114069k51399L13845J51003l79706l00250J05765J20135j09822R4502P3656
$$ 2114069 1862670 2176515 2327518 1947812 1647562 1753327 1873462 1763640 1858142 1931798
4311A931798M2975m2026l6246j1793r0749j1881J28318p2681m4609J99126J31567
$$ 1931798 1974773 1932747 1896501 1884708 1793959 1782078 1910396 1837715 1793106 1992232 2123799
4300B123799l8289J44305P7410K0554K50246m3104o2924J10006j8660k10118j40793
$$ 2123799 2085510 2229815 2307225 2327779 2578025 2534921 2471997 2582003 2563343 2353225 2212432
4289B212432J41401J78450k71419R738J1666n8409J88501k80347J18923J78430
$$ 2212432 2353833 2532283 2260864 2270602 2282268 2223859 2412360 2132013 2250936 2429366
4279B429366n9632k63600r2625K39578K44625K2320J74197n9288N8966N0753k11017
$$ 2429366 2369734 2106134 2013509 2253087 2497712 2520032 2694229 2634941 2693907 2744660 2533643
4268B533643R2862M5659K11457J54042l5957K95076J92736p12J20655r816j46478
$$ 2533643 2626505 2672164 2883621 3037663 3001706 3296782 3489518 3488806 3609461 3599645 3453167
4257C453167L1469J5974j02386l844J81386P4894j4097J97066j0827J9337j53750
$$ 3453167 3484636 3500610 3398224 3394380 3575766 3650660 3636563 3833629 3822802 3842139 3688389
4246C688389J36248j5259Q1394K06348k8466K59852K05143K35774N0345j34401
$$ 3688389 3824637 3809378 3890772 4097120 4068654 4328506 4533649 4769423 4819768 4685367
4236D685367J90866R0028Q5670K10595J41559L45462J03636J4212O3476J02769
$$ 4685367 4876233 4966261 5051931 5262526 5404085 5749547 5853183 5867395 5930871 6033640
4226F033640L22372l4017Q5759L29106L02936P720K99840J10788J82893M35574
$$ 6033640 6356012 6321995 6407754 6736860 7039796 7047516 7347356 7458144 7641037 8076611
4216H076611J97595L98118O7433L07298j2653P3787L13591J62003J86548R1851
$$ 8076611 8274206 8672324 8739757 9047055 9034402 9108189 9421780 9583783 9770331 9862182
4206I862182L49039K05822J87512L40629L05616J11408L17350M43806K79992K60297
$$ 9862182 10211221 10417043 10604555 10945184 11250800 11362208 11679558 12123364 12403356 12663653
4196A2663653L21624K48353O17927N96273O14554P30431M03061L77874Q78638
$$ 12663653 12985277 13233630 13851557 14447830 15062384 15792815 16195876 16573750 17452388
4187A7452388P20533P23606P51928P76584R61999J011109J010189R47719J173948
$$ 17452388 18172921 18896527 19648455 20425039 21387038 22398147 23408336 24356055 25530003
4178B5530003J160670J590547J370795J387196J311660J624122J597093J791547
$$ 25530003 26690673 28281220 29652015 31039211 32350871 33974993 35572086 37363633
4170C7363633K053812K143948K617386K791443L453883M135424N368792O963564
$$ 37363633 39417445 41561393 44178779 46970222 50424105 54559529 59928321 66891885
4162F6891885P837775R238060J1149924J4405518J9591636K6197009L1317571
$$ 66891885 74729660 83967720 95117644 109523162 129114798 155311807 186629378
4155A86629378L0441482K0917292J937486j8874459l1734087l3645427k7151196
$$ 186629378 217070860 237988152 239925638 221051179 189317092 155671665 128520469
4148A28520469j9902028j4733004j1091132q548243p018204n460435m512967m017846
$$ 128520469 108618441 93885437 82794305 74246062 67227858 61767423 57254456 53236610
4140E3236610k844951k547737k031596j977334j543954j273199r81514p69467
$$ 53236610 50391659 47843922 45812326 43834992 42291038 41017839 40036325 39266858
4132C9266858k97522R5712m0293L51217K12990K81279K23452O11102R29834P95832
$$ 39266858 38969336 39065048 39024755 39375972 39588962 39870241 40093693 40704795 41634629 42430461
4122D2430461J154369J134616J185922J322616J652202J937421J954377K273584
$$ 42430461 43584830 44719446 45905368 47227984 48880186 50817607 52771984 55045568
4114E5045568K758761L518352M408026N587610O869065Q267983J0614996J3802110
$$ 55045568 57804329 61322681 65730707 71318317 78187382 86455365 97070361 110872471
4106A10872471J7672475K2261705K5706825K7665093K6981361K1452560J2688922
$$ 110872471 128544946 150806651 176513476 204178569 231159930 252612490 265301412
4099B65301412L414550j1570399k5017533k7073033k7124245k8269989k5232182
$$ 265301412 268715962 257145563 232128030 205054997 177930752 149660763 124428581
4092A24428581j9413992j4569788j1457271r295564o911873n848914n014869m089382
$$ 124428581 105014589 90444801 78987530 69691966 62780093 56931179 51916310 47826928
4084D7826928l787011l134104k724518k365973j968153j877994j588249j491795
$$ 47826928 44039917 40905813 38181295 35815322 33847169 31969175 30380926 28889131
4076B8889131j185226j015734r46731q61429j235367r36216p33587j009919r23876
$$ 28889131 27703905 26688171 25741440 24880011 23644644 22708428 21974841 20964922 20041046
4067B0041046j017471q36452o41622o80944o26637q83743o73821m92825n80272
$$ 20041046 19023575 18187123 17545501 16864557 16237920 15354177 14680356 14187531 13607259
4058A3607259k54625n22787k61589m28163k73745l05220m39589j26224k47621
$$ 13607259 13352634 12829847 12568258 12140095 11866350 11561130 11121541 10995317 10747696
4049A0747696m89340k17458j88307l33322j61838n9163j11314k01830k80717k20135
$$ 10747696 10258356 10040898 9852591 9519269 9357431 9298268 9186954 8985124 8704407 8484272
4039H484272o9949j13527j20200K05734Q4929j87581l64173k53129k20937m81041
$$ 8484272 8414323 8300796 8180596 8386330 8471259 8283678 7919505 7666376 7445439 6964398
4029F964398l11845l17686j33082j48876r6179k41861k11848r4858q9748j49415
$$ 6964398 6652553 6334867 6201785 6052909 5956730 5714869 5503021 5408163 5318415 5169000
4019E169000J4036j24031j74782k09928j60616O8359j0736j79142O0791o2998
$$ 5169000 5183036 5059005 4884223 4674295 4513679 4582038 4571302 4392160 4452951 4389953
4009D389953j33382J4335m4620j00192p5629p1373q5640Q1878j40454j371j28037
$$ 4389953 4256571 4270906 4226286 4126094 4050465 3979092 3893452 3975330 3834876 3833505 3705468
3998C705468p9002j43235j02100r91l6308J80300j76055o7547j80486K05016J94388
$$ 3705468 3626466 3483231 3381131 3380140 3343832 3524132 3348077 3280530 3100044 3305060 3499448
3987C499448p2393k513J1491k40190j22589o5270k61509r8993J1931k3507j13739
$$ 3499448 3427055 3424542 3436033 3195843 3073254 3007984 2746475 2647482 2659413 2635906 2522167
3976B522167J47498J10069q4561n4713m0175k8963J37951j79174j60140j6181
$$ 2522167 2669665 2779734 2695173 2640460 2600285 2571322 2709273 2530099 2369959 2353778
3966B353778j10562N1093N904P7241p2934M8503J03990R8470k25146k86882l4921
$$ 2353778 2243216 2294309 2300213 2377454 2304520 2353023 2457013 2555483 2330337 2043455 2008534
3955B008534K50341j80425l55297J17775J11223j3809l06297j63351J70068K47805
$$ 2008534 2258875 2078450 1723153 1840928 1952151 1938342 1632045 1468694 1638762 1886567
3945A886567J3303p1925j62469m6363J79219K2065k70214J2162J4693r3021J745
$$ 1886567 1899870 1827945 1665476 1619113 1798332 1820397 1550183 1562345 1577038 1484017 1485762
3934A485762K43143L2305j40686Q6884K3800l8164o2148k776o2753J78157j5257
$$ 1485762 1728905 1761210 1620524 1707408 1731208 1693044 1630896 1628120 1565367 1743524 1728267
3923A728267l6977r411m9178J69431L76242J24157r3708J89412P5991j47686k66082
$$ 1728267 1691290 1681879 1632701 1802132 2178374 2302531 2208823 2398235 2474226 2326540 2060458
3912B060458j74655k29227q3138N3072k745q1993r7659n4233j78125k06221R6309
$$ 2060458 1885803 1656576 1573438 1626510 1623765 1541772 1444113 1389880 1211755 1005534 1101843
3901A101843p1994k6101J18921R1893J89734j77737l5687m33162J41674L13073
$$ 1101843 1029849 1003748 1122669 1214562 1404296 1226559 1190872 757710 899384 1212457
3891A212457l66934J27672Q5299J04150J8791N5183j29212K0338j04306l4275
$$ 1212457 845523 973195 1058494 1162644 1181435 1236618 1107406 1127744 1023438 989163
3881I89163J24032m2947J89478J02066j86034J24508J8093L8115j72895l2229
$$ 989163 1113195 1070248 1259726 1361792 1175758 1300266 1318359 1356474 1183579 1151350
3871A151350J08172J00382R5242J69846K89745j0131N3955R3740Q3504o8342P6371
$$ 1151350 1259522 1359904 1455146 1624992 1914737 1904606 1958561 2052301 2135805 2067463 2143834
3860B143834k56107k65197l3353j90470J56050j95219j65005o9761J30861Q9466
$$ 2143834 1887727 1622530 1589177 1398707 1554757 1359538 1194533 1124772 1255633 1345099
3850A345099r0265J3935J09389k08976j33344J23411K4182N4831K9174o5301j50250
$$ 1345099 1254834 1268769 1378158 1169182 1035838 1159249 1183431 1238262 1267436 1202135 1051885
3839A051885j7253R6878k6347M9283j36611J76433J4476j52660P9649l9730K39093
$$ 1051885 1034632 1131510 1105163 1154446 1017835 1194268 1208744 1056084 1135733 1096003 1335096
3828A335096M1542J02654q6443k20801j54981l4886J44542K84217j24682j25870
$$ 1335096 1376638 1479292 1392849 1172048 1017067 982181 1126723 1410940 1286258 1160388
3818A160388N691J79868K07245m2971K8692M09181j55621J62497M2649Q9170J30330
$$ 1160388 1166079 1345947 1553192 1510221 1538913 1948094 1792473 1954970 1997619 2086789 2217119
3807B217119J05154K15280q5765p1542j58678j7851j55075k71585j11855R93j70172
$$ 2217119 2322273 2537553 2451788 2380246 2221568 2203717 2048642 1777057 1665202 1666195 1496023
3796A496023j74952J5270j1433J6721J95582J39369j29674L4661j20864L2910
$$ 1496023 1321071 1336341 1324908 1341629 1537211 1676580 1546906 1581567 1460703 1493613
3786A493613K40608j5673j83329L6804J86241N9326j16548R0219l2659q4829j98503
$$ 1493613 1734221 1718548 1535219 1572023 1758264 1817590 1701042 1791261 1758602 1673773 1475270
3775A475270J30951J93048O1218M4125j4250n4014m0875K7855r8743R4240J59094
$$ 1475270 1606221 1799269 1860487 1904612 1890362 1836348 1795473 1823328 1724585 1818825 1977919
3764A977919l9365J06622J94914q8460J39546k6665J1030M6636J06058l4208j0033
$$ 1977919 1938554 2045176 2240090 2151630 2291176 2264511 2275541 2322177 2428235 2394027 2383994
3753B383994N2963J93190m4514o7610K53299P7399R4094J39963J1614K32336J51478
$$ 2383994 2436957 2630147 2585633 2518023 2771322 2848721 2942815 3082778 3094392 3326728 3478206
3742C478206k74475J08010J26199P8872J26320j53767O6090J72347K89222L63181
$$ 3478206 3203731 3311741 3437940 3516812 3643132 3489365 3555455 3727802 4017024 4380205
3732D380205O4389p0514R7042J34398J49761J22027J28531O9083R3669L29204
$$ 4380205 4444594 4374080 4471122 4605520 4755281 4877308 5005839 5074922 5168591 5497795
3722E497795L42737K05334J98413J81186L96312K39340J32796L22846J18303J97197
$$ 5497795 5840532 6045866 6244279 6425465 6821777 7061117 7193913 7516759 7635062 7832259
3712G832259M92015O11310M40599M38814M08917O83900O69098P51517Q49931P65676
$$ 7832259 8324274 8935584 9376183 9814997 10223914 10907814 11576912 12328429 13178360 13944036
3702A3944036Q47242Q82648R13309J226673J085736J028908J441514J291970J269257
$$ 13944036 14791278 15673926 16587235 17813908 18899644 19928552 21370066 22662036 23931293
3693B3931293J106791J103923P11040M24966l4034k54094p30340p13586j284668
$$ 23931293 25038084 26142007 26853047 27278013 27243979 26989885 26259545 25545959 24261291
3684B4261291j253179j307598j237459j590860j136378j125444j151864r35714
$$ 24261291 23008112 21700514 20463055 18872195 17735817 16610373 15458509 14522795
3676A4522795r86702q06445q73025o94808p47768n48365m73464m60429m22817
$$ 14522795 13536093 12729648 11856623 11161815 10414047 9865682 9392218 8931789 8508972
3667H508972o18007m62925j79571k83589k56505m30242j45694l37960k52328l54726
$$ 8508972 7890965 7428040 7248469 6964880 6708375 6278133 6132439 5794479 5542151 5187425
3657E187425k13686J2809k28229j29461j38456j57344j45740j78780M2292j52545
$$ 5187425 4973739 4986548 4758319 4628858 4490402 4333058 4187318 4008538 4050830 3898285
3647C898285l7710j00680j34327j51151p1541J7362n8501j10694j88801M6535
$$ 3898285 3860575 3759895 3625568 3474417 3402876 3420238 3361737 3251043 3062242 3108777
3637C108777M5196j90310l99217O0108K37135j23798j41192o1191n5417j07219
$$ 3108777 3153973 2963663 2564446 2624554 2861689 2737891 2596699 2535508 2480091 2372872
3627B372872r3202j66559J84756K95469k69040k14997q2584L1285K82084k12619
$$ 2372872 2279670 2113111 2297867 2593336 2324296 2109299 2026715 2058000 2340084 2127465
3617B127465P4221n9969m18882Q8586L96291j64577k07085k74866m0382Q6703
$$ 2127465 2201686 2141717 1722835 1811421 2207712 2043135 1836050 1561184 1520802 1607505
3607A607505J50467j39424p4225J08638m0699P6669m3157j08564r1632N0013N6934
$$ 1607505 1757972 1618548 1544323 1652961 1612262 1688931 1645774 1537210 1445578 1495591 1552525
3596A552525p1927j53925k8630J51594L455j60636j43316O4070Q6768J42467J29100
$$ 1552525 1480598 1326673 1298043 1449637 1453092 1292456 1149140 1213210 1299978 1442445 1571545
3585A571545r2524j42897j16995o0978J01016P7323J37906k18972M2580l1382
$$ 1571545 1479021 1336124 1219129 1158151 1259167 1336490 1474396 1255424 1298004 1266622
3575A266622o6896R4007m3676l2901O1593M0431j68484M108r4228m0566L5251
$$ 1266622 1199726 1293733 1250057 1217156 1278749 1319180 1150696 1154804 1060576 1020010 1055261
3564A055261J02564J51013J14275j64950m9853Q1101p5326k3997p717j17945p841
$$ 1055261 1157825 1308838 1423113 1258163 1208310 1289411 1214085 1190088 1182371 1064426 1056585
3553A056585K4910p911O8626j78411P7677O9658p493J53196k90950J16339L05498
$$ 1056585 1081495 1073584 1142210 963799 1041476 1111134 1103641 1256837 965887 1082226 1387724
3542A387724l6082k73273n886l8710K3184n8754o7304K04991n7883q6391L2655
$$ 1387724 1351642 1078369 1072483 1033773 1056957 998203 930899 1135890 1078007 991616 1024271
3531A024271O5353J33863r3466J0831p6798O553J42368l7816q1897p9699Q5836
$$ 1024271 1089624 1223487 1130021 1140852 1064054 1070607 1212975 1175159 1093262 1013563 1099399
3520A099399K51010k27753k5827O8192J10708n0247j96487K0932P5496j04746
$$ 1099399 1350409 1122656 1096829 1165021 1275729 1225482 1028995 1049927 1125423 1020677
3510A020677O3452j17698J21469l6080P0930J8291k05002P8771Q9625R6940J48750
$$ 1020677 1084129 966431 1087900 1051820 1122750 1141041 936039 1014810 1104435 1201375 1350125
3499A350125n2964n5834j03160p2733N4970j06999j009p0528P7540K08359K79467
$$ 1350125 1297161 1241327 1138167 1065434 1120404 1013405 1012396 941868 1019408 1227767 1507234
3488A507234k63998k67896j6468J09503k26972k26608K08474P8210P309L14981
$$ 1507234 1243236 975340 958872 1068375 841403 614795 823269 901479 908788 1223769
3478A223769j08620P6516j34753k26115Q0974J9392j03092J57251J62563R7759
$$ 1223769 1115149 1191665 1056912 830797 911771 931163 828071 985322 1147885 1245644
3468A245644O7456j30911J13033K1717j03014m2665K2256J24818l7201P3104j90254
$$ 1245644 1313100 1182189 1295222 1316939 1213925 1171260 1193516 1318334 1281133 1354237 1163983
3457A163983p3202J06315O0891Q3526J15255K76939K9791k9584o4886j06520j58429
$$ 1163983 1090781 1197096 1257987 1341513 1456768 1733707 1763498 1733914 1669028 1562508 1404079
3446A404079J0731J24142k8836j0108j91885j42840N0447J00367J23513q8402
$$ 1404079 1414810 1538952 1510116 1500008 1308123 1165283 1215730 1316097 1439610 1351208
3436A351208J84685L0597j39476m6790J84423j84660J0296J14682j65871L8681
$$ 1351208 1535893 1566490 1427014 1380224 1564647 1379987 1390283 1504965 1339094 1377775
3426A377775M3972J25475j0935j04819J74564J15615K08173K07826J49854j20308
$$ 1377775 1421747 1547222 1536287 1431468 1606032 1721647 1929820 2137646 2287500 2167192
3416B167192k58451m0855l5521J841J92791j92281k32597L5102l1405J33119J26006
$$ 2167192 1908741 1867886 1832365 1834206 2026997 1834716 1602119 1637221 1605816 1738935 1864941
3405A864941J59816q7598k35175r4707J06015m1159J07867Q8272J92551O7111
$$ 1864941 2024757 1937159 1701984 1607277 1713292 1672133 1780000 1868272 2060823 2127934
3395B127934J807m4643k6027j2177n3852J16522k9454L1570q0418L3658j23021
$$ 2127934 2129741 2085098 2059071 2046894 1993042 2109564 2080110 2111680 2031262 2064920 1941899
3384A941899O9290J31982j5234J30436O9863j27894q5240m6697j23807j19082
$$ 1941899 2011189 2143171 2127937 2258373 2328236 2200342 2115102 2068405 1944598 1825516
3374A825516j07110J14345J293l1908J08096n058j0722j20547j1899O0039J06492
$$ 1825516 1718406 1832751 1834044 1802136 1910232 1905174 1894452 1773905 1762006 1822045 1928537
3363A928537Q5738j86867N4174m2767K37626K11350K0763K373j7709j13931Q2881
$$ 1928537 2014275 1827408 1881582 1838815 2076441 2287791 2308554 2310927 2293218 2179287 2262168
3352B262168n9306K16750K6066j74431l1758R2599K05447N7353k64988k13038
$$ 2262168 2202862 2419612 2445678 2271247 2239489 2332088 2537535 2594888 2329900 2116862
3342B116862J03705N8640j9240J21184J51982j80246j10108k534K01267J77170
$$ 2116862 2220567 2279207 2259967 2381151 2533133 2352887 2242779 2240245 2441512 2618682
3332B618682j47331q4n2850O3788J1420Q6923J3022l0936j10104J50675L0684
$$ 2618682 2471351 2471267 2418417 2482205 2493625 2580548 2593570 2562634 2452530 2603205 2633889
3321B633889R918R4698L19136o738j40208J5638L6721J53013J3870L9014k62139
$$ 2633889 2643807 2738505 3057641 3050903 2910695 2926333 2963054 3116067 3129937 3168951 2906812
3310B906812J78160L7979J29184J60410k4997j20973j0365N2710L0920k2018J89558
$$ 2906812 3084972 3122951 3252135 3412545 3387548 3266575 3256210 3308920 3339840 3317822 3507380
3299C507380m8984O2739J5592j0408o4324M8779J34932P6868P4721J60929N7525
$$ 3507380 3458396 3521135 3536727 3526319 3461995 3510774 3645706 3722574 3797295 3958224 4015749
3288D015749R5136Q0497K37420J26937J90421J02563n0053J7922k21571q9698
$$ 4015749 4110885 4191382 4428802 4555739 4746160 4848723 4798670 4816592 4595021 4505323
3278D505323J89618k4145L69013M7940j00355J21469O9320K39452J25272j41809
$$ 4505323 4694941 4670796 5039809 5087749 4987394 5108863 5178183 5417635 5542907 5401098
3268E401098J82971j66610K51446L41699J30531l3182K4007L09179L45444K66144
$$ 5401098 5584069 5417459 5668905 6010604 6141135 6107953 6131960 6441139 6786583 7052727
3258G052727J44595M67507K22231M47598L68108M8723M15712M22585M62436L85088
$$ 7052727 7197322 7664829 7887060 8334658 8702766 8751489 9167201 9589786 10052222 10437310
3248A0437310R0624M36377M3921N3651o5173N6297j80902m88618k58589n20683
$$ 10437310 10527934 10964311 11008232 11061883 10996710 11053007 10872105 10383487 10124898 9604215
3238I604215p36134l84039m13347m12038m83138l93659j76552k65329m45592j44451
$$ 9604215 8868081 8484042 8070695 7658657 7175519 6781860 6605308 6339979 5894387 5749936
3228E749936j32205k96820L0287o3434k46716k35142j54298Q1708j09750k8968
$$ 5749936 5617731 5320911 5351198 5287764 5041048 4805906 4651608 4733316 4623566 4594598
3218D594598q9278j95167j55947j89424J42053O0633r6024k3035n7907k42438
$$ 4594598 4505320 4310153 4154206 3964782 4106835 4167468 4071444 4048409 3990502 3748064
3208C748064k00178j06355r4336N8125j62818J59175q1598l9956r1121m5819O4742
$$ 3748064 3547886 3441531 3347195 3405320 3242502 3401677 3320079 3280123 3189002 3143183 3207925
3197C207925j89915M0169q1344r5498O0977l5433k89220q768K88579k62243K6920
$$ 3207925 3018010 3058179 2976835 2881337 2942314 2906881 2617661 2608893 2897472 2635229 2662149
3186B662149N2898p2893R2307j05664p4569j44876j14029L03275k5734m7791j40507
$$ 2662149 2715047 2642154 2734461 2628797 2554228 2409352 2295323 2598598 2572864 2525073 2384566
3175B384566Q045k2650k168j55605j3343j43865K6151J4311k45788O3577K24505
$$ 2384566 2392611 2369961 2367793 2212188 2198845 2054980 2081131 2095442 1849654 1913231 2137736
3164B137736K19563j14070p4779k70052J31129l1098O283m3643o4018N5663J91232
$$ 2137736 2357299 2243229 2168450 1898398 2029527 1998429 2004712 1961069 1897051 1952714 2143946
3153B143946j91885k12368j284P0650Q902n0072O2732n319j75902k77355K04887
$$ 2143946 1952061 1739693 1738409 1809059 1817961 1767889 1830621 1825302 1649400 1372045 1576932
3142A576932N4588J54310o007n4750J48965k06769n1039m8192M9255O502K08674
$$ 1576932 1631520 1785830 1779823 1725073 1874038 1667269 1616230 1568038 1617293 1623795 1832469
3131A832469l186j47955j44666o1074J42278N6793K9952j85792J9158R4205j48547
$$ 1832469 1829283 1681328 1536662 1475588 1617866 1674659 1704611 1518819 1537977 1632182 1483635
3120A483635K2583J03110j69210j72203K36197P2897m5078J6606J50439k47535
$$ 1483635 1506218 1609328 1440118 1267915 1504112 1577009 1531931 1548537 1698976 1451441
3110A451441j38651j2629K12934q4023L444n1553r2295K9383J29052j7827L64
$$ 1451441 1312790 1300161 1513095 1429072 1432516 1380963 1288668 1318051 1447103 1429276 1429640
3099A429640j18172k10388K4946Q5716J87346N0258k61848k2959p013J23326M3927
$$ 1429640 1311468 1101080 1126026 1211742 1399088 1449346 1187498 1164539 1157526 1280852 1324779
3088A324779p0185M9769j7840o3056j54566K10841J16606J6200k16697n8621o5563
$$ 1324779 1254594 1304363 1286523 1223467 1068901 1279742 1396348 1412548 1195851 1137230 1071667
3077A071667J04915j53595Q0450J38544R7909j91563K11131j39235j24465j24414
$$ 1071667 1176582 1022987 1103437 1241981 1339890 1148327 1359458 1220223 1095758 971344
3067I71344Q1174J7750L9519M4716j77859J01362Q6765N0245r5781j08290j0864
$$ 971344 1052518 1070268 1109787 1154503 976644 1078006 1164771 1215016 1119235 1010945 1000081
3056A000081Q1760m2507J34836m199P5623j32666k22083Q8338K02774k31864j10414
$$ 1000081 1081841 1039334 1174170 1169971 1245594 1112928 890845 979183 1181957 950093 839679
3045H39679J64613J86918L3921L5968l3167k07363k1638N8972K988j17727J90384
$$ 839679 1004292 1191210 1225131 1261099 1227932 1020569 998931 1057903 1060891 943164 1133548
3034A133548P1559j80153l2721P3368O9084n3466m7753m530M5906k031J30479
$$ 1133548 1205107 1024954 992233 1065601 1134685 1081219 1033466 1028936 1074842 1072811 1203290
3023A203290k7739J68719Q364l05414K98711J44134k52218O65Q9944j7981j32326
$$ 1203290 1175551 1344270 1352634 1047220 1345931 1490065 1237847 1238512 1328456 1310475 1178149
3012A178149m3196k7144n6833K10116j20180J89637J0020j8556J30295l3695j58739
$$ 1178149 1134953 1107809 1050976 1261092 1140912 1330549 1340569 1322013 1452308 1418613 1259874
3001A259874j02650J64848r9607K4461J7381N5090r4581J1087q835O1830N4398
$$ 1259874 1157224 1322072 1222465 1246926 1264307 1319397 1224816 1235903 1227068 1288898 1343296
2990A343296O9014j9922k5235J99140J21825p4902K1161j61720Q8065N196r7950
$$ 1343296 1412310 1392388 1367153 1566293 1688118 1613216 1634377 1472657 1560722 1565918 1467968
2979A467968k2269J69995Q4608J27046j21749K3804J15320j60728m8368q523K6146
$$ 1467968 1445699 1615694 1700302 1827348 1705599 1729403 1844723 1683995 1635627 1627104 1653250
2968A653250Q4118Q4702m4502O5821k4701J98062l4299N9924q4200j492l32J0853
$$ 1653250 1737368 1822070 1777568 1843389 1818688 2016750 1982451 2042375 1958175 1956683 1956351 1967204
2956A967204J96855J03688j22701k564J57117J1300J35861m7767N5100K54908
$$ 1967204 2164059 2267747 2145046 2142482 2299599 2310899 2446760 2398993 2454093 2709001
2946B709001P3696r7014k4378P1951K7177J2047k60550J60888K21006M7893M2830
$$ 2709001 2782697 2685683 2661305 2733256 2760433 2772480 2511930 2672818 2893824 2941717 2984547
2935B984547Q4642J51177K91751q8694n6847J37041Q1284r8709J87728l8912J34344
$$ 2984547 3069189 3220366 3512117 3423423 3366576 3503617 3584901 3486192 3673920 3635008 3769352
2924C769352K6059l33078K04672J51771O7518N0728o0382k1008L83062J05106
$$ 3769352 3795411 3462333 3667005 3818776 3886294 3937022 3876640 3855632 4238694 4343800
2914D343800j42776k7342J69054J84005q507L35808L04885L33908J46096K41249
$$ 4343800 4201024 4173682 4342736 4526741 4518234 4854042 5158927 5492835 5638931 5880180
2904E880180K40962O0188j01891l33637l89515j18903k32351k8284n3661j66916
$$ 5880180 6121142 6181330 6079439 5745802 5356287 5237384 5005033 4976749 4923088 4756172
2894D756172k9932j817l4942k15558J97057j54033P8976O5934J07514n5355p6630
$$ 4756172 4726240 4724423 4689481 4473923 4670980 4516947 4595923 4661857 4769371 4714016 4637386
2883D637386N5999J38087q5394J84957K17810l7327o7164N4902M9181k2363k16899
$$ 4637386 4693385 4831472 4746078 4931035 5148845 5111518 5044354 5099256 5148437 5126074 4909175
2872D909175j60413k07655N3932p4666k73536j98214k21946K2658q0929k35672
$$ 4909175 4748762 4541107 4595039 4520373 4246837 4048623 3826677 3849335 3768406 3532734
2862C532734Q8038r7047j91552J25553J92967k03836p777n7973m5644k3567o7027
$$ 3532734 3620772 3523725 3332173 3457726 3650693 3446857 3439080 3381107 3335463 3311896 3244869
2851C244869j16210j19809O2981j83639j33180j3381j0451k73223n0813k74116
$$ 3244869 3128659 3008850 3071831 2888192 2755012 2741631 2731180 2457957 2407144 2133028
2841B133028M8626P3550q1819m5463k1445l10387r1594P4922j44657k9679j43661
$$ 2133028 2181654 2255204 2173385 2127922 2106477 1796090 1704496 1779418 1634761 1605082 1461421
2830A461421J70524P715j4048o5688J39547Q0698k79080L19534L2484j64129j93670
$$ 1461421 1631945 1639660 1625612 1559924 1699471 1780169 1501089 1820623 1853107 1688978 1495308
2819A495308J54782J31250j24671p2778K0745j15156j19071k22048k4545J06614
$$ 1495308 1650090 1781340 1656669 1583891 1604636 1489480 1370409 1148361 1123816 1230430
2809A230430l4865J40179R4827l4056q8596k38349k59629l9011L22552J51229
$$ 1230430 1195565 1335744 1430571 1396515 1307919 1069570 809941 770930 1093482 1244711
2799A244711k54054l14528J41087J75779j70901k7263l275J04460M0658K9030
$$ 1244711 990657 676129 817216 992995 822094 794831 791556 896016 936674 965704
2789I65704k68645k2723q5235K58379P547j60182K03823j53429j26324P3326m7623
$$ 965704 697059 674336 589101 847480 855027 694845 898668 745239 618915 692241 644618
2778F44618P4278j31782m0022K8111l9958R3970o5744R0619Q8433K618Q9342j67777
$$ 644618 718896 587114 547092 575203 535245 629215 563471 654090 742523 745141 834483 666706
2766F66706k64210O1037L3633k19716Q8150L00675K0755m4209Q1369j12758j39157
$$ 666706 402496 463533 497166 277450 365600 666275 687030 642821 724190 611432 472275
2755D72275J98719J308R8222k3908j24147Q7860m2499k87058J67695n2888M2486
$$ 472275 670994 672302 770524 746616 622469 710329 667830 380772 548467 495579 538065
2744E38065J1668k27400J57793k1203m6962M4581q9755o8995K09576j03771j02323
$$ 538065 549733 322333 480126 458923 411961 456542 366787 297792 507368 403597 301274
2733C01274j05113j5834l1520J47444K56422j61079j13726r5445K47929K9120
$$ 301274 196161 180327 148807 296251 552673 391594 277868 182423 430352 459472
2723D59472Q3971k20241q7310m8586n0199Q9083l8337m0550q1705N1287o0169
$$ 459472 543443 323202 235892 187306 137107 226190 187853 147303 65598 116885 56716
2712E6716O8090K4597P2206K10543k19201o836j06666R3086K04899k6055j69936
$$ 56716 124806 149403 221609 432152 212951 206115 99449 192535 397434 371379 201443
2701B01443Q5736j14979k2026J73208l1990q3801k2767l0708n3397M7478j15585
$$ 201443 287179 172200 150174 323382 291392 207591 184824 154116 100719 148197 32612
2690C2612J89702N5104o9106q330R4864j29396R0189j4197l3582Q0903k2115l6381
$$ 32612 222314 277418 208312 199982 294846 165450 255639 241442 207860 288763 266648 230267
2678B30267j94883J03874O9806L7718j3004q8041J48739l5467L3866j23265j7431
$$ 230267 35384 139258 209064 246782 233778 145737 294476 259009 292875 169610 152179
2667A52179R0993J4824k5014J4771j31502n080j27635J05016N2030K5453j17746
$$ 152179 243172 257996 232982 247753 116251 111171 -16464 88552 140582 166035 48289
2656D8289n9649P9465K2078J0281Q6121p6088q6187o6313J980J15145L8623n7896
$$ 48289 -11360 68105 90183 100464 186585 110497 24310 -42003 -40023 75122 113745 55849
2644E5849n9226n9143J24161J08197p4721N6738o7522N7817j64559n9477J43828
$$ 55849 -3377 -62520 61641 169838 95117 151855 84333 142150 -22409 -81886 61942
2633F1942p4285n5645j89212R8764J69151q338R7601K42777j17612j95751J02982
$$ 61942 -12343 -67988 -257200 -158436 10715 2377 99978 342755 225143 29392 132374
2622A32374K4590N2756k63235R5503m6373m8665P8208J36500N1440j65389n2986
$$ 132374 156964 209720 -53515 41988 -4385 -53050 25158 161658 213098 47709 -5277
2611e277J34146J93357j33139K3567N9440O993q4629J18559P5657j49589J29344
$$ -5277 128869 322226 189087 212654 272094 279087 194458 313017 388674 239085 368429
2600C68429J41991j82747j38266j8209l9304K4634q0039R1557k2398j95621p0681
$$ 368429 510420 327673 189407 171198 131894 156528 76489 168046 145648 -49973 -120654
2589a20654O6103J15565J16278m0789o4533m0911P932j19175P1386j3696o7765
$$ -120654 -54551 61014 177292 136503 71970 31059 38991 -80184 -8798 -22494 -90259
2578i0259P3165q5295L01101J52005j31364Q5899m2704j10775l3993j51503K43149
$$ -90259 -17094 -102389 198712 350717 219353 305252 262548 151773 117780 -33723 209426
2567B09426M5276l5550j26227l3367R7356n5679K15169m9661k47683p5734l5641
$$ 209426 254702 219152 92925 59558 156914 101235 316404 266743 19060 -56674 -92315
2556i2315l9358J83429O5065k3136L0019j02545j1158J8780Q6104j42530l095
$$ -92315 -131673 51756 116821 93685 123704 21159 10001 28781 114885 -27645 -30740
2545c0740R6487j02803J19423k42895j67594Q1935K99936k29276K00530l1456
$$ -30740 65747 -37056 82367 -160528 -328122 -246187 53749 -175527 25003 -6453
2535f453R1094P6948j00597P0373P8217r1290M0070O1315l9490o7163n7067o4222
$$ -6453 84641 161589 60992 131365 209582 118292 158362 219677 180187 113024 55957 -8265
2523h265J23034J49858j61571l7402j30171J04019j17305Q9241J42425K8622j5857
$$ -8265 114769 264627 103056 65654 -64517 39502 -77803 11438 153863 182485 166628
2512A66628n2491p5053N0855J27958k71607j42072K0954P4530J16885J23682J41572
$$ 166628 114137 39084 89939 217897 -53710 -195782 -174828 -100298 16587 140269 281841
2501B81841l9886j80011J11603j16693M1371k36052K8573q0869j342K2144k8837
$$ 281841 241955 61944 173547 56854 98225 -137827 -109254 -190123 -191465 -169321 -198158
2490a98158K38390j3060J0993j35920M9817k7967K48829p7274l4304j2607Q5888
$$ -198158 40232 27172 38165 -97755 -47938 -75905 172924 95650 61346 48739 134627
2479A34627j09821J29292P2274k06464j53403Q5315o5802P1682p6877k4231J50559
$$ 134627 24806 154098 226372 19908 -133495 -48180 -113982 -42300 -119177 -143408 7151
2468G151N1751q9964J6477L8966R5669L7345p3867l01066P9450K31148n7737j40339
$$ 7151 58902 -31062 -14585 24381 120050 157395 83528 -217538 -138088 93060 35323 -105016
2456a05016j34987o2708J93636P2088Q7925Q4017J98024q5103k59354j45308L02836
$$ -105016 -240003 -302711 -109075 -36987 50938 134955 332979 247876 -11478 -156786 146050
2445A46050k8088l2127j64263q2786Q8418j08931j0240k3712Q4214N2009j20659
$$ 146050 117962 85835 -78428 -161214 -72796 -181727 -191967 -215679 -131465 -79456 -200115
2434b00115J92967K53321j17504l2435j25257n0225K8355J37237m5975m8767J00557
$$ -200115 -7148 246173 128669 96234 -29023 -79248 -50893 86344 40369 -8398 92159
2423I2159l3611K9458K28770k05255j75667J82055K3526k73521l654o8475Q8041
$$ 92159 58548 88006 316776 111521 -64146 117909 141435 -132086 -135740 -204215 -116174
2412a16174L8176N6107J06986J51629j80315j52297j91509J53791P8472J86718
$$ -116174 -77998 -21891 85095 236724 56409 -95888 -287397 -133606 -55134 131584
2402A31584o8684p8316Q3610O929K7370L1046k06946k0722J91261p5775M5885
$$ 131584 62900 -15416 68194 75123 102493 133539 -73407 -94129 97132 21357 67242
2391F7242j00009J30475J75956j42189q425J27028L2565j20570L1939J9430L1655
$$ 67242 -32767 97708 273664 131475 123050 250078 282643 162073 194012 213442 245097
2380B45097n3516l2685L8792O2794k4827J9454K96535N9615n8414m9748m3241
$$ 245097 191581 158896 197688 260482 235655 255109 551644 611259 552845 503097 459856
2369D59856J6428j13307l4863Q0835P1166j51939k52552r3158M13470m7018k05682
$$ 459856 476284 362977 328114 408949 480115 328176 75624 -17534 395936 348918 143236
2358A43236N0179k7477J35477L1873l23714J87140n0904l9587Q7741r3729j0954
$$ 143236 193415 165938 301415 333288 9574 196714 145810 106223 193964 100235 89281
2347H9281j56280J27160j1556O9455J93762j75284m9753o4108L6390K51122j22460
$$ 89281 -66999 60161 48605 118060 311822 136538 86785 22677 59067 310189 187729
2336A87729N1907n7949k08402J35735M770R9164N7329l7675J11522j11237J108
$$ 187729 239636 181687 -26715 109020 113790 212954 270283 232608 344130 232893 234001
2325B34001j67601J4061p3589J63887J23114j10311q2695J35576k13720j10952
$$ 234001 66400 80461 6872 170759 293873 183562 100867 236443 22723 -88229
2315h8229q5355J47469J38106j85321Q2047N83R6449j5523j19191K56138k35404
$$ -88229 -173584 -26115 111991 -73330 8717 9300 105749 90226 -28965 227173 -8231
2304h231k0925Q276j8687M2686K82311L7384j61646N4234L4520N1460m6505o5276
$$ -8231 -29156 -20880 -39567 3119 285430 322814 161168 215402 249922 301382 254877 189601
2292A89601n3038K18913j27706n2390L0136k0676l196k36477j00075Q3887n6786
$$ 189601 136563 355476 227770 175380 205516 184840 181644 -54833 -154908 -71021 -127807
2281a27807J24538M1228l9464p1074r3513J82376n9785K35484r3676N5063l3204
$$ -127807 -3269 37959 -1505 -72579 -166092 16284 -43501 191983 98307 153370 120166
2270A20166l0572L40774p6894p8838m0365M4176M4947j50829j9578M371n3158
$$ 120166 89594 430368 353474 274636 234271 278447 323394 172565 152987 157358 104200
2259A04200J72232N4774Q2992j09667j81174K9593K54199k21243k0344J5868J0231
$$ 104200 276432 331206 414198 304531 123357 152950 407149 185906 165562 181430 191661
2248A91661J38024R6535j35223k7163j15214o0439j20985O346J87429L2141J19659
$$ 191661 329685 426220 290997 263834 148620 88181 -32804 -26458 160971 193112 312771
2237C12771m1408n3424Q4072O7225J1053O4324J45819J16121q7903k01337P8580
$$ 312771 271363 217939 302011 369236 380289 444613 590432 706553 618650 417313 495893
2226D95893K7696k7836o1632l188r8780k04872K19286J55204j32884p6032J82913
$$ 495893 523589 495753 434121 430933 332153 127281 346567 501771 368887 292855 475768
2215D75768j79535N6203J53419J83373k6088k69014J69414J19792j66795J0645
$$ 475768 296233 352436 505855 689228 663140 394126 563540 683332 516537 527182
2205E27182o4584k8754o2797M9271P8501p331K77716M3995p1004o3523N3095P6743
$$ 527182 462598 433844 371047 420318 498819 491488 769204 813199 742195 678672 731767 808510
2193H08510K5159J57428l8985J70173J61396k1840Q9560Q4984j59538L1525j51409
$$ 808510 833669 991097 952112 1122285 1283681 1261841 1351401 1436385 1276847 1308372 1156963
2182A156963M0513K5967M9333J08873J07226J29212j32614n1595J98201K47778
$$ 1156963 1197476 1223443 1272776 1381649 1488875 1618087 1485473 1433878 1632079 1879857
2172A879857J8929J3750k09859l9168R5049K06435n8113R4819K16377r289o7187
$$ 1879857 1898786 1912536 1702677 1663509 1758558 1964993 1906880 2001699 2218076 2208787 2141600
2161B141600J5388J30613P1080j94404K06250J77006J4907J137K52023J24200
$$ 2141600 2156988 2287601 2358681 2164277 2370527 2547533 2562440 2563577 2815600 2939800
2151B939800l5143J30686J46247L5941J29020P6682j12728R378M36590K92554
$$ 2939800 2904657 3035343 3181590 3217531 3346551 3423233 3310505 3319883 3756473 4049027
2141D049027N5875K03687K08362L58852L13303L56036R1488n5555J37487M78720
$$ 4049027 4104902 4308589 4516951 4875803 5189106 5545142 5636630 5581075 5718562 6197282
2131F197282M81867K04654M75232M27752L12394M55772M80409M03502O08282O62693
$$ 6197282 6679149 6883803 7359035 7786787 8099181 8554953 9035362 9438864 10047146 10709839
2121A0709839P17073Q74711J048154Q03106Q21923N33960Q33917J346759J911380
$$ 10709839 11426912 12301623 13349777 14152883 14974806 15508766 16342683 17689442 19600822
2112A9600822K291252L012264L317131L987206N474336Q107853J2016470J5583227
$$ 19600822 21892074 24904338 28221469 32208675 37683011 45790864 57807334 73390561
2104G3390561J4112390P419750k992606j7066101j8286553j2130056q200714n913994
$$ 73390561 87502951 94922701 91930095 74863994 56577441 44447385 36246671 30332677
2096C0332677m693662l456454k777773j965174j443953j068433j133878p48919
$$ 30332677 25639015 22182561 19404788 17439614 15995661 14927228 13793350 13044431
2088A3044431o83528r15158r55155j192266j045407n82665l56353m84743n81629
$$ 13044431 12360903 11445745 10490590 9298324 8252917 7670252 7313899 6829156 6247527
2079F247527k28673j84688n24725l47336J1515k54923k08255m213k27433k52485
$$ 6247527 6018854 5834166 5309441 4962105 4973620 4718697 4510442 4506229 4278796 4026311
2069D026311l51219J8296k44236j08840j30930j33974o3353M480R257j47564m5365
$$ 4026311 3675092 3693388 3449152 3340312 3209382 3075408 3012055 3016535 3025792 2878228 2832863
2058B832863j69486j67573m1649k20620J9595q9272p6541j43380R3479r3302p636
$$ 2832863 2663377 2495804 2454155 2233535 2253130 2163858 2087317 1943937 2037416 1944114 1936478
2047A936478r2729j56155j1869R4484o5131j74715J03946j43228K8307q3760P9059
$$ 1936478 1843749 1687594 1675725 1770209 1705078 1530363 1634309 1491081 1519388 1435628 1514687
2036A514687j25422j58537j3620N7321l6847j29941r3690q323r0150J56531K8302
$$ 1514687 1389265 1230728 1217108 1274429 1237582 1107641 1013951 1005628 915478 1072009 1100311
2025A100311Q8533m0102j715k61088o6635L8738j2059K41284j10470j31931m4083
$$ 1100311 1188844 1148742 1147027 885939 819304 858042 845983 1087267 976797 844866 800783
2014H00783o9800l9898J786P5777P8975n4049q6441J733k87365Q3879J04783r1374
$$ 800783 730983 691085 692871 768648 847623 793574 707133 708866 421501 505380 610163 518789
2002E18789k9633N0590k516K5019l5936j51443j1587Q391j4461O3186K9410l2306
$$ 518789 489156 539746 537230 562249 526313 374870 363283 371674 357213 420399 449809 417503
1990D17503J7020j95361n7891J70667L0831j22791L0136O7569n5765J79315j12050
$$ 417503 434523 239162 181271 351938 382769 259978 290114 357683 301918 481233 369183
1979C69183j3039K03112j30060k16758L8824J2688k1608k7466P6528K48233J02434
$$ 369183 356144 559256 429196 212438 251262 263950 242342 214876 291404 539637 642071
1968F42071K8280j90063P2551p4910j03679j830j04700l2037P6911q6157k6005
$$ 642071 670351 480288 552839 477929 374250 372420 267720 235683 312594 226437 200432
1957B00432p0189N2915M6993k12542p6164Q4355J32028k13628J16039O6202J3276
$$ 200432 130243 183158 230151 17609 -58555 25800 157828 -55800 60239 126441 139717
1946A39717n8114j28789J38628J31352J68597j60696l5885K753M6409k49539j51446
$$ 139717 81603 -47186 91442 222794 391391 230695 194810 197563 243972 -5567 -157013
1935a57013K33653J24884J1663l3943J28230j42616L8024j59612k7151l1962M819
$$ -157013 76640 201524 213187 179244 307474 164858 202882 43270 16119 -15843 -11024
1924a1024j65552R7751K73855n026K1862k51064K7782M8223N5830j43699j9503
$$ -11024 -176576 -78825 195030 190004 211866 -39198 -11416 36807 92637 -51062 -70565
1913g0565P4492N3119k12930J41488O3219K9157L2831J187k51533o3037K29208
$$ -70565 3927 57046 -155884 -14396 48823 77980 110811 111998 -139535 -202572 26636
1902B6636J33631P1017j11056k00012j00151K50879L6966j15274r8737R8408m4315
$$ 26636 160267 231284 120228 -79784 -179935 70944 107910 -7364 -106101 -7693 -52008
1891e2008J00490L3569J58563r1448l21944Q4523O778p4917J18297Q1139Q6034
$$ -52008 48482 82051 240614 149166 -172778 -88255 -81477 -156394 -38097 43042 129076
1880A29076n9071m8037M9577m8119p1142K8282O2473j8951j10736J1405K8230
$$ 129076 70005 21968 71545 23426 -47716 -19434 43039 24088 -86648 -75243 -47013
1869d7013J00268J11218j17503R5560n5250K18140K7556j41562j68366J4444K9579
$$ -47013 53255 164473 46970 142530 87280 305420 332976 191414 23048 37492 67071
1858F7071m5901K03402Q6373n7288j01162j47269N7084K21105k45606r0560K13936
$$ 67071 21170 224572 310945 253657 152495 5226 62310 283415 37809 -52751 161185
1847A61185Q5785j59535j75661J91110p262P6708K8641M3741P8430J42678J34474
$$ 161185 246970 87435 -88226 102884 95622 172330 200971 244712 323142 465820 600294
1836F00294q2163q1785j23395K4908M3841n686r6319r5834j68372K3796j18105
$$ 600294 518131 436346 312951 337859 381700 376014 279695 183861 15489 39285 -78820
1825g8820J12968k7595N6930k157p0887L1832n786O8249k43989J81319K11126
$$ -78820 34148 6553 63483 61326 -9561 22271 16485 84734 -159255 22064 233190
1814B33190j99255j44810Q5932K20661q4759j10309J96149j97548N4664J16408
$$ 233190 33935 -110875 -24943 195718 110959 650 196799 -749 53915 170323
1804A70323r5299j79186j44679j30948K35550J18832p8069K949K6115J34214K4815
$$ 170323 75024 -104162 -248841 -379789 -144239 -25407 -103476 -100527 -74412 59802 84617
1793H4617M4130m4450j63664j38657J42255O65O6274O6255J17480n4811l2848
$$ 84617 128747 84297 -79367 -218024 -75769 -75104 -8830 57425 174905 120094 87246
1782H7246j22487k660q5290j40301J39954J00654K8969j91120o3101K17163o9162
$$ 87246 -35241 -37901 -123191 -263492 -123538 -22884 6085 -185035 -248136 -30973 -100135
1771a00135k29436P5898J19785n9583J23366j76804K1852J32538m5656J96880
$$ -100135 -329571 -253673 -133888 -193471 -70105 -246909 -225057 -92519 -138175 58705
1761E8705j48696J63869J72026p137j01257o3900k10063J69962J50223j94000
$$ 58705 -89991 73878 245904 238767 137510 73610 -136453 33509 183732 -10268
1751a0268N571q2849J35692q6975k38087J38587Q9374l687j55618L0914K02439
$$ -10268 -4697 -87546 48146 -38829 -276916 -138329 -48955 -52642 -208260 -177346 25093
1740B5093j66094M6479J3588N7650j90398K25978J62578k09123q0932J29596j6534
$$ 25093 -141001 -94522 -80934 -23284 -213682 12296 174874 -34249 -115181 14415 -2119
1729b119o9347J01634n9731l7116K11632K09026m13896n5039J30106J09069k51239
$$ -2119 -71466 30168 -29563 -66679 144953 353979 -59917 -114956 15150 124219 -127020
1718a27020n5824K36314j1818j00512r451q6602k9140J92872m0589J72583l4148
$$ -127020 -182844 53470 41652 -58860 -68311 -154913 -184053 8819 -31770 140813 106665
1707A06665k68975r9085R1948K20720k19869r0894O1627L2202J44177p7281Q9485
$$ 106665 -162310 -261395 -169447 51273 -168596 -259490 -197863 -165661 -21484 -98765 -9280
1696i280r0442P9534K3862p42L6877q9882N7192M2571j75345R441k01916J28319
$$ -9280 -99722 -20188 3674 2932 39809 -50073 7119 49690 -125655 -116214 -318130 -189811
1684a89811P3678k3646J05228p849P3166j67562r1147m5512J14903p1093J02408
$$ -189811 -116133 -139779 -34551 -42400 30766 -136796 -227943 -273455 -158552 -229645 -127237
1673a27237K6402K00711Q5453l26749N131O7080N7934K8380j22701J96826J6439
$$ -127237 -100835 99876 185329 -141420 -136289 -69209 -11275 17105 -105596 91230 107669
1662A07669j09945l6775j93819M0503r5968o3446K70467j38083k6186o5945N1115
$$ 107669 -2276 -39051 -232870 -192367 -288335 -351781 -81314 -219397 -245583 -311528 -260413
1651b60413M3670O8756Q4349l7371o760J45697R5197j20951L2521n8557r2477
$$ -260413 -216743 -147987 -63638 -101009 -107769 37928 133125 12174 44695 -13862 -106339
1640a06339Q499K3700M6219r600J82152k4937p2753K5559j05957j21744J69957
$$ -106339 -97840 -74140 -27921 -37521 144631 119694 46941 72500 -33457 -155201 14756
1629A4756k57139j24269J14198J22671J06886L8097p1501p7508k6318j77319Q6371
$$ 14756 -242383 -366652 -252454 -129783 -22897 15200 -56301 -133809 -160127 -337446 -251075
1618b51075L1937j00346K2002J80514J94975O9531k48502j1664J36882P8574J5691
$$ -251075 -219138 -319484 -297482 -116968 78007 147538 -100964 -112628 24254 102828 118519
1607A18519j34958J36080J0002J3986k81854o3601N6334j92763K45368Q284N5684
$$ 118519 -16439 119641 129643 143629 -138225 -201826 -145492 -338255 -92887 -84603 -28919
1596b8919R255J19471N9695J28962k20802N731M4910j29352j66097O8699J21322
$$ -28919 -19664 99807 159502 288464 67662 73393 118303 -11049 -177146 -108447 12875
1585A2875m5126j78107J14696M4162J67409P5180j05071j86263N4281K36386k00502
$$ 12875 -32251 -210358 -95662 -51500 115909 191089 86018 -100245 -45964 190422 -10080
1574a0080P7049J36144k10092o6463J25502j5386k67468J6167J31053r2530j45903
$$ -10080 66969 203113 -6979 -73442 52060 36674 -230794 -214627 -83574 -176104 -322007
1563c22007j10135J74378J74758J09890L3318j91325M1567J61867r3123j53506
$$ -322007 -432142 -257764 -83006 26884 60202 -131123 -89556 72311 -20812 -174318
1553a74318J69504N9526r8004r1133l7099K51664j67353J68120j38669J7587N3930
$$ -174318 -4814 54712 -43292 -134425 -171524 80140 -87213 80907 -57762 -40175 13755
1542A3755j23416l4732J49479J5632J3090M648j89879l9630O1547J35458j00976
$$ 13755 -109661 -144393 5086 20718 33808 38456 -151423 -191053 -129506 5952 -95024
1531i5024O6814M3507J07912N3737k0267l6152j63594M5107j0623K67p8773l120
$$ -95024 -28210 15297 123209 176946 156679 120527 -43067 2040 -8583 -8316 -87089 -90209
1519i0209K8323K28285m7365j09759q1959j49004K8773L7239J47493j02954L8088
$$ -90209 -61886 166399 119034 9275 -72684 -221688 -192915 -155676 -8183 -111137 -73049
1508g3049J60744O0417m1997q6473J57549J25199j50809k96892J10571J31251
$$ -73049 87695 148112 106115 19642 177191 302390 151581 -145311 -34740 96511
1498I6511p6892R276n2731O1037O7709j5921k41512k3361o9591K03171m7225L349
$$ 96511 19619 28895 -23836 37201 104910 88989 -152523 -175884 -245475 -42304 -89529 -86180
1486h6180K59520j43727j03219j21426K9828P8883r9507j20442Q3840K90500p3821
$$ -86180 173340 29613 -73606 -195032 -165204 -86321 -185828 -306270 -222430 68070 -5751
1475e751j34720R0188K6429n0841J16035P1748o5196k17676J00763J53867j16773
$$ -5751 -140471 -50283 -23854 -74695 41340 113088 47892 -169784 -69021 84846 -31927
1464c1927k15877P7727K17559j42817J24273p7694M2092j81400j14061K22084
$$ -31927 -247804 -170077 47482 -95335 28938 -48756 -6664 -188064 -302125 -80041
1454h0041o6918j4709M3773k705J02064M3624J70427n8031k66966P096n1564O3775
$$ -80041 -146959 -161668 -117895 -120600 -18536 25088 195515 137484 -129482 -122386 -173950 -110175
1442a10175m301K5699q0208m5604Q7996M282J82289k6124j5902P1046P8752n1235
$$ -110175 -114476 -88777 -168985 -214589 -126593 -122311 59978 33854 17952 88998 167750 116515
1430A16515m2186N5804q4557q3113J48396j49591r7253J78728L5257r2563r5386
$$ 116515 74329 130133 45576 -37537 110859 -38732 -135985 42743 78000 -14563 -109949
1419a09949M8865L1907o5849k0237O5385p0420k2591q1182R8788K1411j57383
$$ -109949 -61084 -29177 -95026 -115263 -49878 -120298 -142889 -224071 -125283 -103872 -261255
1408b61255J70723J86970m5077p9337M8892j3823j47505l194Q1699p2197q0057
$$ -261255 -90532 96438 51361 -27976 20916 7093 -140412 -143606 -61907 -134104 -214161
1397b14161J15782J63156o5750L0276n5719P6180j9420K0497J10745k92589j46003
$$ -214161 -98379 64777 -973 29303 -26416 49764 30344 50841 161586 -131003 -277006
1386b77006M9797Q776N8649J38273J17280q8514m9740M2547m3527k00068J26878
$$ -277006 -227209 -218433 -159784 -21511 95769 7255 -42485 62 -43465 -243533 -116655
1375a16655J21359q6440J5238l4235j68574J43113R1848P4553n5198m8629N358
$$ -116655 4704 -81736 -66498 -100733 -269307 -126194 -34346 40207 -14991 -63620 -58262
1364e8262k64342L15375O3936k036o0104P8787k3442m6947k3739k56221j8758
$$ -58262 -322604 -7229 56707 54671 -5433 73354 49912 2965 -20774 -276995 -295753
1353b95753J48551K9084Q1116Q9175J7072j794J0657r5914j20847k4836J36574
$$ -295753 -147202 -118118 -37002 52173 69245 67451 78108 -17806 -138653 -163489 -26915
1342b6915K8373j8880o597j62522j81680o4071M062L07096J68161J578k30572
$$ -26915 1458 -17422 -24019 -186541 -368221 -432292 -428230 -121134 47027 48605 -181967
1331a81967J0958P5802k5060n9699M2431J11821L3507Q6871k49867r8842J52325
$$ -181967 -171009 -95207 -120267 -179966 -137535 -25714 7793 94664 -155203 -254045 -101720
1320a01720J13180n5799K01084J36252j75234j98166j24657p3503J12541J60578
$$ -101720 11460 -44339 156745 292997 117763 -80403 -205060 -278563 -166022 -5444
1310e444L3673j956j14878Q9711R5744k38167N4036J73871j87282J34843J6637
$$ -5444 28229 26273 -88605 1106 96850 -141317 -87281 86590 -100692 34151 50788
1299E0788k22063J377j8806J94058K1740J92143M4040n8959q6696n9769l8717
$$ 50788 -171275 -169898 -188704 5354 27094 219237 263277 204318 117622 57853 19136
1288A9136m9173j73658P6935J79648m1222j31657k3793Q5404p7681q4920q1466
$$ 19136 -30037 -203695 -126760 52888 11666 -119991 -143784 -58380 -136061 -220981 -302447
1277c02447J96635O2813J01007J8847J03618l1524l8025l9033r4936L118p3203
$$ -302447 -105812 -42999 58008 76855 180473 148949 110924 71891 -23045 -19927 -93130
1266i3130l6235j18306n725L1379J03026J26887L4448j03242J00535J05460l6512
$$ -93130 -129365 -247671 -253396 -222017 -118991 7896 42344 -60898 39637 145097 108585
1255A08585j22264o607L5982J72504k99390j57377N5782J85652J82357n9360k9779
$$ 108585 -13679 -20286 15696 188200 -111190 -268567 -212785 -27133 155224 95864 66085
1244F6085j2500Q5726k45646N9064J18743o4061K03829n5923j44098j2668n9557
$$ 66085 53585 139311 -106335 -47271 71472 7411 211240 155317 11219 -1449 -61006
1233f1006k0411J16168q6907j65589J10289J26321j02657J05409L7564N5095O8893
$$ -61006 -81417 34751 -52156 -217745 -107456 18865 -83792 21617 59181 114276 183169
1222A83169j51314k9733p3826j9500O7598N3922j02993J13323R3694j68615R839
$$ 183169 31855 2122 -71704 -91204 -23606 30316 -72677 40646 134340 -34275 -24436
1211b4436J4341l27017R0305J67466K14503J5259q9202j4786o6438L3023q4094
$$ -24436 -10095 -337112 -246807 -79341 135162 150421 61219 46433 -20005 13018 -71076
1200g1076J26032J47336j7825j88503k13833J25148J32471j29882l2265o8832
$$ -71076 54956 202292 184467 -4036 -217869 -92721 39750 -90132 -122397 -191229
1190a91229J36578J58234l1151J11542l7632j08706m0485m2780M7315l9731j347
$$ -191229 -54651 103583 72432 183974 146342 37636 -2849 -45629 1686 -38045 -39392
1179c9392Q8090p884o520j0055o5377p1152L14693n6817o2565p3740m9267j82330
$$ -39392 48698 40814 34294 24239 -41138 -112290 202403 145586 83021 9281 -39986 -222316
1167b22316Q7570J873j5650r1208K38711M2158r6526J87796j20250N4330k28361
$$ -222316 -134746 -132873 -148523 -239731 -1020 41138 -55388 132408 12158 66488 -161873
1156a61873L70675O2179r4738k0305j19187K4285j38738Q8771j72857j87K31676
$$ -161873 208802 270981 176243 155938 36751 61036 -77702 11069 -161788 -161975 69701
1145F9701k31882P3692o5633k9391Q8306J21981R0500m0847o4089P8635o0135
$$ 69701 -162181 -88489 -154122 -183513 -95207 26774 117274 76427 12338 90973 30838
1134C0838j55800Q3279J06818K79459r2234k62630p9241L2305n910k486r0783
$$ 30838 -124962 -41683 65135 344594 252360 -10270 -89511 -57206 -63116 -65602 -156385
1123a56385l7548M5369N0042J3567O0788j6851l670j09774J46514m3864n3821
$$ -156385 -193933 -148564 -98522 -84955 -24167 -41018 -44688 -154462 -7948 -51812 -105633
1112a05633J76399k47149j74822R8955J42218n7557k4052r7065R2566J53984Q9416
$$ -105633 70766 -176383 -351205 -252250 -110032 -167589 -191641 -288706 -196140 -42156 47260
1101D7260P2740K7140k38074J19135J40032k13487q5188J3810j630j08252L0703
$$ 47260 120000 147140 -90934 28201 168233 -45254 -130442 -116632 -118262 -226514 -195811
1090a95811N9356O8912P2071J79344O436l0909K18k60703o0607J75815P2132j03744
$$ -195811 -136455 -67543 4528 183872 190308 159399 159617 -101086 -161693 14122 86254 -17490
1078a7490J96401r26k45428J3419l1772j3492Q6423j64405K6414l0417J28266
$$ -17490 178911 177985 -67443 -54024 -85796 -99288 -12865 -177270 -150856 -181273 -53007
1067e3007K0403k88810J41152J86092j12728P3774P0026N2969j04398l6224j07921
$$ -53007 -32604 -321414 -180262 5830 -106898 -33124 36902 89871 -14527 -50751 -158672
1056a58672O143K18614N5296j07531j13795n4085J38913J1947o5181j25019r6264
$$ -158672 -152529 66085 121381 13850 -99945 -154030 -15117 -3170 -68351 -193370 -289634
1045b89634l4425K20894J13230o6045J25239k56361l5238M7925P2871K17672o3978
$$ -289634 -324059 -103165 10065 -55980 69259 -187102 -222340 -174415 -101544 116128 52150
1034E2150l39862K10109p7329m4305J94577J09676j83470l06667k1682J98419
$$ 52150 -287712 -77603 -154932 -199237 -4660 105016 -78454 -385121 -406803 -208384
1024b08384N2909j20285K57936N6132j78111J00029J71011O9043k35988J50168
$$ -208384 -155475 -275760 -17824 38308 -139803 -39774 131237 200280 -35708 114460
1014A14460K09675l24275K7529K0440m2802n7935Q6504L9288j73081K33106m6462
$$ 114460 324135 -140 27389 47829 5027 -52908 33596 72884 -100197 132909 86447
1003H6447q6279l4176N2749M0615j76705m7299j89149J18232K92662k28840K13323
$$ 86447 168 -34008 18741 59356 -117349 -164648 -353797 -235565 57097 -171743 41580
$$ [...]
##END NTUPLES=NMR SPECTRUM
##END=
