##TITLE=1H_TG-2357-B
 CDCl3
 8 sc, 
 30.09.2022
##JCAMPDX= 6.0         $$ Bruker NMR JCAMP-DX V2.0
##DATA TYPE= NMR SPECTRUM
##DATA CLASS= NTUPLES
##ORIGIN= UXNMR, Bruker Analytische Messtechnik GmbH
##OWNER= root
$$ XWIN-NMR		Version 3.5
$$ Fri Sep 30 13:52:07 2022 Russian Standard Time (UT+4h)  she@DPX200
##.OBSERVE FREQUENCY= 200.1313499994
##.OBSERVE NUCLEUS= ^1H
##.ACQUISITION MODE= SIMULTANEOUS
##.ACQUISITION SCHEME= undefined
##.AVERAGES= 8
##.DIGITISER RES= 18
##SPECTROMETER/DATA SYSTEM= spect
##.PULSE SEQUENCE= zg30
##.SOLVENT NAME= CDCl3
##.SHIFT REFERENCE= (INTERNAL, CDCl3, 0, 15.7458)
##AUDIT TRAIL= $$ (NUMBER, WHEN, WHO, WHERE, WHAT)
$$ ##TITLE= Audit trail, XWIN-NMR		Version 3.5
$$ ##JCAMPDX= 5.01
$$ ##ORIGIN= Bruker BioSpin GmbH
$$ ##OWNER= she
$$ F:/spectra/data/she/nmr/H-F/1/pdata/1/auditp.txt
$$ ##AUDIT TRAIL=  $$ (NUMBER, WHEN, WHO, WHERE, WHAT)
(   1,<2022-09-30 13:50:41.68 +0400>,<she>,<DPX200>,
      <created by zg, POWCHK disabled, PULCHK disabled
       configuration hash MD5:
       00 E9 B6 7A A2 85 ED C7 34 08 36 98 17 FE 4E 26
       data hash MD5: 16K
       91 76 B5 20 99 35 57 27 AE 12 92 43 26 7D 42 CA>)
(   2,<2022-09-30 13:50:45.45 +0400>,<she>,<DPX200>,
      <Start of raw data processing
       efp BC_mod = 2 LB = 0.24 FT_mod = 6 PKNL = 1 PHC0 = -18198.4 PHC1 = 12.60069 SI = 16K 
       data hash MD5: 16K
       E3 EF 41 78 70 22 89 83 6C E4 C2 0A 08 A4 2D 28>)
(   3,<2022-09-30 13:51:01.35 +0400>,<she>,<DPX200>,
      <pk PHC0 = 163.55 PHC1 = -0.8 
       data hash MD5: 16K
       EF A0 9D 4D 2A D4 BA 0A 61 21 51 13 FC 3D 58 11>)
(   4,<2022-09-30 13:51:04.51 +0400>,<she>,<DPX200>,
      <abs ABSG = 5 
       data hash MD5: 16K
       82 17 EB 1F 02 6D 28 C2 D8 C7 27 2E 87 4E EC C1>)
$$ ##END=
$$ 
$$ hash MD5
$$ E9 19 FD 7B ED AD A4 6C 5D 90 AD 5D F5 60 84 FD
##$RELAX= 
##$RELAX= 
##$RELAX= 
##$RELAX= 
##$RELAX= 
##$RELAX= 
$$ Bruker specific parameters
$$ --------------------------
##$DU= <F:/spectra>
##$EXPNO= 1
##$NAME= <H-F>
##$PROCNO= 1
##$TYPE= <nmr>
##$USER= <she>
##$AMP= (0..31)
100 100 100 100 100 100 100 100 100 100 100 100 100 100 100 100 100 100 
100 100 100 100 100 100 100 100 100 100 100 100 100 100 
##$AQSEQ= 0
##$AQ_mod= 1
##$AUNM= <au_zg>
##$AUTOPOS= <>
##$BF1= 200.13
##$BF2= 200.13
##$BF3= 200.13
##$BF4= 200.13
##$BF5= 200.13
##$BF6= 200.13
##$BF7= 200.13
##$BF8= 200.13
##$BYTORDA= 1
##$CFDGTYP= 0
##$CFRGTYP= 5
##$CHEMSTR= <none>
##$CNST= (0..31)
1 1 145 1 1 1 1 1 1 1 1 1 1 1 1 1 1 1 1 1 1 1 1 1 1 1 1 1 1 1 1 1 
##$CPDPRG= <>
##$CPDPRG1= <>
##$CPDPRG2= <>
##$CPDPRG3= <>
##$CPDPRG4= <mlev>
##$CPDPRG5= <mlev>
##$CPDPRG6= <mlev>
##$CPDPRG7= <mlev>
##$CPDPRG8= <mlev>
##$CPDPRGB= <>
##$CPDPRGT= <>
##$D= (0..31)
0 1.2 0 0 0 0 0 0 0 0.06 0 0.03 0 0 0 0 0.0002 0 0 0 0 0 0 0 0 0 0 0 0 
0 0 0 
##$DATE= 1664531441
##$DBL= (0..7)
120 120 120 120 120 120 120 120 
##$DBP= (0..7)
150 150 150 150 150 150 150 150 
##$DBP07= 0
##$DBPNAM0= <>
##$DBPNAM1= <>
##$DBPNAM2= <>
##$DBPNAM3= <>
##$DBPNAM4= <>
$$ [...]
##$SUBNAM3= <"">
##$SUBNAM4= <"">
##$SUBNAM5= <"">
##$SUBNAM6= <"">
##$SUBNAM7= <"">
##$SUBNAM8= <"">
##$SUBNAM9= <"">
##$SW= 18.0517283424941
##$SWIBOX= (0..15)
0 0 2 0 0 0 0 0 0 0 0 0 0 0 0 0 
##$SW_h= 3612.71676300578
##$TD= 16384
##$TD0= 1
##$TE= 0
##$TE2= 300
##$TE3= 300
##$TEG= 300
##$TL= (0..7)
0 120 120 120 120 120 120 120 
##$TP= (0..7)
150 150 150 150 150 150 150 150 
##$TP07= 0
##$TPNAME0= <>
##$TPNAME1= <>
##$TPNAME2= <>
##$TPNAME3= <>
##$TPNAME4= <>
##$TPNAME5= <>
##$TPNAME6= <>
##$TPNAME7= <>
##$TPOAL= (0..7)
0.5 0.5 0.5 0.5 0.5 0.5 0.5 0.5 
##$TPOFFS= (0..7)
0 0 0 0 0 0 0 0 
##$TUNHIN= 0
##$TUNHOUT= 0
##$TUNXOUT= 0
##$USERA1= <user>
##$USERA2= <user>
##$USERA3= <user>
##$USERA4= <user>
##$USERA5= <user>
##$V9= 5
##$VALIST= <valist>
##$VCLIST= <CCCCCCCCCCCCCCC>
##$VD= 0
##$VDLIST= <DDDDDDDDDDDDDDD>
##$VPLIST= <PPPPPPPPPPPPPPP>
##$VTLIST= <TTTTTTTTTTTTTTT>
##$WBST= 1024
##$WBSW= 4
##$XGAIN= (0..3)
0 0 0 0 
##$XL= 0
##$YL= 0
##$YMAX_a= 224714
##$YMIN_a= -385698
##$ZGOPTNS= <>
##$ZL1= 120
##$ZL2= 120
##$ZL3= 120
##$ZL4= 120
##$ABSF1= 15.76452
##$ABSF2= -2.28733
##$ABSG= 5
##$ABSL= 3
##$ALPHA= 0
##$AQORDER= 0
##$ASSFAC= 0
##$ASSFACI= 0
##$ASSFACX= 0
##$ASSWID= 0
##$AUNMP= <proc_1d>
##$AZFE= 0.1
##$AZFW= 0.1
##$BCFW= 0
##$BC_mod= 2
##$BYTORDP= 0
##$COROFFS= 0
##$CY= -3
##$DATMOD= 1
##$DC= 0
##$DFILT= <>
##$DTYPP= 0
##$F1P= 0
##$F2P= 0
##$FCOR= 1
##$FTSIZE= 16384
##$FT_mod= 6
##$GAMMA= 0
##$GB= 0
##$INTBC= 1
##$INTSCL= 3.70164e-10
##$ISEN= 128
##$LB= 0.24
##$LEV0= 0
##$LPBIN= 0
##$MAXI= 10000
##$MC2= 0
##$MEAN= 0
##$ME_mod= 0
##$MI= 1.114404
##$NCOEF= 0
##$NC_proc= -6
##$NLEV= 6
##$NOISF1= 3.799351
##$NOISF2= 2.8
##$NSP= 0
##$NTH_PI= 0
##$NZP= 0
##$OFFSET= 15.74579
##$PC= 1
##$PHC0= -18034.85
##$PHC1= 11.80069
##$PH_mod= 1
##$PKNL= yes
##$PPARMOD= 0
##$PSCAL= 0
##$PSIGN= 0
##$REVERSE= no
##$SF= 200.130005153007
##$SI= 16384
##$SIGF1= 3
##$SIGF2= 2
##$SINO= 5.538805
##$SIOLD= 16384
##$SREGLST= <1H.CDCl3>
##$SSB= 0
##$STSI= 16384
##$STSR= 0
##$SW_p= 3612.71676300578
##$SYMM= 0
##$S_DEV= 0
##$TDeff= 16384
##$TDoff= 0
##$TI= <>
##$TILT= no
##$TM1= 0
##$TM2= 0
##$TOPLEV= 0
##$USERP1= <user>
##$USERP2= <user>
##$USERP3= <user>
##$USERP4= <user>
##$USERP5= <user>
##$WDW= 1
##$XDIM= 16384
##$YMAX_p= 306133921
##$YMIN_p= -363913
$$ End of Bruker specific parameters
$$ ---------------------------------
##NTUPLES= NMR SPECTRUM
##VAR_NAME=  FREQUENCY,     SPECTRUM/REAL,   SPECTRUM/IMAG
##SYMBOL=    X,             R,               I
##VAR_TYPE=  INDEPENDENT,   DEPENDENT,       DEPENDENT
##VAR_FORM=  AFFN,          ASDF,            ASDF
##VAR_DIM=   16384,         16384,           16384
##UNITS=     HZ,            ARBITRARY UNITS, ARBITRARY UNITS
##FACTOR=    0.220516191357247, 1,           1
##FIRST=     3151.2049393554, 0,             0
##LAST=      -461.511823650377, 0,           0
##MIN=       -461.511823650377, -363913,     0
##MAX=       3151.2049393554, 306133921,     0
$$ Real data points
##PAGE= N=1
##DATA TABLE= (X++(R..R)), XYDATA
$$ [...]
7059A7515419j849663k023775k117032j752969j518655j041893q64596p09448
7051E637388n19597l88779l72922m26497l27812k58842j29250j88220j21334j19786
7041B784349j18564p2610j89181k18160j46237p9867K4853l6462l6895j04175
7031A807051m745M0015j29228j11542k9581J4499l3922n8137o1362l4533k6169
7020A372346p5854J0222p7635r1222k8878J0610l8737j10196j18403K1948K0688
7009H94889j2956j39925N078N2993k0419l5907L7658m5987l8291j20061j8287
6998E58785L1988j03743O8325M5187q2450l5485L1982J12698o317j14350j13767
6987C92853o1333N1780L3721l4751M2651j0777q0228M4522J06825l4864o3791
$$ y = [17515419, 15665756, 13641981, 11524949, 9771980, 8253325, 7211432, 6346836, 5637388, 5117791, 4729012, 4356090, 3929593, 3601781, 3342939, 3213689, 3025469, 2904135, 2784349, 2665785, 2593175, 2403994, 2185834, 2039597, 1959730, 1984583, 1948121, 1911226, 1807051, 1802306, 1842321, 1713093, 1601551, 1571970, 1586469, 1552547, 1494410, 1433048, 1398515, 1372346, 1296492, 1306714, 1229079, 1137857, 1108979, 1119589, 1080852, 970656, 852253, 874201, 894889, 881933, 742008, 747086, 800079, 779660, 743753, 781411, 735424, 697133, 577072, 558785, 590773, 487030, 555355, 600542, 518092, 482607, 514589, 627287, 620970, 506620, 392853, 331520, 383300, 417021, 382270, 424921, 414144, 333916, 378438, 485263, 450399, 386608]
6976C86608K2060l5942J396m354l223k0863M7966n744J9600q4557k7119k6189
6964B69639L7345M0969l6219K2226J07559j05778j07571p8559M3002O6494P2301
6953C31408K9636k9549j11582q6377L0003K0345Q3731r6281K6964k3319L2899
6942B07878j28601Q5856n66m9217Q4865j5118j3909Q3085j645J3520n6234o70
6930B09244m2952J4649J7056m5555M2104J2016j8902j7441p6565J425L2302J9649
6918A47030N0746k7633l3973K4646j7013N0246J69301l0785o1869K4665o8026
6907B27335p2561n0810J20039J53138M5416L4288N8495J33617m4381M17N3628
6896F58621j46729p7909l2579M0106j6987j10524l908q5605L7377j36070j6340
$$ y = [386608, 408668, 372726, 374122, 369768, 366545, 345682, 393648, 387904, 407504, 322947, 295828, 269639, 306984, 347953, 311734, 333960, 441519, 335741, 228170, 149611, 192613, 259107, 331408, 361044, 331495, 219913, 133536, 163539, 183884, 267615, 171334, 198298, 174979, 207878, 79277, 165133, 164567, 115350, 200215, 185097, 171188, 254273, 252628, 266148, 209914, 209244, 166292, 180941, 197997, 152442, 194546, 206562, 187660, 170219, 93654, 95079, 127381, 147030, 197776, 170143, 136170, 160816, 143803, 194049, 363350, 332565, 270696, 295361, 227335, 154774, 103964, 224003, 377141, 422557, 456845, 515340, 648957, 604576, 604993, 658621, 511892, 433983, 401404, 441510, 424523, 313999, 310091, 224486, 261863, 125793, 109453]
6885A09453O3108R1304l0691k130k7021K3774L0290l6299p2722M0859q1819M7724
6873A55830j25903J79712R7450p4407r20m6417j40286O1336P9039q5074O0538
6862A60898j39996K0386R0121l8522l3226Q8566L2109j4600N469k4577j5880M4595
6850A75343n9042o783l8621J39378J6806L2528N335R6574k8896o9962O0096o3023
6838B59733k5107m3609p2234k4201J06300M9803k5290j3096Q024k8774N3791R4264
6826C39604l6803M2691M1835p0620j00565Q9556J25699p7461m0807j14445Q1258
6815B79942N1950n8384N1572j54405R196M7609K2177p7455l705K8664r6637L288
6803A03812k1271L4445j7789o483o2625P4979M6368j8004l1114o0038j646L5820
$$ y = [109453, 172561, 263865, 233174, 231044, 204023, 227797, 258087, 221788, 149066, 189925, 108106, 155830, 29927, 209639, 307089, 232682, 231762, 185345, 45059, 106395, 185434, 100360, 160898, 20902, 41288, 131409, 92887, 59661, 148227, 180336, 165736, 171205, 146628, 130748, 175343, 116301, 109518, 70897, 210275, 227081, 259609, 264944, 361518, 332622, 262660, 322756, 259733, 234626, 191017, 118783, 94582, 200882, 250685, 225395, 212299, 220323, 191549, 245340, 339604, 302801, 345492, 387327, 316707, 216142, 305698, 431397, 353936, 313129, 198684, 279942, 331892, 273508, 325080, 170675, 179871, 227480, 249657, 172202, 168497, 197161, 100524, 103812, 82541, 116986, 99197, 92714, 30089, 105068, 151436, 133432, 102318, 42280, 40634, 76454]
6791G6454K15200q0234p2194j79308Q6840L9197M0898n630L0701l1816k025O3406
6779A81489j36131p870K693N0236O0893O4496M7129j17254j20825m122K8356L1563
6767H0653R8224m2339p5765N1507j0527l5352n6231P0054J29769J706q322o2965
6755A40412m2405j5516Q010O6654k5200n0410q8372M0872q9527L0010J31175K8452
6743A34155N0717j3597j31902J62477j20557l6703P2969K6133m9898P1026q2841
6732H1979p3756J17846j973r6962Q2554R1219P975O2214k1835q2716r299j751
6720A55495J3607L2731Q6323r020m88J1659p532J69891J9922j16335o2904P5131
6708C68480M5738l6244q6854n1732K731J734j06204K6362L4571q0997m93O4151
$$ y = [76454, 291654, 211420, 139226, -40082, 46758, 85955, 126853, 121223, 151924, 120108, 118083, 181489, 45358, 37488, 40181, 90417, 151310, 215806, 262935, 145681, 24856, 20734, 49090, 80653, 178877, 136538, 60773, 112280, 101753, 66401, 10170, 80224, 209993, 211699, 203377, 140412, 98007, 82491, 90501, 157155, 131955, 81545, -6827, 34045, -55482, -25472, 105703, 134155, 184872, 171275, 39373, 201850, 81293, 44590, 117559, 143692, 93794, 164820, 81979, 8223, 126069, 124096, 27134, 109688, 200907, 208882, 271096, 249261, 166545, 157246, 155495, 169102, 201833, 288156, 279136, 278648, 290307, 282775, 452666, 472588, 356253, 293349, 368480, 414218, 377974, 291120, 239388, 242119, 243853, 137649, 164011, 198582, 117585, 117092, 181243]
6696A81243k7623N0291j08408k7391L0385P8680O512n9610L3360K4062J6143l0579
6684A67065L2057j6865r9M7265p6356j3114p2427K7575o2063O4675j3497J3381
6672I7597n1409P9277L5244q0655j4348J09816K6434j7175p9573r2541J23354
6661A36021Q0435J3155r0796M1498n4603J3715L6661L2649j393m6314N166n1131
6649A15063J2693P1527m1270K674k5204j23470J6348J117j15641J06929J62369
6638A83135m1385o5434J08873m7582o3633J363l7001K3993K8937J2399K1488j01561
6626B3592m976M207R8839O8252K4370J07384j31523p5380p1628l3760N8709K1383
6614H9469M9345J0570J6667n7514r3051P2252M6050q3560J32656r8785P21k0387
$$ y = [181243, 153620, 203911, 95503, 68112, 98497, 177177, 183689, 124079, 157439, 181501, 197644, 167065, 199122, 182257, 182158, 229423, 153067, 139953, 67526, 95101, 33038, 97713, 84216, 97597, 46188, 125465, 160709, 80054, 65706, 175522, 201956, 184781, 105208, 12667, 136021, 216456, 229611, 138815, 180313, 125710, 139425, 176086, 208735, 207342, 161028, 166194, 115063, 127756, 199283, 158013, 160687, 135483, 12013, 28361, 29478, -86163, 20766, 183135, 141750, 76316, 185189, 137607, 73974, 75337, 38336, 62329, 91266, 103665, 125153, 23592, 18616, 22823, 121662, 189914, 214284, 321668, 190145, 114765, 43137, 9377, 68086, 89469, 138814, 149384, 166051, 108537, 15486, 87738, 133788, 50228, 182884, 84099, 84820, 64433]
6602F4433J7530N0540J3970M3871j6814q7575J2243R558m0209P295j6565J00132
6590A58409N6810q8729j09402M3905M8537N8461J2232K656L9263l5969j12209
6579G3964K6276R128o2288j7931J00097N1345J7690J2323j65116J7835Q9809j3302
6567A39830O486L4380K0806p2241j9532q406J8010L493O941j5049K8215o7792
6555G5141q5171J09749j7039J9654N4346l1920R328m7576J8761r2829O3079m0140
6543C5383N4963Q0846j973m5767j22361K0080K2839J13840j5573r1339l0536Q20
6531B1222N4018r963J8207O0062m7715n4076K7064k7776P6075L7307j52284k610
6519d69L912N8809j8102P97o5668q919Q324P0590K4622M55k2777P7449J92333
$$ y = [64433, 81963, 132503, 146473, 190344, 173530, 85955, 98198, 107756, 67547, 74842, 58277, 158409, 215219, 126490, 17088, 60993, 109530, 167991, 180223, 182879, 222142, 186173, 73964, 100240, 109368, 47080, 29149, 129246, 180591, 198281, 210604, 45488, 63323, 153132, 139830, 146316, 180696, 201502, 129261, 109729, 101323, 119333, 122826, 129767, 114718, 142933, 75141, -10030, 99719, 82680, 102334, 156680, 124760, 134088, 86512, 105273, 12444, 75523, 35383, 90346, 171192, 169219, 123452, 1091, 21171, 44010, 157850, 142277, 50938, 20402, 21222, 75240, 65277, 83484, 143546, 95831, 41755, 68819, 41043, 117118, 154425, 2141, -469, 3443, 62252, 44150, 44947, -20721, -29640, -21316, 49274, 73896, 74351, 51574, 129023, 321356]
6506C21356r0688r0150l751k9477p1290O229J15799Q0671o5577j50903n5758P5526
6494D1987L4394M4578L9368q1952Q9455M3979j33980k8790l5708N3748M7715o272
6482A08522L1859J1328n1071o636K0185p839M658J4485o6332L9060j13593P5851
6470F0477J8824o559N9342O2860r7723R925m19m7423P6568M3547o1710J942Q6980
6457B06631r8609m7485M5516N0347o2797l882j2441M2275m5100P807P9873n2659
6445A09476K4384J06930J4724q7417l1061N2344O0637n071j10902L6729n1227
6434A19546O1451J30219j33440Q24J0292n3263P3389R4118l277j9385N0619p8174
6422B52919L8715r6056n4566j2073j2454M509J27659l8077l2929J1472k718R746
$$ y = [321356, 230668, 140518, 136767, 107290, 36000, 42229, 158028, 238699, 173122, 22219, -33539, 41987, 76381, 120959, 160327, 78375, 167830, 211809, 77829, 49039, 13331, 67079, 114794, 108522, 140381, 151709, 100638, 94002, 114187, 106348, 111006, 125491, 59159, 98219, -15374, 60477, 79301, 72742, 132084, 194944, 97221, 107146, 106727, 59304, 135872, 179419, 117709, 119651, 206631, 108022, 60537, 106053, 156400, 93603, 89721, 77280, 119555, 74455, 82262, 162135, 109476, 133860, 240790, 255514, 168097, 137036, 189380, 250017, 244946, 134044, 170773, 119546, 180997, 311216, 177776, 178600, 188892, 135629, 209018, 303136, 299859, 280474, 331093, 252919, 291634, 195578, 141012, 128939, 116485, 120994, 248653, 210576, 177647, 189119, 186401, 196147]
6410A96147m034M6237L988l3968j18852J9412k9092J7487L3490j3734N9867j40661
6398C6287Q411N3987K9933Q4714K6107J1744o1944m5764Q7737L2541l8650J18872
6386C43975r325k2940m9645j50n5962j3859L3603m9137n344p7129M7369P9408
6374B20864J4350l180J03649M9685j13968M3223j1669j18505L5648O2457l122
6363B79432j0325J8983J6675P5552o2841m2699j9841j27503K7981Q5495P4377
6352C15286r5802q282m932m1894K5894N5812j6375k2599Q990j0389n2295N593
6340A59007l9709J4451j0319Q9776O0135n5713O9484o5773M1998Q6165j04817
6329B44685L0885j5286L8112j0229j7733q079j5585l4210J8639k6483K3686J7320
$$ y = [196147, 192113, 238350, 242338, 208370, 89518, 108930, 79838, 97325, 130815, 117081, 176948, 36287, 44698, 98685, 128618, 213332, 239439, 251183, 189239, 143475, 231212, 263753, 225103, 343975, 334650, 311710, 262065, 261915, 205953, 192094, 225697, 176560, 171216, 94087, 141456, 220864, 235214, 232034, 335683, 385368, 271400, 314623, 302954, 184449, 220097, 282554, 279432, 269107, 288090, 304765, 380317, 317476, 274777, 254936, 127433, 155414, 240909, 315286, 219484, 211202, 206270, 164376, 190270, 246082, 229707, 207108, 216098, 205709, 153414, 159007, 119298, 133749, 123430, 213206, 273341, 217628, 287112, 221339, 263337, 349502, 244685, 275570, 260284, 298396, 288167, 270434, 262355, 246770, 212560, 231199, 204716, 228402, 245722]
6317B45722L601M3593o7487M2225K0159k0987r911L8152l8628K9182M6374M9812
6305C81807M3138j45424q4142P5002j0557K3192q778Q7223k3944j92434J15543
6294B60626O2762K3950N5215o690j1763L7487p7033l0609j2441J429P3479l4751
6282C41661M2313r159J67937j3798r013j31272O2660J5240q1604j5572J39347
6271E08740L4686j64122M7013j4552n7099P6311N2814N3752o7647m81K4881K4871
6259E19167n285o2611O878l0123k3370p3081O1165L2907m8555M2276K3078o277
6247D36169R0993J4284J7884n0250n8113L2581M142R6817o28j08870J6989N6925
6235E48923M2116m8245Q100K5949Q6394l4643N5809O2203r0829q0009J0929k6941
$$ y = [245722, 249323, 292916, 225429, 267654, 287813, 266826, 256915, 295067, 256439, 285621, 331995, 381807, 424945, 279521, 195379, 270381, 259824, 283016, 274238, 361461, 337517, 145083, 260626, 323388, 347338, 402553, 395863, 384100, 421587, 344554, 313945, 301504, 302933, 376412, 341661, 383974, 374815, 542752, 528954, 519941, 388669, 451329, 466569, 384965, 369393, 508740, 543426, 379304, 426317, 411765, 354666, 430977, 483791, 537543, 469896, 469415, 494296, 519167, 513882, 451271, 458149, 428026, 404656, 331575, 392740, 425647, 377092, 419368, 442446, 436169, 527162, 541446, 559330, 509080, 450967, 483548, 487690, 584507, 583879, 475009, 491998, 548923, 591039, 542794, 550894, 576843, 663237, 628594, 684403, 746606, 655777, 575768, 586697, 559756]
6223E59756M6185P0936J18841J507r645n4283K1816N3413J3529J5154q3815K2022
6211G75416J1274k8723R1039Q306K4127p751l7265p9152N6187P8671O0928m983
6199I48074N2082R059N0811J9653p1866m9305L5776Q9675K2297j7826K3168K9553
6187A141151j6586O5128n7215n4459k327Q3881K4270Q8165L752Q861O5814O619
6175A357054l0153J7747O5792l3019l2515O4639j08303k410P2918P8727O8063
6164A518540J28864M813l2101M8419l908O928M6530m0057R6074J18492P7025n7916
6152A911703q2556L0212R1354Q5648J12388O2000Q7850J60700Q9356L4236J49512
6141B732403K6677o5963J6410K05351J64055l1199L7994J50499N3488J04204J90571
$$ y = [559756, 605941, 676877, 795718, 797225, 787580, 733297, 755113, 808526, 822055, 837209, 753394, 775416, 786690, 757967, 849006, 857312, 881439, 873688, 836423, 757271, 813458, 892129, 953057, 948074, 1000156, 1009215, 1060026, 1079679, 1007813, 958508, 994284, 1083959, 1106256, 1088430, 1111598, 1141151, 1124565, 1189693, 1132478, 1078019, 1075692, 1159573, 1183843, 1272008, 1275760, 1284621, 1350435, 1357054, 1326901, 1344648, 1410440, 1377421, 1344906, 1409545, 1301242, 1298832, 1371750, 1450477, 1518540, 1647404, 1652217, 1620116, 1668535, 1664627, 1671555, 1718085, 1678028, 1774102, 1892594, 1969619, 1911703, 1829147, 1859359, 1950713, 2036361, 2148749, 2210749, 2298599, 2459299, 2548655, 2582891, 2732403, 2759080, 2693117, 2709527, 2914878, 3078933, 3047734, 3085728, 3236227, 3289715, 3393919, 3584490]
6130C584490Q2353J43503P7213Q4897K50995K10570L38148K05730K17624K96200
6120E491723L68433L55006L71652N46129P04026R31901Q12055J046836J251234
6111A1878995J473549J735850J883503J327040O40347k86441j023477j128236
6103A6501130j099425n85478q6414J87597P52962J114598J256330P41248n9341
6094A8723207j220858j782678j923508j792323j369426j138792p47728o11457
6086H136437m48488m10884j91299l08952j90230j79684n1659L5899l3564J96956
6076F554532K11271K56456J30666P1932J92761K38200K80343L16304L68996M46845
6066I068306M82910P36907P22659R98375J287408J478514J755642J973395K251704
$$ y = [3584490, 3666843, 3810346, 3887559, 3972456, 4223451, 4434021, 4772169, 4977899, 5195523, 5491723, 5860156, 6215162, 6586814, 7132943, 7836969, 8768870, 9580925, 10627761, 11878995, 13352544, 15088394, 16971897, 18298937, 18939284, 18652843, 17629366, 16501130, 15401705, 14816227, 14729813, 14917410, 15670372, 16784970, 18041300, 18782548, 18723207, 17502349, 15719671, 13796163, 12003840, 10634414, 9495622, 8747894, 8136437, 7687949, 7277065, 7085766, 6776814, 6586584, 6406900, 6355241, 6391140, 6357576, 6554532, 6765803, 7022259, 7152925, 7224857, 7417618, 7655818, 7936161, 8252465, 8621461, 9068306, 9551216, 10288123, 11010782, 12009157, 13296565, 14775079, 16530721, 18504116, 20755820]
6057B0755820K103453J290191N4303j003998j466211j463353j047310n01529J15345
6048A8836711O47177J232140J526384J318350L40443r14513j973949k478716k318551
6039A6215476k012410j647014j409328j056781j025693q71190o78507o27228m60582
6030F426743m85709l60029l03443j97880k51164l72496p9991m2215r8434j41896
6020D093486j71358n8095L9073j06168p3325j4568M6389l522K3048J7815O0197
6009C852972J83088J09846N2814P6797J15285K9086j62272k73358j64320k21584
5999C598354j70881j82547j67908n3511k9564n8952q3200O9548M1504j23305j8120
5988B821418j2792q801J3675j4705j0509l0072k7750P7549N200K00914J03953
$$ y = [20755820, 22859273, 24149464, 24203767, 23199769, 21733558, 20270205, 19222895, 18721366, 18836711, 19483888, 20716028, 22242412, 23560762, 23901205, 22986692, 21012743, 18534027, 16215476, 14203066, 12556052, 11146724, 10089943, 9064250, 8193060, 7514553, 6887325, 6426743, 5941034, 5581005, 5277562, 5079682, 4828518, 4456022, 4376031, 4333816, 4235382, 4093486, 3922128, 3864033, 3903106, 3796938, 3723613, 3709045, 3755434, 3751912, 3774960, 3792775, 3852972, 4036060, 4145906, 4198720, 4275517, 4390802, 4419888, 4257616, 3984258, 3819938, 3598354, 3427473, 3244926, 3077018, 3023507, 2993943, 2934991, 2851791, 2921339, 2962843, 2839538, 2821418, 2808626, 2799825, 2813500, 2798795, 2788286, 2758214, 2730464, 2808013, 2813213, 3014127, 3118080]
5977C118080o2597N8655M0747J27805J41475J00815p0789j6688J7493k2174n5307
5966C377515k154p7926m2721n683O1292Q6642p090O0637J45465J26742N4331L0272
5954C807322L5414J05151J71499K04695M0672K56100J12147j4398J32617n653
5944D845566K6798J43424J79585O2601L27788R2993R6027J12058P3662J12661
5934F073163J57488O6365P6092J84678J60142J46289J78749J66362K43780J76037
5924G629145J71186J73535J81651L69777L62973K85984K49950K57271K62339L12955
5914A0256766K39971J29911J56801L64442M63407M52208M48365O16002M10522
5905A3538395N04755N67845O24796O21669Q10347Q89766P87094O56171L94758
$$ y = [3118080, 3055483, 3114138, 3154885, 3282690, 3424165, 3524980, 3454191, 3437503, 3454996, 3432822, 3377515, 3375361, 3297435, 3254714, 3249031, 3310323, 3396965, 3389875, 3450512, 3595977, 3722719, 3777050, 3807322, 3842736, 3947887, 4119386, 4324081, 4364753, 4620853, 4733000, 4718602, 4851219, 4845566, 4872364, 5015788, 5195373, 5257974, 5585762, 5678755, 5774782, 5886840, 5960502, 6073163, 6230651, 6297016, 6373108, 6557786, 6717928, 6864217, 7042966, 7209328, 7453108, 7629145, 7800331, 7973866, 8155517, 8525294, 8888267, 9174251, 9424201, 9681472, 9943811, 10256766, 10496737, 10626648, 10783449, 11147891, 11611298, 12063506, 12511871, 13127873, 13538395, 14043150, 14610995, 15235791, 15857460, 16667807, 17557573, 18344667, 19000838, 19395596]
5896A9395596K57751J86389K23857L81312N51602N17234Q02755R22698J168597
5887B4407791J282199J577920J742285J852522K188849K034211K042138J916383
5879C9044298J516454R55112M49372l9299m74034o91330q67698r46053p47566
5870C8199256p01651p11614m23455p11410j456842j932729k535241k826822k594187
5861B4305305k400770k146561j689695j334091j089382p19270o08762m66653m73105
5852A3377016m39450k75446l17000k91526j68367j59732q7440j1159R2271K39027
5842A1958194K99901M61233N11793P57034R28604J133136J082091P19598L3099
5833A7884683p91541j437977j715447j662639j490883j220660q95641o70250n12494
$$ y = [19395596, 19653347, 19839736, 20063593, 20444905, 20996507, 21513741, 22316496, 23239194, 24407791, 25689990, 27267910, 29010195, 30862717, 33051566, 35085777, 37127915, 39044298, 40560752, 41515864, 41965236, 41925937, 41451903, 40760573, 39892875, 38946822, 38199256, 37497605, 36785991, 36362536, 35651126, 34194284, 32261555, 29726314, 26899492, 24305305, 21904535, 19757974, 18068279, 16734188, 15644806, 14925536, 14316774, 13850121, 13377016, 12937566, 12662120, 12345120, 12053594, 11885227, 11725495, 11638055, 11626896, 11719167, 11958194, 12258095, 12719328, 13231121, 13988155, 14916759, 16049895, 17131986, 17851584, 17884683, 17093142, 15655165, 13939718, 12277079, 10786196, 9565536, 8669895, 7999645, 7487151]
5824G487151m38786k92648k93727k95944j03777j89300j91952l9043j417l2508
5814E608049m5079K0002q098J48561J45576J78720K56441K19716K93868L52885
5804G170641L69101K33196r6406k85214m65872o13411m98694l38428m41013l15199
5794D718701j58722j18370n8122j40411r7828j54833p1136R878j4930o8376Q5608
5783C931459r5696Q7136P7805p1462n3896R2456J20731Q0496n3130m4912J62586
5772D233573O860L0965J2903J57152L9229N0204J02731J38781K13374J79200M0008
5761E204980O4505J38232L29029K61683J82629L30909M30745M78321M55713N90697
5751H467443O16969Q37157J112659J216682J231768J468400J817721J846671J283978
$$ y = [7487151, 7048365, 6755717, 6461990, 6166046, 6062269, 5872969, 5681017, 5641974, 5640557, 5608049, 5562970, 5582972, 5574874, 5723435, 5869011, 6047731, 6304172, 6523888, 6817756, 7170641, 7539742, 7772938, 7676532, 7391318, 6925446, 6312035, 5813341, 5474913, 5033900, 4718701, 4559979, 4441609, 4383487, 4243076, 4145248, 3990415, 3919279, 3929157, 3914227, 3845851, 3931459, 3835763, 3922899, 4000704, 3929242, 3875346, 3967802, 4088533, 4169029, 4115899, 4070987, 4233573, 4240433, 4271398, 4284301, 4441453, 4480682, 4530886, 4633617, 4772398, 4985772, 5164972, 5204980, 5269485, 5407717, 5736746, 5998429, 6181058, 6511967, 6942712, 7421033, 7876746, 8467443, 9084412, 9921569, 11034228, 12250910, 13482678, 14951078, 16768799, 18615470, 19899448]
5742A9899448M68626m36189j135822j561399j891169j855328j445126r95206p77296
5733A0270539m86202l45611l02600j08871R038O3191J47076M46870L53903N51344
5723A0598677P71392P96189R68105J197004J340540J620104J874768J664152Q89516
5714B1720447M6383r49637j664348k073578k102023j733292j441562j032898o70724
5705A0098768n30311l07616j44986n4492l671K22997L77376M44615P29546P04324
5695A1536550R18094J080933J330940J049302N87580N6465o69719j153412j453797
5686A3282936j548434j317390q89386q63802o08078m62571k07676j11979j05195
5677G168425k3667O3293J69108K23944K84892N06849M89755O66974P55475R66524
$$ y = [19899448, 20368074, 19931885, 18796063, 17234664, 15343495, 13488167, 12043041, 11047835, 10270539, 9784337, 9438726, 9136126, 9027255, 9036293, 9099484, 9246560, 9693430, 10047333, 10598677, 11370069, 12166258, 13134363, 14331367, 15671907, 17292011, 19166779, 20830931, 21720447, 21766830, 20817193, 19152845, 17079267, 14977244, 13243952, 11802390, 10769492, 10098768, 9568457, 9260841, 9115855, 9061363, 9057692, 9280689, 9658065, 10102680, 10832226, 11536550, 12454644, 13535577, 14866517, 15915819, 16503399, 16559864, 15890145, 14736733, 13282936, 11734502, 10417112, 9527726, 8663924, 8055846, 7593275, 7385599, 7273620, 7168425, 7144758, 7208051, 7377159, 7601103, 7885995, 8392844, 8882599, 9549573, 10305048, 11271572]
5667A1271572J254012J384398J406684J030781K42824m87642j126732j705819
5659A3270078j739383j637493j318428j139692q58833n79660m58388l45122m17353
5650D775726m06549l09295k39946m6882j71424q9876j47224n2974p0076j64089
5640C077391o508j9411k18224O1790j4720j500j21812N911J1298L2711o3724j44884
5628B598318J4405J00048j97278j18804q6735j67829J15649Q7621J0810J8927
5618B375132N1288K2167o3667o881R6054k9736q8446m2834P748J92574k6514l9466
5606B447419M6016l7937n9382m8322J45052n2300M3523p128p087J5058J26017
5595B610929k5349m5325J29955p120L7248O6845M6909J721R7644R4477k2289O1158
$$ y = [11271572, 12525584, 13909982, 15316666, 16347447, 16590271, 16102629, 14975897, 13270078, 11530695, 9893202, 8574774, 7435082, 6576249, 5996589, 5538201, 5193079, 4775726, 4369177, 4059882, 3819936, 3773054, 3601630, 3511754, 3364530, 3311556, 3241480, 3077391, 3070883, 3051472, 2833248, 2895038, 2880318, 2878818, 2757006, 2762917, 2774215, 2806926, 2743202, 2598318, 2612723, 2712771, 2515493, 2396689, 2309954, 2142125, 2257774, 2345395, 2356205, 2375132, 2426420, 2448587, 2384920, 2378039, 2474093, 2444357, 2355911, 2313077, 2320825, 2513399, 2486885, 2447419, 2493435, 2455498, 2396116, 2347794, 2492846, 2440546, 2484069, 2476941, 2469854, 2484912, 2610929, 2585580, 2540255, 2670210, 2663090, 2700338, 2767183, 2814092, 2815813, 2913457, 3007934, 2985645, 3046803]
5583C046803K3177k8077O7361J17555N6164Q2072l5838l7882J22945J88147J45118
5572C747545J68354j7477J26146J65463R6202J05573J96168J97585J66934O6193
5562E018686J53370J6909J61610L0923O2359J82054R2861q794J43848J97290J11173
5551F162289J87339L10983K20579J89294L07258L32419K58195K86580L72896L69532
5541H997364K58333K81584L68248J20865J84679Q5173N7769N5045M1587k6147
5531A0424500N087p7858O1343K4102J49267J60778K50115L06206J86234M10898
5521A1900672M86103M24644M45714L77485M07634N09580K56347J59998J08239
5512A5076416n5377k23102j85511k11467m41483k78415j79198l20847k35931j65743
$$ y = [3046803, 3069980, 3041903, 3109264, 3226819, 3282983, 3365055, 3329217, 3291335, 3414280, 3602427, 3747545, 3915899, 3898422, 4024568, 4190031, 4286233, 4391806, 4587974, 4785559, 4952493, 5018686, 5172056, 5188965, 5350575, 5381498, 5443857, 5625911, 5718772, 5709978, 5853826, 6051116, 6162289, 6349628, 6660611, 6881190, 7070484, 7377742, 7710161, 7968356, 8254936, 8627832, 8997364, 9255697, 9537281, 9905529, 10026394, 10211073, 10296246, 10354015, 10409060, 10450647, 10424500, 10429587, 10351729, 10413072, 10437174, 10586441, 10747219, 10997334, 11303540, 11489774, 11900672, 12386775, 12811419, 13257133, 13634618, 14042252, 14551832, 14808179, 14968177, 15076416, 15021039, 14797937, 14612426, 14400959, 13959476, 13681061, 13501863, 13181016, 12945085, 12779342]
5502A2779342m8032l663R5854J91570J12836J65950K17212L03158L31056K20414
5492A4365697J81678J75275L2460N6021j43495k97791l00301k38710k58040k51918
5482A3320876l47193l84629j84819j75450o5118M3745n2611R098J95709K34242
5472A2593850K30603K59385L35851L40206L70207K26889n4613N4874j7727j29368
5462A4210157l28736m50482l33026l60589l18069j96369j42178j6749L7488J6207
5452A2117654L9966J13771J6930N1291L03735K33483J57612K01487J02061K96927
5442A3634917K22760K34039K82384J75137L37577M25788M79654N64342N30439
5433A6887037O70158P61420P53768R10254J045778J117028J263247J400600J653825
$$ y = [12779342, 12731310, 12727647, 12823501, 13015071, 13127907, 13293857, 13511069, 13814227, 14145283, 14365697, 14547375, 14722650, 14755110, 14811131, 14667636, 14369845, 14069544, 13830834, 13572794, 13320876, 12973683, 12589054, 12404235, 12228785, 12163667, 12207412, 12154801, 12163899, 12359608, 12593850, 12824453, 13083838, 13419689, 13759895, 14130102, 14356991, 14302378, 14357252, 14339525, 14210157, 13881421, 13430939, 13097913, 12737324, 12419255, 12222886, 12080708, 12063959, 12101447, 12117654, 12157620, 12271391, 12288321, 12339612, 12643347, 12876830, 13034442, 13235929, 13337990, 13634917, 13857677, 14091716, 14374100, 14549237, 14886814, 15312602, 15792256, 16356598, 16887037, 17557195, 18318615, 19072383, 19982637, 21028415, 22145443, 23408690, 24809290, 26463115]
5424B6463115J966458K034591K306026K708189L371815L813399M200640M278768
5416E1143001L524217K667508K421325K041036J187875L1395q39528j562513j532604
5407E9081712j975433k564928k620281k435757j954116j452871q49072k78666
5399D4950588K89611Q41619J404159J475789J033911L85343L31361n4509q80264
5390D9777608j420149j515931j165371p71382m69667n15510q15837j009432j394553
5381D0699776j779024k102054k356274k253576k123344j915705j753800j499208
5373B4916791j072316p92563n25546n53024l45609j7525j1502Q6384L60441K10684
5363B2256215M86508O75833O72733R40796R67041J107542J353771J636820J879874
$$ y = [26463115, 28429573, 30464164, 32770190, 35478379, 38850194, 42663593, 46864233, 51143001, 54667218, 57334726, 59756051, 61797087, 62984962, 63016357, 62176829, 60614316, 59081712, 57106279, 54541351, 51921070, 49485313, 47531197, 46078326, 45229254, 44950588, 45240199, 46081818, 47485977, 48961766, 49995677, 50381020, 50712381, 50657872, 49777608, 48357459, 46841528, 45676157, 44904775, 44435108, 43919598, 43103761, 42094329, 40699776, 38920752, 36818698, 34462424, 32208848, 30085504, 28169799, 26415999, 24916791, 23844475, 23051912, 22526366, 21973342, 21627733, 21610208, 21598706, 21685090, 22045531, 22256215, 22742723, 23418556, 24091289, 25032085, 25999126, 27106668, 28460439, 30097259, 31977133]
5354C1977133K272778K683885L352640M151348M640519L972192K319237K48800
5346E5618532r55387r12084o32249p70315j210679k063706k918966l284666l309365
5337C9561115k800441j990968j197034n97015J12265Q43348J424166J931996K466361
5328C9753793L121416L997287M614858L873778J793594n91332k084725j936692
5320E2541977j224619q02879j128621j959944l101176m083506m519437m516881
5312C1204914m018927l235192k433917j914194j477028j181514q52634p94140
5304A5297368p21428n54748m59500m11562k38799k77655m93652k37690p5308j58322
5294A1668704j07719j14941j01372q2530j4380M2120j27374k37669k73408j04757
$$ y = [31977133, 34249911, 36933796, 40286436, 44437784, 49078303, 53050495, 55369732, 55618532, 54663145, 53751061, 53118812, 52348497, 51137818, 49074112, 46155146, 42870480, 39561115, 36760674, 34769706, 33572672, 32975657, 33087922, 33931270, 35355436, 37287432, 39753793, 42875209, 46872496, 51487354, 55361132, 57154726, 56563394, 54478669, 52541977, 51317358, 50514479, 49385858, 47425914, 44324738, 40241232, 35721795, 31204914, 27185987, 23950795, 21516878, 19602684, 18125656, 16944142, 16091508, 15297368, 14575940, 14021192, 13561692, 13150130, 12911331, 12633676, 12140024, 11902334, 11827026, 11668704, 11560985, 11446044, 11344672, 11262142, 11247762, 11289882, 11162508, 10924839, 10651431, 10546674]
5284A0546674j30359j78730k45224k18330o8545l2644o5524q9009K9320L8476
5274I586105Q909P2018P4869R2856J15858J66017K64610K54293K30364K40325
5264A1106224Q4754j18028j36436j18293k77226j85882o6778k2989L7038K114
5254A0304498J05576M9581M5989J33744J98692K37507K58265K47117K87985K06456
5244A2075410K92558L33484K91126M70705L75532M59534M12258M18722N15502
5235A5644831O01649Q06617P71226P74888R61507J081898J261353J421797J693035
5226B5018801J938953K144327K680077L087079L715573M382928M901765N525565
5218E3395068N926571O233395O146672M941365L203043J849605m80348k879795
$$ y = [10546674, 10416315, 10237585, 9992361, 9774031, 9705486, 9672842, 9607318, 9518309, 9547629, 9586105, 9595014, 9667032, 9741901, 9834757, 9950615, 10116632, 10381242, 10635535, 10865899, 11106224, 11190978, 11072950, 10936514, 10818221, 10540995, 10355113, 10288335, 10265346, 10302384, 10304498, 10410074, 10459655, 10505644, 10639388, 10838080, 11075587, 11333852, 11580969, 11868954, 12075410, 12367968, 12701452, 12992578, 13463283, 13838815, 14298349, 14710607, 15129329, 15644831, 16246480, 17053097, 17824323, 18599211, 19560718, 20642616, 21903969, 23325766, 25018801, 26957754, 29102081, 31782158, 34869237, 38584810, 42967738, 47869503, 53395068, 59321639, 65555034, 71701706, 76643071, 79846114, 81695719, 81215371, 78335576]
5210G8335576m452510n973429o890986o797001o547696n813260m900525m066871
5202C2893298l176730k475242j850148j488328j190516q84791p72331o45301m87576
5193A9922335n29063n71484n17887l74098m86563m86531k60068k35207j43450
5184A6317984M452M6307J19645J86224K34529L39217N43360N02224O75810P69966
5174A9739718P94882O54221L97206J55075Q7140K44286K12923M51515P12666P64367
5164B4213999J053701J305792J343442R07997P11489N10771N79946P80379J229840
5155C2637356J470788J655732J925399K179513K428502K901764L025675K601700
5147E0826429J663642J132148O57720j86657r01283j192881r63640m44552J23603
$$ y = [78335576, 73883066, 67909637, 61018651, 54221650, 47673954, 41860694, 36960169, 32893298, 29716568, 27241326, 25391178, 23902850, 22712334, 21827543, 21055212, 20409911, 19922335, 19393272, 18821788, 18303901, 17929803, 17443240, 16956709, 16696641, 16461434, 16317984, 16322436, 16368743, 16488388, 16674612, 16909141, 17248358, 17791718, 18293942, 18969752, 19739718, 20534600, 21188821, 21586027, 21741102, 21828242, 22072528, 22285451, 22736966, 23449632, 24213999, 25267700, 26573492, 27916934, 28824931, 29536420, 30047191, 30627137, 31407516, 32637356, 34108144, 35763876, 37689275, 39868788, 42297290, 45199054, 48224729, 50826429, 52490071, 53622219, 54279939, 54093282, 53191999, 51999118, 51035478, 50590926, 50714529]
5138E0714529N55557N76401M58580L41027k65945j032937j578960j771707j591945
5129D6404600q30351l40838K33060O80332J095239N44246k24108n27804r54650
5120D6079726j638382j703543j299089o83980Q7262L77758K87530l91563j356792
5111C9758927j512797j850404k337372k701399k412038k166237j593397j180790
5103B4004493j136562j057366j095836r93985q98252p40826o57673l61288k75872
5094A6786833k42404m4257K2458P9301O0648k0863q0003j14921j08489k38920
5084A6099383k17072j12753k4372K7128k1969K15216K31455L32737M73139M69508
5074A7472400O65824Q14547P08664M06469J21920N7746O4226L7497K05514K73557
$$ y = [50714529, 51270086, 51846487, 52305067, 52646094, 52380149, 51347212, 49768252, 47996545, 46404600, 45574249, 45233411, 45466471, 46146803, 47242042, 47786288, 47562180, 47034376, 46079726, 44441344, 42737801, 41438712, 40754732, 40841994, 41219752, 41507282, 41115719, 39758927, 38246130, 36395726, 34058354, 31356955, 28944917, 26778680, 25185283, 24004493, 22867931, 21810565, 20714729, 19720744, 18822492, 18081666, 17423993, 17062705, 16786833, 16544429, 16500172, 16522630, 16601931, 16662579, 16641716, 16561713, 16446792, 16338303, 16099383, 15882311, 15769558, 15745186, 15772314, 15750345, 15965561, 16197016, 16529753, 17002892, 17472400, 18138224, 18952771, 19661435, 20067904, 20189824, 20247570, 20311796, 20349293, 20554807, 20828364]
5064B0828364N62383P21886P18493O10674L80344J62623j19614l4540K23752L43728
5054B4398093L12970K25777J02435N8324L41466O36971P60306K60443J46254P7251
5044B7320290l0622o2881j73162j91681j64896J50996N58654P39543L20360J66969
5034B8633570j03033l33023M3583L24107J23859m45410n58982q61245p53093o50697
5024B5419636l95463l07815j09008M3235J6695n4288m92292p77273j194114j205778
5014B0943535r52813o12976l96063n23093n49081o03212n81430l39341j84852
5005A6200674l28119m47533n84669o00848o18769n79984l35315j29833L7188P641
4995A2620433L0076k28763l58304o40418p21862q02102p13007m91396l64791k41674
$$ y = [20828364, 21390747, 22112633, 22831126, 23441800, 23822144, 23984767, 23865153, 23830613, 24054365, 24398093, 24711063, 24936840, 25039275, 25097599, 25439065, 26076036, 26836342, 27096785, 27243039, 27320290, 27289668, 27226787, 27053625, 26861944, 26697048, 26848044, 27406698, 28146241, 28466601, 28633570, 28530537, 28197514, 28241097, 28565204, 28689063, 28243653, 27684671, 26823426, 26070333, 25419636, 25024173, 24716358, 24607350, 24650585, 24667280, 24612992, 24120700, 23343427, 22149313, 20943535, 19990722, 19377746, 18981683, 18458590, 17909509, 17306297, 16724867, 16385526, 16200674, 15872555, 15425022, 14840353, 14239505, 13620736, 13040752, 12705437, 12575604, 12612792, 12620433, 12650509, 12421746, 12063442, 11423024, 10701162, 9899060, 9186053, 8694657, 8329866, 8088192]
4985H088192l08579k41647l29084l24270k53532j57723k24344k27127j50155j64446
4975E707285r4352m4174j63267q5535r4836j68291n1844j65789q2840k8953j04418
4964D622986k8358j9125m9291j73748j31693O0797p2380q8242k1620K1018j13372
4953D006972j11879k0298O0407q9258j23904L2471l8572q9134m7038j5756L6713
4942C600724k882j02754M4252j5723j33972n2895N8711M7348K2876j4427m4947
4931C406311K8412o7340p4868M2308K4299k2200O7203R0491L6167J4931N070J57887
4919C708671J04979R0790K03169J24189J96051R9304J28638J23772p0129k55962
4909D453472k09758k26545k01386j24253j72455j08319M1370r4691j11119j09534
$$ y = [8088192, 7779613, 7537966, 7208882, 6884612, 6631080, 6473357, 6249013, 6021886, 5871731, 5707285, 5612933, 5568759, 5405492, 5319957, 5225121, 5056830, 5004986, 4839197, 4756357, 4727404, 4622986, 4594628, 4575503, 4526212, 4352464, 4220771, 4281568, 4209188, 4120946, 4099326, 4120344, 4006972, 3895093, 3874795, 3935202, 3845944, 3722040, 3754511, 3715939, 3626805, 3579767, 3564011, 3600724, 3597842, 3495088, 3539340, 3523617, 3389645, 3336750, 3395461, 3442809, 3465685, 3451258, 3406311, 3434723, 3367383, 3292515, 3334823, 3359122, 3336922, 3404125, 3494616, 3530783, 3545714, 3550784, 3708671, 3813650, 3904440, 4107609, 4231798, 4427849, 4527153, 4655791, 4779563, 4709434, 4453472, 4243714, 4017169, 3815783, 3691530, 3519075, 3410756, 3452126, 3357435, 3246316, 3136782]
4899C136782r8018j9125j6571k6195K5315J4211K9125M2296m813O5786K5145O5303
4887C239241p2593J72441k485N5224J43271o9632Q1461N3338J0785P5537K09803
4876C896391K81079K02590J36632K06644R2222p6781k79796k20967r5561n7732
4866D084721j18659k761L0259J8957m5189P3422J41980K57823K03137k4636k9425
4855D589629j40070j48612j35548j56762j40842l4533j19530R7214o1751k0956
4845C728239n0489m6409j36145J08039L9037o476Q3353j7549l2320J01145J71210
4834C941635K7135N9814Q2323J06760Q1717K8931K15226M7951J17417L8659m2876
4823D704692R6729K9104J70248J78884K15369J38313J77719J29672O8053M9131
$$ y = [3136782, 3038764, 3019639, 3003068, 2976873, 3002188, 3016399, 3045524, 3087820, 3083007, 3148793, 3173938, 3239241, 3166648, 3339089, 3336604, 3391828, 3535099, 3465467, 3546928, 3600266, 3611051, 3686588, 3896391, 4177470, 4380060, 4516692, 4723336, 4815558, 4738777, 4458981, 4238014, 4142453, 4084721, 3966062, 3963301, 3993560, 4012517, 3967328, 4040750, 4182730, 4440553, 4643690, 4619054, 4589629, 4449559, 4300947, 4165399, 4008637, 3867795, 3833262, 3713732, 3810946, 3749195, 3728239, 3677750, 3631341, 3495196, 3603235, 3642272, 3635796, 3719149, 3701600, 3669280, 3770425, 3941635, 3968770, 4028584, 4110907, 4217667, 4299384, 4328315, 4543541, 4591492, 4708909, 4747568, 4704692, 4801421, 4830525, 5000773, 5179657, 5395026, 5533339, 5711058, 5840730, 5908783, 5957914]
4813E957914J72884L25779J55757J16983J57084J01903J34353J6538K0390K19685
4803G379270P8533N183N1020M4095J15171J52687L12373K79255L50804L57018
4793I125409L52623K33828L38836L81455L03539J39480J90214L5878J20617K76345
4783A1498224K31829K39625K32766K48380M82268L50345M96919O57202O04110
4774A5041668P44560Q32494J043499J161333J211587J604175J846368K118099
4766B5603783K423406K807950L236178L774548M083876L443851K254131Q26800
4758D8454523k96083j068777k073975k813653k829361l213482l258885k615241
4750C0285066j928061j380697p57286k06807J84533P85372J213870J647402K120363
$$ y = [5957914, 6130798, 6456577, 6612334, 6729317, 6886401, 6988304, 7122657, 7139195, 7159585, 7379270, 7457803, 7462986, 7514006, 7558101, 7673272, 7825959, 8138332, 8417587, 8768391, 9125409, 9478032, 9711860, 10050696, 10432151, 10735690, 10875170, 11065384, 11101262, 11221879, 11498224, 11730053, 11969678, 12202444, 12450824, 12933092, 13283437, 13780356, 14437558, 15041668, 15786228, 16618722, 17662221, 18823554, 20035141, 21639316, 23485684, 25603783, 28027189, 30835139, 34071317, 37845865, 41929741, 45373592, 47627723, 48454523, 48158440, 47089663, 45015688, 42202035, 39372674, 36159192, 32900307, 30285066, 28357005, 26976308, 26219022, 26012215, 26196748, 26982120, 28195990, 29843392, 31963755]
4741C1963755K693926L383108M008409M622086M190094L359612K046207l88718
4733E5878479k579338l801044m567530m482697l630130k854022j776788o97138
4725C1489792l6942O43610J246387J967691K651122L055628L301936L549573L205917
4716E1074714K797487J412996o24980k410480m147381m857169m789782m188899
4708C4266506l113190k142131j266427l81240J74401Q29300J427665J773654K381678
4699C3950216L083173L515960L513571L175070J844217K88143j248640k945816
4691D5175894m171118m641124m903694m426215l753261l161857k444700j917268
4683A5756657j523078j130651j044486q25488o56768o41755n43947m78455l42991
$$ y = [31963755, 34657681, 38040789, 42049198, 46671284, 50861378, 54220990, 56267197, 55878479, 53299141, 49498097, 44930567, 40447870, 36817740, 33963718, 32186930, 31489792, 31452850, 32096460, 33342847, 35310538, 37961660, 41017288, 44319224, 47868797, 51074714, 53872201, 55285197, 54660217, 52249737, 48102356, 43245187, 38455405, 34266506, 31153316, 29011185, 27744758, 27363518, 27537919, 28367219, 29794884, 31568538, 33950216, 37033389, 40549349, 44062920, 47237990, 49082207, 49370350, 48121710, 45175894, 41004776, 36363652, 31459958, 27033743, 23280482, 20118625, 17673925, 15756657, 14233579, 13102928, 12058442, 11232954, 10576186, 9934431, 9390484, 8912029, 8569038]
4674H569038l23937l10168l08146k44461j67906l02423j65553k47865k08368j35182
4664F155029k05873L6306o3075k04445j34768j41270j58642j04260j82242r2984
4654D903776n6057j73421K9131K7774r2586J9564M508m0900j43090M8725o0225
4643D467199P816L7727K7129K3624l635j21390N3634M715j2675q6164L2106j8762
4631D411324O4195N6998Q121M0959m9114J19764M7794j13175J7767J16973Q5281
4620D806887L0021J36602J11744L6192J5492J46402M7005J30507J46557M4535
4610E651944K0062K9460R9401J56318K47848J42429J80777J07387J38893O9243
4600F843762J36166K48241K81249J51768J78349K75709L59578K87842K01634M36470
$$ y = [8569038, 8245101, 7934933, 7626787, 7382326, 7214420, 6911997, 6746444, 6498579, 6290211, 6155029, 5949156, 5985462, 5922387, 5717942, 5583174, 5441904, 5283262, 5179002, 4996760, 4903776, 4847719, 4674298, 4703429, 4731203, 4638617, 4658181, 4662689, 4621789, 4478699, 4527424, 4467199, 4475015, 4512742, 4539871, 4563495, 4559860, 4438470, 4492104, 4496819, 4484144, 4397980, 4430086, 4411324, 4475519, 4532517, 4540638, 4581597, 4532483, 4652247, 4700041, 4586866, 4604633, 4721606, 4806887, 4836908, 4973510, 5085254, 5121446, 5136938, 5283340, 5330345, 5460852, 5607409, 5651944, 5672006, 5701466, 5800867, 5957185, 6205033, 6347462, 6528239, 6635626, 6774519, 6843762, 6979928, 7228169, 7509418, 7661186, 7839535, 8115244, 8474822, 8762664, 8964298, 9400768]
4590I400768M55509M77626M93214O62413O73033Q81520J015025J271852J503785
4581A6834745J567026J817411K063909K511287K257132J502356N05642n35735
4573B8523773j125531j083492q96076m03101K72977R24038J370850J765206J639361
4564C0988005J080152J58116o77578j108880r21861n17456K7613P41427J310010
4555C1079548J504509J083113N61494R9628j51482M83027J016643J664848J945091
4546C9286419J574764R13865j3174p04685j361739j738272j810028j658125q73251
4537C3615774k09453R519j63402p35996j588748j968300j971284j584872r45489
4528B4457749l11106L18037O91703P10474J34926p53282j384293j582698j396882
$$ y = [9400768, 9856277, 10333903, 10827117, 11489530, 12162563, 13044083, 14059108, 15330960, 16834745, 18401771, 20219182, 22283091, 24794378, 27051510, 28553866, 29059508, 28523773, 27398242, 26314750, 25418674, 25015573, 25288550, 26212588, 27583438, 29348644, 30988005, 32068157, 32226273, 31548695, 30439815, 29517954, 29000498, 29028111, 29769538, 31079548, 32584057, 33667170, 34228664, 34328292, 34176810, 34659837, 35676480, 37341328, 39286419, 40861183, 41775048, 41761874, 41057189, 39695450, 37957178, 36147150, 34489025, 33615774, 33406321, 33415840, 33252438, 32516442, 30927694, 28959394, 26988110, 25403238, 24457749, 24146643, 24464680, 25156383, 25866857, 26001783, 25248501, 23864208, 22281510, 20884628]
4519B0884628r72450o62810m1862M08967Q20941P56109J18543p17990j580581
4510A9013495j938598k026643j796491j496349j204864p91334n43534n27825m05869
4501H281988k99544l09201l27923l69248l56469l92193j80461J0356n7854j76298
4491E823153o1081j7273L3041k9277M1957Q2174Q8342J71346K26250J59290J15070
4480F632992l7125j56881k00479j21195n0954N0366J20344R6507J47736J26065
4470F607376j02760j97215l8913K5010k6658M8617L7563K79339N58049L96534
4460G586942J36504q7560j71199k14664l31352l50801m49614k87364p4994l2651
4450E723247o9827j70300k13429l32119k29766k16158j87988j73011p6347j70679
$$ y = [20884628, 19912178, 19249368, 19207506, 19616473, 20437414, 21193523, 21312066, 20594076, 19013495, 17074897, 15048254, 13251763, 11755414, 10550550, 9759216, 9215682, 8687857, 8281988, 7982444, 7673243, 7345320, 6976072, 6619603, 6227410, 6046949, 6057305, 5999451, 5823153, 5762072, 5744799, 5777840, 5748563, 5790520, 5872694, 5961036, 6132382, 6358632, 6517922, 6632992, 6595867, 6438986, 6238507, 6117312, 6066358, 6116724, 6237068, 6333575, 6481311, 6607376, 6504616, 6307401, 6268488, 6293498, 6266840, 6315457, 6353020, 6632359, 7190408, 7586942, 7723446, 7635886, 7464687, 7250023, 6918671, 6567870, 6118256, 5830892, 5755898, 5723247, 5653420, 5483120, 5269691, 4937572, 4707806, 4491648, 4303660, 4130649, 4054302, 3883623]
4440C883623p5140P4166q134l7977m3711M0289K23778J03773J07656J27042J78572
4429D573937J32624M6757L7046o8511p9178k85274k82940k29310k212j96890j76772
4418C469277l4248p4637R078L096k7018K5911K3451l3605J7313J25544r782l1302
4406C463078k8517K3622M9691l0836l7356Q4695J22030J24106K05414J08035J96365
4395D280327J97187J46185K31794K62409M15431N38843N41896O81112P30162Q48723
4385H874069N00370m4228m17745o29136q04111p26616n84907m51791m04149k44856
4375E066900j14538k09406r9729L8793k3361P6927O8804m3016l9324j02150k134
4364D617766L0381J11603K01528O9813K13866J63305L04120L74351M68910O34278
$$ y = [3883623, 3808483, 3882649, 3874515, 3836538, 3792827, 3833116, 4056894, 4160667, 4268323, 4395365, 4573937, 4706561, 4753318, 4790364, 4721853, 4642675, 4357401, 4074461, 3845151, 3842939, 3646049, 3469277, 3435029, 3360392, 3369470, 3372566, 3345548, 3371459, 3394910, 3361305, 3378618, 3504162, 3494380, 3463078, 3434561, 3458183, 3507874, 3477038, 3439682, 3524377, 3646407, 3770513, 3975927, 4083962, 4280327, 4477514, 4623699, 4855493, 5117902, 5533333, 6072176, 6614072, 7295184, 8025346, 8874069, 9374439, 9330211, 8912466, 8283330, 7479219, 6752603, 6167696, 5715905, 5311756, 5066900, 4952362, 4742956, 4643227, 4682020, 4658659, 4735586, 4804390, 4761374, 4722050, 4619900, 4617766, 4648147, 4759750, 4961278, 5031091, 5244957, 5408262, 5712382, 6086733, 6555643, 7189921]
4354G189921O94578Q07185Q22664M59990k15823o90786r74892r26332q36835o46297
4344E683373m50944l98563k02274j80661j51917j4075j05123j43293M1603N8467
4334D136593j35087j07591p0049J42980K26234p0368j46862K5311J715k695K0062
4323D020243M573O036L2809j3773J47478K5503J13405J48708J94358K30589K30673
4312E140602K54807K00770L41315K92172J84716M6503j9793j00614k02924j92419
4302E945135j20670k81678q9996p7729j00637q7597n624m3620j23557q698K6628
4291E031957Q8461L4694J53600J71638J01811J04149J71008K78384L32853L22123
4281F790678M29595M52115M51583M14624J60369q3759k18295m04414m79669n42120
$$ y = [7189921, 7884499, 8691684, 9514348, 9974338, 9758515, 9067729, 8092837, 7166505, 6329670, 5683373, 5232429, 4833866, 4631592, 4450931, 4299014, 4284939, 4179816, 4036523, 4078126, 4136593, 4001506, 3893915, 3823866, 3966846, 4193080, 4122712, 3975850, 4001161, 4002876, 4000181, 4020243, 4024816, 4030852, 4063661, 4049888, 4197366, 4222869, 4336274, 4484982, 4679340, 4909929, 5140602, 5395409, 5596179, 5937494, 6229666, 6414382, 6460885, 6441092, 6340478, 6137554, 5945135, 5824465, 5542787, 5452791, 5375062, 5274425, 5186828, 5181204, 5137584, 5014027, 5005329, 5031957, 5120418, 5155112, 5308712, 5480350, 5582161, 5686310, 5857318, 6135702, 6468555, 6790678, 7220273, 7672388, 8123971, 8538595, 8698964, 8615205, 8396910, 7992496, 7512827, 6970707]
4271F970707l50180k31867j85148j07248n7466j09199j3538j0087l8903j4809
4261E852262L9012P1215Q7078J68254J97727Q2535J05012K51113J85867K64356
4251G304431L08077L46064K74617N52826N79862O20028P18313Q43116Q53397N00156
4241A2900887K07947o5043m41651m87615o17568p60544o20155l74279l85129l24495
4231I032355j42191m2419k37079l4007P9282n1787J17740K9319J89499P1933K7160
4220I039805K33008Q7038N8943K54567J93193J50917K11217K45893J99557J37390
4210A0811528K04315K75913J76927J92043J85588J48071K22407J39814J79056
4201A2535662K16983M9004K03800K25821J81530J68939J84618L54760L63991K19602
$$ y = [6970707, 6620527, 6388660, 6203512, 6096264, 6038798, 5929599, 5916061, 5905974, 5867071, 5852262, 5891274, 5962489, 6049567, 6217821, 6415548, 6498083, 6603095, 6854208, 7040075, 7304431, 7612508, 7958572, 8233189, 8786015, 9365877, 9985905, 10704218, 11547334, 12400731, 12900887, 13108834, 13043791, 12602140, 12114525, 11496957, 10736413, 10116258, 9741979, 9356850, 9032355, 8890164, 8847745, 8610666, 8576659, 8655941, 8604154, 8721894, 8751213, 8940712, 9012645, 9039805, 9272813, 9359851, 9418794, 9673361, 9866554, 10017471, 10228688, 10474581, 10674138, 10811528, 11015843, 11291756, 11468683, 11660726, 11846314, 11994385, 12216792, 12356606, 12535662, 12752645, 12801649, 13005449, 13231270, 13412800, 13581739, 13766357, 14121117, 14485108, 14704710]
4191A4704710L43196L78525L73221L11986K63233M35479N58401M89753N02539
4182A8361043O54961O75854P75035Q58818Q35317O70421P92420R00807Q80440
4173B5405116Q08147J016621J043473J151586J303685J210277J416071J461996
4165C4816972J373689J664356J821164J962060K180974K338291K656137K943999
4157E1757642L316115L731277M400414M950190N830664O625406P871672R380544
4149I7863924J1484448J4044377J7122605J9950333K3560453K7618904L1333466
4142B42978510L0215435K3587848R352128p791433k2221004l2509454l4956093
4135B08655937l3536181k8765740k3221565j7775500j3592731j0604974q424797
$$ y = [14704710, 15047906, 15426431, 15799652, 16111638, 16374871, 16810350, 17368751, 17858504, 18361043, 19016004, 19691858, 20466893, 21325711, 22161028, 22831449, 23623869, 24524676, 25405116, 26213263, 27229884, 28273357, 29424943, 30728628, 31938905, 33354976, 34816972, 36190661, 37855017, 39676181, 41638241, 43819215, 46157506, 48813643, 51757642, 55073757, 58805034, 63205448, 68155638, 73986302, 80611708, 88483380, 97863924, 109348372, 123392749, 140515354, 160465687, 184026140, 211645044, 242978510, 273193945, 296781793, 306133921, 298342488, 276121484, 243612030, 208655937, 175119756, 146354016, 123132451, 105356951, 91764220, 81159246, 72734449]
4128G2734449o775053n718772m645938l963111l218565k776022k431622j988092
4120D1217274j729236j635257j553357j305351j016436j063034r36113p46169
4112C1232321p10407o39553n89175m10525l19046k37387j62271l4854j28992R9410
4102B8099521K86679K53752M90372M14779O68761P83651R13049J178240J312474
4093C4401278J554159J840960K235895K777110L275321M080265M796542N689976
4085F0651506O927936P960872R204131R998232R577775R119338Q283746M012054
4077A25735590o14318l054386p278261j1067262j1771830j1980827j1420013j0108065
4069E8440628q193820o690980n181311m078463l353719k695109k112473j849047
$$ y = [72734449, 65959396, 60240624, 55594686, 51631575, 48413010, 45636988, 43205366, 41217274, 39488038, 37852781, 36299424, 34994073, 33977637, 32914603, 31978490, 31232321, 30521914, 29882361, 29293186, 28882661, 28563615, 28326228, 28163957, 28129103, 28000111, 28099521, 28386200, 28639952, 29130324, 29545103, 30213864, 30997515, 31910564, 33088804, 34401278, 35955437, 37796397, 40032292, 42809402, 46084723, 50164988, 54961530, 60651506, 67579442, 75540314, 84744445, 94742677, 104320452, 113439790, 121723536, 125735590, 125121272, 122066886, 114788625, 103721363, 91949533, 79968706, 68548693, 58440628, 50246808, 43555828, 38374517, 34296054, 30942335, 28247226, 26134753, 24285706]
4061B4285706j438619j441072j108236r23257j045481p49335o59768p50513o77893
4052A5491532o19626m85787m20286m63825l53264l87190l53835l42733j88816
4043A1876170j54595k64189k72125l34318k45515l14666m11902k60394j34192
4034I484274l16439l44535k13586k61197l07800k63601l18843k01826m0696j49626
4024G066125q7282j81468j12735q5137L3228p3297j04510k9520n0157j55686m6487
4013F173074l5323j54728j48639j57329J1742o5131j09516O8993m3237K8637q7903
4002E480640p0125p6013n3804o9523R094j5880l4517q8826o9260m2903n4137J08927
3990E023673P6086m6790j6032l7243O3575K8553r6440L4549J9500q045n7765p7700
$$ y = [24285706, 22847087, 21406015, 20297779, 19374522, 18329041, 17579706, 16919938, 16169425, 15491532, 14871906, 14386119, 13965833, 13502008, 13148744, 12761554, 12407719, 12064986, 11876170, 11721575, 11457386, 11185261, 10850943, 10605428, 10290762, 9878860, 9618466, 9484274, 9167835, 8823300, 8609714, 8348517, 8040717, 7777116, 7458273, 7256447, 7215751, 7066125, 6978843, 6797375, 6684640, 6599503, 6632731, 6559434, 6454924, 6425404, 6375247, 6219561, 6173074, 6137751, 5983023, 5834384, 5677055, 5688797, 5623666, 5514150, 5583143, 5539906, 5568543, 5480640, 5410515, 5334502, 5280698, 5211175, 5220269, 5204389, 5169872, 5081046, 5011786, 4968883, 4914746, 5023673, 5099759, 5052969, 5036937, 4999694, 5063269, 5091822, 4995382, 5029931, 5049431, 5041386, 4983621, 4905921]
3978D905921j60362r6863N9393P8100m5630K0180J589L546L1523R828l1511M0059
3966D815773P1481J12237J50176L739K5833M1283O1032J1469j28587m0045q877
3955E115514j2854K9948J52330J01867j34853L3911J55023k7319j5423K2852K334
3944E423330J28489O3843j45532Q9082J07285K7720q397R3140P071m7719M3668
3933E781980m23r4237P3815j7383l3862J23157J10479k5488Q3188J16712j0823
3922F107115k2687j9564J7815M6822r5176l8502P2412L6863n7131j52520K7287
3911E922734Q5887o8946q2240l8277J8147j400m7273O9848k3954J00598l9730
3900E895394Q094L5175j5260l7141p6335J147P293K8628J47735k9165J9838l51
$$ y = [4905921, 4745559, 4648696, 4708089, 4786189, 4740559, 4760739, 4762328, 4765874, 4797397, 4807225, 4775714, 4815773, 4887254, 4999491, 5149667, 5153406, 5179239, 5220522, 5281554, 5293023, 5164436, 5124391, 5115514, 5102660, 5132608, 5284938, 5386805, 5251952, 5285863, 5440886, 5413567, 5398144, 5420996, 5423330, 5551819, 5615662, 5470130, 5559212, 5666497, 5694217, 5685820, 5778960, 5786031, 5738312, 5781980, 5781557, 5687320, 5761135, 5743752, 5709890, 5833047, 5943526, 5918038, 6001226, 6117938, 6107115, 6084428, 6064864, 6082679, 6129501, 6034325, 5995823, 6068235, 6105098, 6047967, 5895447, 5922734, 6008621, 5939675, 5857435, 5819158, 5837305, 5835905, 5788632, 5858480, 5834526, 5935124, 5895394, 5903488, 5938663, 5923403, 5886262, 5809927, 5811074, 5818367, 5846995, 5994730, 5965565, 5985403, 5985052]
3888E985052R660n049q8177j05191k57332j80066p9535q2307r8577j81483p1232
3877D845763j6213j43921k2568j35062j05406k1100q4192p048r6542M0767n0551
3866D203927q2961Q205q1552q5892p6895j1448J53743J07205l416Q5220j11640
3855D104496n0054J11431J43776J56418J48047L3307J00672j22312j92410k10322
3845D223049k16770j98887j95256j08206m5109J3016k70373j23966n9407j38919
3835B879172N004N7618l6266j07541m9697j0908l8076j2204j24346p6818M8181
3824B534119r7158l4608K4048J31454j13862q6484M6159m0337n0995q1005R251
3813B240582P7826n5021j23039Q9898K5859Q0162k45866O7205j3770j29825J54173
$$ y = [5985052, 5994712, 5989663, 5901486, 5796295, 5538963, 5358897, 5279362, 5197055, 5098478, 4916995, 4845763, 4829550, 4685629, 4663061, 4527999, 4422593, 4401493, 4317301, 4310253, 4213711, 4254478, 4203927, 4120966, 4129171, 4047619, 3961727, 3884832, 3873384, 4027127, 4134332, 4130916, 4216136, 4104496, 4054442, 4165873, 4309649, 4466067, 4614114, 4647421, 4748093, 4625781, 4433371, 4223049, 4006279, 3807392, 3612136, 3503930, 3458821, 3471837, 3201464, 3077498, 3018091, 2879172, 2884176, 2941794, 2905528, 2797987, 2748290, 2737382, 2699306, 2687102, 2562756, 2485938, 2534119, 2436961, 2402353, 2426401, 2557855, 2443993, 2357509, 2403668, 2363331, 2312336, 2231331, 2240582, 2318408, 2263387, 2140348, 2230246, 2256105, 2336267, 2090401, 2157606, 2143836, 2014011, 2168184]
3802B168184K4711o1151k1374L3610P8746L0713O616r9948k0184N7745k0141N4509
3790B232036k195k7613R8687J26864r6139l9304J08882L960m5844J0506k8434
3779B341406j02617r3171N4129p4929j16275j44392k9200O461Q0697l42l7624
3768A884143J2166j32992j8671M6970l0669o9498l0576J75542k8678j01422O128
3757A712443N157M812j407M1269k4720l1427N9763k8392j0700p9394m8431M7938
3745A646911J8414K6963l4613m1202k805K6438N7307j4570k6029l5263l4627N3915
3733A640839L0427J29830j11539o3230L4070n701p5897o1825Q9283J09239l334
3722A712162m2415l6300l1350Q845J7404n708J09035q9190j26102M2356O8176
$$ y = [2168184, 2192895, 2131744, 2110370, 2143980, 2222726, 2253439, 2260055, 2160107, 2139923, 2197668, 2177527, 2232036, 2229841, 2202228, 2300915, 2427779, 2331640, 2292336, 2401218, 2405178, 2359334, 2369840, 2341406, 2238789, 2145618, 2199747, 2124818, 2008543, 1864151, 1834951, 1841412, 1922109, 1921767, 1884143, 1896309, 1763317, 1744646, 1791616, 1760947, 1691449, 1660873, 1836415, 1807737, 1706315, 1712443, 1717600, 1722412, 1721005, 1762274, 1737554, 1706127, 1765890, 1737498, 1726798, 1647404, 1598973, 1646911, 1665325, 1692288, 1657675, 1616473, 1613668, 1640106, 1697413, 1682843, 1656814, 1621551, 1586924, 1640839, 1671266, 1801096, 1689557, 1626327, 1660397, 1654696, 1578799, 1516974, 1606257, 1715496, 1712162, 1669747, 1633447, 1602097, 1610942, 1628346, 1622638, 1731673, 1642483, 1516381, 1558737, 1626913]
3711A626913Q2398r0682J5210p5175K1776K6999j3779K7177K5236l678R5401K70
3699A738066N4127m9808N2841K734R7509K5471j44531K7743J78232o836j36116
3688A839432N3525l9212m7060j8856N3352L0901r186J4541j08034p4070L8252
3677A733585P6208O9763j8811L1358p5940R6273p2155l876J05124J9955k8494
3666A932990J1399O3127Q116j6680J61697L9823n8412q1234L8246J9374k2228
3655B096218k6537m9619J06070K7676j18705K3975L5609p5112J12726K4877j6362
3644B140816J0412M7961n8508j0932o3808j346L5846Q2697k0643j9179j7354O6769
3632B192731l9208j22747Q5616K9766O8699L5766J105j19140L9345n510J9540
$$ y = [1626913, 1709311, 1618629, 1633839, 1558664, 1580440, 1607439, 1593660, 1620837, 1646073, 1642395, 1737796, 1738066, 1792193, 1742385, 1795226, 1797960, 1895469, 1920940, 1776409, 1804152, 1982384, 1975548, 1839432, 1892957, 1853745, 1806685, 1787829, 1841181, 1872082, 1862896, 1877437, 1769403, 1695333, 1733585, 1809793, 1879556, 1860745, 1892103, 1816163, 1912436, 1840281, 1836405, 1941529, 1961484, 1932990, 1944389, 2007516, 2015632, 1998952, 2160649, 2200472, 2142060, 2060826, 2099072, 2118446, 2096218, 2069681, 2020062, 2126132, 2153808, 2035103, 2059078, 2094687, 2019575, 2132301, 2157178, 2140816, 2151228, 2199189, 2140681, 2129749, 2065941, 2064595, 2100441, 2183138, 2162495, 2143316, 2125962, 2192731, 2153523, 2030776, 2116392, 2146158, 2214857, 2250623, 2251728, 2132588, 2171933, 2166423, 2185963]
3621B185963J04165N1668m7137p1034q3736J27077k1943l8216j43147r2334J11792
3610B083118O3343n6937j1937j5770Q5995N453J5346q0813k556J02231P0545J30956
3598B388974o0458p6076m1592j10644N5436P3408K2861M4965J1554M3183m8830
3587B302781k3528P387o1395k469N5400R9721M3663k09091J09646L0027p4486
3576B277656m6270J81825Q657q8819J9113O636q2456O3600P403r114J4524r846
3564B342909K8471k7465m2667N2963q081Q7426o2042l4336n3416j4833K11168
3553B480097q4023p1114R6399K2976M965O8755j22850L2872L5361k2862j0559
3542B430017Q9679j2597P7426j0942k5738J23336r4591P1596J13482J20462n8158
$$ y = [2185963, 2290128, 2341796, 2294659, 2223625, 2139889, 2266966, 2245023, 2206807, 2063660, 1971326, 2083118, 2146461, 2089524, 2077587, 2061817, 2147812, 2153265, 2168611, 2087798, 2085242, 2187473, 2258018, 2388974, 2328516, 2252440, 2210848, 2100204, 2155640, 2229048, 2251909, 2296874, 2308428, 2351611, 2302781, 2279253, 2286640, 2225245, 2222776, 2278176, 2377897, 2421560, 2212469, 2322115, 2352142, 2277656, 2231386, 2413211, 2421868, 2333049, 2352162, 2358798, 2276342, 2339942, 2347345, 2338231, 2352755, 2342909, 2371380, 2343915, 2301248, 2354211, 2346130, 2433556, 2371514, 2337178, 2283762, 2268929, 2480097, 2396074, 2324960, 2421359, 2444335, 2449300, 2518055, 2395205, 2428077, 2463438, 2440576, 2430017, 2519696, 2507099, 2584525, 2573583, 2547845, 2671181, 2576590, 2648186, 2761668, 2882130, 2823972]
3531B823972r3720j00356J1382L0012k427j4823n7052N7256M1163R4004M2481
3520B831892n5068K003p9702K3667O1480m0036J4691P7087R4221Q1958l1205o7167
3508B913821l6612O6385J59879M9900j08181m2788K1938p7978J59250O8598j8024
3497C156188L5372l4801J29143R4019n3897l5787M4311l8979l2369J32437J32455
3486C528092J9983l2194J40029M0228j4036K3170R5385M7200L2707K2754j2874
3475C890444J39052P2848n8722Q6191J01018J00724p9518M9635J02907P1726J72130
3464D648435K351L2577R5076O8366P7643J09728J16354J71039J40366K46844K04145
3453E912924J82932J69805J01913J13498K33817K61195L09396M06462M68493N52343
$$ y = [2823972, 2730252, 2629896, 2641278, 2671290, 2668863, 2654040, 2596988, 2654244, 2695407, 2789411, 2831892, 2776824, 2778827, 2699125, 2722792, 2784272, 2744236, 2758927, 2836014, 2930235, 3012193, 2980988, 2913821, 2877209, 2943594, 3103473, 3153373, 3045192, 3002404, 3024342, 2946364, 3105614, 3174212, 3156188, 3191560, 3156759, 3285902, 3379921, 3326024, 3290237, 3334548, 3295569, 3263200, 3395637, 3528092, 3548075, 3515881, 3655910, 3696138, 3682102, 3705272, 3800657, 3847857, 3880564, 3903318, 3890444, 4029496, 4102344, 4043622, 4129813, 4230831, 4331555, 4252037, 4301672, 4404579, 4476305, 4648435, 4650786, 4683363, 4778439, 4846805, 4924448, 5034176, 5150530, 5321569, 5461935, 5708779, 5912924, 6095856, 6265661, 6367574, 6481072, 6714889, 6976084, 7285480, 7691942, 8160435, 8712778]
3443H712778N37158O14809Q20916J062673J059082J266846J523561J340874P12998
3434A7651695K527p92851j453077j533409j364660j065001p04668n77722m39397
3425I723437k30628j12690q2406p9316n1021J63429K00353K16886K26232M07092
3415A0381368M53238O90064P33082P87261J020962J271002J558841J826474K111091
3406B0833383K541128K798566K621444J373901k74522j869357l092547l061612
3398B1870384k980532k453737j898454j198872q53593p45178m27140l52717l43599
3389A0616562l35537j40676O8143M6810J16118J79613J88553K91789L58475L93672
3379A1783522N92745O66727O63804N55057Q27147R98652J089617R62033L49310
$$ y = [8712778, 9249936, 9864745, 10685661, 11748334, 12807416, 14074262, 15597823, 16938697, 17651695, 17654222, 16861371, 15408294, 13874885, 12510225, 11445224, 10740556, 10162834, 9723437, 9492809, 9380119, 9297713, 9218397, 9167376, 9330805, 9531158, 9748044, 9974276, 10381368, 10834606, 11524670, 12257752, 13045013, 14065975, 15336977, 16895818, 18722292, 20833383, 23374511, 26173077, 28794521, 30168422, 29893900, 28024543, 24931996, 21870384, 18889852, 16436115, 14537661, 13338789, 12485196, 11740018, 11312878, 10960161, 10616562, 10281025, 10140349, 10208492, 10255302, 10371420, 10551033, 10739586, 11031375, 11389850, 11783522, 12376267, 13042994, 13706798, 14261855, 15089002, 16087654, 17177271, 18139304, 18488614]
3370A8488614k62710r01186j448050j479463j479566j378901r14389p28147n19113
3361I377089m13696k82052k22949l45981j10568p9637n0984L2897J50823P4678
3351H129620K60769K40345K92615L97555L03732K75204m271l46444n06010m65890
3341H577225n07471k98040k59831k27366j56630j34007o6365n7582n2256o8054
3331F749623j30725K5430p0974O6994J41177P7964k6165k1002M8560J71960J51857
3320G184699R5742J02128K14737J93342J80483L20183K20776J18805M929k29632
3310H406192j24060j32359k15339j807J07404n6341o0137J90347L6545r8478O636
3299H058603J38737m0458N6782K7164K0970J32241J32128R0176R0116N4959l1962
$$ y = [18488614, 18225904, 17324718, 15876668, 14397205, 12917639, 11538738, 10624349, 9896202, 9377089, 8963393, 8681341, 8458392, 8112411, 8001843, 7922206, 7871222, 7904119, 8054942, 8129620, 8390389, 8630734, 8923349, 9320904, 9624636, 9899840, 9895569, 9549125, 9043115, 8577225, 8069754, 7771714, 7511883, 7284517, 7127887, 6993880, 6927515, 6869933, 6817677, 6749623, 6618898, 6644328, 6573354, 6640348, 6781525, 6859489, 6833324, 6812322, 6860882, 7032842, 7184699, 7280441, 7382569, 7597306, 7790648, 7971131, 8291314, 8512090, 8630895, 8635824, 8406192, 8282132, 8149773, 7934434, 7932627, 8040031, 7983690, 7923553, 8113900, 8150445, 8051967, 8058603, 8197340, 8156882, 8213664, 8240828, 8261798, 8394039, 8526167, 8616343, 8706459, 8761418, 8729456]
3288H729456J00803N1202O3137Q5342l182Q9140M6238J12079J72190K07420J20525
3277I774350L9316J49279K41711K23557K61293K60105K31568J70522J41628K87213
3267A1780542K21095J45752J68715K86794L38603K40811K59817L60061K61736
3258A4063926K34039J28937J53235R1371J10184J95368K21099M25625L42804L97827
3248A6364415N70073N97962P21741P30744O37423O73758Q12547J020616Q73576
3239B3002855P61941O30416P46032N58675L17860m4382m97539p32115j178647
3230B3565096j189863j264715j146423j015424r53443p93227q66328p76436o41841
3221A4917396o53308n52172m41644l89796m41746l55826k10613l04345l12018
$$ y = [8729456, 8830259, 8881461, 8944598, 9029940, 9026758, 9115898, 9162136, 9274215, 9446405, 9653825, 9774350, 9813666, 9962945, 10204656, 10428213, 10689506, 10949611, 11181179, 11351701, 11493329, 11780542, 12001637, 12147389, 12316104, 12602898, 12941501, 13182312, 13442129, 13802190, 14063926, 14297965, 14426902, 14580137, 14671508, 14781692, 14977060, 15198159, 15623784, 15966588, 16364415, 16934488, 17532450, 18254191, 18984935, 19622358, 20296116, 21108663, 22129279, 23002855, 23764796, 24395212, 25141244, 25699919, 26017779, 25973397, 25475858, 24743743, 23565096, 22375233, 21110518, 19964095, 18948671, 17995228, 17202001, 16335673, 15559237, 14917396, 14264088, 13711916, 13270272, 12880476, 12438730, 12082904, 11872291, 11567946, 11255928]
3212A1255928k72493k12247j95141k32382k07857k22470j95870k03741j40789
3203I372938l7119n6416l30687j63100k07744j81530j08827j61736j15033j35797
3193G874949j99104j19997j19989j09201j03482j39136j66181j00620m6393k24641
3183F546205Q128L1767l2412j99593n6635n5443p6882q5993p3061M1518r568q187
3171F029844r2314j81739p4528J3712n8668l7169k5254j55580j64577O1940n6151
3160E259516k3159k4555j21892k8338k4253J8984j87805n8588P8482O667o2660
3149D832399j27089M4217J8952J962n7464r6020J4571P189n6156q1843M1387j2924
3137D529181l7929j6883j77253P1759m5973m3973q1379j9902R4124k8980j38764
$$ y = [11255928, 10983435, 10771188, 10576047, 10343665, 10135808, 9913338, 9717468, 9513727, 9372938, 9335819, 9279403, 8948716, 8785616, 8577872, 8396342, 8287515, 8125779, 8010746, 7874949, 7675845, 7555848, 7435859, 7326658, 7223176, 7084040, 6917859, 6817239, 6770846, 6546205, 6554333, 6586100, 6553688, 6354095, 6297460, 6242017, 6165135, 6079142, 6006081, 6047599, 6038031, 6029844, 5937530, 5755791, 5681263, 5694975, 5636307, 5599138, 5573884, 5418304, 5253727, 5315667, 5259516, 5236357, 5211802, 5089910, 5061572, 5037319, 5056303, 4868498, 4809910, 4888392, 4895059, 4832399, 4705310, 4749527, 4768479, 4770441, 4712977, 4616957, 4631528, 4638717, 4582561, 4500718, 4542105, 4529181, 4491252, 4474369, 4297116, 4368875, 4322902, 4278929, 4197550, 4177648, 4271772, 4242792, 4104028]
3126D104028o6732L6406k7156o1010k338N022j45616k8815R3568l8735m2606J0834
3114C836850O5393L2434K6730j03546j18646M7568j04424j9253n9143K6790K7829
3103C658582j17106j17240n7439m8977R8443m362l2543L5764N0864j01482l0293
3092C334211M521p1180n4930J03212L3966j19114J0109j507O0090q3209N6132
3081C272301n364p0076P9105o9949q0540K8047R0P7516q0578m458J8661K0592
3069C185347m790K3581m139j70759L5690j45292L1942P4799j23006j1731N3864
3058B945506J7251j5256n4936l7063N7463Q204r9694j883K4006j1970k9878L2953
3046B834703N1440P7248o6545j07804K1490O0307M2416J2928n8392k4505q1305
$$ y = [4104028, 4037296, 4073702, 4046546, 3985536, 3983198, 3988220, 3842604, 3813789, 3907357, 3868622, 3826016, 3836850, 3902243, 3934677, 3961407, 3857861, 3739215, 3786783, 3682359, 3663106, 3603963, 3630753, 3658582, 3541476, 3424236, 3366797, 3317820, 3416263, 3411901, 3379358, 3415122, 3465986, 3364504, 3334211, 3338732, 3267552, 3212622, 3315834, 3349800, 3230686, 3240795, 3239288, 3299378, 3216169, 3272301, 3266937, 3196861, 3275966, 3206017, 3125477, 3153524, 3153614, 3231130, 3150552, 3146094, 3164755, 3185347, 3180557, 3204138, 3199999, 3029240, 3064930, 2919638, 2951580, 3026379, 2903373, 2891642, 2945506, 2962757, 2947501, 2892565, 2855502, 2912965, 2921169, 2821475, 2819592, 2843598, 2831628, 2801750, 2834703, 2886143, 2963391, 2896846, 2789042, 2810532, 2870839, 2913255, 2926183, 2867791, 2843286, 2761981]
3035B761981m3457l4915L9477J58902Q02j33717j5602L9026p0198R5561L1582
3024B829442r2755M2577p3269j15251J16478j1680R6559P7866k5651p874M8006
3013B884448r6295m2204N2287n2735J28060o2156Q7542L8154L2490K05013k6737
3002C147867j92196r38J01502j5448O2336J08320J06374j35042n1928O3892P4948
2991C269687q1593J21671l7997Q9105M6602p6346l9208K2892O1530K6470J08201
2980C511014j9318J0325P6020J19397N36n1865J07411R0559o5287O8116K57206
2969D104114R1713Q985R9656J5326o0849K5472J27799L4365L4259l3669k973p3762
2957D370436N281J16739m0l1846M8432M6653n9352L6431M3861P29J43638J09384
$$ y = [2761981, 2718524, 2683609, 2723086, 2881988, 2882790, 2749073, 2733471, 2772497, 2702299, 2797860, 2829442, 2736687, 2779264, 2705995, 2590744, 2707222, 2695542, 2792101, 2869967, 2844316, 2836442, 2884448, 2788153, 2745949, 2798236, 2745501, 2873561, 2811405, 2898947, 2937101, 2969591, 3174604, 3147867, 2955671, 2954733, 3056235, 3040787, 3103123, 3211443, 3317817, 3182775, 3130847, 3194739, 3269687, 3188094, 3309765, 3271768, 3360873, 3407475, 3331129, 3291921, 3314813, 3376343, 3402813, 3511014, 3491696, 3502021, 3578041, 3697438, 3697974, 3646109, 3753520, 3844079, 3778792, 3846908, 4104114, 4195827, 4204812, 4304468, 4319794, 4258945, 4284417, 4412216, 4446581, 4480840, 4447171, 4444198, 4370436, 4375717, 4492456, 4492416, 4460570, 4509002, 4555655, 4496303, 4532734, 4576595, 4577324, 4720962, 4830346]
2945D830346L9217L2785N5442L8156M2276O4615J55271J00441O8971Q2053J29458
2934E639031P5426J61927J11085J04915J23333J03616Q1417Q2130J81724J00328
2924F764932R6900Q8323J51295J06669J62880l5239K8911J30937K9859J3359O3815
2913G602641P2056k2117R6617J24089Q2741J35695J70587J26937K18811J39342
2903H747399K21566J95485K81051J87567L05984K53465M18861M56156L11120J97891
2893A1576545K6047L8147j7542j77885k33191l61731k93538j26407k83286k45559
2883I901600j86967k9147M5358M4438j9804Q5905N9147J34496J34689K00301P1359
2872A0441375N060j3192J08654J61684O1893k0852J00694j58337n9185j64237
$$ y = [4830346, 4869563, 4902348, 4957790, 4995946, 5038222, 5102837, 5258108, 5358549, 5427520, 5509573, 5639031, 5714457, 5876384, 5987469, 6092384, 6215717, 6319333, 6400750, 6482880, 6664604, 6764932, 6861832, 6950155, 7101450, 7208119, 7370999, 7335760, 7364671, 7495608, 7525467, 7538826, 7602641, 7674697, 7652580, 7749197, 7873286, 7956027, 8091722, 8262309, 8389246, 8608057, 8747399, 8968965, 9164450, 9445501, 9633068, 9939052, 10192517, 10611378, 11067534, 11378654, 11576545, 11602592, 11640739, 11623197, 11445312, 11212121, 10850390, 10556852, 10430445, 10147159, 9901600, 9714633, 9685486, 9730844, 9775282, 9755478, 9841383, 9900530, 10035026, 10169715, 10370016, 10441375, 10446435, 10433243, 10541897, 10703581, 10765474, 10744622, 10845316, 10686979, 10627794, 10463557]
2862A0463557j77439j88068k47988k79015k71253l12853k34437l48520j81348
2853H222636j33202j38703r5885p9524o2056o0939m50k66283l131j27372j23661
2842G131430j47535r5137j45039k04599k12618k36799j73114j49790k77997j27058
2832E361744k30951j40089j50912j93076N1754o7780k03669p5290j27448j35340
2822D088943l085j41368k0672l0151j44360o915p6528l1571r9343o8021r9143
2811C367786p2714m5638J266j5153j06730j78881r0335r249j01351J2590j03339
2800B658252j05085K1949l5536q0320J0242q3307k4114k8205q0990K4450j50373
2789B126963J6582j39707j6728O2933q668j9161p4506N887K6903j13146n5957
$$ y = [10463557, 10286118, 10098050, 9850062, 9571047, 9299794, 8986941, 8752504, 8403984, 8222636, 8089434, 7950731, 7854846, 7775322, 7713266, 7652327, 7651877, 7385594, 7382463, 7255091, 7131430, 6983895, 6888758, 6743719, 6539120, 6326502, 6089703, 5916589, 5766799, 5488802, 5361744, 5130793, 4990704, 4839792, 4646716, 4698470, 4630690, 4427021, 4351731, 4224283, 4088943, 4085858, 3944490, 3923818, 3893667, 3749307, 3742392, 3665864, 3634293, 3534950, 3466929, 3367786, 3295072, 3249434, 3250700, 3235547, 3128817, 2949936, 2859601, 2850352, 2749001, 2761591, 2658252, 2553167, 2575116, 2539580, 2459260, 2469502, 2386195, 2362081, 2333876, 2252886, 2277336, 2126963, 2143545, 2003838, 1987110, 2050043, 2041375, 2022214, 1947708, 1953595, 1980498, 1867352, 1811395]
2778A811395R8510l0960j62627m5175Q2364q4824L8498j4796m8575n1144p3570
2767A519096Q5636o1236j12825k2409K6849q2018m0885L1518r9391P6860N2835
2756A374030P7901k2405o5391l5660m0100k0410j57384L5873N2179p9684L650
2745A122599L4257O4336j15342j0318m7979l1425n4600M3718O640r4465j0834
2734I06587p8691j2658l1351N2960r496K3034n362o6297O3026L0020p4057j1716
2722G85999K7404R3448j59702j12358N9131j0887M4592j0751q9483M342M1760
2711F73495o0307K2049P0023M6877r1491j5348n0210J2413j41591J4129J3908
2700D93947r4423L319O4319j3001J27M0278L5701L831M1362M644J3601j41947
$$ y = [1811395, 1909905, 1878945, 1716318, 1671143, 1753507, 1668683, 1707181, 1692385, 1643810, 1592666, 1519096, 1604732, 1543496, 1430671, 1408262, 1435111, 1353093, 1312208, 1343726, 1244335, 1321195, 1374030, 1451931, 1429526, 1364135, 1328475, 1288375, 1267965, 1110581, 1146454, 1198633, 1118949, 1122599, 1156856, 1221192, 1105850, 1095532, 1047553, 1016128, 961528, 1005246, 1011886, 917421, 906587, 827896, 815238, 783887, 836847, 827351, 850385, 845023, 778726, 841752, 871772, 797715, 785999, 813403, 906851, 747149, 634791, 693922, 683035, 727627, 716876, 627393, 631735, 673495, 613188, 635237, 705260, 752137, 660646, 645298, 595088, 607501, 465910, 480039, 493947, 399524, 402843, 467162, 454161, 454288, 494566, 530267, 534098, 575460, 580104, 593705, 451758]
2688D51758k4518N0344o5718n1231l8260k973P6857L5656l1312J8479O2101j0963
2676D70220l8942n9641p9606K8010K6667M2558m2881k1900N5422j7423r3479M5309
2664C14314n5216M048J7388L5432M1257N146m1399m7242l8591j6831R0766O9260
2652C78332n9263k6203j26972R3812N747M4100L8299k1827j07284M487J25375
2641C48603p545p3696r9188K8892M7247n082M879j01874m2249J17876L3547m7901
2629B03509n1730N6121l7497o900o1145j883O7362R2857j8514j2902q689P4092
2617B94681m7954M0770O6617r8010M0548O4464Q4037q7868q980p5077M5185k3245
2605B95168J5997n4407O4719L4933j11183j01627J5325m2010l113L3650J13006
$$ y = [451758, 427240, 477584, 411866, 360635, 322375, 319402, 396259, 431915, 400603, 419082, 481183, 470220, 431278, 371637, 292031, 320041, 346708, 389266, 346385, 324485, 379907, 362484, 269005, 314314, 259098, 263146, 280534, 315966, 357223, 362369, 320970, 273728, 235137, 218306, 309072, 378332, 319069, 292866, 165894, 259706, 265453, 309553, 347852, 326025, 218741, 223228, 348603, 341058, 267362, 168174, 197066, 244313, 239231, 244110, 142236, 99987, 217863, 251410, 203509, 151779, 207900, 170403, 163503, 102358, 100475, 167837, 260694, 242180, 229278, 220589, 294681, 246727, 287497, 354114, 256104, 296652, 361116, 445153, 357285, 348305, 273228, 318413, 295168, 311165, 256758, 321477, 356410, 245227, 143600, 158925, 116915, 113802, 147452, 260458]
2594B60458N9317q4997Q8280n5278n5563l2211k4328n8308J27027l0381q5947
2583A08069O1182M9051p858O2555j2368p0821l7224Q9400N6352l1409M710k6192
2571B45447r9497N3379k483m6497K8854p9563N2345M0881O1683L7315j01997P857
2559A97724J1273k708P6096q6096J5056m7450m3732Q716l6849O2763J38078p8400
2547B14471j6755J2345m9349k2534M453n4859L1674k6691N811j1116Q000N2574
2535A48024o4972N976P415M0423J891J5984M0061j2737L6990P2131m0025m0275
2523B10886k1251o2846j76549P5624L4392M7882r9512n6913J053K0344o5275M7103
2511d5062K6948L2689R1767k0935j25492k273M9834m0087K3607P5224o2930m5824
$$ y = [260458, 319775, 234778, 323058, 267780, 212217, 180006, 155678, 97370, 224397, 194016, 108069, 169251, 218302, 210444, 272999, 260631, 189810, 152586, 241986, 298338, 266929, 271639, 245447, 145950, 199329, 196846, 150349, 179203, 99640, 151985, 192866, 254549, 291864, 189867, 197724, 208997, 206289, 282385, 196289, 211345, 163895, 120163, 128879, 92030, 154793, 292871, 214471, 197716, 210061, 160712, 138178, 142631, 87772, 119446, 92755, 98566, 87450, 95450, 148024, 83052, 89028, 96443, 136866, 138757, 154741, 194802, 182065, 219055, 291186, 251161, 210886, 189635, 126789, -49760, 25864, 60256, 108138, 8626, -48287, -47234, -26890, -92165, -45062, -18114, 14575, 106342, 85407, -40085, -42358, 7476, -32611, -9004, 66220, 3290, -42534]
2499d2534j8161N653Q9301L6221q9164q284J3942K2684m2391K5108N1081r0463
2487d7007m7954q1054O8296Q1682N3580N6492o8635j03004M9637j11579j1898
2476a61444K01359K0807L2276k0703K2350k1741j31719K4186J29956q42j22771
2465b8286k9444n5778L0885P0275P2377j9605K182J1145k0061r5134O9561r656
2453a539m908K4741P6417J14771j02722q1751Q3027M1643j58352J4787m3327m7095
2441h4308M3928J5223o5338m513K7511M2505o4785J47426M636j54631P1032m0839
2429f2153L2822m4760L0494J4553j3050M920k1463O2318M7936M714J2399n1742
2417A6988n7452O2647L7107M2453J11397o6006j05296J9148J1489r7289J6807
$$ y = [-42534, -60695, -55042, 34259, 70480, -18684, -26968, -13026, 9658, -32733, -7625, 43456, -47007, -94961, -176015, -107719, -26037, 27543, 84035, 15400, -87604, -37967, -149546, -161444, 39915, 60722, 92998, 72295, 94645, 72904, -58815, -34629, 95327, 94485, -28286, -57730, -113508, -82623, -12348, 60029, 40424, 42606, 53751, 33690, -61444, 8117, -1539, -6447, 18294, 94711, 209482, 106760, 25009, 108036, 149679, -8673, 6114, -37213, -84308, -40380, -25157, -90495, -95008, -67497, -24992, -89777, 57649, 62285, -92346, -21314, -62153, -29331, -74091, -43597, -29044, -42094, -37174, -58637, 3681, 51617, 56331, 68730, 16988, -40464, 22183, 59290, 101743, 213140, 147134, 41838, 60986, 72475, -24814, -8007]
2406h007L2849K7808k9559l7303l0417K4368J6138k9036K9507L8824M6570l6521
2394D5221o1337l6461Q924L2871K4526j7506N4512J21119j7045j24816q2812J22085
2382F9281n1186N1712q2736L6952P3225J460r7211q76M1578Q919O324j5050l1470
2369A0922p5451M4017L4579L8380Q2883J5383q7941O429j0976L4722J5618n555
2357A03010k4719j18171J21307L0705l3272k5723q1930Q5485j3061K4841l3129
2346C5343j333k7021j2266K0294Q6488L995j0004l8533r3507J7613m1866Q4793
2334B3996J51450j17982L453L0139K3292q7211k1260L4651J5918q9609M3781N744
2322A6362J9452K6600m1854J03346m6583r5618N9962N2943j14914J6096M8637
$$ y = [-8007, 24842, 52650, 23091, -14212, -44629, -20261, -4123, -33159, -3652, 35172, 81742, 45221, -16116, -52577, -43653, -10782, 13744, -3762, 50750, 171869, 154824, 30008, -52804, 69281, 18095, 69807, -12929, 24023, 97248, 98708, 1497, 621, 42199, 51118, 57442, 42392, 10922, -64529, -20512, 14067, 52447, 135330, 150713, 62772, 69201, 58225, 92947, 108565, 103010, 78291, -39880, 81427, 112132, 78860, 53137, -28793, 56692, 43631, 68472, 35343, 34010, 6989, -5277, 15017, 101505, 105500, 95496, 56963, -36544, -18931, -60797, 23996, 175446, 57464, 60917, 91056, 114348, 27137, 5877, 40528, 56446, -33163, 10618, 16362, 35814, 62414, 20560, 123906, 77323, -18295, 41667, 94610, -20304, -4208, 44429]
2311D4429R258l5092o120r744j6703M5888N642j7873K546j5854Q0914J334R0468
2298A79093k0651j23867N1089m5572P0233k3749o5406K8161j3525J2632J42763
2287A91201l9822p201j9508P181n3428r578j7480J5922j4106M4906o2293M4547
2275H0341J13194o2098k7495l6851k5109M9262J00201N489k1167m9041j9362J0283
2263A17647J8789K6890n8069n8999J10147K3050Q212M125j9470P6607q7877M525
2251A65577m0385N5346l642J3497k7685j44615J08082M8108K0385q5655M4312
2240A53325L7333r739r933L0121k2621p4228K9941K961q5150L5997J7809m1715
2228F4101p70P3842J9601K1856N249Q368O089K0020K293Q8072j6105o65K9476
$$ y = [44429, 53687, 18595, 12475, 2731, -13972, 31916, 37558, 19685, 22231, 6377, 87291, 88625, 179093, 158442, 34575, 85664, 40092, 110325, 86576, 21170, 49331, 35806, 48438, 191201, 151379, 144178, 124670, 131851, 78423, 68845, 51365, 67287, 53181, 98087, 35794, 80341, 193535, 131437, 103942, 67091, 41982, 91244, 191445, 196934, 175767, 126726, 107364, 117647, 136436, 163326, 105257, 46258, 156405, 179455, 187667, 191792, 172322, 248929, 161052, 165577, 125192, 180538, 176896, 190393, 162708, 18093, 126175, 174283, 194668, 109013, 153325, 190658, 180919, 170986, 201107, 178486, 104258, 134199, 137160, 52010, 88007, 105816, 64101, 63331, 137173, 156774, 178630, 183879, 192247, 198336, 218356, 220649, 308721, 292616, 291951, 321427]
2215C21427j42283j3707N6306O8030m5568n6958j436M0322R5476q7562K9762Q0776
2203C44585j11394j2760N6451l2379O9005n9983R7089m8349k6936J5457Q7157
2192C77943k4542O163M6157j6715L5647p67M8844M8948k5699P7271k4863J07979
2180F56366m7498p0618l9863J7027j7323R5452J8392m899P4096K1088R5600q1535
2168G16285R1887J03013m5843j3422K087j1069j7777M6299k6808J732J62917M3378
2156A052679q313k3144P4232P459M0071j7989Q5896m334J07589n9171J7272J4050
2144A286297m5524O5824P4924N9167J13235N0553O0592P6648K9834P4985P7268
2133A923803L5252J46412J19029N8734J55351J80567Q0610J25580P2910L0701
$$ y = [321427, 179144, 165437, 221743, 289773, 244205, 187247, 185811, 226133, 321609, 234047, 263809, 344585, 233191, 220431, 276882, 244503, 313508, 253525, 350614, 302265, 275329, 290786, 377943, 353401, 359564, 405721, 389006, 424653, 423886, 472730, 521678, 495979, 573250, 548387, 656366, 608868, 538250, 498387, 515414, 498091, 593543, 611935, 607036, 681132, 702220, 797820, 716285, 808172, 911185, 865342, 851920, 854007, 842938, 825161, 871460, 844652, 846384, 1009301, 1052679, 1044366, 1021222, 1095454, 1102913, 1142984, 1124995, 1210891, 1206557, 1314146, 1254975, 1272247, 1286297, 1240773, 1306597, 1381521, 1440688, 1553923, 1604476, 1665068, 1741716, 1771550, 1846535, 1923803, 1959055, 2105467, 2224496, 2283230, 2438581, 2619148, 2699758, 2825338, 2898248, 2928949]
2123B928949J31838J69567J24195J29171J17436K94846J34903J66407K98421K23015
2113D718748K72686M73625L44746N06195M58230O22790N95487L86091L83874P91000
2103I553472Q19214J020071J469748J874805K320800K984154L496740M015222
2095B7554226M981475O374383M640409n6426m535112p180098n937704n090942
2087B0750211m168957k985033k036638j486185j126500r29101q16712o25392k89424
2078F286269l48326l74502n68215l66873l00429k99925j91063l33179k43044j54786
2068C105927j88061j84290j44293j15171j02128k04751p3021j11356j90482k4022
2058A768352q2162j66499l7173q0690J0991n0382n4501n5902j17992l7664l4440
$$ y = [2928949, 3060787, 3230354, 3354549, 3483720, 3601156, 3896002, 4030905, 4197312, 4495733, 4718748, 4991434, 5465059, 5809805, 6316000, 6774230, 7397020, 7992507, 8378598, 8762472, 9553472, 10372686, 11392757, 12862505, 14737310, 17058110, 20042264, 23539004, 27554226, 32535701, 38910084, 43550493, 43494067, 38958955, 31778857, 25841153, 20750211, 16581254, 13596221, 11559583, 10073398, 8946898, 8017797, 7201085, 6575693, 6286269, 5937943, 5563441, 4995226, 4628353, 4327924, 4027999, 3836936, 3503757, 3260713, 3105927, 2917866, 2733576, 2589283, 2474112, 2371984, 2167233, 2094212, 1982856, 1792374, 1768352, 1686190, 1519691, 1482518, 1401828, 1412819, 1362437, 1307936, 1252034, 1134042, 1096378, 1061938]
2047A061938M748l0638j05133l3257O7385k652M1621j53200q5915J43003k5257
2036H82643j1818J2124k2137m3183m416l2029j49415k3965p4076N5898k0214r531
2024E59881J3953o3957j1492k828q8717L4355J6217j30417K8841J07213J4721
2013D77770p3191l7363M9757p1191j4052p6725n0745J10732l2090k6683L9142
2002B95361O5116j1086o0704j2506N7775p8859R0341l2924q5803l4660o5489M8172
1990A74734P3675j8603K072j7103k237m8839k5337L0714l7100j04407R1965l6887
1978H2647J7834J00478q2086l7104K7935n002N1771K0574J3987k9121p5566M156
1966I0503j2183m635o6030K3600K2749M5739L0628L8679J9395m8993r13J0375
$$ y = [1061938, 1066686, 1036048, 930915, 897658, 965043, 962391, 1004012, 850812, 764897, 907900, 882643, 870825, 882949, 860812, 817629, 813213, 781184, 631769, 607804, 533728, 589626, 569412, 559881, 573834, 509877, 498385, 495557, 406840, 441195, 457412, 326995, 355836, 463049, 477770, 404579, 367216, 416973, 345782, 331730, 255005, 204260, 314992, 282902, 256219, 295361, 360477, 349391, 288687, 276181, 333956, 255097, 345438, 312514, 226711, 192051, 126562, 174734, 248409, 229806, 231878, 214775, 212538, 163699, 138362, 169076, 131976, 27569, 119534, 82647, 100481, 200959, 118873, 81769, 109704, 104702, 156473, 177047, 191034, 161913, 86347, 90503, 78320, 73685, 7655, 31255, 54004, 99743, 130371, 169050, 188445, 139452, 138539, 148914]
1954A48914J2147r9312l7969P4682o8679n5426M2588L342M290K3189N0667m5079
1942E3354j07852J05063n5761p3086J43158m7239j3343l5935R0733K3402j8602
1931F3892n6129j1339j0202j6586Q9920R538N8721r3497J2656L1974l1360K8239
1919G5827o4500q5896R9270j9992j9906j4077k680K9108p708n8060L7493M1709
1907A0588p5534m9325R1760Q7187k7204m6049N4344M122K8660J6191k641k5695
1895F6404l3520o2454p4375P7518p841k3026o1485R1110N7149n2932l805o0482
1883h7739P7944n0638n4242K5432J63456m9781n8161j083m4983m2597L6720P8189
1871g483j18358R9274N5226m3467P927Q695o0071R6777L3016r7478l0505O8945
$$ y = [148914, 161061, 61749, 23780, 98462, 29783, -25643, 16945, 20287, 24577, 47766, 98433, 53354, -54498, 50565, -5196, -78282, 64876, 17637, 4294, -31641, 59092, 82494, 63892, 7763, -3576, -13778, -30364, 59556, 69094, 127815, 34318, 46974, 78948, 47588, 75827, 11327, -74569, 24701, 4709, -15197, -29274, -31954, -2846, -10554, -68614, -31121, 10588, -64946, -114271, -22511, 64676, 37472, -8577, 45767, 49889, 78549, 94740, 92099, 66404, 32884, -29570, -103945, -26427, -34268, -57294, -118779, -27669, 29480, -23452, -27257, -87739, -9795, -60433, -114675, -89243, 74213, 24432, -33729, -34812, -79795, -122392, -85672, -7483, -125841, -26567, 28659, -14808, -6881, 1814, -58257, 38520, 71536, -25942, -56447, 12498]
1859A2498k1959K5404K0574n3501j9762J7125L4389N6787q5783m3284L7365M6621
1847B6474J10880m7319l5957q903J8894K5900m5518K5906l0515k3811m5786P8231
1835D8476m0859M3265K9367k3798J08651j01908k2495L3994R8244q346K9472M0418
1823B34481o723j0449N108m3202l7719n4481m5342N1163o5558k9251P5891M0344
1811A14262j7625j1688J7681l8498p1933R2870q4536o5816j2516l1577J29297
1800A9921r3801l2447N1096K5587N7747j1852l2084K5912p2181K5778R7437j17309
1788e6196j7474K2451J23425J3126M4177r954n1383m1368p3394P4498N8024j07910
1776b1978M98k4431l371R066R4713j9577p9551M4344j6463J742N7145Q0544j13462
$$ y = [12498, -9461, 15943, 36517, -16984, -36746, -19621, 14768, 71555, -14228, -57512, -20147, 26474, 137354, 90035, 54078, 45175, 64069, 89969, 44451, 70357, 39842, 16031, -29755, 48476, 7617, 50882, 80249, 56451, 165102, 63194, 40699, 74693, 172937, 164591, 194063, 234481, 227758, 217309, 222417, 179215, 141496, 87015, 41673, 92836, 27278, -1973, 73918, 114262, 96637, 84949, 102630, 64132, -7801, 85069, 533, -65283, -77799, -109376, 19921, -73880, -106327, -55231, -29644, 28103, 16251, -15833, 10079, -62102, -36324, 61113, -56196, -73670, -51219, 72206, 85332, 129509, 119555, 68172, 26804, -46590, 27908, 85932, -21978, -21480, -45911, -49282, -40216, 54497, 34920, -44631, -287, -16750, -15008, 42137, 122681, 9219]
1763I219J4705l0998P3638J7091j16858o4624J4874K0466J7526M6283j736m1721
1751d2135M9812L873J6741K3219J10714j04966r8244O8515L0099p2926L3225N317
1739B3244n7106m7954K7751R2876l1909J3852K5206j19851N5075L4505l1910Q639
1727g582l6622L9569L0020q3840M8226q792n8360N7895r6240N6754Q2082l953
1715A9157L8518Q5541l6925j05740r3461N0040k4264O8018O9404o3537m1197m0092
1703g4538n8085P9821O532M183M2370j54221K1796L0534O5837O7610M4980k0636
1691E6183j14565o3374J6985K5558K9489N627k3025R9610k53o1651k6824l5827
1679i2067n5847J74320r9537n1714k6468r271Q9854R4493j2729K065j7893N7579
$$ y = [9219, 23924, -7074, 66564, 83655, -33203, -97827, -82953, -62487, -44961, 1322, -414, -42135, 7677, 11550, 28291, 51510, 162224, 57258, -40986, 27529, 57628, -15298, 17927, 23244, -33862, -81816, -54065, 38811, 6902, 20754, 45960, -73891, -18816, 15689, -16221, -7582, -44204, -4635, 25385, -58455, -10229, -19021, -77381, -19486, -115726, -58972, 23110, 19157, 57675, 143216, 106291, 551, -92910, -42870, -67134, 884, 70288, 6751, -34446, -74538, -132623, -52802, -46270, -42087, 283, -153938, -132142, -101608, -35771, 31839, 76819, 56183, -58382, -121756, -104771, -79213, -49724, -44097, -67122, 32488, 32235, -29416, -56240, -92067, -147914, 26406, -73131, -124845, -151313, -160584, -70730, 23763, 11034, 13099, -4794, 52785]
1667E2785p028j8244k9466L6762N3899l9092o3996n8081Q3986m8112O9803O858
1655D0074Q030j9116o5483j3535Q203m7639R0924J6014l3499o732j0443K6038
1643g164k6449L951J08757j27579K595L8802m173q479m5122j6712P824q675n2371
1630a34795L0419r3886N1997P1200M9567j8270p8268j3M263N3193r9264n767J56300
1617a3324k9795J7660M1866j6425m5891q1921k2042J23264K7739Q5073k794k1732
1605F1678m046j12731l951N0467N2941j1764K0972o043M4378M681r5464p0782
1593f9664L823p2387L1877n5664N0643L07J3819P3383M8415k2429M7848K806n7774
1580d997m0519O4961m5201R188j7903j18006R817L5901J23612N1020p6024k6797
$$ y = [52785, 45757, 27513, -1953, 34809, 88708, 49616, -14380, -72461, 11525, -36587, 33216, 40074, 48104, 28988, -36495, -50030, -41827, -89466, 1458, 17472, -16027, -22759, -33202, -7164, -33613, -29662, 79095, -48484, -45889, -7087, -11260, -19739, -64861, -81573, -73749, -82424, -134795, -104376, -198262, -146265, -75065, -25498, -43768, -122036, -122049, -117786, -64593, -163857, -169624, -13324, -43119, -25459, 16407, -18, -45909, -127830, -149872, -26608, 1131, 86204, 83410, 61678, 57632, -55099, -59050, -8583, 44358, 32594, 53566, 47523, 91901, 96582, 1118, -69664, -65841, -138228, -106351, -162015, -111372, -111065, -97246, -23863, 24552, 2123, 49971, 52777, -4997, -45516, 19445, -25756, -16568, -34471, -152477, -142660, -106759, 16853, 67873, -8151, -34948]
1568c4948M1927l2492M6553J12136m0769q7702R1399m0339L437m3993l5038q2135
1556a01964J3460J2144l6154m5523J0435J78062l1968r8904M7494m2503J02274
1545F853O3130J6954l8841P84j33955m371q470k1548K8259P3609J9762o1857k6414
1532h6105M4547j9449K2931O9016m5027J300m753j2801Q396r6860M1905J33114
1520E6214p4664M2601N2418q9106r582O0181L3751j9623j28990L5168P9176M012
1508D1556j13228j99M2251j29987m8981Q2781J12333n3455K858J5319r5227N5327
1496h8652J3309J7783l1433l4216K7952R4715K5361J18j0633J8177j1816L7183
1484E7848p6435j4536n0969m2784J02199Q3830m0909n353J1416J26181k5089m2934
$$ y = [-34948, 6979, -25513, 21040, 133176, 92407, 4705, 96104, 55765, 59202, 15209, -19829, -101964, -88504, -76360, -112514, -158037, -147602, 30460, -1508, -100412, -52918, -95421, 6853, 69983, 86937, 48096, 48880, -85075, -89446, -97916, -119464, -91205, -17596, 2166, -59691, -86105, -41558, -61007, -38076, 30940, -14087, -12787, -17540, -30341, -21945, -118805, -76900, 56214, -18450, 24151, 76569, -12537, -22119, 38062, 71813, 52190, -76800, -41632, 37544, 41556, -71672, -71871, -29620, -159607, -208588, -125807, -13474, -66929, -64071, -48752, -143979, -88652, -75343, -57560, -88993, -123209, -95257, -542, 24819, 24937, 14304, 32481, 20665, 57848, -18587, -33123, -84092, -126876, -24677, 59153, 18244, 12891, 24307, 150488, 125399, 82465]
1472H2465j73530q4524j69M7011J46994K871l1852j14507O725l161K5208J10035
1460A3566O4938M9729r6164l7829l3732J5856K1169k0736L7891j10051Q349k4169
1448a11183k1539Q626K6224K4783l4608m6866K4945L1267j5572O5644O2012k7155
1436a3422k8544j417N0617k3937Q1484k5774J1744o3664J9515n238o2151K3221
1424c7566L2027m0146m6969K3886j783p2212r7068P0083Q5375n473k2849l2953
1412a45648O1288m0808R088N7840m8971R0856j5723m3638l9953p2365Q4269O4101
1400c9664m9735J9926J19600K3919q6558l9753R6492L3031m9726m9493l2018q0457
1388a34436N0887J3450N8914N967m0675L4866m2460N3885M2638j05792q2056R2408
$$ y = [82465, -91065, -175589, -175758, -128747, 18247, 21118, -10734, -125241, -118516, -121677, -96469, 13566, 78504, 128233, 32069, -5760, -39492, -23636, -2467, -23203, 14688, -95363, -87014, -111183, -132722, -124096, -97872, -73089, -107697, -154563, -129618, -98351, -113923, -48279, 13733, -13422, -41966, -43383, 7234, -16703, 64781, 39007, 50751, -12913, 6602, 1364, -60787, -37566, -5539, -45685, -92654, -68768, -70551, -142763, -239831, -169748, -84373, -89846, -112695, -145648, -84360, -125168, -116080, -58240, -107211, -16355, -32078, -75716, -115669, -188034, -103765, -39664, -89399, -69473, 50127, 74046, -12512, -52265, 44227, 77258, 27532, -21961, -53979, -134436, -83549, -70099, -11185, -5218, -45893, -11027, -53487, 398, 43036, -62756, -144812, -52404]
1376e2404K5840L5410L2717q1620l0997p7586J8188l8893R9275P653m1908N6322
1364d8003l4564J11747j41355N041R7427j14319K12P6828K7633N47k5024K5548
1352a8282J7637n2620l1149J26388K4062J2307n961R105p5254m7506o5064O8138
1340c8199K3145q0368p957M8207n9234L805K9553J1703j2020L5507Q6167r464
1328C0845j45396K6833M3182L5793p3321J7867K12K5331J06507j7799j37697k0346
1316a07989J13413n1184O1653n7196k6525K8586J7206o0413O1994l152J0842m8745
1304f1510L7610M2632M1804r717q7339q316L4590m0285J04602n2089k8967J19112
1292I2127J1037n9653q0882P3249L8703m9032p3787J4755l4933p3982M9844N2448
$$ y = [-52404, -26564, 8846, 41563, -40057, -71054, -148640, -130452, -169345, -70070, -62417, -104325, -48003, -82567, 29180, -112175, -107134, -9707, -124026, -123814, -46986, -19353, -18806, -43830, -18282, -645, -53265, -84414, 41974, 66036, 78343, 72382, 81487, 6233, -41273, -106337, -38199, -15054, -95422, -103379, -55172, -114406, -110601, -81048, -69345, -81365, -45858, 40309, 30845, -114551, -87718, -44536, -8743, -82064, -64197, -63985, -38654, 67853, 50054, -87643, -107989, 5424, -45760, 15893, -41303, -67828, -39242, -22036, -82449, -20455, -23607, -12765, -61510, -23900, 18732, 60536, 50819, -36520, -44836, -10246, -50531, 54071, 1982, -26985, 92127, 103164, 43511, -37371, 35878, 74581, 25549, -48238, -33483, -68416, -142398, -92554, -40106]
1280d0106O9383J3737m204p6835j2698K3871J7307O2874k3936l1163K4511p841
1268A4900Q877N5146q5619j20002M9781L101m9295Q4805J07911J7025j6651j9943
1256E0036L9282m0609p6077k2219o8730J18785o691o2799Q2282j7833L8396o2224
1244b8401p7995r4377L5039J52793K0870L6859m1794k6317J04061Q9474p2563
1233I7649Q270p8601j14689J3519l0606k5575Q7959l1641m0077M4735K1614m0299
1221h7742n4573N5523P4503l61L8846j60684K0513J22054J2446q592j13155R5128
1209f094L2461j0851K6907K0364k0932l1320j8176o2451j3332j0009P3278K3663
1197C508M8493l9976M4245j1445k5055L4696k9430p0468q213j3465r667k8077
$$ y = [-40106, 29277, 43014, 38810, -38025, -50723, -26852, -9545, 53329, 29393, -1770, 22741, 14900, 23777, 78923, -6696, -126698, -76917, -73816, -123111, -38306, 69605, 86630, 69979, 50036, 89318, 48709, -27368, -49587, -118317, 468, -6223, -69022, 13260, -4573, 33823, -28401, -106396, -200773, -165734, -12941, 7929, 44788, 2994, -23323, 80738, 170212, 97649, 105919, 27318, -87371, -73852, -104458, -130033, -42074, -73715, -113792, -69057, -47443, -87742, -142315, -86792, -12289, -12650, 26196, -134488, -113975, 8079, 20525, 11933, -101222, -6094, 26367, 15516, 42423, 62787, 41855, 10535, -7641, -70092, -83424, -93433, -20155, 3508, 52001, 12025, 56270, 44825, 19770, 54466, 25036, -45432, -53645, -67110, -76777, -104854]
1185a04854J06149m3421L8290O9263k7370R1715m3798q2123n7545m3101J01425
1174D630L1423p4302P7617l1291n4599J2324K5633p8600N5278M842M7006M1229
1162F1190J8127q2857j9266M6664o4946l1020R3048l1622R1345K765l3578m3593
1150F257N56j08629J39865m4115k8250K7012R246j9933m4791k0723q7360R6496
1138g4369r2439R7214J50654K9096N7705j19120k3657R0891k16411k3280q140
1127a31856l144J61857J15297j02241j06441J7437n979M1622J2029j03630o5417
1116a70466P1062R1959n6944R7624M791k4091K9426q8807Q0351R377M031l5677
1104A2636k6957J34613q804K4251J2463m5941j13697L0424l3993m7899J5884J2890
$$ y = [-104854, 1295, -42126, -3836, 65427, 38057, 129772, 85974, 3851, -53694, -96795, 4630, 36053, -38249, 39368, 8077, -46522, -34198, -8565, -87165, -31887, -27045, 19961, 61190, 79317, -3540, -22806, 23858, -41088, -72108, 20940, -10682, 80663, 83428, 49850, 6257, 6813, -101816, 38049, -6066, -34316, -7304, 1942, -17991, -62782, -83505, -170865, -74369, -166808, -69594, 81060, 110156, 167861, 48741, 25084, 115975, -100436, -123716, -131856, -135000, 26857, 142154, 39913, -66528, -49091, -55070, -13448, -1419, -105049, -170466, -99404, -7445, -64389, 33235, 38026, 13935, 43361, -45446, 34905, 44282, 48313, 12636, -14321, 120292, 111488, 135739, 148202, 102261, -11436, 18988, -15005, -62904, -47020, -34130]
1092c4130k9479M7951M3404k516m5458l6526N5122P2859k0264p631j03328J13825
1080E3829J03997o3878q7073L7374q6633O0575K4499r6676M6757j5719j5607R913
1068b8642o3186O9393Q0478k1308N3937j29559q4586J8079J03404l5978o1515
1057i9483J03937N2647q5755K1466K6804R2423q0332q3384K8380k3477N4019M9330
1045E6575m2035J4830j0954p0485r857P6435P5986K197j04063Q8176r8894j06142
1033a28231P1564J01521J3426p089j3582k4021j4721O8187O9969l7965l5856o249
1021E6953k2443j7852n8069j8127l6819M9447J2495O482M2449J3601j784n5509
1009b9176r2655P9252l5718M9084J8641n4045q1521j3130L2355M6603J50576n833
$$ y = [-34130, -63609, -15658, 27746, 25230, -20228, -56754, -1632, 71227, 50963, 43332, -59996, 53829, 157826, 93948, 6875, 44249, -42384, 18191, 42690, -53986, -7229, -22948, -38555, -28642, -91828, -22435, 58043, 36735, 90672, -38887, -123473, -105394, -1990, -37968, -99483, 4454, 57101, -28654, -7188, 19616, 112039, 31707, -51677, -23297, -46774, 7245, 56575, 14540, 29370, 18416, -52069, -61926, 14509, 90495, 92692, -11371, 76805, -22089, -128231, -56667, 44854, 58280, 51191, 37609, 13588, -1133, 67054, 137023, 99058, 63202, 56953, 34510, 16658, -41411, -59538, -96357, -46910, -34415, -27933, 14516, 28117, 26333, -29176, -121831, -42579, -78297, -29213, -10572, -64617, -146138, -159268, -126913, -80310, 70266, 64433]
997F4433J2191k8595l5145K7265k4504j18719J6606k0716L3065J5688M0579K7249
985I397k8060k9474o4445J13208O9070m8145p3229L5433K951k7282o4291L0328
973g4539Q6948N5220M359l1689j08285r3534J12496L0080J14397j95685p076J2580
961i4728O0991N7430n0191N5160r803n905N3521r9046j4052M5598L0479J1655
949D1109K1956n6336j8096j0918K0552k3460M3051K1780p063M9806K6069j1721
$$ y = [64433, 76624, 48029, 12884, 40149, 15645, -103074, -86468, -107184, -74119, -58431, -17852, 9397, -18663, -48137, -112582, 626, 69696, 21551, -51678, -16245, -13294, -40576, -104867, -74539, 12409, 67629, 71988, 40299, -67986, -161520, -49024, -18944, 95453, -100232, -107308, -94728, -33737, 23693, -26498, 28662, 18859, 12954, 66475, -32571, -46623, -1025, 29454, 41109, 63065, 6729, -11367, -22285, -1733, -25193, 17858, 39638, 32575, 82381, 108450, 96729]
$$ [...]
##END NTUPLES=NMR SPECTRUM
##END=
