##TITLE=1H_TG-2357-A4
 CDCl3
 8 sc, 
 29.08.2022
##JCAMPDX= 6.0         $$ Bruker NMR JCAMP-DX V2.0
##DATA TYPE= NMR SPECTRUM
##DATA CLASS= NTUPLES
##ORIGIN= UXNMR, Bruker Analytische Messtechnik GmbH
##OWNER= root
$$ XWIN-NMR		Version 3.5
$$ Mon Aug 29 12:14:31 2022 Russian Standard Time (UT+4h)  she@DPX200
##.OBSERVE FREQUENCY= 200.1313499994
##.OBSERVE NUCLEUS= ^1H
##.ACQUISITION MODE= SIMULTANEOUS
##.ACQUISITION SCHEME= undefined
##.AVERAGES= 8
##.DIGITISER RES= 18
##SPECTROMETER/DATA SYSTEM= spect
##.PULSE SEQUENCE= zg30
##.SOLVENT NAME= CDCl3
##.SHIFT REFERENCE= (INTERNAL, CDCl3, 0, 15.7348)
##AUDIT TRAIL= $$ (NUMBER, WHEN, WHO, WHERE, WHAT)
$$ ##TITLE= Audit trail, XWIN-NMR		Version 3.5
$$ ##JCAMPDX= 5.01
$$ ##ORIGIN= Bruker BioSpin GmbH
$$ ##OWNER= she
$$ F:/spectra/data/she/nmr/H-F/1/pdata/1/auditp.txt
$$ ##AUDIT TRAIL=  $$ (NUMBER, WHEN, WHO, WHERE, WHAT)
(   1,<2022-08-29 12:13:13.92 +0400>,<she>,<DPX200>,
      <created by zg, POWCHK disabled, PULCHK disabled
       configuration hash MD5:
       00 E9 B6 7A A2 85 ED C7 34 08 36 98 17 FE 4E 26
       data hash MD5: 16K
       8F FB 95 BA A0 D2 6F 12 D2 8A 11 CA D4 52 18 D3>)
(   2,<2022-08-29 12:13:19.07 +0400>,<she>,<DPX200>,
      <Start of raw data processing
       efp BC_mod = 2 LB = 0.24 FT_mod = 6 PKNL = 1 PHC0 = -18044.14 PHC1 = 15.20069 SI = 16K 
       data hash MD5: 16K
       FD BC 6F 53 2C 6A BF 6A 97 45 0B B4 B8 25 B9 B4>)
(   3,<2022-08-29 12:13:37.14 +0400>,<she>,<DPX200>,
      <pk PHC0 = 3.249076 PHC1 = 1.8 
       data hash MD5: 16K
       A3 C3 49 97 68 A2 DD BD 31 12 40 07 55 44 70 4E>)
(   4,<2022-08-29 12:13:40.32 +0400>,<she>,<DPX200>,
      <abs ABSG = 5 
       data hash MD5: 16K
       55 AB 31 82 97 71 C7 2D 17 3B 2A 80 B7 44 1A 8D>)
$$ ##END=
$$ 
$$ hash MD5
$$ 4F DA 45 4B AF 6B CF B1 3F 4C F7 83 B3 9C E1 23
##$RELAX= 
##$RELAX= 
##$RELAX= 
##$RELAX= 
##$RELAX= 
##$RELAX= 
$$ Bruker specific parameters
$$ --------------------------
##$DU= <F:/spectra>
##$EXPNO= 1
##$NAME= <H-F>
##$PROCNO= 1
##$TYPE= <nmr>
##$USER= <she>
##$AMP= (0..31)
100 100 100 100 100 100 100 100 100 100 100 100 100 100 100 100 100 100 
100 100 100 100 100 100 100 100 100 100 100 100 100 100 
##$AQSEQ= 0
##$AQ_mod= 1
##$AUNM= <au_zg>
##$AUTOPOS= <>
##$BF1= 200.13
##$BF2= 200.13
##$BF3= 200.13
##$BF4= 200.13
##$BF5= 200.13
##$BF6= 200.13
##$BF7= 200.13
##$BF8= 200.13
##$BYTORDA= 1
##$CFDGTYP= 0
##$CFRGTYP= 5
##$CHEMSTR= <none>
##$CNST= (0..31)
1 1 145 1 1 1 1 1 1 1 1 1 1 1 1 1 1 1 1 1 1 1 1 1 1 1 1 1 1 1 1 1 
##$CPDPRG= <>
##$CPDPRG1= <>
##$CPDPRG2= <>
##$CPDPRG3= <>
##$CPDPRG4= <mlev>
##$CPDPRG5= <mlev>
##$CPDPRG6= <mlev>
##$CPDPRG7= <mlev>
##$CPDPRG8= <mlev>
##$CPDPRGB= <>
##$CPDPRGT= <>
##$D= (0..31)
0 1.2 0 0 0 0 0 0 0 0.06 0 0.03 0 0 0 0 0.0002 0 0 0 0 0 0 0 0 0 0 0 0 
0 0 0 
##$DATE= 1661760793
##$DBL= (0..7)
120 120 120 120 120 120 120 120 
##$DBP= (0..7)
150 150 150 150 150 150 150 150 
##$DBP07= 0
##$DBPNAM0= <>
##$DBPNAM1= <>
##$DBPNAM2= <>
##$DBPNAM3= <>
##$DBPNAM4= <>
$$ [...]
##$SUBNAM3= <"">
##$SUBNAM4= <"">
##$SUBNAM5= <"">
##$SUBNAM6= <"">
##$SUBNAM7= <"">
##$SUBNAM8= <"">
##$SUBNAM9= <"">
##$SW= 18.0517283424941
##$SWIBOX= (0..15)
0 0 2 0 0 0 0 0 0 0 0 0 0 0 0 0 
##$SW_h= 3612.71676300578
##$TD= 16384
##$TD0= 1
##$TE= 0
##$TE2= 300
##$TE3= 300
##$TEG= 300
##$TL= (0..7)
0 120 120 120 120 120 120 120 
##$TP= (0..7)
150 150 150 150 150 150 150 150 
##$TP07= 0
##$TPNAME0= <>
##$TPNAME1= <>
##$TPNAME2= <>
##$TPNAME3= <>
##$TPNAME4= <>
##$TPNAME5= <>
##$TPNAME6= <>
##$TPNAME7= <>
##$TPOAL= (0..7)
0.5 0.5 0.5 0.5 0.5 0.5 0.5 0.5 
##$TPOFFS= (0..7)
0 0 0 0 0 0 0 0 
##$TUNHIN= 0
##$TUNHOUT= 0
##$TUNXOUT= 0
##$USERA1= <user>
##$USERA2= <user>
##$USERA3= <user>
##$USERA4= <user>
##$USERA5= <user>
##$V9= 5
##$VALIST= <valist>
##$VCLIST= <CCCCCCCCCCCCCCC>
##$VD= 0
##$VDLIST= <DDDDDDDDDDDDDDD>
##$VPLIST= <PPPPPPPPPPPPPPP>
##$VTLIST= <TTTTTTTTTTTTTTT>
##$WBST= 1024
##$WBSW= 4
##$XGAIN= (0..3)
0 0 0 0 
##$XL= 0
##$YL= 0
##$YMAX_a= 121078
##$YMIN_a= -252138
##$ZGOPTNS= <>
##$ZL1= 120
##$ZL2= 120
##$ZL3= 120
##$ZL4= 120
##$ABSF1= 15.75019
##$ABSF2= -2.30166
##$ABSG= 5
##$ABSL= 3
##$ALPHA= 0
##$AQORDER= 0
##$ASSFAC= 0
##$ASSFACI= 0
##$ASSFACX= 0
##$ASSWID= 0
##$AUNMP= <proc_1d>
##$AZFE= 0.1
##$AZFW= 0.1
##$BCFW= 0
##$BC_mod= 2
##$BYTORDP= 0
##$COROFFS= 0
##$CY= -3
##$DATMOD= 1
##$DC= 0
##$DFILT= <>
##$DTYPP= 0
##$F1P= 0
##$F2P= 0
##$FCOR= 1
##$FTSIZE= 16384
##$FT_mod= 6
##$GAMMA= 0
##$GB= 0
##$INTBC= 1
##$INTSCL= 3.70164e-10
##$ISEN= 128
##$LB= 0.24
##$LEV0= 0
##$LPBIN= 0
##$MAXI= 10000
##$MC2= 0
##$MEAN= 0
##$ME_mod= 0
##$MI= 1.114404
##$NCOEF= 0
##$NC_proc= -7
##$NLEV= 6
##$NOISF1= 3.799351
##$NOISF2= 2.8
##$NSP= 0
##$NTH_PI= 0
##$NZP= 0
##$OFFSET= 15.73477
##$PC= 1
##$PHC0= -18040.89
##$PHC1= 17.00069
##$PH_mod= 1
##$PKNL= yes
##$PPARMOD= 0
##$PSCAL= 0
##$PSIGN= 0
##$REVERSE= no
##$SF= 200.130007357999
##$SI= 16384
##$SIGF1= 3
##$SIGF2= 2
##$SINO= 5.538805
##$SIOLD= 16384
##$SREGLST= <1H.CDCl3>
##$SSB= 0
##$STSI= 16384
##$STSR= 0
##$SW_p= 3612.71676300578
##$SYMM= 0
##$S_DEV= 0
##$TDeff= 16384
##$TDoff= 0
##$TI= <>
##$TILT= no
##$TM1= 0
##$TM2= 0
##$TOPLEV= 0
##$USERP1= <user>
##$USERP2= <user>
##$USERP3= <user>
##$USERP4= <user>
##$USERP5= <user>
##$WDW= 1
##$XDIM= 16384
##$YMAX_p= 509270126
##$YMIN_p= -6613218
$$ End of Bruker specific parameters
$$ ---------------------------------
##NTUPLES= NMR SPECTRUM
##VAR_NAME=  FREQUENCY,     SPECTRUM/REAL,   SPECTRUM/IMAG
##SYMBOL=    X,             R,               I
##VAR_TYPE=  INDEPENDENT,   DEPENDENT,       DEPENDENT
##VAR_FORM=  AFFN,          ASDF,            ASDF
##VAR_DIM=   16384,         16384,           16384
##UNITS=     HZ,            ARBITRARY UNITS, ARBITRARY UNITS
##FACTOR=    0.220516191357247, 1,           1
##FIRST=     3148.99960008657, 0,            0
##LAST=      -463.717162919209, 0,           0
##MIN=       -463.717162919209, -6613218,    0
##MAX=       3148.99960008657, 509270126,    0
$$ Real data points
##PAGE= N=1
##DATA TABLE= (X++(R..R)), XYDATA
$$ [...]
9202 4431866 4684890 4902559 4760216 4655891 4769461 4795190 4977844 5040227 5070389 4917445
9192 4917445 4848307 4914886 5058458 5362292 5650254 5913749 6074359 6210147 6054542 6083534
9182 6083534 6153521 6108735 6316392 6829343 6918337 6810126 7369909 7470678 7623384 7876160
9172 7876160 8145762 8107896 8366699 8407945 8179958 8660972 8524830 8893306 8776986 8576349
9162 8576349 9125099 9223238 9438979 9735447 9987084 10527036 10726854 11151432 11419337 11793239
9152 11793239 12302544 12556227 13375534 14211387 14759192 15138078 15211612 15339931 15811557 16292061
9142 16292061 16614054 16685960 16751380 17156012 17430242 17923215 18948323 20316989 21254797
9133 21254797 22343173 23381387 24817820 26593073 28850456 30882947 31643810 31080738
9125 31080738 29484156 27858591 26731749 26294038 26303091 26493541 26902313 27339455 27619626
9116 27619626 27286221 27083450 26975460 27083844 27668616 28112137 29204282 30521715 31802575
9107 31802575 32663336 33956562 35018130 36160466 37653915 39696302 42276732 44006948
9099 44006948 45772315 47328563 48452479 49881708 51661963 53981444 57642575 62208136
9091 62208136 67561987 74549766 83900301 95880556 110972321 126471658 135975833 134753967
9083 134753967 123081552 107946707 93478519 82008657 74628562 70252049 68489748
9076 68489748 68387277 68464357 66546100 62233327 56891444 52581018 49403962 47186957 45617449
9067 45617449 44358114 43268480 43243184 43630400 44160620 45408894 46917532 48667469 50453066
9058 50453066 52994164 55802763 60379576 65731378 70968257 73537553 73720482 73093936
9050 73093936 74434962 78177461 84651563 94543847 107980620 123546395 135781154 137271461
9042 137271461 125857754 106179179 85731902 70198420 58413868 50593567 44929839
9035 44929839 40630933 37404071 35084293 33856914 33030606 32628528 32148423 30808171 28489142
9026 28489142 25922801 23201412 21180483 19905001 18580299 17433988 16924015 15983405
9018 15983405 15312358 14751482 13814759 13296971 12799579 12270479 12020320 11475244 10679787
9009 10679787 10642925 10183400 9777429 9496792 9316546 8898751 8471539 8015169 7794015 7568546
8999 7568546 7510886 7551197 7471745 7355568 7122966 6785386 6550222 6340682 6372442 6220462
8989 6220462 6081002 5900058 6096914 5918993 5904892 5996051 5783471 5585368 5306130 5281759
8979 5281759 5228402 5147322 5363843 4903982 4757657 4560324 4353938 4312842 4205471 4233137
8969 4233137 4209007 4271942 4422611 4417032 4038528 3690976 3815753 3876435 3635264 3748573
8959 3748573 3559454 3663800 3583636 3853652 3613006 3573673 3235975 3266529 3400968 3146496
8949 3146496 3208539 2971583 2802168 2821014 2633411 2708574 3188990 3114937 3295152 3389483
8939 3389483 3024985 2721857 2716475 3014875 3110936 2999840 2909836 2738205 2545376 2945869
8929 2945869 2905521 2946728 2842445 2788689 2610996 2430113 2674311 2752687 2910177 2718960
8919 2718960 2580750 2464626 2359964 2591746 2675784 2545273 2582720 2798162 2683580 2690891
8909 2690891 2527830 2454809 2580944 2556326 2736258 2649903 2610882 2567168 2697803 2759015 3069788
8898 3069788 3045321 2843162 2777119 2848366 2860882 2875718 2889144 2546499 2568861 2779534 2595192
8887 2595192 2546183 2436283 2726450 3021566 2971889 2827430 2987186 2835418 2437648 2339711
8877 2339711 2713149 2928702 3067429 2917897 2948813 2934259 2823752 3007398 3016158 3337092
8867 3337092 2924343 2850709 2939233 3076444 3048244 2896750 3003919 3539963 3308547 3402427
8857 3402427 3301689 3111108 3111880 3096686 2975513 3036851 3158678 2660175 2564629 2724943 3135653
8846 3135653 3463154 3309550 3143341 3319633 3574847 3469504 3074267 3075926 3133125 3332047
8836 3332047 3462509 3278221 3148829 3058910 3199177 3405669 3399530 3369411 3593475 3748288
8826 3748288 3692349 4151575 3942959 3955977 4007264 4244184 4449370 4478721 4524306 4308204
8816 4308204 4269676 4206445 4393021 4446344 4564095 4410993 4744113 5096056 5172091 5150736
8806 5150736 5343522 5515853 5562748 5606012 5427982 5532732 5965955 5983686 6176967 6280993
8796 6280993 6207639 6277729 6092550 6409005 6445336 6764214 7012724 7156904 7424064 7568025
8786 7568025 7780267 7879376 7827765 8140644 8275990 8601297 8970045 9424664 9826911 10011971
8776 10011971 10489057 10791367 10976388 11110501 11375606 11884026 12613627 12984644 13103575
8767 13103575 13263704 13804987 14406879 14817769 15269489 15834807 16350491 16811612 17311194
8758 17311194 17679359 18290661 18877682 19570067 20288786 20848326 21173233 21734556 22273314
8749 22273314 22637718 23164209 23940921 24610445 24762982 25132740 25715144 26303173 26889580
8740 26889580 27485148 28123654 29102241 30137243 30991531 31759347 32956402 34188327 35520938
8731 35520938 36602675 37890742 39543211 41305781 43123631 44787536 46364862 48060019
8723 48060019 49756838 51886394 54168460 56850004 59363602 62086670 64928727 68384278
8715 68384278 72155366 76470198 81805873 88410397 95586893 103169636 110952431 119363474
8707 119363474 128647577 137158882 144399749 149959745 155912911 163670844 172116204 175444145
8699 175444145 168804378 151678885 135191395 122477384 110990993 101475674 93797553
8692 93797553 87964125 83107504 78595435 74263978 70639576 67174892 64280266 62104884
8684 62104884 60372168 59232790 58732224 58856913 59573639 60698209 61987278 63640982 65696848
8675 65696848 68716153 71195802 73689948 76640905 80025359 84194444 87889097 90784923
8667 90784923 93540790 96459320 99115110 100162110 98919900 96335500 92772964 89323144
8659 89323144 84460859 77645074 70275325 63710382 58087810 52736129 47510181 43192974
8651 43192974 39791571 37031904 34294834 32080174 30066093 28454277 27125987 25602386
8643 25602386 24221078 22787423 21635892 20221577 19248711 18461517 17617217 16716338 15906729
8634 15906729 15150491 14269565 14074943 13700885 13178843 12675417 12156871 11851364 11355737
8625 11355737 11264966 10778960 10163299 10111012 9975447 9759114 9471322 9146591 8738936 8421545
8615 8421545 8489039 8057856 7692646 7632522 7241185 6773768 6821171 6836725 6674308 6578996
8605 6578996 6602153 6431250 6140300 5880798 5757130 5652052 5237550 5105137 5307873 5307236
8595 5307236 4867683 4863008 4915422 5062404 4821527 4506377 4532258 4737346 4338174 4467583
8585 4467583 4505306 4497217 4382782 4455661 4343976 4115447 3964226 3842313 4001237 3893117
8575 3893117 3459062 3806859 3923179 3979949 3844232 3516730 3846982 3579185 3600534 3746730
8565 3746730 3879069 3933896 3527147 3042176 3142028 3487149 3223575 3103637 3589678 3653070
8555 3653070 3558243 3179336 3104041 3032108 2683410 2580454 2113410 2124218 2503302 2497949 2634538
8544 2634538 2445479 2343692 2070714 1909338 1906214 2003495 2114213 1931843 1493409 1716644
8534 1716644 1949270 1678573 1718759 1841171 1925306 1965956 1869233 1855752 1853477 1574907 1180537
8523 1180537 1331251 1400990 1498456 1758450 1725789 1647469 1780453 1906130 1809538 1669690
8513 1669690 1426960 1376097 1360093 1319943 1169668 1021452 1284581 1259267 897448 929011
8503 929011 1092389 1005048 784172 826122 810558 681298 760791 819284 975642 1071126 420293
8492 420293 553934 676107 701277 662024 632252 883528 641334 720445 666089 767128 888303
8481 888303 611736 685654 728692 563778 655016 322664 231312 780288 834937 262789 423831
8470 423831 467491 430694 434638 823284 869137 638197 463462 471068 574684 733182 329071
8459 329071 536196 539395 366812 504169 620067 781872 373757 296993 -1957 -141891
8449 -141891 151900 413687 398200 492826 285278 385888 214929 277738 346270 319092 373978
8438 373978 430411 162544 387527 466745 398507 368273 116380 154896 -75889 304445 264263
8427 264263 206509 124475 -122164 125907 733933 683934 336680 110853 -31367 -175012
8417 -175012 -180539 144564 318925 369375 297561 531306 387868 320407 361385 145427 45965
8406 45965 4298 60328 387484 144700 -3505 127871 -124422 26568 76445 52945 89108
8395 89108 195513 136802 -59542 -91262 -141399 -61150 -58457 64724 -98458 61066 -123937
8384 -123937 12303 -55403 -274018 -101550 52286 -9031 38250 326239 703068 551665
8374 551665 221470 99138 -41586 -56584 106204 296538 390963 -712 -98982 10753
8364 10753 38989 453303 288910 311305 81233 131891 463210 482596 325957 404243 419918
8353 419918 451612 319945 428943 743312 559446 447985 445950 219280 191971 156939 483915
8342 483915 768991 538381 294551 381439 726779 388544 572695 556294 755867 825978
8332 825978 409927 276461 543401 598124 354794 262168 369203 494807 490402 623906
8322 623906 696147 724272 520571 390814 157647 107493 306767 72 26462 157058
8312 157058 51204 232690 95544 305818 501009 506175 491249 269769 408040 417380 439873
8301 439873 495336 381016 334658 159640 438772 444429 404985 541576 615822 659147 707556
8290 707556 632502 422647 330991 221421 -2769 494304 446688 205037 108476 398156
8280 398156 353538 -21744 223047 353334 314911 29353 395485 394673 -59080 -60740 -205431
8269 -205431 -66844 -282926 -76463 40521 169837 -26598 -290669 -361797 -212397 98341
8259 98341 225734 133398 -181848 118805 94052 -21191 43587 -61076 275793 261392 203154
8248 203154 103549 -178342 131745 84988 249183 98457 215353 29025 -98267 218459
8238 218459 167258 -69439 19484 197905 265353 276563 336915 398572 139761 -159547 -1061
8227 -1061 63321 181089 89301 290432 522665 398132 94971 -277989 100476 276894
8217 276894 -177108 57649 84889 223415 274578 347982 -22271 -18077 176400 265418 62
8206 62 -182155 -142245 187977 230929 223895 -146108 -263155 -174579 -110339 -278244 -165919
8195 -165919 -351922 -497909 -2439012 -6613218 -2396465 -546757 -314183 -363766 -152987
8186 -152987 132909 -191584 -291192 -482242 -175168 -217523 17078 95773 203955 -120617
8176 -120617 117421 -95021 -30369 86673 113886 -75075 162997 -261522 -146332 -122279
8166 -122279 29571 -84675 -60323 6665 8044 -283941 -446210 -235641 -52428 97078
8156 97078 15908 -220932 -487437 -637439 -266686 -350136 -572126 -455645 -203102 31684
8146 31684 299671 327930 104877 -97316 230211 -127457 51788 -88520 -204402 -133416
8136 -133416 -258141 -305613 -412351 -220891 -256259 -165063 -50069 79973 -223908 -330454
8126 -330454 -304622 -255104 -122471 -68030 -142649 -164024 -424976 -368363 -22237 62627 -53624
8115 -53624 -174754 -268856 -355171 -372215 -311282 -171611 -55268 -72223 -277713 -180248 1877
8104 1877 -19557 -880 17990 119282 181025 178418 65219 23934 -177898 -432954 -384627
8093 -384627 -109874 -78819 -265412 93274 80836 -107225 -207883 -394447 -486867 -297464
8083 -297464 -136388 -16104 -104192 -373018 -276551 144785 468375 377793 -49109 -389861
8073 -389861 -206606 17111 123297 -115545 -189411 -266870 -136910 -131491 -41792 -225776 -261416
8062 -261416 -119847 22953 84807 200586 51680 1255 68432 -284999 -473121 -451315
8052 -451315 -372941 42456 71551 -303780 -12044 137516 -445980 -129197 -99002 46034
8042 46034 -28365 -342863 -431965 -370105 -310237 -551226 -273964 -98483 -21056 1379 47010
8031 47010 -33432 54398 -41589 -70978 94017 -295488 -344151 90621 42998 -283744 -179880
8020 -179880 -222759 70810 163763 -50875 -59808 6391 -93524 -229601 -28310 -26832 -82209
8009 -82209 73233 -66202 205484 164071 187462 302697 140340 -149652 -323080 -417461
7999 -417461 -281490 -58159 -203839 157791 244076 4582 -15150 31362 99283 330497
7989 330497 219781 834 -59929 -232934 -139315 -74934 -68369 67976 142412 -53015 -169245
7978 -169245 -171757 -222972 -169775 -147075 62599 -72685 67087 154500 -8312 -295075 -109219
7967 -109219 391792 733063 486443 435570 422684 478611 465279 457380 225439 134955 -27209
7956 -27209 202106 283610 312783 10220 84224 401787 302438 76748 158629 81489 32770
7945 32770 93550 104779 82685 500099 133091 -17417 181528 199483 3971 -80802 417005
7934 417005 328916 328839 255624 233067 144480 54499 -49861 -54627 266310 187535 179481 -129552
7922 -129552 13699 279618 -118594 67345 -25263 135098 174269 101647 84221 -17005
7912 -17005 -46021 -306377 -2330 111572 28446 -30301 -196099 -270147 -61613 79312 -335374
7901 -335374 -270484 -74675 5744 -48003 449860 106497 -107071 207686 414940 502191
7891 502191 312739 109002 -113133 -100491 91052 39250 -157052 13306 295526 64115
7881 64115 16344 -129969 -43177 -28344 33887 168189 143855 8285 123909 234170 281165
7870 281165 71724 32195 313025 245337 83252 103252 -5704 199893 -9005 7678
7860 7678 182025 273760 -83862 35433 130805 151187 78605 -42440 -126663 -150388 -20361
7849 -20361 -228029 -382174 -226809 -452382 -170472 -211425 -167256 407093 74276 99398
7839 99398 -119311 -295680 -93659 -41016 -101007 -90746 -203747 -191534 14160 131191 98332
7828 98332 -243746 -321006 -17622 134181 356445 35149 150653 141163 375610 236781
7818 236781 -12717 394492 427195 276099 72406 -17747 60693 -4245 236580 176815 244285
7807 244285 7304 631335 -32195 -36438 240257 157850 -128067 -402882 -295164 263784
7797 263784 243854 -114039 -99109 -366842 -399844 -381345 -65425 -27179 -60072 -173523 -139775
7786 -139775 -262672 -114690 193737 -33946 -147107 -179929 -408859 -374418 -249633 -69438
7776 -69438 -137788 43882 -80932 -114769 -173581 63410 -186556 -290712 -220594 -134017 -350818
7765 -350818 -152943 -113748 -45299 -316630 -157727 -14100 -178715 -247901 -55437 -137488
7755 -137488 -171959 -116433 -217387 -111750 96256 18515 -153845 -335015 -235263 -118353
7745 -118353 -110456 187692 160157 305593 177704 207633 256942 215603 -190735 -202870 -270058
7734 -270058 -114834 139699 204456 140248 -83961 -145683 16464 303806 393420 70948
7724 70948 -49220 45251 -129352 -178845 15973 -23313 -863 6875 41790 -150086 -55177
7713 -55177 -81040 315284 76109 -153006 321729 431744 346575 259978 -378058 -125495
7703 -125495 -149624 183902 299740 -125942 -372271 -374137 -230609 -205011 145115 207929 117182
7692 117182 177567 59438 141566 403263 96848 -41225 -84998 -86752 -159614 -56589 -140140
7681 -140140 -350177 -435093 58997 -112381 -82116 36037 363508 138229 215674 314907
7671 314907 337625 455257 175990 147546 295156 295881 519957 601641 156050 86918 205261
7660 205261 272757 65002 -11441 96639 246530 125018 165754 -5942 -80616 85348
7650 85348 5739 -168966 -7517 8993 69700 340701 2502 138534 400713 276250
7640 276250 292486 229775 375288 413369 199762 204166 283116 303054 -184662 -221761 -154413
7629 -154413 175301 97030 339209 428397 225468 117280 89720 79142 265935 419353
7619 419353 407561 161038 290151 461757 285104 248935 124500 126382 306410 405764 345766
7608 345766 302604 219475 74542 -68857 127934 321096 270827 485657 348314 639622
7598 639622 857166 678487 467311 192610 174551 163441 547691 330037 220223 544969
7588 544969 637237 379858 324253 533552 730324 657373 553157 538153 710673 975370
7578 975370 1047753 650897 754309 889655 1086073 1006767 740802 760682 829503 779755 768010
7567 768010 546789 676946 682727 652148 633321 852594 1166121 1378265 1032592 1002020 1084215
7556 1084215 1151518 1232963 1068269 996504 1155232 1505053 1326772 1320654 1330736 1136739 1032573
7545 1032573 1076591 1243292 958025 753969 1035940 1045552 1049020 1256955 1488440 1617255
7535 1617255 1351398 1278988 1410085 1673771 1629012 1728299 1850390 1806423 1974546 2054755
7525 2054755 2001724 2246356 2231355 2231595 2469771 2678833 3086317 3103356 3243093 3433430 3646408
7514 3646408 4104444 4605626 4606990 4244709 4426109 4667649 4674374 4551338 4180443 4087234
7504 4087234 4205917 4029662 3824974 3722749 3217419 3273937 2966735 2786386 2781465 2320543
7494 2320543 1927150 2102444 2111367 1841118 1501583 1506682 1430621 1543577 1438659 1455205 1550222
7483 1550222 1527738 1447361 1570266 1807556 1338954 1540360 1688065 1792783 2007003 2066412
7473 2066412 2034210 1779623 1681071 1885257 1914220 1310536 1181770 1369513 1462795 1059323
7463 1059323 1093878 1263212 1527367 1688454 1887281 1700675 1541717 1633359 1429601 1518048
7453 1518048 1301658 1261294 1480392 1324012 1398710 1536686 1365703 1334912 1344636 1360804 1299420
7442 1299420 1404644 1223967 1169477 1456526 1426429 1525848 1222586 1247762 1170037 932661
7432 932661 931824 1278869 1452215 1370850 1481700 1270773 1366642 1069710 1009657 1214586 1397810
7421 1397810 1203969 817327 982378 1016131 1030559 550182 386192 935291 831008 931823
7411 931823 911865 883137 941735 811731 836148 1126251 917003 996397 1165761 932998 903700
7400 903700 976098 844999 829098 801355 943837 835530 728697 870245 973532 638389
7390 638389 790246 763651 727341 549296 797526 856138 511202 399315 598646 544120
7380 544120 509883 860886 832362 539137 682316 127088 377715 821902 634856 560619
7370 560619 295275 705219 870043 834742 519043 642332 489403 217735 350388 302784
7360 302784 86699 482901 509767 333633 522979 679594 860349 752715 394013 326003
7350 326003 212487 274523 396124 327090 843294 809100 614574 910751 543550 309900
7340 309900 454880 660261 422970 583944 466473 372162 7578 244317 491167 330219
7330 330219 534924 729643 768436 501054 425151 969074 779016 723901 880128 724488
7320 724488 800353 774404 640015 440526 339810 445174 433179 527459 838831 984940
7310 984940 768492 646660 399579 231573 296909 264083 397505 412313 702069 765865
7300 765865 709523 513606 585772 496418 584780 730370 535680 524803 745791 764130 379852
7289 379852 326834 234951 232770 548956 497043 207299 538988 556307 511508 569667 580340
7278 580340 830437 939999 1237583 967915 638199 850093 756396 537087 660556 913754
7268 913754 940358 585197 634960 820746 895964 715659 627436 760261 951186 528759
7258 528759 572277 1111694 1166872 1131360 1060745 708340 728502 1099445 1173552 1139699 1088004
7247 1088004 885041 791241 815060 760026 751414 686082 666812 799939 1219427 1295525 1192001
7236 1192001 1091242 1036585 1043037 1022906 1233110 1448568 1621128 1823854 1639805 1237857
7226 1237857 1281450 1286152 1305430 1525833 1847133 1670836 1198795 1179404 1284710 1548508
7216 1548508 1897754 1719229 1281352 1763290 2000243 1714262 1793871 2067929 1924892 1627164
7206 1627164 1921512 2107094 1997932 1804871 1894430 1926369 2091741 2040637 2333569 2500958
7196 2500958 2511251 2525653 2766794 2718519 2780703 3193055 3103149 3110942 3097922 3442193 3588351
7185 3588351 3653909 3388661 3672330 3884068 3784854 4053330 4173728 4158390 4428959 4412519
7175 4412519 4488187 4818540 4901238 4831544 5010289 5195648 5218777 4811847 5176712 5573581
7165 5573581 5681453 5914713 6105315 6129387 6224160 6349974 6606685 7099722 7705298 7974682
7155 7974682 7963268 8244167 8336788 8879885 9246082 9605205 10298259 10802050 11099656 11938145
7145 11938145 12477279 12984686 13562221 14510742 15178177 15817165 16716984 17274334 18183522
7136 18183522 19336087 20495243 21752842 23190542 25260503 26931505 29281719 32117740
7128 32117740 35612850 39637134 44844756 50920012 57700572 64242955 70380784 77196836
7120 77196836 84952551 95619356 109835497 125768847 139161885 145452901 141018520 127155834
7112 127155834 107690659 87865149 71214797 58298758 48948572 42208431 36988041
7105 36988041 32988328 29369283 26290884 23795995 21972078 20516364 18984196 17323142
7097 17323142 15905261 15189221 14183945 13312008 12736128 11781287 11131424 10880204 10622865
7088 10622865 10185046 10014040 9492051 8723524 8102064 7741454 7638793 7731396 7262868 6743641
7078 6743641 6638319 6615926 6175641 5894667 5534361 5471359 5429670 5119361 4919899 4741542
7068 4741542 4474047 4573371 4667800 4508851 4428823 4485986 4046723 3817462 3985725 4024442
7058 4024442 4251125 4150955 3949277 3660491 3546471 3103137 2727580 2841449 2943065 2884024
7048 2884024 2972328 2964679 2939986 2767426 2660487 2771429 2725473 2632351 2635275 2755218 2792400
7037 2792400 2693519 2464843 2418430 2363781 2408353 2463053 2563686 2618480 2580110 2734232 2476282
7026 2476282 2263428 2219192 2341441 2549948 2396724 2274415 2437929 2372674 2277093 2345996
7016 2345996 2192705 2121436 2251594 1973569 1783805 1805690 1699981 1907971 1851176 1820210
7006 1820210 1636257 1452776 1447604 1481409 1876999 1724397 1477319 1609664 1734312 1408022
6996 1408022 1475774 1802807 1736817 1655286 1750850 1960546 2028876 1902847 1871539 2018766 1904539
6985 1904539 1860266 1957879 2139428 2290311 2136938 2062757 2213788 2456425 2460183 2527973 2484206
6974 2484206 2690020 2426337 2604988 2732607 2866226 3154922 3424947 3334961 2976736 3018298
6964 3018298 2918463 3016355 2991148 2782734 3186779 3308400 2903934 2569592 2441842 2233049
6954 2233049 2235166 2368666 2540077 2405031 1805977 1890867 2138854 1849886 1559217 1724702
6944 1724702 1705729 1768662 1579638 1436326 1356019 1504969 1599366 1233124 1330596 1507612
6934 1507612 1679261 1435687 1074674 1314443 1415090 1213563 1565834 1410027 1231343 816299
6924 816299 918227 1166775 879660 837347 742327 933663 1122769 1248026 1430725 1481240
6914 1481240 1280949 1288215 1403365 1431471 1263104 1369272 1531071 1632548 1645888 1540582
6904 1540582 1644605 2062715 1981491 1928920 1971626 2182206 2217729 2377033 2299543 2531285
6894 2531285 2331348 2265475 2552155 2978353 3073401 2876198 3067150 3174744 3207144 3207030 3616515
6883 3616515 3278361 3087918 3114011 3146326 3150340 3236017 3222376 3605007 3900755 3584006 3759098
6872 3759098 3748785 3736122 3761452 3718214 3872030 3760266 3670305 3659535 3368973 3601319 3483319
6861 3483319 3130110 2845168 2991009 2992730 2821706 2627065 2411310 2278739 2194440 2417137
6851 2417137 1946337 1689500 1857639 1825825 2141004 1944001 1662911 1192649 1349697 1383596
6841 1383596 1341666 1296873 1473937 1589574 1673210 1714835 1591309 1492265 1779227 1781626 1755641
6830 1755641 2175040 2550942 2624027 2657250 2949068 2843273 2607812 2847267 2777160 2909347
6820 2909347 2959676 2620924 2678376 2668232 2760700 2732651 2916882 2418872 2340508 2082590 2188641
6809 2188641 1974385 1724291 1836296 1968546 1675981 1386016 1263558 1350504 1077761 1296140
6799 1296140 1564637 1410564 1033192 1050168 1191708 1210854 1044440 1075374 990823 997725 1102915
6788 1102915 1018737 1372577 1152876 602219 600345 550688 328321 539742 322276 464051
6778 464051 715535 929586 955459 699810 669770 770446 612752 499651 700411 741896
6768 741896 828029 787840 805861 753736 782491 634271 761664 466170 577427 803202 383122
6757 383122 406861 406975 372383 502291 326696 397003 546425 481976 628658 655044 751909
6746 751909 559277 331245 696941 588894 202993 182324 462760 643492 902486 1097593
6736 1097593 992443 810265 766290 653809 613472 476270 280473 382051 824512 874688
6726 874688 708699 928944 922998 702912 700640 744177 744339 1097135 908848 855925 1198351
6715 1198351 1373357 1224353 1189888 1171662 1356290 1143565 1024971 941387 892507 839560
6705 839560 890013 843544 640872 548634 661193 673100 525980 652188 1118307 1211742 1081521
6694 1081521 804046 691263 807585 686747 717138 552597 499220 605486 589373 430714
6684 430714 303188 581465 427183 131205 421995 838857 1082890 706300 565452 649656
6674 649656 668019 762814 634918 669747 748168 658447 644778 1203088 792763 699716 584306
6663 584306 661069 699256 748977 728802 611302 502577 680325 600189 786721 892179 545859
6652 545859 671168 552969 237458 549409 562420 494107 601942 642226 497512 257530
6642 257530 574143 812025 800137 685659 906483 753652 848272 507801 334273 613903
6632 613903 665280 876740 1159615 1055086 859417 946533 971110 880387 1076889 1038094 800479
6621 800479 922666 1251842 1133200 1097376 1000354 1158483 1126967 1339861 952212 782195
6611 782195 777021 898617 1273501 1438971 1421705 1428747 1689382 1724894 1810718 1696583 1799420
6600 1799420 2136133 2011118 2139421 2537709 2260981 2014818 1746496 1625122 1551097 1649558
6590 1649558 1469861 1521839 1703138 1908445 2213262 1840210 1879055 1935642 2247103 2564450
6580 2564450 2384252 2495144 2929722 3019979 2939397 2912368 3596914 3895163 4178487 4732482
6570 4732482 4853047 4983828 4586283 3929805 3716264 3497493 3326724 2863275 2607169 2424457
6560 2424457 2391931 2645390 2519996 2432046 2820508 2935768 2910152 3044388 3389078 3495911
6550 3495911 3591955 3971614 3824607 3919762 4219280 4624709 5134972 5812143 6222641 6074420
6540 6074420 5842913 5200175 4432546 4141284 3861002 3412091 2982141 3008698 2858110 2879388
6530 2879388 2965048 2741583 2605966 2822577 3209254 2860152 2861721 3122013 3285638 3668851
6520 3668851 3869441 3621018 3791653 4079490 4218202 4703087 5198166 5490499 5437018 4963815
6510 4963815 4183369 3529659 3146819 2926285 2502284 2417716 2273582 2317374 2460484 2145091
6500 2145091 2047475 2069621 2083640 2101964 2231399 2123546 2064546 2373771 2154195 2281794
6490 2281794 2453606 2510880 2165641 2306207 2784910 3039970 2856015 2906696 2884079 2480917
6480 2480917 2439803 2230454 2104735 1966688 1829387 1839778 1763943 1808766 1745673 1778431 1746740
6469 1746740 1566765 1746350 2078237 2193183 2366517 2126792 1834905 1833216 1694903 1438270
6459 1438270 1953776 2162464 2047238 1977872 1964767 1857345 1514707 1582698 1770296 1727050
6449 1727050 1693171 1826824 1871192 1800402 1744832 1734869 1615017 1603408 1865738 1851091 1871232
6438 1871232 1586883 1456619 1420166 1081268 1235327 1375367 1347926 1360370 1419580 1819068
6428 1819068 1982238 1663703 1479944 1282812 1470067 1406160 1419069 1541551 1579453 1626444
6418 1626444 1669935 1556704 1435299 1360619 1639470 1795706 1728995 1629205 1668971 1598621 1648997
6407 1648997 1750952 1676728 1405388 1465813 1430989 1525457 1366892 1627277 1820688 1647188
6397 1647188 1670453 2137411 2109787 1856454 2116974 2032523 1885762 1674128 1806429 1610563
6387 1610563 1315999 1567065 1444248 996805 893927 1061648 1384080 1299318 1262794 1349001
6377 1349001 1470189 1639092 1457062 1384271 1540709 1626849 1574168 1483622 1708047 1850213
6367 1850213 1555645 1611317 1701722 1793152 1572281 1300709 1282398 1337785 1308720 1023730 1255284
6356 1255284 1198258 803102 660571 1221364 1347314 1374066 1370237 1271512 1398141 1441388 1730733
6345 1730733 1706932 1622603 1527736 1459615 1246052 897074 1024624 1256767 1275181 1355803 1212957
6334 1212957 1155213 1410272 1350066 1308904 1414848 1550584 1160393 933494 1008177 933647
6324 933647 1207579 1373458 1355189 1162778 1043073 1231291 1386992 1348463 1485620 1542006
6314 1542006 1785889 1571662 1406072 1461995 1312994 1839111 1990044 1652137 1717239 2274646
6304 2274646 2360169 2476154 2784447 3072820 2833657 2658587 2661421 2544012 2198539 1961442
6294 1961442 1917142 1884294 1687106 1584490 1615516 1662073 1768321 1656219 1570403 1479656 1542773
6283 1542773 1598631 1623285 1504662 1574903 1710480 1797293 1833513 2219331 2289438 2300621 1945136
6272 1945136 2133658 2484894 2351654 2067081 2094891 1751883 1460114 1880324 1924458 1791740
6262 1791740 1627126 2017578 1967171 2061219 2184274 2092388 2167809 2081015 1447076 1563125
6252 1563125 1760268 1709264 2159785 2051010 2019998 1912743 1890627 1934479 1984345 2056755 2096322
6241 2096322 2059289 2018729 2099546 2115968 2248588 2304372 2416225 2182772 1924228 1912216 2302874
6230 2302874 2242284 2008190 2225542 2464562 2627860 2414847 2396451 2169027 2484179 2371769
6220 2371769 2352253 2766170 2824596 2725439 2540974 2396791 2493750 2499497 2294978 2590665 2533920
6209 2533920 2492512 2492636 2464197 2890960 3041561 2703033 2436028 2573949 3053659 3046699 3063314
6198 3063314 3271494 3210006 2977899 2899768 2782183 2892269 2462236 2383832 2447027 2596492
6188 2596492 2325365 2767755 3077463 2692980 2971682 3324077 3354731 3417807 3659377 3491988
6178 3491988 3403790 3456193 3387532 3301188 3332472 3277877 3033793 2825151 2883228 2870614 3094444
6167 3094444 2914602 2568604 2650002 2692145 2576835 2441744 2589906 2791425 2779560 2881765
6157 2881765 2525796 2598849 2769823 2589028 2583569 2605495 2761320 2963751 2767593 3046920
6147 3046920 3065688 3131888 3551825 3401020 3164431 3622835 3541641 3256000 3496574 3644624
6137 3644624 3907785 4123288 3974478 3921299 3915632 3910232 3843764 3822836 4012058 3923560 4033555
6126 4033555 4457708 4850325 5150138 5559212 6062281 6612862 7216426 7915386 8302687 8458451
6116 8458451 8256138 7620301 7037624 6824302 6647078 6412095 6506088 7096935 7750844 7912994
6106 7912994 8392093 8378617 7785619 7215062 6376211 5588157 5187426 4837703 4634513 4983420
6096 4983420 4692575 4386240 4757453 4664391 5121577 5305174 5101503 4963340 4850045 4852254
6086 4852254 4763215 4831634 4858987 5181213 5198779 4692147 4608324 5101122 5076697 5278015 5463381
6075 5463381 5509529 5969283 5885093 6259287 7075565 7868859 8909455 9729300 10127135 10441007
6065 10441007 9994133 9220837 8764165 8419035 8180404 8057657 8073035 7981701 8709050 9984464
6055 9984464 10759229 10604251 10132062 9354668 8559839 7493809 7003838 6805191 6313643
6046 6313643 5710540 5392833 5297282 5249673 5343692 5368449 5265815 5039510 5009391 5077279 4801260
6035 4801260 4784115 4784022 4983226 5100706 5012020 4988221 4806486 4518559 4559877 5146546 5241043
6024 5241043 5244808 4952515 4984208 5263445 5188757 5196523 5561268 5673527 5995795 6115436 5963939
6013 5963939 6065861 6037186 6276803 6058744 6212354 6330720 6257287 6207248 6056215 6205554
6003 6205554 6640739 7061450 7211442 6950816 6784379 6836665 7200889 7623992 7625057 7696057
5993 7696057 7694138 7852943 8358595 8491407 8699918 9098631 9132872 9453174 9912911 10332003
5983 10332003 10225624 10131110 10720227 10873791 10899175 11025936 11259053 11271903 11273062 11517172
5973 11517172 11884752 11736411 11882390 12208900 12313941 12892109 12779725 13241507 14007341
5964 14007341 14551804 14531094 14866514 14856856 14891488 14806685 14596956 13998255 14221139 15101995
5954 15101995 15256781 15598883 16215263 16877788 17557067 18398123 19348807 20182287 21193039
5945 21193039 22811415 24288604 25718159 27461303 29441255 31436694 32449124 31187002
5937 31187002 29101478 26872068 24821767 23797669 23017348 22558178 22188957 21872372 21837975
5928 21837975 21904400 22313778 23168783 23780127 24448843 25573262 26593588 27793720 28947358
5919 28947358 30739092 33155628 36324608 38793597 39827511 39270414 37725456 36701356
5911 36701356 35928726 35257351 35106408 34956215 35272282 35612882 36234163 37204143 38865417
5902 38865417 40952156 43013181 45445456 48671530 52706307 57620816 63363423 70450883
5894 70450883 79348526 90328791 103098669 115254536 124334584 128590622 128583426 124612055
5886 124612055 116038126 104174110 92295357 83120670 76319096 71203628 68207916 66162894
5878 66162894 65462363 65901078 66811836 68829412 72072468 76472783 82339688 90158256 100338152
5869 100338152 113338321 129765529 149583882 166977913 173987571 166427096 146548839
5862 146548839 123557033 103628168 88039572 76434585 67601513 60749987 55230566
5855 55230566 50698006 46782995 43887966 41483334 39162825 36994828 35261726 33622340
5847 33622340 32136193 30979662 29766927 28621181 27564847 27109787 25962615 25107270
5839 25107270 24377509 23709450 22812344 21855498 21334201 20994559 20399120 19924104 19866707 19580969
5829 19580969 19463115 19298011 18712166 18398893 18185637 17801351 17710049 17456575 17079511 16758158
5819 16758158 16425898 16075758 16215659 16237440 15954007 16036792 15906735 15898401 15816118 15859000
5809 15859000 16356956 16557388 17170422 18363722 18622724 18486160 17900363 17301071 16606372
5800 16606372 16118722 15908933 15723238 15320077 15167624 14967532 14506652 14471121 14046179 14231727
5790 14231727 14558786 14650203 14776719 14835645 14518339 14279127 14472994 14872053 15525526 16112679
5780 16112679 16636185 17151228 17605937 17613731 17379151 16849790 16409738 15842258 15527497 15560413
5770 15560413 15808708 16095096 16278481 16925189 17703886 18847112 19722813 20262265 20113952
5761 20113952 19456998 18776933 18814457 18880873 19162592 18701087 18203930 17963159 17523978 17282042
5751 17282042 17327766 17324632 17386811 17753411 17804657 17910058 18319761 18915499 19596098 20777471
5741 20777471 22003335 23211697 25381948 27607575 29678638 31779170 33066384 33701217
5733 33701217 34018250 33816971 33453850 32575223 31500359 29982052 28476384 27405202 27032223
5724 27032223 26458205 26042314 25632646 25863076 26266668 27019772 27901354 28813306 30890510
5715 30890510 33217152 35554391 38372712 41437989 44052927 45947780 47003602 47770880
5707 47770880 47699731 46942133 45031580 43005634 40691430 38104666 35752781 34135043 32840458
5698 32840458 31788137 30866313 30295732 30181882 30238708 30651359 31652494 32922875 34286310
5689 34286310 36244588 38685735 41874113 44896530 47166952 48541518 48274990 46684837
5681 46684837 44589452 42573613 40022248 37212144 34486068 32014638 29411577 27742083
5673 27742083 26358101 25460576 24581929 23817764 23736477 23616498 23485995 23362901 23755033
5664 23755033 24290428 25082172 26066910 26994908 27611071 27925804 27956260 26869578 25526834
5655 25526834 24264745 22773085 21699149 20845526 19974494 19360571 18584956 17898393 17528168
5646 17528168 17150885 17004364 16883384 16846133 17032910 17026557 16839474 16943688 16932087 16836047
5636 16836047 16626728 16825102 17061014 17025850 16754267 16333224 16071870 16151133 16167423 16245736
5626 16245736 16186728 16505642 16865487 16846408 16771869 16705871 16796449 16142234 16030835 15787167
5616 15787167 15297247 15199786 14865786 14949825 15250012 15260341 15357993 15395818 15352573 15252875 15457569
5605 15457569 15434376 15305810 15369303 15690259 16069163 15998255 16108151 16166988 16060554 16115871
5595 16115871 16287630 16208500 15845518 15854229 15893039 15783733 15865478 15912980 15800448 15930993
5585 15930993 15715655 15440936 15348806 15606784 15442311 15372704 15409495 15288727 15516858 15618665
5575 15618665 15784815 15844384 15748835 15969861 15849655 15804396 16030872 16149627 16287416 16192074
5565 16192074 16310782 16434478 16880677 17176419 17913000 18549359 19382972 20824782 22247149
5556 22247149 23345568 23683106 22663942 21402820 20065264 19258280 18713184 18305820 17743466
5547 17743466 17388589 17223460 17016890 16836680 16891003 16752212 16670200 16664598 17036117 17572559
5537 17572559 17420529 17562651 17561894 17618056 17556306 17469165 17676027 18037292 18519596 19185477
5527 19185477 20319022 21392570 22213402 22845579 22089318 20749838 19406513 18058197 17481651
5518 17481651 16901995 16598504 16546022 16369349 16097724 16210993 15964506 15725267 16001318 15845779
5508 15845779 15666136 15721409 15704793 15504572 15423461 15320278 14861664 14832060 14688566 14120940
5498 14120940 13765080 13542419 13429206 13461301 13346997 13594009 13831944 13799268 13659575 13671008
5488 13671008 13654734 13770566 13768074 13537981 13494441 13199225 13158289 13313534 13118993 13132517
5478 13132517 13491106 13440617 13754807 13705605 13791465 13789606 13872334 13824772 13944582 13774656 13928780
5467 13928780 13928836 14015194 14143195 14137046 14218138 14127982 14076495 14139232 13982688 14018736 13925715 13929882
5455 13929882 14270416 14359003 14266752 14262006 14626430 14757185 15036998 15051745 14938251 15219588
5445 15219588 15440883 15337169 15373915 15638698 15984789 15963891 15833026 15808917 15975086 16019552
5435 16019552 15706149 15602023 15614168 15536591 15600829 15954977 15868785 15843509 15972579 16256415
5425 16256415 16560959 16510299 16542320 16665817 17012144 17631557 17837120 17624501 17617109 17086485
5415 17086485 16795594 16790815 16733154 16513008 16481092 16676232 16719438 16894773 17292089 17855031
5405 17855031 18163222 17752319 17100120 16795256 16381960 16150611 15979603 15975312 16388858 16607964
5395 16607964 16720727 16434540 16246476 16065896 15952884 15907301 15837948 15607006 15206052 15076094
5385 15076094 14866737 14839863 14885877 14972918 15274298 15563667 15340718 15207763 15301550 14919465
5375 14919465 14803445 14395061 14104485 14065498 14221006 14051543 13754447 13985402 14079354 14480694
5365 14480694 14187749 14298677 14568382 14672103 14535241 14425651 14343525 13990839 14068066 13907185
5355 13907185 13487320 13736888 13849838 13795714 13605326 13661003 13650323 13498485 13656332 13492239
5345 13492239 13506660 13508142 13489921 13462201 13780169 14053449 14206952 14467012 15047450 15567448
5335 15567448 15851868 16054298 15743087 15574677 15806271 16013021 16161505 15767382 15728609 16013107
5325 16013107 16078661 15936642 16334389 16257018 16115201 16360895 16412132 16189230 16315251 16220308
5315 16220308 15935687 16352573 16716799 16677132 17071847 17772726 18421351 19183863 19520440 19354018
5305 19354018 19477955 19394672 18983751 18491564 18342748 18119227 18125752 17994589 17806754 17277523
5295 17277523 17085929 17085008 16732927 16433201 16346658 16552856 16487122 16681121 16723096 16608712
5285 16608712 16401117 16431298 16331099 16266349 16487795 16516760 16229421 15787414 15419545 15572639
5275 15572639 15611426 15829397 15708298 15651288 15276933 15182624 14926126 14424741 14278721 14399670
5265 14399670 14416028 14473553 14194005 14501520 14650220 14072524 14066204 14068573 14193467 14138008 14247115
5254 14247115 14196133 14271245 14251795 14274303 14261555 13931929 13974620 13819663 13981995 14413807
5244 14413807 15041759 15301270 15505042 15837265 16048904 16438129 17496813 19140170 21090856
5235 21090856 22084186 22556096 21851078 20121086 18428431 17350798 16500745 15984955 15799696
5226 15799696 15413230 15132405 15348679 15640825 15502576 15610132 15402375 15770177 15825688 15615846
5216 15615846 15436448 15500675 15485330 15453130 15469342 15561463 15752125 16382122 16850026 17042390
5206 17042390 16945655 17393418 18048718 18862806 19575856 20337642 21368487 22485577 24385080
5197 24385080 26363784 28446311 29792185 30180051 29246044 28117217 27227405 26552814 26254465
5188 26254465 25706163 25570655 25555967 25402854 25477312 25685449 25963714 26525195 27674097 28724271
5178 28724271 29671366 31020455 32058600 33433901 34972119 36984892 39247351 41486529
5170 41486529 42316210 41363735 39896002 38982120 38870634 39015647 38948520 39245458 39855030
5161 39855030 40897092 42207246 43754960 45012926 46321579 47822685 49680867 52820986
5153 52820986 56487890 61485761 67992489 76713091 86264188 94619177 98005351 94715758
5145 94715758 86438512 78181678 71760882 66655545 63127583 61077093 59580490 59146043
5137 59146043 59629579 60786651 62547555 65035302 68761638 73709066 80091127 88076328
5129 88076328 98055425 110099448 123061572 133418743 139044330 138189813 130951743 118655366
5121 118655366 103997464 90624660 79712946 71111497 64605287 59675581 56360292 53660793
5113 53660793 51416212 49868386 49484514 49231690 49737358 50736539 52454020 55261904 58770329
5104 58770329 63666772 70014878 78041347 85482502 88508053 85156898 76606647 67543616
5096 67543616 60414883 55033998 50841512 47145777 43961830 40459926 37875272 35620985
5088 35620985 33725267 32573561 32448918 31783493 31300167 31622302 32220327 33544029 35318535
5079 35318535 36400708 36362566 34894938 32368374 30323698 28910577 27957413 27313913 26961129
5070 26961129 26883686 26801251 26745444 27497759 27845774 27692967 26902532 25739127 25007420 24867281
5060 24867281 24885484 25524428 26067141 26630561 27320377 28370496 29717778 30322332 29740510
5051 29740510 28081837 25620924 23690782 22572687 21650110 20700561 20032361 19115100 18384874
5042 18384874 18002188 17545616 16766372 16521516 16143133 15802700 15523010 15483161 15270684 14644480
5032 14644480 14724577 14561187 14538362 14035764 14259576 13862783 13282870 13004151 12866103 12428151
5022 12428151 12118219 12175802 12182968 12084143 11694273 11315298 10514753 10388319 9749887 9091962
5012 9091962 8924713 8940965 9057076 8663039 8815078 8737883 8435419 8216711 8260778 8246077
5002 8246077 8223410 8205064 8143924 8205649 7813657 7706133 7717445 7504288 7157990 6786784
4992 6786784 6975440 6818724 6756415 6472559 6363868 6251608 6171000 6211937 6247059 6290049
4982 6290049 6136506 6079088 5897145 5882105 5631179 5475943 5595346 5659960 5460937 5819529
4972 5819529 5404359 5261488 5514736 5437001 5147224 4867087 4959886 4870688 5098342 5288728
4962 5288728 5267419 5040160 4876772 4830037 4790797 4519777 4593853 4604075 4676235 4873405 4960844
4951 4960844 5153019 5137866 5000256 4693188 4579924 4263314 4186317 4076061 4120285 3999456
4941 3999456 4057899 4162337 4093821 4120279 4065522 4129608 3934643 4087137 4138774 4173079 4430867
4930 4430867 4167295 3780487 4039252 3880934 3697808 3523524 3684231 3716975 3630658 3167650
4920 3167650 3375424 3545342 3330546 3372873 3367812 3360733 3262590 3324053 3167258 3024114 3182022
4909 3182022 3305655 3229429 3075396 2988170 2910940 2775940 2959308 3003880 2732735 2763107
4899 2763107 3014130 2777641 2492443 2489083 2533037 2375757 2370396 2342367 2530273 2249011 2257607
4888 2257607 2199854 2284390 2248955 2266144 2617322 2341736 2373561 2408454 2281007 2423768 2308715
4877 2308715 2221456 2210907 2401744 2587590 2392346 2401278 2408432 2564748 2825809 2401179 2194028
4866 2194028 2231392 2281725 2312488 2350251 2584674 2462931 2104465 2204302 2358826 2236586
4856 2236586 2243279 2781396 2624119 2461644 2591840 2488761 2197308 2272606 2314996 2628126
4846 2628126 2856541 2361097 2188678 2258151 2592395 2758748 2608841 2691319 2803548 2671911
4836 2671911 2543059 2739331 2802035 2509702 2844882 2946825 3016347 3136322 3074443 3066241
4826 3066241 2933419 2900299 3224732 3270229 3097079 3262505 3526738 3502517 3466791 3400325
4816 3400325 3321241 3306163 3651305 3778570 4298086 4263988 4151679 4201136 4308968 4530392
4806 4530392 4422723 4632648 4744010 5030417 4946513 5162453 5318426 5280812 5622796 5794431
4796 5794431 5752880 6072705 6256147 6011113 6164522 6481521 6647159 6939215 7494385 7433749
4786 7433749 7795217 8299691 8580091 8827781 9428596 9994639 10613496 11418830 12025896 12816470
4776 12816470 13916393 14951103 15599392 15275192 14916560 14662117 14477936 14125466 14086094
4767 14086094 14318577 14899170 15474358 16043077 16919267 17576419 18665239 19703420 21103876
4758 21103876 22663160 24218054 25951666 27675904 28505551 29059231 28858010 27902344 27307003
4749 27307003 26526714 26217889 26257243 26735721 27558883 28345120 28973291 30060472 31211669
4740 31211669 32751985 34924936 37236112 39706481 42770296 46139922 48817070 50728324
4732 50728324 51044043 50953138 51225531 51436211 51348061 51173450 50028469 48746639 46648084
4723 46648084 43973481 41428385 39161381 37124170 35796328 34635431 34049949 33569049
4715 33569049 33313657 33379860 33787038 34383170 35128481 36280213 37354922 38396201 39311761
4706 39311761 39907339 40240945 40151509 39889274 39760429 39206315 37644189 35420394 32761619
4697 32761619 30047363 27070009 24235479 21858877 20087044 18323142 16956749 15741425
4689 15741425 14890600 14020466 13032216 12296485 11602382 11247405 10739529 10169280 9957114
4680 9957114 9996957 9605849 9489371 9293080 8795963 8735559 8858524 8676167 8339312 8484175
4670 8484175 8639677 8660896 8437723 8393459 8215101 7805714 8142673 7889411 8122652 8038333
4660 8038333 7696725 7744455 7767133 7509365 7657520 7424992 7395885 7383980 7715786 7954710
4650 7954710 8217699 8471707 8591690 8728868 9202431 8955180 9025575 9114527 9014383 9017264
4640 9017264 8993559 8803585 8600326 8589597 8447576 8443680 8689012 8261802 8120216 8145755
4630 8145755 8281613 8283228 8454491 8633861 8651990 8935632 9225663 9603909 9696286 9831166
4620 9831166 9911752 10082427 10092299 10528280 10891293 10993315 11116730 11466065 11547375 11396477
4610 11396477 11274377 11253475 11014143 10755826 10201515 10041287 10216329 10164184 10129110 9990275
4600 9990275 10087345 10682180 11081342 11314211 12150527 13590480 14528159 14967804 14767122 14205424
4590 14205424 13512465 13251080 12956242 12757418 12836002 13146689 14054537 14714574 15145307 15359805
4580 15359805 14195150 12850758 11774840 11094695 10915078 10873525 11024420 11566215 11921263
4571 11921263 11924815 11081275 10186919 9606919 9291034 9144203 9146466 9016310 9298378 9632204
4561 9632204 10141620 10703064 10706590 10081175 9317867 8684828 8126445 7576746 7067287 6948458
4551 6948458 6457699 6492990 6099523 5768419 5815598 5377623 5531310 5841467 6058140 5809973
4541 5809973 5937330 5921427 5935531 5835482 5806076 6026721 6090237 6395885 6299746 6021588
4531 6021588 5961967 6369259 6299751 6533797 6670652 6453795 6200876 6310241 6365030 5984469
4521 5984469 5548270 5326696 5290636 5531749 5974918 5779586 5302441 5726837 5873481 5733369
4511 5733369 5797787 5853858 5752464 6015162 6203668 6297517 6254140 6346947 6448451 6519488 6680360
4500 6680360 6427852 6334783 5829528 5788037 5594701 5582588 5441164 5356151 5455968 5674940
4490 5674940 5465785 5462134 5440760 5241781 5192349 5196672 5219036 5227232 5557244 5115377 4822769
4479 4822769 4526416 4588194 4799927 4916395 4827546 4722424 4849646 4894788 5155685 5168497
4469 5168497 5213360 5330408 4915322 5211333 5459530 5721696 6118466 6441732 6198994 6206814
4459 6206814 6029344 5845144 5786563 5605866 5743672 5842224 5979968 5915385 6083871 6205647
4449 6205647 6271381 6910254 7270225 7450223 7566486 7837342 8504880 9198674 9620690 9604058
4439 9604058 9391499 8959019 8511620 8287886 7695238 7293802 7114827 7105549 6979607 6981291
4429 6981291 7530107 7256050 6906985 7045784 6897829 6619510 6719724 7086755 7243690 6902612
4419 6902612 6735092 7219248 7303293 7423747 7224011 7217692 7164085 7354661 7439169 7588291
4409 7588291 7571291 7800808 8005989 8050740 8453785 8808721 9386301 9248779 9459542 9890189
4399 9890189 10688922 11506038 12152105 12212101 12136736 12259849 12754825 13317338 13677310 13785354
4389 13785354 13349713 13403759 13097232 12727664 12456185 11921814 11583824 11754537 11872956 11391113
4379 11391113 10685627 9559262 8871526 8280042 7789820 7327630 7018216 6848578 6784431
4370 6784431 6326123 6413434 6128079 6115754 6070770 5750864 5656717 5782435 5399295 5254729
4360 5254729 5403485 5329175 5568042 5596951 5681347 5658135 5227875 5360339 5229205 5028452
4350 5028452 5047453 4937980 4998518 4887117 4902317 4643320 4691169 4798636 4867307 4981722
4340 4981722 4753882 5066279 4775242 4484584 4690800 5193704 4948251 4758124 5186772 5234762
4330 5234762 5131781 4941752 4683212 4756413 4707461 5297360 5215974 4930526 5330160 5559417
4320 5559417 5436188 5442050 5398643 5349548 5660516 5690733 5411324 5200541 5167679 5147818 5410872
4309 5410872 5329908 5554009 5478329 5425894 5633969 5826638 5648970 5755284 5642272 5713849
4299 5713849 5493016 5697023 5620174 5481027 5378285 5147424 5477786 5820831 6163799 6058489
4289 6058489 6172635 5946644 5942223 6372653 6376479 6309576 6465876 6388078 6553964 6864119 6828099
4278 6828099 7115857 6996685 7174311 7212561 7306559 7576521 8046486 7542742 7487976 7642004
4268 7642004 7500351 7912734 7972181 8055180 8353494 8555476 8374252 8347848 8515350 8095317
4258 8095317 8250105 8242036 8257957 8525617 8427820 8438367 8320885 8757729 9101102 9167626 9215571
4247 9215571 9365688 9266061 9265809 9588083 9383773 9848394 10002951 10217871 10261178 10394383
4237 10394383 10631771 11292059 11550326 12106361 12607299 12780501 13112478 13306160 13641796
4228 13641796 13847261 14783842 15249260 15591329 16100782 16716674 17195518 17970826 19003751
4219 19003751 20040036 21229149 22724641 24730126 26815456 28658420 30665999 31749610
4211 31749610 31475082 30041903 28040734 26722258 25937918 25490852 25407993 25004098 24885874
4202 24885874 25097087 25258444 25523913 25644357 26087297 26368726 26818810 27579817 28506209
4193 28506209 28963900 29593340 30396082 30993302 32015164 33426846 34936949 36136283 37528102
4184 37528102 38803713 40198074 41604022 43831907 45857698 47650592 49825353 52272986
4176 52272986 55017287 57717866 60716845 64034802 67105472 70866960 74893554 79522972
4168 79522972 85071984 91644144 98775518 107103007 117519061 129719153 144577050 162518036
4160 162518036 184335229 211518198 245414992 289462897 346147042 412466761 474712126
4153 474712126 509270126 497977151 446879276 376083281 309723089 256564883 215252599
4146 215252599 184105882 160390593 141625257 126332173 113246626 102553900 93633344
4139 93633344 86360933 80387973 74967350 70221903 66011278 62082435 58320714 55420963
4131 55420963 53116431 51308042 49213838 47282459 45318694 43805461 41880448 40130613
4123 40130613 38280893 36817164 35263712 33698338 32399170 31196646 29871954 28898447
4115 28898447 27932751 26890277 25929532 25066675 24763629 24563113 23494562 22675865 22547489
4106 22547489 22251448 21732205 21368853 21091065 20478679 19987159 20120670 20239810 19636887
4097 19636887 19104400 18903563 18386068 18269630 17735805 17470909 17151996 17075647 17058638 16742882
4087 16742882 16470597 16178263 15930990 15545656 15396512 14963985 14902545 14739369 14249210 14103229
4077 14103229 14056952 13902803 13477490 13421924 13268148 13129243 13284976 13186315 12691786 12399261
4067 12399261 12449821 12091963 11823719 11378110 10768629 10634724 10549638 10662975 10591400 10323714
4057 10323714 10395928 10155589 9972442 9848678 9861687 9954517 9157642 9218588 9712606 9789348
4047 9789348 9793217 9547799 9369611 9536726 9707331 9828482 9589519 9629605 9997352 10214077
4037 10214077 10422750 10428823 10479478 10612606 10556567 10795389 10843128 11283532 11427639 11979170
4027 11979170 12193206 12682803 13221552 13447183 13899623 13964201 13893555 13604114 13373106 12886423
4017 12886423 12379710 11892795 11701168 11313739 10912753 10288661 9937856 9567899 9458017
4008 9458017 9344349 8657998 8184858 7997579 7718040 7770293 7486624 7688751 7248549 6922947
3998 6922947 7057179 6835183 6615511 6644410 6797627 6912638 6857814 6861563 6889543 6566393
3988 6566393 6222511 6413640 6077663 6030968 5953335 5881514 5688059 5014326 5031560 5117639
3978 5117639 5272580 5320134 5014902 4933550 5036884 5003608 5137528 4952729 5110177 5282341
3968 5282341 5320478 5212080 5052954 4751955 4712837 4969898 5252423 4928072 4753655 4855274
3958 4855274 4940911 5194272 4866674 4288661 3875406 3903791 4045964 4160251 4216380 4277979
3948 4277979 4134718 4084015 4446303 4514811 4131046 3713644 4110120 4180923 4188154 4252527 4206885
3937 4206885 4277092 4177060 4165653 4113269 4191632 3975857 4043877 3906915 3976039 3909883 3846540
3926 3846540 3962480 3680144 3571207 3972287 3764114 3759014 3818158 3811765 3855180 3434514 3534653
3915 3534653 3766216 4009547 3982934 3850030 3965529 3809109 3516340 3531607 3676474 3960255
3905 3960255 4148564 4212925 4516569 4634535 4669832 4660688 4460285 4464386 4870788 4807832 4707769
3894 4707769 4634764 4981856 5009274 5339701 5774576 6121643 6458290 6766738 7062184 7762487
3884 7762487 8351992 8887556 9919669 10727828 11262998 11383676 10900538 9829725 8853241
3875 8853241 7962048 7199573 6378460 6033764 5933984 5899279 6077430 5858652 5682895 5998921
3865 5998921 6128657 6606209 6840199 7041680 7124943 7136094 6780258 6460233 6386023 6191112
3855 6191112 5846186 5447237 5209785 4964897 4541900 4313046 4246988 4377441 4372352 4106192
3845 4106192 3576162 3508179 3327861 3206981 3190856 3254133 3446522 3431234 3440850 3255367 2885389
3834 2885389 2783766 3222632 3373336 3196166 3012494 3081998 3513333 3460667 3272845 3318972
3824 3318972 3317081 3161313 2918588 3147252 3089104 3016685 2884034 2765875 2554091 2404886
3814 2404886 2539230 2669229 2906902 2754911 2596527 2169817 2390127 2757563 2589489 2588136
3804 2588136 2539953 2113557 2314813 2633469 2624495 2546886 2460307 2448763 2656964 2494741 2409557
3793 2409557 2282897 2072972 2208905 2458301 2461373 2545880 2569740 2842415 2736310 2784283
3783 2784283 2867479 2720418 2803649 2772522 2864690 2810563 3088868 3050238 3010555 2953068 3056087
3772 3056087 2973665 3086084 3320230 3567794 3860912 3666621 3895712 3770942 3858907 4086105
3762 4086105 3881855 3701606 3851670 3815099 3781715 4166035 4336116 4389163 4143445 3996635
3752 3996635 4116227 4276498 4340310 4622278 4721175 4788008 4969247 5222189 5278526 5470601
3742 5470601 5721901 6005624 6011769 6038185 6199792 6218550 6575161 6978512 7251861 7091860
3732 7091860 7514900 7681631 7858223 8313384 8500628 8779909 9176090 9747975 10012629 10294431
3722 10294431 10799067 11438488 12010375 13008850 13376908 14132870 15066900 15889583 16882771
3713 16882771 17886694 19012000 20495814 21526439 23221992 24673279 26726536 28858661
3705 28858661 30872353 33217518 35814746 37641068 39207675 40086610 40360538 39198481
3697 39198481 37466900 35088481 31806303 28631626 26049349 23656166 21234400 19186568
3689 19186568 17671313 16390935 14993624 13614226 12657359 12158362 11196361 10379649 9792288
3680 9792288 9184273 8479172 8360446 7920313 7742212 7498777 7147093 6871260 6578411 6209022
3670 6209022 6037448 5923408 5818267 5152857 5149053 5388465 5177633 4980621 4766089 4789822
3660 4789822 4652219 4528780 4579609 4336585 4373687 4493735 4412308 4124603 4209213 4072563
3650 4072563 4199992 4094513 4051921 3941310 3856107 3893446 4004236 3804604 3477310 3357355
3640 3357355 3376336 3321871 3328621 3205474 3278624 3074205 3084521 2958243 3102864 3072604 3117329
3629 3117329 3041577 3066309 3185906 3122596 3138632 2820693 2874893 2705261 2831462 2683532
3619 2683532 2685088 2693277 2816428 2699258 2622625 2560611 2631502 2999212 2974984 2701627 2388792
3608 2388792 2164509 2182877 2212021 2008747 2391838 2502990 2627314 2290106 2135035 2270943
3598 2270943 2162843 2419469 2687468 2682163 2638059 2340458 2293332 2530798 2541558 2447480 2485415
3587 2485415 2314695 2451037 2397984 1977682 2023990 2181859 2240033 2430968 2420698 2125465
3577 2125465 1992693 2210334 2524915 2209175 2184300 2275310 2118934 2527282 2665559 2524972
3567 2524972 2723469 2621922 2520154 2479339 2351412 2053750 2181278 2581594 2288279 2149918
3557 2149918 2247710 2225558 1962645 1795188 2059358 2013852 2080673 1735493 1836318 1772656
3547 1772656 1995001 2095885 2113521 2241683 2107687 2067017 2118459 2435767 2643754 2502270
3537 2502270 2254388 2162307 2322085 2181812 2231716 2163119 2016626 1887267 1862249 2054339
3527 2054339 1749419 1832547 2024932 1757985 2005249 2036141 2288615 1983071 2051987 2295288
3517 2295288 2142856 2173029 2138267 1910325 2221814 2585155 2485128 2372153 2593311 2597150
3507 2597150 2379444 2677407 2381160 2218513 2312527 2228587 2445768 2400738 2288488 2581381
3497 2581381 2608651 2665082 2598830 2703973 2519411 2158702 1998082 2155016 2116405 2177960
3487 2177960 2386657 2430629 2341954 2405409 2199088 2051654 2221092 2299707 2195558 2225653
3477 2225653 2349456 2461083 2547846 2414871 2600528 2490147 2590474 2456071 2252772 2281087
3467 2281087 2446769 2543459 2414270 2236008 2610459 2616745 2361697 2372584 2034731 2258961
3457 2258961 2237755 2180944 2743771 2757021 2592763 2783683 2572735 2526888 2739606 2682849
3447 2682849 2612355 2732774 2786607 2808462 2909532 2722295 2550639 2198930 2280275 2635970
3437 2635970 2579253 2694286 2909845 2788182 2911860 2927780 2739365 2916522 2939989 3030971
3427 3030971 3017050 3335367 3238244 3155007 3419000 3258203 2959141 3246131 3467463 3432036
3417 3432036 3265089 3022977 3185098 3208350 3092926 3186665 3329241 3591821 3571645 3819784
3407 3819784 3868880 3753677 3466307 3868406 4011844 4271038 4114004 4042903 4381838 4900141
3397 4900141 5178348 5219286 5182254 5155569 4978289 4610446 4516396 4571404 5027524 5139029
3387 5139029 5104502 4776432 4709439 4703811 5004952 4848906 4699555 5044767 5277152 5251376
3377 5251376 5316894 5535763 5541006 5581905 5410826 5445447 5690518 5673004 5935378 6117532 6176362
3366 6176362 6321689 6327801 6588441 6789223 6515963 6523170 6837336 7016162 7137248 7287207
3356 7287207 7305209 7812369 8227572 8339145 8374983 8678509 8811800 9048696 9392458 9579636
3346 9579636 9921809 10271543 10599387 11108062 11721710 12381049 12794342 13454496 14507042
3337 14507042 14983185 14982145 15275782 15645515 15869614 15745222 16073317 16397708 16999105 17712563
3327 17712563 18169034 19085534 19983883 21136205 22417912 23957191 24892800 25669493 26346230
3318 26346230 27252152 28608772 30054563 32066945 34811397 38043345 41953613 46630779
3310 46630779 52051106 58825898 66628266 73334261 74741480 69491132 61363207 54129581
3302 54129581 48738573 44210255 40854553 38465360 36816807 35943948 35654387 35572638 35325009
3293 35325009 35216382 35399005 35448498 35316338 35675363 36478389 37723899 39732950 42250071
3284 42250071 44955249 48476091 52753455 58439320 65297507 71530957 74721050 71195386
3276 71195386 62852121 55310616 50027886 45725914 42617442 40362661 38562049 37077985
3268 37077985 35692593 34740784 33608451 32673598 32530821 32630776 32449571 32632845 33147751
3259 33147751 33576683 33846987 34523596 34979887 35915945 36444621 37390296 38386517 39269323
3250 39269323 40244178 41395436 42359368 43019445 43736089 44491152 45261564 45609904 45422570
3241 45422570 44177233 42723054 40942273 39098963 37228023 36138460 35266964 34701977
3233 34701977 34424670 34227789 33637140 32267925 30654035 28999283 27518788 26500813 25520712
3224 25520712 24637436 24250602 23814652 23300003 22804216 22805044 22407418 22207718 21819642 21464384
3214 21464384 21813895 21331279 21217234 21443713 21598745 21616753 21747020 21827517 21915294 22473948
3204 22473948 23319216 24636877 26051056 27595237 28550515 28143747 26564944 24841102 22932126
3195 22932126 21088132 19897223 19266628 18417029 17870094 17613980 17361461 16876432 16441268
3186 16441268 16753025 16639450 16147454 16189283 16616872 16598975 16643253 17060761 17901347 18613800
3176 18613800 19416446 19723187 19670571 19455870 19704910 20622961 21282255 22071885 22003685 21118642
3166 21118642 20069037 18702628 17620512 16580540 15382755 14319497 13643977 13187387
3158 13187387 12822314 12464842 12414302 12477411 12649377 12612918 12622201 12983600 13496328 13884261
3148 13884261 14121241 13911910 13717815 13198384 13347821 13435701 13096458 12733441 12338163 12183110
3138 12183110 11532894 11061000 10679480 9947747 8972116 8240167 7818839 7585211 7702252
3129 7702252 7347810 6981161 6490528 6322213 6364473 6207305 6130653 5858699 5879897 5833618
3119 5833618 5769306 5805793 5618494 5606398 5637980 5515385 5268700 5083725 4924236 5251446
3109 5251446 5354010 5319157 5167937 4992027 5283867 5076900 4834595 4685359 4759238 4487487
3099 4487487 4401479 4303699 4290045 4042606 4005343 3987301 4149294 3993159 3911071 3594886 3512749
3088 3512749 3649549 3828555 4064907 3784163 3849549 3727710 3588360 3753846 3529524 3534424
3078 3534424 3961936 3494678 3400668 3662984 3682434 3377201 3075653 3338551 3476693 3518955
3068 3518955 3419827 3259924 3180888 3174936 3171306 3125537 2858232 2553209 2501913 2643028 2734595
3057 2734595 2888976 2689273 2719399 2929320 2667030 2353408 2430255 2552546 2689084 2820567
3047 2820567 2856276 3038759 2763016 2682606 2942401 3086234 2684799 2432193 2443318 2655159
3037 2655159 2527384 2292395 2453201 2509924 2864536 2780731 2519207 2586562 2759259 2457853
3027 2457853 2426328 2575353 2727293 2769936 2821663 2722446 3125247 2912420 2865795 2902474 2758407
3016 2758407 2428697 2444133 2874330 2801004 2871036 2975399 2798223 2468323 2726640 2609996
3006 2609996 2393724 2696771 2786725 2797311 2985072 2906824 2360007 2268687 2937234 3063534
2996 3063534 3190072 2977898 3128686 3065649 3122655 3025923 3044142 3059594 2777179 2715853 2875967
2985 2875967 2948648 3078534 3227262 3251684 3337275 3257170 3344666 3375566 3369697 3431563 3354033
2974 3354033 3469274 3642370 3766701 3696097 3761393 3836074 3766179 3901030 3790195 3505827
2964 3505827 3386408 3465542 3424531 3480967 3493458 3483046 3987090 4206448 4144060 4106102 3959099
2953 3959099 3976250 4016676 4189826 4448446 4475765 4527392 4537396 4826222 5316952 5682704
2943 5682704 5685014 5776280 6282345 5944066 6053921 6094903 6552183 6991099 7054042 7446915
2933 7446915 7479509 7417263 7651921 7612504 7710813 7664427 7755868 7517203 7378973 7816819 7988805
2922 7988805 7892947 7833426 7880542 8136038 8202763 8174333 8201554 8059900 8569173 9048582 9469362
2911 9469362 9495672 9995993 10350924 11093919 11643580 12536960 13406088 13449767 12961193 12513126
2901 12513126 11922358 11490257 11007094 10410647 9829902 9337107 8961684 8778227 8599504
2892 8599504 8103433 7837344 7871528 7952884 7839544 7888454 8289891 8263404 8339304 8486726
2882 8486726 8896818 8715368 8710555 8749312 8740731 8610824 8463606 8839029 8797563 8783008 8642055
2871 8642055 8357382 8319839 7656585 7156228 7082265 6774256 6727173 6605990 6407525 6552512
2861 6552512 6427808 6022900 5840639 5833780 5708319 5749021 5599024 5188950 5258415 5059686
2851 5059686 4881738 4932411 5009671 4511989 4314587 3940858 3950811 3791482 3750393 3751349 3467569
2840 3467569 3219713 3028905 2818397 2888144 3091645 3129599 2900307 3323630 3088362 3047954
2830 3047954 3015809 2675793 2599552 2694736 2497006 2783928 2768137 2688049 2814039 2361059
2820 2361059 2522388 2417738 2327966 2226132 2058915 2113478 1804745 1881464 1894850 1952121
2810 1952121 1684846 1565717 1615533 1736307 1678950 1670014 1593607 1867715 1667817 1794870
2800 1794870 1887707 1537629 1673806 1565918 1461558 1411330 1417104 1341114 1488936 1519726 1550860
2789 1550860 1513792 1117220 1148746 1559125 1645051 1465998 1600819 1660467 1770527 1655000
2779 1655000 1072685 1097392 1234211 1520772 1489049 1446736 1096261 981637 1002232 1048415
2769 1048415 1066205 1169049 920226 863828 1093075 1161177 1086808 1109741 1064227 1131762 1024528
2758 1024528 746720 670319 893714 995563 993075 721250 577393 600275 576092 586936 706761
2747 706761 1005645 956802 779303 699734 752340 804522 676179 768042 844581 879773 731642
2736 731642 732916 760338 814345 675958 795913 684753 685895 937248 717150 585446 409556
2725 409556 306958 378355 264550 537131 516334 741573 600566 805949 732207 270177
2715 270177 126195 416414 772053 820884 840838 600201 626223 219488 471734 475304 465630
2704 465630 577717 673802 895075 573635 279809 674483 733226 514861 559313 521476
2694 521476 524144 221236 124759 111581 218657 189332 166733 -27972 20933 116487 88738
2683 88738 175607 304153 429907 305667 203990 328555 574643 558604 402406 494863
2673 494863 720605 477082 406275 541919 460491 428488 371741 302277 143563 195837 494248
2662 494248 290609 263650 730288 210068 -74089 272453 277404 277610 -44762 95411 199322
2651 199322 405317 370176 241630 145856 161860 31373 262293 403563 419097 273148
2641 273148 124927 291368 134216 -98401 -17588 197432 377045 725173 637298 308791
2631 308791 128948 -51695 3334 202507 341089 133800 220633 217380 117082 81600 89347
2620 89347 409269 507505 308680 360271 279448 299467 357695 351870 422803 87964 327762
2609 327762 425502 213192 130670 298666 457680 319344 20596 -129998 162446 248393
2599 248393 356952 128939 72922 63451 54011 68166 37542 259242 218389 66424 141034
2588 141034 120310 -116331 -156781 131255 356061 490501 244447 266167 140663 400630
2578 400630 446988 368411 312098 527689 251092 290382 688348 482762 233797 38738
2568 38738 178757 193021 36127 -107983 -239221 55286 78293 83633 507798 431668 298779
2557 298779 260598 442128 315839 3970 -40648 -186674 73288 111419 8754 -21691
2547 -21691 -21582 54899 46479 346103 192666 7887 -192294 93130 28304 144711 218688
2536 218688 -28619 67420 289412 70192 206942 240365 244149 195704 183784 67600 -178564
2525 -178564 7429 98308 470164 447848 108939 135043 -103334 175921 127019 250383
2515 250383 229664 152299 111256 179223 -266571 -193033 -7046 -63179 -150831 -382324 -154177
2504 -154177 159641 243161 378942 357702 137830 92891 -23338 -23301 -1197 32210 -56869
2493 -56869 24420 314155 385048 49526 -164730 185923 -38689 29277 111821 95268 192577
2482 192577 259287 270949 389689 405114 110923 234047 -18551 -177061 102474 271846
2472 271846 -101412 -299320 9228 -210886 -325824 -8688 171232 206396 215052 302156
2462 302156 284647 328051 61358 30786 -23161 196931 271654 87767 -108140 -2759 -15755
2451 -15755 18242 7665 433031 344253 103952 271838 365038 335942 307777 601356 360502
2440 360502 -83527 -137578 -160057 -96085 -113076 157926 417706 293000 -30910 -323788
2430 -323788 -601300 -405236 -87589 -238211 185163 202421 254591 270682 -15524 148704
2420 148704 251192 -50061 -38227 165788 277312 182281 41622 203573 421775 401641
2410 401641 294236 329457 69350 10411 377870 581895 451809 318946 499185 771566
2400 771566 298157 128113 -40133 -35230 55589 16645 68405 14488 -48591 59393 4840
2389 4840 264110 399284 317579 -76900 74552 -128011 -156426 189154 307319 360685 405999
2378 405999 370494 327016 277503 225453 347726 482871 768910 1116375 1148560 1069986 941210
2367 941210 575615 580599 704294 515534 264134 315255 168222 -40499 424009 392549
2357 392549 177119 -39981 -67150 92908 223437 492413 415122 319097 83332 320828
2347 320828 -143092 -202635 42074 269885 422463 454864 432943 404211 171733 -3559
2337 -3559 128470 411283 434367 92406 166747 95834 -145785 -321 -149741 -16143 -11185
2326 -11185 195441 207637 271353 268008 280636 354286 201032 332015 504424 379792 142493
2315 142493 206737 260545 23820 83594 138729 328375 2048 174575 236751 386649 296443
2304 296443 237184 502656 168544 -145215 -117449 -9579 -65251 50717 -187970 -166515
2294 -166515 36386 347742 -105093 147069 412068 166342 136489 370750 481926 231859
2284 231859 150766 -30143 146898 255111 275372 296471 403137 410265 452381 679473 522267
2273 522267 303616 274619 230948 328325 -62845 101395 476882 491770 353386 533855
2263 533855 876523 721869 739547 690197 687930 442093 538666 477630 92319 213539 148611
2252 148611 -26182 78649 166018 275756 162713 483308 585162 422397 303818 191041
2242 191041 605121 762820 324847 608682 574006 673234 713793 928332 1159369 515452
2232 515452 373117 210434 249082 433934 486821 483676 370686 454803 551116 647596 503364
2221 503364 763761 698194 779086 820975 795412 555534 427320 786529 912039 1154721
2211 1154721 807183 696315 705147 542507 1091422 1167564 1111864 655553 526359 954935
2201 954935 1105842 1080130 938415 1148963 1040898 762983 760359 1294542 1222325 1061762
2191 1061762 1349376 1432795 1528360 1362489 1455329 1685409 1799282 1852859 1712623 1618773
2181 1618773 1644487 1898189 1702849 2153004 2318385 2032183 1853034 1948022 1993353 2202576
2171 2202576 2151578 2348005 2812269 2772474 2851116 2961975 2908173 2838114 2779970 2764530 2777738
2160 2777738 2983685 3129227 3281943 3322005 3465669 3528160 3443050 3357707 3659909 3843703
2150 3843703 4155926 4456060 4349075 4224407 4400471 4837403 4796977 4787482 4957010 5405119
2140 5405119 5814049 5983749 6289189 6697702 6901643 7426600 7652580 8095111 8630021 9207434
2130 9207434 9387632 10110813 10849683 11485439 12053049 12776406 13880050 14791913 15722291
2121 15722291 16575798 18258770 19817021 20936775 22498254 23371545 24884620 27004923
2113 27004923 30013929 33363591 38139345 43966074 51199174 60617068 73357391 90923879
2105 90923879 115732892 140297797 151775729 135745118 105472044 82605790 64800678
2098 64800678 52591982 43726106 37390769 32556332 29157131 26627608 24315548 22175544
2090 22175544 20871882 20034612 19021061 17405111 16013987 14634112 13210266 12449840
2082 12449840 11787902 10874655 10217639 9649135 9654173 9233441 8859865 7965997 7583321 7609905
2072 7609905 7119422 6844568 6383153 6008998 6146657 5479592 5514618 5516616 5180712 4790933
2062 4790933 4520797 4492905 4413195 4117012 4041251 4042815 4049086 4094125 3637884 3476791 3830832
2051 3830832 3734031 3618135 3665924 3367179 2933268 3070191 3276425 2830214 2884469 2905395
2041 2905395 2829532 2743874 2581080 2587654 2777753 2619889 2587090 2534668 2843954 2715260 2423027
2030 2423027 1811939 1993169 2045685 2073941 2011957 2067419 1890894 1708271 1966914 1662189
2020 1662189 1694802 1747537 1782731 1743572 1413023 1526241 1579327 1497076 1394980 1166697 917607
2009 917607 1054044 1084305 1316724 1585045 1268142 971929 1023405 1378532 1350529 1099528
1999 1099528 990526 875442 724527 928716 788735 539276 931370 1120566 1022701 658702
1989 658702 908683 1076451 1062566 869067 838443 857096 515759 575709 590339 783583 976194
1978 976194 805248 857518 810573 495459 701602 869542 1016790 844400 836525 773790 721103
1967 721103 566012 452404 405923 476946 653123 1188090 969469 948948 697041 782655
1957 782655 764670 775598 701679 374879 634898 370714 513255 384867 559320 558305 428804
1946 428804 732029 757410 569720 399881 507582 389010 392789 542626 342688 105957
1936 105957 435395 582242 338061 538994 598239 494447 496065 -102135 228083 720239
1926 720239 394722 297814 243422 -53426 -122234 186342 233192 290361 61581 382199 337617
1915 337617 400381 360465 332420 368277 353180 173901 179323 220674 321069 374471 62958
1904 62958 120884 249791 405601 218442 -47085 74110 122222 150698 154247 182153 -115549
1893 -115549 -259572 -279316 -121417 -50970 163011 34851 -46190 31811 233504 170282 -5437
1882 -5437 -44615 455 384506 613846 492275 235905 191289 41833 62304 3755 160284
1871 160284 346863 261985 434093 602264 403102 186597 275802 300178 403147 322529
1861 322529 103065 398167 336008 40459 293552 395000 576548 740202 438334 239840
1851 239840 175873 147424 -123066 -1424 167164 208402 476875 511365 414588 674990 475024
1840 475024 454744 731433 749738 789111 793574 533741 782138 926622 785230 563576 521538
1829 521538 474606 410481 520839 575476 452329 279775 332815 227524 25388 39499 137894
1818 137894 153029 142392 122237 143336 129274 113642 296876 193546 11580 -360731 -182260
1807 -182260 231618 408490 53344 -71030 -3527 34503 -11292 -111840 -408274 -291185
1797 -291185 -35833 200127 134561 -369423 -653651 -48456 138920 -31161 151042 3730
1787 3730 -36012 -145731 186867 210569 -214014 -163512 -116455 -70119 -18287 89219 333039
1776 333039 273463 227241 19893 53797 189085 279929 659792 458254 302165 297163 394139
1765 394139 254419 -37025 3216 -185774 221319 119094 21921 119722 70466 -162279
1755 -162279 137256 39181 234209 363912 -42524 125272 245257 86876 82485 18067
1745 18067 70421 273477 425454 261213 -161544 -79707 27554 146518 122674 42472 197769
1734 197769 132261 -87113 47088 211842 -35542 101659 104071 47480 36361 -187957 -84586
1723 -84586 -209241 -104417 -5179 -50999 -64085 -207744 116360 -108076 4443 330931
1713 330931 -53508 -93364 -9455 74313 130576 150924 184052 75842 477080 543540 248030
1702 248030 -4968 -26493 106891 -166029 -140949 -31979 -53708 171030 128734 9739
1692 9739 -42276 133313 202904 431307 540162 111504 -95045 -136976 204776 552542 394292
1681 394292 233694 -81939 52133 93275 80042 266353 -38890 -305957 -358710 -45033
1671 -45033 321852 415180 281428 58466 82832 153924 398025 248092 194964 106889 35703
1660 35703 -180881 170377 52844 -85672 -125021 -140423 127068 304882 336381 161660
1650 161660 273698 218858 175197 206145 134340 -47045 187191 207166 279353 -152629 -290860
1639 -290860 -388681 -412102 47512 206910 75460 214248 46228 142848 86476 337646
1629 337646 360500 320027 209845 209980 -94617 -12634 199604 27015 -68035 -11177 89862
1618 89862 -27091 -153927 -92259 231343 -61369 -186794 385362 63002 103794 -36243
1608 -36243 18759 -67870 -215017 -28994 151982 36738 -212477 -301971 -296944 172170 -43287
1597 -43287 -180100 -177959 60515 -38566 -204830 6637 -103831 -246216 -270950 -200318 163551
1586 163551 63556 -90435 -206898 -42509 24503 -137277 -9838 -71212 -219109 -215642 121587
1575 121587 327515 137211 194770 188119 -81447 -147421 93359 -31570 2459 -196258 -111190
1564 -111190 -60635 51588 212205 34197 158422 271759 244504 -15696 19691 -140777
1554 -140777 -74580 -186272 -14112 246444 224782 26701 -278928 -217521 -310866 -439797
1544 -439797 -427123 -156812 -40738 -73651 -142154 137753 128501 -42835 166715 123741 80110
1533 80110 85029 -121451 -473028 -333259 -147447 -64977 23082 34641 291793 346707 181868
1522 181868 -139922 -78360 87326 184279 126825 -96304 -321143 -322499 -383705 -424016 -119016
1511 -119016 122086 -157168 -271473 -288261 -37208 -3309 -200140 -226475 -118958 -133922
1501 -133922 148524 220953 193959 416398 413907 261620 591465 353291 93331 52474 -99826
1490 -99826 -37556 43019 213798 -82622 74111 -64829 -157108 -165116 4911 -85540 -19998
1479 -19998 4643 -211428 77944 -171451 92812 227707 135482 33997 3017 -95187 -199948
1468 -199948 -310877 -354842 -32233 -157378 -70912 -281257 -162122 -212349 -347871 -72333
1458 -72333 -83263 -5321 -205674 -318245 -47837 -59932 154603 216805 -10376 -17842 26103
1447 26103 -40669 -212233 -71548 -184020 -257129 6963 126685 97280 275379 45343
1437 45343 36323 -28628 191441 113507 -288539 -219463 -150012 -103051 -306788 -275610 -162393
1426 -162393 104380 124770 -142089 -221501 -228373 71749 -33060 -267461 -457702 -396320 46919
1415 46919 142667 124665 -1560 202617 289076 27564 -80528 24352 19987 58219 -125558
1404 -125558 -218149 -61462 439804 187103 -47062 17013 112536 141423 72393 -217279 -272469
1393 -272469 -14102 128560 64797 122655 24569 -88195 -27627 11254 -183437 -306146 -361989
1382 -361989 -224526 -73928 138855 -256371 -171192 -126637 -92918 401381 82449 25276
1372 25276 -262083 -122311 107713 254555 283446 119481 -9784 -22252 48488 202175
1362 202175 102833 -94835 -401939 -254359 73344 -260723 -212491 -169924 -195439 -280552 -114582
1351 -114582 60892 105420 70599 -124377 -285850 -171876 -189602 -459058 14183 1783
1341 1783 -53826 110315 -34529 -164169 -101618 -140373 -247090 -90865 -46819 -1163 144765
1330 144765 115448 113047 170712 63371 -106301 -75583 -163978 -156936 207063 247436 -24139
1319 -24139 -229060 -89841 125189 250613 -202014 -126842 -9075 -111230 193722 4005
1309 4005 217015 254516 -10467 -158896 -209842 15575 80951 32802 157414 304205 386554
1298 386554 111203 151805 127319 192707 411692 -44232 -287223 -86256 11063 35136 -105091
1287 -105091 -98114 39452 -173348 -264836 -297243 -364835 -36312 171636 217264 171542 -72965
1276 -72965 -364865 -271330 58820 -68055 -358148 -458351 101238 213079 -139766 215932
1266 215932 131228 -34601 -79830 93009 30202 -102435 -94648 -50674 39308 163033 76307
1255 76307 -210339 -223782 -193441 -31228 133110 61978 -75168 -91849 -144554 -307044 -362950
1244 -362950 -451560 -243009 -300834 -264104 66463 111446 42399 166963 222449 2537 -75689
1233 -75689 233013 136447 34372 -121297 -148122 -276943 -121364 -58134 -69412 153414 464031
1222 464031 551283 93144 104219 -104059 -286576 -90895 65564 -179735 -120939 58681
1212 58681 214189 270128 234137 -286162 -406749 -284690 -334413 104010 119456 -256750 -283593
1201 -283593 -239667 -46537 88522 216649 117747 223300 32489 67648 322809 45053
1191 45053 -25506 -236756 -172720 -72620 413099 173912 -94186 -79510 -245146 -126780
1181 -126780 -187711 -121077 -41841 -37516 -144230 -292568 -210000 -1070 -154076 -17887 -231963
1170 -231963 -77049 -277144 -266131 -226682 -179041 -137025 -52052 -111778 -139237 6009 130448
1159 130448 172973 13359 247803 238620 94226 154289 -61996 193172 286423 -37121 -85097
1148 -85097 105672 199957 238226 70892 41215 171078 344006 337966 125054 -86330 -209835
1137 -209835 -271961 -199075 88877 93241 120184 167004 192651 409173 151701 48856 -78595
1126 -78595 -75184 123104 336670 282497 229906 129794 -47302 396497 109273 100926 -169720
1115 -169720 35123 145114 -238259 -156681 -30023 -434405 -517500 -235947 266668 227756
1105 227756 -20322 -255685 -273659 -128801 -269397 -12749 -85079 -182969 -466300 -362034
1095 -362034 -294631 -303371 2773 -158489 -3243 110390 -15731 -35513 30684 28255 406646
1084 406646 154475 246979 154508 210569 175005 -131987 -241807 -32692 138498 306575
1074 306575 500572 173641 137372 -196419 -197554 13626 67904 116758 231710 307012 -10122
1063 -10122 -245118 -261531 318604 127110 -306252 -152149 43472 -16588 -163220 -209805
1053 -209805 -362306 -438367 -232625 83886 184736 50234 -105053 -128705 -250553 -141679
1043 -141679 -195043 -65622 -54806 -194930 -455388 -373645 -79568 79792 -155964 -244269
1033 -244269 -47009 -240783 -5212 34530 -33581 144105 -118140 -26910 201346 110058
1023 110058 -29176 -97424 -173766 -171512 85327 93999 -103376 -265009 -130824 11519 -110403
1012 -110403 -21592 -174909 -134004 -221402 -172955 77818 159007 -117654 -7955 67580 -148298
1001 -148298 -336127 -152989 -30421 -69359 120715 71727 249279 233764 -207426 -237778
991 -237778 -13760 7132 75354 267588 226365 79175 268851 -21375 110529 215253
981 215253 215712 35826 -258505 -118157 -242338 -231996 -243038 -283524 -272058 93739 -177508
970 -177508 -103322 229099 47290 186608 382792 286003 -124582 -241341 -239218 -115033 -102547
959 -102547 118668 19408 32061 105319 262421 260267 212895 570464 463443 395580 370598
948 370598 362372 342280 303614 301734 322938 196541 99869 1919 -188355 69099 161708 140836
936 140836 255135 163231 213926 105742 120004 134150 104788 120137 50109 -255299 -155258
925 -155258 -35740 -48970 -183754 3185 195826 84116 -35193 -54183 -138628 -142583 73432
914 73432 196206 162729 117505 45008 -132559 -333326 -106540 431948 408871 460098 271707
903 271707 -114679 -424740 -463724 -595526 -345033 -399615 -419921 -392764 -221806 -134511 -56956
892 -56956 -31442 -470348 -414163 153638 204945 82224 -123596 -102484 -121440 -280692 -349082
881 -349082 -570380 -148640 -113893 -134700 -375089 -181357 19078 -26725 -122841 -247251 38332
870 38332 -134577 -138218 -34010 -217372 -346349 -112544 253816 296333 753903 395330 -20241
859 -20241 190371 57274 142999 83955 36412 118502 21718 -26766 -203213 -330110 -217110
848 -217110 -7348 -17157 -18216 -37493 524125 480340 4606 -317383 -204360 91415 -29329
837 -29329 176345 -128034 -189456 -56658 57669 308997 124331 53790 305706 -302716
827 -302716 -485358 -33980 -56976 -46467 149340 209059 216038 36634 -211788 -102251 -50010
816 -50010 -34102 196503 6849 142171 2512 -284881 -94344 -491270 -588889 -107933
806 -107933 79888 121481 -75235 -422947 -67595 126049 -524705 -574541 -109989 -75336
796 -75336 -115754 -236152 -389415 -358730 -39913 155446 -92034 -184980 -124198 58066 -38374
785 -38374 5684 -6618 73377 130351 -62912 70195 138603 148100 72943 131799 164461 39275
773 39275 -41027 206296 150440 -168426 14024 -119215 68503 -136657 -442885 -263202
763 -263202 -183862 -325209 -169324 -87862 -30922 25909 125203 271412 260712 92980 214381
752 214381 258110 23187 -316711 -473679 -76255 16819 157184 219498 410715 337057 -136315
741 -136315 -165798 67011 -142226 133002 428908 56563 -3097 176710 -101635 -308066
731 -308066 -12359 -149248 -40461 -36548 -266988 -295867 -217437 10536 6210 294710 116316
720 116316 -281715 -94406 167563 -5519 -120634 -150512 -32929 -14253 40803 -283357
710 -283357 -210250 -120122 -31016 100849 15405 88309 18220 -86021 -103092 -239025 -241624
699 -241624 -237673 -43434 129438 149975 78441 -251740 -285314 211153 62959 82746 85352
688 85352 -432735 -634744 -106972 108923 -127945 -162046 -97653 -22553 334556 454641 187767
677 187767 156392 340475 331265 -158086 -156720 -318587 -186517 -12194 -165081 -215325 -404046
666 -404046 -140433 44793 -107699 200893 311118 210426 -66570 -33192 -74233 -318079
656 -318079 -363206 -65947 76009 -260376 -330351 -337078 -403293 -225867 -71132 156941 230768
645 230768 163725 -142362 -236924 -91813 -243865 -195755 -126455 -120019 -303960 -308470 -236927
634 -236927 -144390 -123824 -91356 -83910 -69784 -69256 -105122 59299 268125 223266 435091 163508
622 163508 -67823 -249074 -210095 -74092 -23225 164980 -31036 21310 -47533 -98417 358
611 358 249789 97295 31474 62107 41450 105162 317481 199302 -65572 -178685 -114216
600 -114216 -129997 -73185 -54058 -22732 -35898 32746 36289 90946 89532 103289 41350 -91615
588 -91615 -263660 -208483 -180759 -108417 -57059 -154497 26646 5323 -22803 -162309 -262488
577 -262488 -153183 -143731 202506 22327 135786 363749 105767 -31120 144934 25230
567 25230 -326375 -324006 11478 -76489 -137757 -36828 6610 -362499 -477009 -467396 -259763
556 -259763 -109481 -378085 -240549 -171787 82312 97619 -287932 -236620 100871 67581 -59371
545 -59371 -133490 -10264 60942 118820 66801 -271672 -159432 -156980 -433633 -706704 -497822
534 -497822 -39911 6557 44188 -307042 70179 302427 102900 155022 214734 173253 237230
523 237230 141619 -10960 -61833 150237 -193465 -53973 322719 210767 -281704 -272738 -416179
512 -416179 -322303 -147492 -79028 -110347 -5062 161092 243100 539039 369359 207099 69571
501 69571 180269 17341 38693 -82931 -311189 -119598 37376 -122769 -325375 -287804
491 -287804 -127553 -78908 -356936 -304076 -158899 -180176 -114526 -53905 -444778 -336974 -217860
480 -217860 87757 197323 192522 146108 36896 374178 245641 -55655 -37646 9540 68997
469 68997 273370 280861 50749 -84637 -112472 139740 104411 -115669 8355 -85279 -127541
458 -127541 -62983 -88297 100742 118433 -246047 -237231 62766 -180843 -439370 -31228 62838
447 62838 -17350 -366157 -184258 -113535 -134689 -42515 55042 -23932 -289994 -249964 -64307
436 -64307 -90742 -161765 -148705 -141839 -100610 -249111 -175121 33299 -224774 -345093 -177673
425 -177673 18298 234720 174097 184474 136970 -123394 -74172 -34794 -311263 -342483 -101580
414 -101580 162766 -117363 -234891 -83200 223090 434638 402880 473081 362196 120136
404 120136 151388 20127 -2375 -217157 -384768 -110409 162962 288824 92816 58656
394 58656 -37624 -91551 -310407 -418185 -274456 -236268 35350 -91312 -150567 -110892 -235103
383 -235103 30840 97337 -8845 -113618 48450 140446 218063 139170 80068 142805 96655
372 96655 -27446 176772 65432 175364 468735 418014 172945 265173 232725 213909 -105270
361 -105270 252803 428195 152309 -90912 -114068 102677 22829 -100636 -258664 31642
351 31642 16340 -307753 -10270 -1768 482843 510899 442332 324641 -63105 -232706 -299980
340 -299980 -362258 -229135 -143745 -153088 -146510 -105894 91622 -135922 -37758 -113476 -94803 -27889
328 -27889 -46343 -51599 -101428 -354383 35684 116242 142297 295928 129355 107667 137378
317 137378 159989 247835 -17775 183101 76227 66859 105387 5011 279166 -106858 -419687
306 -419687 -204088 -85650 60138 346976 120159 -32708 174600 42480 68769 286584
296 286584 240400 -287447 -417886 -81052 460493 441935 495359 18692 -415638 -141216
286 -141216 194075 -24856 104085 447891 148313 -312993 -51354 70177 152045 28221
276 28221 165935 44275 -47559 136827 87382 154563 211225 318074 144558 26337 131120
265 131120 -89977 303392 142502 -30646 21612 -219895 122152 40024 238225 -476
255 -476 120902 -113744 -142268 184277 -32111 -95834 282974 163422 130114 103694 116465
244 116465 -38701 -191954 -150744 -24066 660681 178972 -185748 177770 116717 191915
234 191915 255388 221144 123551 40376 98332 139333 111619 188775 324668 -77420 -369678
223 -369678 -57558 16594 59021 -48996 31577 -24620 212000 36431 -265232 -8867 23819
212 23819 126884 221591 165135 68396 95950 161871 261991 242677 13792 -47165 -204375
201 -204375 -131142 201683 49278 -158106 -277090 -195927 54493 54175 -26228 -181462 -123001
190 -123001 -100267 122953 277002 18638 130701 132736 11867 -45884 -212145 -146303 -41760
179 -41760 -288837 -316358 9693 24427 140868 257078 380309 5320 -145537 -46972 35131
168 35131 250309 56414 -15528 133969 163455 124440 -276721 -312611 -162047 -29818 -37301
157 -37301 -143009 6440 17887 24345 -18675 254560 313917 16729 6412 -12275 -40301
146 -40301 192731 183777 -38845 -1217 53796 -46295 -47513 -34172 -238504 19288 189166
135 189166 464511 556306 177062 133192 -9082 -40238 10750 -112887 -3340 70380 267260
124 267260 220926 -136532 33161 -38973 105805 174527 -205287 -34707 -84184 -258604 -201914
113 -201914 172576 151188 -271766 49601 -121712 -347033 -102807 -96749 63804 96186 -139363
102 -139363 -136042 152194 175512 -44189 57459 267921 161316 -33413 157143 294409
92 294409 270499 55494 196648 354030 120535 -46761 133649 52922 -96658 -217998
82 -217998 -69545 -111280 151702 383969 328333 165285 250654 162932 164779 22494 83493
71 83493 345097 202172 58280 -21617 -223453 -99206 21431 64819 63040 140880 15003
60 15003 -32946 93389 278952 226248 5469 -60090 71817 238814 181070 126688 -27878
49 -27878 59690 63005 6821 96541 207432 92426 -4644 4531 -189150 -227957 -105785 -228634
37 -228634 -26778 82309 185047 88327 -84397 -154291 -9032 -75471 35403 39163 177143
26 177143 -11552 -218513 -20715 -56514 -62023 84280 -141399 -90516 -147811 -235460 -115857
15 -115857 109976 194692 146925 104958 104325 297836 122276 61483 -92898 40732 145074
4 145074 278669 158251 -151058 9171
0 9171
$$ Imaginary data points
##PAGE= N=2
##DATA TABLE= (X++(I..I)), XYDATA
16383 -1286677 -1370185 -1394404 -1215072 -1215770 -1199441 -1265310 -1175307 -1002001 -1012968 -1050329 -1127530
16372 -1127530 -1058278 -837030 -876097 -942107 -1011759 -949549 -835298 -830046 -605336 -551481 -519430
16361 -519430 -508873 -638421 -643907 -551043 -484090 -542670 -533440 -332121 -409210 -550364 -739023
16350 -739023 -758140 -565887 -413251 -322058 -291026 -272944 -425571 -390643 -385221 -252207 -223949
16339 -223949 -133428 13552 -133738 -189180 45761 13125 153166 75310 93508 46805 200268
16328 200268 119077 160538 418052 139433 71388 111807 331497 344752 317483 482255 307511
16317 307511 643651 635795 455362 574003 348215 245794 455428 516848 420135 698436
16307 698436 717255 669670 640182 441690 642902 942810 952004 952925 986327 943186 837714
16296 837714 806559 613627 763808 828685 742972 797743 873889 1044164 1020189 1108333 1008511
16285 1008511 995331 869651 811011 849587 972030 806637 892084 1208840 1326865 1448032
16275 1448032 1272965 1178431 1423031 1391224 1282362 1289921 1035479 1202255 1397439 1559668
16265 1559668 1341883 1381196 1371314 1259645 1265605 1169610 1569756 1461892 1366599 1382648 1255370
16254 1255370 1224272 1277462 1366875 1440496 1649982 1655458 1592183 1576865 1729366 1732275 1621810
16243 1621810 1678411 1771917 1456245 1478638 1735280 2006287 1929717 1677340 1644399 1943005
16233 1943005 1960709 1850645 1775447 1861735 2061171 2191098 2201288 1988670 1942375 2102470
16223 2102470 1958340 1605507 1601625 1433779 1536905 1876352 2030345 2235262 1948589 1641776
16213 1641776 1816727 2079446 2235383 2036564 1663435 1919640 2346901 2068765 2154751 2118617
16203 2118617 1972655 2024804 2022050 2001080 2177684 2383828 2183128 2361304 2279365 2166512
16193 2166512 2101448 2106037 2095976 2277361 2300803 2314261 2363741 2192047 1731990 1879278 2150075
16182 2150075 2056311 2287107 2208539 2529455 2607377 2364755 2538278 2459375 2538623 2456989
16172 2456989 2232403 2371385 2351539 2314098 2415826 2217928 2331650 2234260 2095266 2066089
16162 2066089 1782202 2167485 2384141 2473120 2214961 2118679 2042079 2255437 1933871 1957301
16152 1957301 2104294 2350682 2253975 2230535 2155766 2461816 2580133 2601867 2431976 2414337
16142 2414337 2653614 2606426 2507282 2506854 2580812 2762592 2539502 2608150 2795976 2587535 2784070
16131 2784070 2601247 2555326 2353509 2325587 2258290 2497513 2417254 2588308 2400590 2500428
16121 2500428 2566254 2575300 2416181 2260946 2337533 2329347 2424582 2434027 2711528 2645259 2598364
16110 2598364 2788738 2811325 2714815 2630902 2692857 2635865 2669660 2808228 2736932 2603405 2308579
16099 2308579 2452615 2741853 2723208 2466381 2419190 2698034 2904837 3032350 3057448 2826759
16089 2826759 2740965 2906537 2660727 2840499 2882416 2670213 2374031 2605626 2540081 2526708
16079 2526708 2805110 2568673 2731131 2732518 2717321 2807712 2735963 2581427 2468411 2411115
16069 2411115 2523323 2856317 2894635 2760499 2466148 2554471 2864007 2930976 2783039 2872899
16059 2872899 2886094 2647389 2596763 2849762 2672886 2747943 2678283 2652992 2780047 2744689
16049 2744689 2971159 2848200 2931667 2929866 2749526 2598722 2817750 2721081 2558694 2469594
16039 2469594 2472780 2705096 2615103 2760155 2995532 3062654 2923912 2703811 2833087 2972034
16029 2972034 3061726 2741564 2676216 2795363 2926723 2790157 2674362 2482762 2686111 2848098
16019 2848098 2737997 2664886 2714831 2766133 2662315 2659334 2526556 2898995 2995869 2425522
16009 2425522 2398074 2675181 2917682 2897969 3128874 3061545 2727476 2831441 2651575 2615575
15999 2615575 2283852 2486729 2604739 2330004 2512736 2688807 2863393 2766865 2534375 2340493
15989 2340493 2139842 2054876 2135676 2436589 2696070 2649630 2603753 2949725 2919159 2912423 3111528
15978 3111528 2885219 2504393 2574698 2720092 2715667 2488993 2504479 2890300 2975136 2697329
15968 2697329 2630961 2755316 2728722 2841080 2693025 2547246 2438426 2480073 2514357 2649870
15958 2649870 3022120 2700547 2394046 2450734 2438989 2736230 2888981 2891131 2758089 2829324
15948 2829324 2845143 2901780 2931423 2958036 2782204 2808368 2633807 2665523 2810406 2729891 2975805
15937 2975805 3166917 2732175 2721170 3037613 2719645 2728931 2684843 2632582 2760682 2756114 2542970
15926 2542970 2739358 3084356 2582985 2473523 2794915 2620251 2382762 2580721 2799212
15917 2799212 2924798 2916698 2696961 2987645 3164681 2967121 2905426 2916751 2843687 2965097
15907 2965097 2974209 2958756 2684317 2830994 2566710 2536171 2893521 2817441 2770921 2814554 2934639
15896 2934639 2723442 2787926 2783302 2640379 2813337 3080534 2519119 2604794 2843231 2775237
15886 2775237 2760463 2673855 2775330 2877245 3031062 3004657 2916123 2802502 2651147 2813524
15876 2813524 2897987 2830914 3225701 3032957 2876872 2660546 2727352 2808525 2835289 2560363
15866 2560363 2662718 2587940 2490195 2499903 2639407 2866975 2768083 2823483 3075218 2979221 2996513
15855 2996513 2815152 2284116 2583814 2756346 2680442 2705774 2847913 2883575 2948436 3153700
15845 3153700 2819640 2634097 2693202 2610183 2971968 2773231 2822670 2804773 2741300 2652538
15835 2652538 2477006 2573499 2456131 2911457 3016170 2944171 2748937 2751986 2758856 2551117
15825 2551117 2823755 2646929 2739879 2887248 2739251 2722043 2279259 2179020 2476319 2360441
15815 2360441 2333555 2505282 2742870 2817352 2934018 2977010 2848837 2897578 2737270 2849777
15805 2849777 3104717 3184744 2781263 2961007 3054902 3061693 3077503 2944998 2996784 2765808
15795 2765808 2678834 2908328 2983902 2644272 2443748 2423227 2386117 2689467 3210663 3138553
15785 3138553 2961202 2985251 2886123 3164113 3019385 2549674 2925961 2942217 3065146 3212114
15775 3212114 3229164 3073612 3238679 2874666 2771555 2800965 2610528 2622706 2590417 2655632
15765 2655632 2595239 2551517 3043559 2855322 2781795 2495820 2807706 2747876 2543792 2833616
15755 2833616 2722600 2617227 2671465 2699479 2706106 2936629 2924363 2682265 2626260 2503058
15745 2503058 2697216 2831736 2679181 2538208 2745375 3029756 2985657 3055723 2860188 2579895
15735 2579895 2347827 2255453 2394432 2638188 2615077 2497870 2639382 2597069 2846788 3110688
15725 3110688 3082984 3144267 2887210 2872400 2597944 3100222 3168785 3079396 3190597 3182397 2735836
15714 2735836 2667462 2411339 2580710 3014870 3009054 2977549 3048115 2862780 2734116 2591090
15704 2591090 2962991 3167876 3163759 3116758 2959575 3073739 2838698 2967845 2870746 2867491
15694 2867491 2907122 2740240 2779961 2645526 2741374 2992422 2844551 2710439 2657885 2837460
15684 2837460 2934079 3021330 2734152 2869408 2992262 2790566 2784246 2917189 2840017 2732686
15674 2732686 2700714 2762892 2893182 2501732 2758303 2788068 2738377 2704452 2851015 2853306 3080986
15663 3080986 2914036 2839773 2501275 2436791 2673052 2576901 2566329 2575929 2941778 2928776 2845059
15652 2845059 2897578 2994304 2842300 2726295 2764026 2964689 2970003 2832812 2780666 2745072 2825209
15641 2825209 2663532 2640759 2830210 2926560 2994151 2710138 2796245 2994786 3065343 2820847
15631 2820847 2863664 2977655 3053781 2783103 2847149 3170217 3136259 2941770 3044558 3437955
15621 3437955 3202903 2855084 3087422 2870239 2896358 3154629 2914214 2778189 2835230 3078328
15611 3078328 2843896 2720939 3088648 3005594 2749486 2501723 2750811 3140647 3033889 2844677
15601 2844677 2947208 3027145 3048651 3148426 3066663 3184038 2726563 2635096 2844649 2806983
15591 2806983 2955858 2959334 2818068 2903652 3230926 3010626 3043196 3233078 3170775 3038072
15581 3038072 2935063 2520580 2756406 3130229 3286726 3145204 2911198 2954114 2826232 2644119
15571 2644119 2691721 3037083 3144925 2988711 2878121 2900381 2745497 2651812 2785246 2787502
15561 2787502 2807011 2843940 2719154 2658040 2743821 2932495 2714994 2667885 2783794 2986133
15551 2986133 2995179 2803893 2766561 2972344 2991865 2710819 2689461 2898029 3024719 3115012
15541 3115012 3075434 3058049 3153474 2853501 2881733 2882878 2640205 2558865 2857359 3288284 3144529
15530 3144529 2906859 2638768 2391274 2551005 2845800 2941883 2771143 2746718 2550952 2729878
15520 2729878 2873254 2795356 3019317 2859691 2707259 2643739 2648541 2477034 2798194 2808175
15510 2808175 2925651 3162056 3174107 2995808 2910148 3006924 2821525 3007204 3112364 3150881
15500 3150881 3041979 3059835 3211893 3142205 2822205 3108587 2904339 2856733 3181460 3059022
15490 3059022 3016739 2907921 2662964 2689138 2837975 2785702 2711231 2676564 2704268 2651583 2872456
15479 2872456 2827270 2827611 2874336 2697043 2735725 2929159 2918119 2835300 2638003 2716269 2686013
15468 2686013 2974091 3001606 2960111 2936232 2822219 2913713 2866829 2922085 3144053 3145971 2664654
15457 2664654 2519500 2676603 2594679 2918803 3146553 2963168 3005561 3086596 3155850 3278671
15447 3278671 3224052 3228059 3115190 2889011 2905495 2989376 3020216 2841606 2764797 2848573 3012919
15436 3012919 2922925 2662504 2638880 2846290 2937278 3007780 3147036 3000775 2795016 3158616
15426 3158616 3080489 2924383 2994610 2835408 2946573 2907440 2997227 3110718 3066262 2942711
15416 2942711 3049981 3064143 2877219 2813608 2902388 3025887 3224211 3422652 3077814 2995498
15406 2995498 2846996 3037884 2953101 2717901 3140064 2869699 2934853 3226311 3240630 3138502
15396 3138502 2989519 2962221 3078321 3158954 3264181 3020575 2980905 3232265 3254661 3048605
15386 3048605 2898260 3239798 3248041 3026934 2793540 2920385 2979608 2923308 2996661 2923355
15376 2923355 2924957 2857356 2649411 2727550 2977252 3005938 2833454 3054416 2850450 2895096
15366 2895096 3127140 3314395 3249386 3009616 2776132 3165651 3185661 2798868 2837707 3002258
15356 3002258 2959058 2819154 3018157 2876237 2767930 2913534 3223996 3185455 2903796 2929268
15346 2929268 2910677 2941597 3150204 2932906 2884102 2671306 2752547 3099500 2980858 2899822
15336 2899822 3177895 3342000 3014736 2919374 2946000 3213906 3052729 2914725 2904793 2946234
15326 2946234 2921097 2604826 2851789 2737965 2862749 3004772 2957998 3121692 2830644 2795668
15316 2795668 3258843 2994593 2609287 2827993 3039576 3104586 3320876 3130473 2867497 2829637
15306 2829637 2924988 3042014 3317084 3320568 3038465 3092618 3133967 3089029 2926070 2731390
$$ [...]
##END NTUPLES=NMR SPECTRUM
##END=
