##TITLE=1H_TG-2357-A1
 CDCl3
 8 sc, 
 25.08.2022
##JCAMPDX= 6.0         $$ Bruker NMR JCAMP-DX V2.0
##DATA TYPE= NMR SPECTRUM
##DATA CLASS= NTUPLES
##ORIGIN= UXNMR, Bruker Analytische Messtechnik GmbH
##OWNER= root
$$ XWIN-NMR		Version 3.5
$$ Thu Aug 25 14:35:37 2022 Russian Standard Time (UT+4h)  she@DPX200
##.OBSERVE FREQUENCY= 200.1313499994
##.OBSERVE NUCLEUS= ^1H
##.ACQUISITION MODE= SIMULTANEOUS
##.ACQUISITION SCHEME= undefined
##.AVERAGES= 8
##.DIGITISER RES= 18
##SPECTROMETER/DATA SYSTEM= spect
##.PULSE SEQUENCE= zg30
##.SOLVENT NAME= CDCl3
##.SHIFT REFERENCE= (INTERNAL, CDCl3, 0, 15.737)
##AUDIT TRAIL= $$ (NUMBER, WHEN, WHO, WHERE, WHAT)
$$ ##TITLE= Audit trail, XWIN-NMR		Version 3.5
$$ ##JCAMPDX= 5.01
$$ ##ORIGIN= Bruker BioSpin GmbH
$$ ##OWNER= she
$$ F:/spectra/data/she/nmr/H-F/1/pdata/1/auditp.txt
$$ ##AUDIT TRAIL=  $$ (NUMBER, WHEN, WHO, WHERE, WHAT)
(   1,<2022-08-25 14:34:31.20 +0400>,<she>,<DPX200>,
      <created by zg, POWCHK disabled, PULCHK disabled
       configuration hash MD5:
       00 E9 B6 7A A2 85 ED C7 34 08 36 98 17 FE 4E 26
       data hash MD5: 16K
       C7 7D 9A F1 1C 75 99 3A 75 F4 FD 4F 99 31 F1 7B>)
(   2,<2022-08-25 14:34:33.62 +0400>,<she>,<DPX200>,
      <Start of raw data processing
       efp BC_mod = 2 LB = 0.24 FT_mod = 6 PKNL = 1 PHC0 = -18195.4 PHC1 = 10.60069 SI = 16K 
       data hash MD5: 16K
       CA 94 B0 45 6C 32 1D A3 AF C1 3F 28 4A DE C9 57>)
(   3,<2022-08-25 14:34:48.32 +0400>,<she>,<DPX200>,
      <pk PHC0 = -7.011973 PHC1 = 10.4 
       data hash MD5: 16K
       EA 3C 83 C9 09 C5 7D 1B B3 EC BE 90 EA D4 82 40>)
(   4,<2022-08-25 14:34:51.62 +0400>,<she>,<DPX200>,
      <abs ABSG = 5 
       data hash MD5: 16K
       1C 48 4F C8 F0 85 90 9D FC 3C FB 74 F2 5B 60 DF>)
$$ ##END=
$$ 
$$ hash MD5
$$ 84 B7 77 D8 68 38 2F FD 11 9D C2 D0 50 C4 03 02
##$RELAX= 
##$RELAX= 
##$RELAX= 
##$RELAX= 
##$RELAX= 
##$RELAX= 
$$ Bruker specific parameters
$$ --------------------------
##$DU= <F:/spectra>
##$EXPNO= 1
##$NAME= <H-F>
##$PROCNO= 1
##$TYPE= <nmr>
##$USER= <she>
##$AMP= (0..31)
100 100 100 100 100 100 100 100 100 100 100 100 100 100 100 100 100 100 
100 100 100 100 100 100 100 100 100 100 100 100 100 100 
##$AQSEQ= 0
##$AQ_mod= 1
##$AUNM= <au_zg>
##$AUTOPOS= <>
##$BF1= 200.13
##$BF2= 200.13
##$BF3= 200.13
##$BF4= 200.13
##$BF5= 200.13
##$BF6= 200.13
##$BF7= 200.13
##$BF8= 200.13
##$BYTORDA= 1
##$CFDGTYP= 0
##$CFRGTYP= 5
##$CHEMSTR= <none>
##$CNST= (0..31)
1 1 145 1 1 1 1 1 1 1 1 1 1 1 1 1 1 1 1 1 1 1 1 1 1 1 1 1 1 1 1 1 
##$CPDPRG= <>
##$CPDPRG1= <>
##$CPDPRG2= <>
##$CPDPRG3= <>
##$CPDPRG4= <mlev>
##$CPDPRG5= <mlev>
##$CPDPRG6= <mlev>
##$CPDPRG7= <mlev>
##$CPDPRG8= <mlev>
##$CPDPRGB= <>
##$CPDPRGT= <>
##$D= (0..31)
0 1.2 0 0 0 0 0 0 0 0.06 0 0.03 0 0 0 0 0.0002 0 0 0 0 0 0 0 0 0 0 0 0 
0 0 0 
##$DATE= 1661423670
##$DBL= (0..7)
120 120 120 120 120 120 120 120 
##$DBP= (0..7)
150 150 150 150 150 150 150 150 
##$DBP07= 0
##$DBPNAM0= <>
##$DBPNAM1= <>
##$DBPNAM2= <>
##$DBPNAM3= <>
##$DBPNAM4= <>
$$ [...]
##$SUBNAM3= <"">
##$SUBNAM4= <"">
##$SUBNAM5= <"">
##$SUBNAM6= <"">
##$SUBNAM7= <"">
##$SUBNAM8= <"">
##$SUBNAM9= <"">
##$SW= 18.0517283424941
##$SWIBOX= (0..15)
0 0 2 0 0 0 0 0 0 0 0 0 0 0 0 0 
##$SW_h= 3612.71676300578
##$TD= 16384
##$TD0= 1
##$TE= 0
##$TE2= 300
##$TE3= 300
##$TEG= 300
##$TL= (0..7)
0 120 120 120 120 120 120 120 
##$TP= (0..7)
150 150 150 150 150 150 150 150 
##$TP07= 0
##$TPNAME0= <>
##$TPNAME1= <>
##$TPNAME2= <>
##$TPNAME3= <>
##$TPNAME4= <>
##$TPNAME5= <>
##$TPNAME6= <>
##$TPNAME7= <>
##$TPOAL= (0..7)
0.5 0.5 0.5 0.5 0.5 0.5 0.5 0.5 
##$TPOFFS= (0..7)
0 0 0 0 0 0 0 0 
##$TUNHIN= 0
##$TUNHOUT= 0
##$TUNXOUT= 0
##$USERA1= <user>
##$USERA2= <user>
##$USERA3= <user>
##$USERA4= <user>
##$USERA5= <user>
##$V9= 5
##$VALIST= <valist>
##$VCLIST= <CCCCCCCCCCCCCCC>
##$VD= 0
##$VDLIST= <DDDDDDDDDDDDDDD>
##$VPLIST= <PPPPPPPPPPPPPPP>
##$VTLIST= <TTTTTTTTTTTTTTT>
##$WBST= 1024
##$WBSW= 4
##$XGAIN= (0..3)
0 0 0 0 
##$XL= 0
##$YL= 0
##$YMAX_a= 73938
##$YMIN_a= -54922
##$ZGOPTNS= <>
##$ZL1= 120
##$ZL2= 120
##$ZL3= 120
##$ZL4= 120
##$ABSF1= 15.77113
##$ABSF2= -2.28072
##$ABSG= 5
##$ABSL= 3
##$ALPHA= 0
##$AQORDER= 0
##$ASSFAC= 0
##$ASSFACI= 0
##$ASSFACX= 0
##$ASSWID= 0
##$AUNMP= <proc_1d>
##$AZFE= 0.1
##$AZFW= 0.1
##$BCFW= 0
##$BC_mod= 2
##$BYTORDP= 0
##$COROFFS= 0
##$CY= -3
##$DATMOD= 1
##$DC= 0
##$DFILT= <>
##$DTYPP= 0
##$F1P= 0
##$F2P= 0
##$FCOR= 1
##$FTSIZE= 16384
##$FT_mod= 6
##$GAMMA= 0
##$GB= 0
##$INTBC= 1
##$INTSCL= 1.705223e-09
##$ISEN= 128
##$LB= 0.24
##$LEV0= 0
##$LPBIN= 0
##$MAXI= 10000
##$MC2= 0
##$MEAN= 0
##$ME_mod= 0
##$MI= 1.114404
##$NCOEF= 0
##$NC_proc= -7
##$NLEV= 6
##$NOISF1= 3.799351
##$NOISF2= 2.8
##$NSP= 0
##$NTH_PI= 0
##$NZP= 0
##$OFFSET= 15.73697
##$PC= 1
##$PHC0= -18202.41
##$PHC1= 21.00069
##$PH_mod= 1
##$PKNL= yes
##$PPARMOD= 0
##$PSCAL= 0
##$PSIGN= 0
##$REVERSE= no
##$SF= 200.130006916935
##$SI= 16384
##$SIGF1= 3
##$SIGF2= 2
##$SINO= 5.538805
##$SIOLD= 16384
##$SREGLST= <1H.CDCl3>
##$SSB= 0
##$STSI= 16384
##$STSR= 0
##$SW_p= 3612.71676300578
##$SYMM= 0
##$S_DEV= 0
##$TDeff= 16384
##$TDoff= 0
##$TI= <>
##$TILT= no
##$TM1= 0
##$TM2= 0
##$TOPLEV= 0
##$USERP1= <user>
##$USERP2= <user>
##$USERP3= <user>
##$USERP4= <user>
##$USERP5= <user>
##$WDW= 1
##$XDIM= 16384
##$YMAX_p= 272387363
##$YMIN_p= -527995
$$ End of Bruker specific parameters
$$ ---------------------------------
##NTUPLES= NMR SPECTRUM
##VAR_NAME=  FREQUENCY,     SPECTRUM/REAL,   SPECTRUM/IMAG
##SYMBOL=    X,             R,               I
##VAR_TYPE=  INDEPENDENT,   DEPENDENT,       DEPENDENT
##VAR_FORM=  AFFN,          ASDF,            ASDF
##VAR_DIM=   16384,         16384,           16384
##UNITS=     HZ,            ARBITRARY UNITS, ARBITRARY UNITS
##FACTOR=    0.220516191357247, 1,           1
##FIRST=     3149.4399045078, 0,             0
##LAST=      -463.276858497978, 0,           0
##MIN=       -463.276858497978, -527995,     0
##MAX=       3149.4399045078, 272387363,     0
$$ Real data points
##PAGE= N=1
##DATA TABLE= (X++(R..R)), XYDATA
$$ [...]
8409g0720q4281Q4255J66338J5206K7254o2128o5946K7085Q5016R9059j37619
8398H3519k03814j45173m413O2577P8317J33004J22909n3899k48192K2517P5658
8387g6990o632N0042P8561N1849j33232N4447M6166m3132l3648J63499q27n4115
8375I5988J9123j02039o6950J94596J31422k19677q2093m5536O0360R4031o964
8364G2261J32384n5070j25177J23873j59741N956l3152M8620J10811p9424k03080
8353a61739L3245R5067o2609N1599J62583N3645K1872j14754j25203m9352o2277
8342a57923J39186m4729K2969j9168N0677k3565j5214J1650J08110J1074M1769
8331A24836m3178r0771O693R5133L6669k49523O6522k7360R268P4597N5870r1609
$$ y = [-70720, -155001, -70746, 95592, 110798, 138052, 75924, 9978, 37063, 122079, 221138, 83519, -120295, -265468, -269881, -207304, -128987, 4017, 126926, 73027, -175165, -152648, -76990, -83622, -33580, 44981, 96830, -36402, 18045, 64211, 21079, -12569, 150930, 150103, 95988, 115111, 13072, -53878, 140718, 272140, 52463, -29630, -75166, -14806, 79225, 72261, 204645, 149575, 24398, 148271, -11470, -5514, -38666, 9954, 120765, 41341, -161739, -128494, -33427, -96036, -44437, 118146, 171791, 193663, 78909, -46294, -95646, -157923, -18737, -63466, -40497, -59665, -8988, -32553, -47767, -36117, 71993, 83067, 124836, 81658, -9113, -2420, 92713, 129382, -120141, -53619, -80979, -71711, 2886, 58756, -32853]
8319c2853n0730J66651o0403j63275Q4049J05821j04841M4866R926j14316N6625
8308e8480K3722M0001K4999l1685q5308m2431l2678j13925K0484J95677M9926
8297i698K1707o4372M428n9775M2220J50155K2828L2101o7196o7229j03841R3859
8285d813M903k0777P556L1977K6151j3355m4337j7373J02801J05470j4520m1594
8273A22089j68896q588J13999m3939n219k9461p419L869j39628J23278J18871
8262G8956K688J02451j64151j23284J0213Q6488l0046n6661n0541J7286L7698
8251h8903j44816K6734J01468R2936J59514j19207j39779m9287l8819N9023Q7672
8240e3464O7748M7291n6534j41932k4041J6031J05437J01680l5709m4642r0647
$$ y = [-32853, -83583, 83068, 22665, -140610, -56561, 49260, -55581, -10715, -789, -115105, -58480, -34758, 5243, 30242, -1443, -86751, -129182, -161860, -275785, -255301, -59624, -9698, 12009, -52363, -47935, -107710, -65490, 84665, 107493, 139594, 72398, 5169, -98672, -4813, 90, -20687, -13131, 18846, 44997, 31642, -12695, -30068, 72733, 178203, 163683, 122089, -46807, -55395, 58604, 14665, 9446, -20015, -27434, -23565, -163193, -39915, 78956, 81644, 184095, 19944, -103340, -93127, -6639, -36685, -93346, -143887, -126601, -88903, -233719, -206985, -105517, -12581, 146933, 27726, -112053, -161340, -200159, -141136, -53464, 14284, 61575, 5041, -136891, -160932, -144901, -39464, 62216, 26507, -18135, -108782]
8229a08782n2913K1872J15379J98524M92j04068k7546K244q7235R272R8316n6834
8217H721p1048l7442j32360p0005K09602M7636J38194p5100n2134j25054p4192
8206b33182J01481P9950J12302K3324j55433p7100L5278J7440J39275M938j68425
8195a20152N9489O873K19389N55778o20953J45070j0517o1150p4373j79335R7058
8184A7177n5483O7998q4255L4795J5172j5225k8271m4331m8436N4558L674m515
8172h7142m4286j05440O434J30761P1208j392M9909p5331q5175N6783k3756J50278
8160D2851n0906M0794L9484o0387p3793J25941N9051n1988o8088p565Q6833j34158
8148e1931q7492J25242J80128O3243q2650m2964j19482M1578N4976q309L9294
$$ y = [-108782, -161695, -139823, -24444, 174080, 174572, 70504, 42958, 45202, -42033, -32761, 65555, 8721, -62327, -99769, -232129, -302134, -92532, -44896, 93298, 18198, -33936, -158990, -233182, -131701, -51751, 60551, 83875, -71558, -148658, -113380, -95940, 43335, 48273, -120152, -60663, -53790, 165599, 721377, 100424, 245494, 234977, 173827, 99454, -79881, 17177, -38306, 29692, -54563, -19768, -4596, -19821, -48092, -92423, -140859, -86301, -82627, -87142, -131428, -236868, -230434, -99673, -28465, -29857, 20052, -55279, -140454, -83671, -107427, 42851, -8055, 32739, 72223, 11836, -61957, 63984, 123035, 71047, 2959, -4606, 82227, -51931, -139423, -14181, 165947, 229190, 146540, 103576, -15906, 25672, 80648, 72339, 111633]
8137A11633Q967q2246n2056o853J75286J17510j66476o6418K1317n1260k19323
8126b09919J73908M335N0145L1718j14230p4664K0274J54451R9104K0045o7553
8115H7614k1261o8032j0974K1589J40084j06316L2639J4200j40774L3043m4532
8104f2720K256O6831O3453r9033n8880k3834m3857O8536Q0232L3663N7937j73632
8092h9048o6940m5416J01507J96909q934J17670j63992l6124o2364p5661J90759
8081E8366M1009m9910P008n7095j41816J37359j0926J1052l199J6870r9416L488
8069h7210N3409J313N4686k0861J14630j10739j21767j09543M9410K52192J09881
8058A85401j17966m1425j06000n0804J81319M4605J5658K7776m8760j325j85903
$$ y = [111633, 120600, 38354, -13702, -20555, 154731, 272241, 105765, 39347, 60664, 9404, -209919, -36011, -31676, 18469, 50187, -64043, -138707, -118433, 36018, 135122, 155167, 87614, 66353, -1679, -12653, 8936, 149020, 42704, 75343, 89543, -51231, -18188, -62720, -60464, 6367, 69820, -29213, -88093, -111927, -155784, -87248, -7016, 26647, 84584, -89048, -155988, -201404, -99897, 97012, 88078, 205748, 41756, 5632, -56732, -132393, 58366, 99375, 49465, 56473, -622, -142438, -5079, -16005, -4953, -8152, 8718, -90698, -87210, -33801, -32488, 22198, 1337, 115967, 5228, -116539, -226082, -176672, 75520, 185401, 67435, 26010, -79990, -130794, 50525, 95130, 110788, 138564, 89804, 88479, -97424]
8047i7424J67565Q6349K2796j48114j80734L7171o6369J42000J49115k0583O4224
8036A55996k1581k20269j36143P4918J28405M961J81676j04311r5211J3955k9451
8025d7055Q9090M8541L0578n0543r7668j2010L3495P0041Q3473m6623j6616L464
8013H8167j55314m9655p5078J19869Q8580k5667j09110p1313P0569m7541L9577
8002a26916O5451K7231L7458l8249J327l6345p8869L564Q3032K5127k602O1912
7990B2121j47613K121O5040J03293J71459j36336n1921P3183k9942j9049k2900
7979B9456l0645J0653o6804j21920L2877J04785N5613N3937L6283j18398O9514
7968E5351k3471M8570L1596L998j7339p5534j24365k8770o8446J27970K55820
$$ y = [-97424, 70141, 156490, 179286, 31172, -149562, -112391, -178760, -36760, 112355, 91772, 155996, 134415, -85854, -221997, -147079, -18674, -13713, 167963, 63652, -31559, -17604, -47055, 42035, 90576, 121154, 70611, -27057, -39067, -5572, 64469, 147942, 101319, 84703, 88167, -67147, -116802, -191880, -72011, 16569, -9098, -118208, -189521, -118952, -166493, -126916, -61465, -34234, 3224, -35025, -33698, -70043, -148912, -145348, -62316, -37189, -39791, 22121, -125492, -123371, -58331, 44962, 216421, 80085, 28164, 101347, 71405, 52356, 29456, -1189, 9464, -57340, -179260, -146383, -41598, 14015, 67952, 104235, -14163, 55351, 31880, 80450, 112046, 116044, 98705, 23171, -101194, -129964, -198410, -70440, 185380]
7957A85380j47269m6642n2537j8414o4047P7542m17j5649n5819m4592J8894J27640
7945c5930P4624J24077J12602j37279q7837o5225r6211r0891J78626J48125L4647
7934A59328j50653K6913j10798j82376P8287K1078K33695j11038j17892M441N7517
7923i1498J46386o4284j06520J09022L4232j68020k5734L9819J61858k5629k08598
7912a98966j0863P3372r669P2647J8017k0693l7034o0287m7795k2632J46739J34759
7900C7595J1553J9301k0575n3146j07746m3664L7505O7827N2635j31763k4610
7889a55088J0565k3311Q0687P0358m3913q9961m1355K5145O0712K02856q7225
7878I470l3683j0521j35471K8090p8813L1790R9644P1703M1309q9978o3819P1839
$$ y = [185380, 38111, -8531, -61068, -79482, -143529, -65987, -66404, -82053, -137872, -182464, -163570, -35930, 38694, 162771, 275373, 138094, 50257, -14968, -111179, -202070, -23444, 124681, 159328, 8675, 35588, -75210, -257586, -179299, -158221, 75474, -35564, -153456, -149015, -91498, 54888, -9396, -115916, -6894, 27338, -140682, -166416, -126597, 35261, 9632, -198966, -209829, -136457, -146126, -73479, -55462, -76155, -113189, -173476, -221271, -243903, -97164, 37595, 49148, 68449, 47874, -5272, -113018, -156682, -119177, -51350, 1285, -130478, -155088, -144523, -167834, -87147, -16789, -60702, -150663, -192018, -166873, -106161, 96695, 9470, -24213, -34734, -170205, -142115, -220928, -189138, -89494, -17791, 23518, -66460, -130279, -58440]
7866e8440J8332N3850K7684l1780J95m6180j18060K6109J8428R1247l9362j24573
7854a82550M966o3586O2063K2512N6565J13476k3141n3098o9354k2887J29534
7843b5500J49543l9175j23960o3085k62041K63530K0588k3244N2933J668j44026
7832a92769j7823K5083J0789O7948J16562M174j29510J0380m4990Q1469J35822
7821F7135Q5332n8329o5466j91952R174J49534k0544P7581Q127j63178o5696l59713
7809e27995K37831Q4306J20745J01622n2225n3481k2172j17821O8276M3087J94499
7798G6672M9234n1107q932o0993N998o5434P0872J5440l5221J15056j4638J8261
7786A15208O4943j15508K783p0660k2427m5722j71752R6053J34536J7888j11087
$$ y = [-58440, -40108, 13742, 41426, 9646, 9841, -36339, -154399, -128290, -109862, -18615, -57977, -182550, -177584, -241170, -179107, -156595, -100030, 13446, -9695, -62793, -132147, -155034, -25500, 124043, 84868, -39092, -102177, -364218, -100688, -80100, -103344, -50411, -48743, -192769, -210592, -185509, -174720, -106772, 9790, 13964, -115546, -105166, -150156, -68687, 67135, 152467, 94138, 28672, -163280, -154106, -4572, -25116, 52465, 60592, -102586, -168282, -527995, -290164, -205858, -85113, 16509, -35716, -89197, -111369, -229190, -160914, -117827, 76672, 125906, 74799, 65867, 4874, 10872, -54562, 16310, 31750, -3471, 111585, 96947, 115208, 180151, 64643, 67426, -3234, -25661, -71383, -243135, -147082, -12546, 5342, -105745]
7775a05745j29840N5242k4678K2256J49650R699j19523j14121L5815k572Q2411
7764a41406J74693l8532K7847k07873q2973m2925J61473R6482M8812n2314l0427
7753h7143j590n9618p4348P8273J77483P8623o4140j73769j02870M2088K5032
7742a61979P3599Q7547J7474p298K2936p7217L7561J9877j01008j8344P2351j9644
7730e4145j08739K4650J08747L2580j88720j10555J08350o8299J58988N0064J6850
7719c0229R3630q9189p7927j12089O2302r701q400J12394O1435j52686r6715Q2090
7707a65085R9595r3634q0597J38332J5917M8729l9262r3508J39270j1773j19519
7696a61535j4068J2193o5074Q2012R9419L6198j8659k5632o5201n4334R1962m1257
$$ y = [-105745, -235585, -180343, -205021, -182765, -33115, -23416, -142939, -257060, -221245, -223817, -141406, 33287, -5245, 22602, -185271, -268244, -311169, -149696, -53214, -4402, -56716, -87143, -88733, -148351, -222699, -144426, 33057, 111680, 47540, -126229, -229099, -187011, -161979, -88380, -833, 16641, 9343, 32279, -44938, -7377, 12500, -88508, -106852, -34501, -54145, -162884, -138234, -29487, 3093, -185627, -296182, -187832, -256131, -97143, -47079, -30229, 63401, -25788, -103715, -215804, -153502, -163203, -171603, -59209, 2226, -150460, -247175, -165085, -65490, -159124, -239721, -101389, -85472, -36743, -76005, -169513, -30243, -42016, -161535, -175603, -163410, -228484, -146472, -47053, -10855, -29514, -55146, -120347, -174681, -82719, -123976]
7684a23976N1413J07693J8372j81445J0585J01854j0707J0417k3521K1794m0811
7673e8332o4339k55359P7309K36231J24071M4398r2750j43755k6960L7365O3785
7662e8336L6939R4723n9077j83326q4558M0877L1268Q1992J04110N3865j47511
7651h9034j6289M8674q9795N8444l593J14521l5672r2454p0566Q1429R1749J9267
7639A6681n7993J7815o6061R523K8723j8891l5517J3833q824N1171M7641J2734
7627A0835j3531k7548k8454p6678Q8090j13522o7017J39589N1962k8253L1609
7616c2918j22404R1789o5949J15715J11735m4110j40299P4928o5034m7705j5383
7605a39635J3006R9727j4301l6005j0131j03797o9187N8602m675J34205P0902
$$ y = [-123976, -72563, 35130, 53502, -127943, -117358, -15504, -26211, -15794, -39315, -17521, -58332, -122671, -378030, -300721, -64490, 59581, 103979, 11229, -132526, -159486, -122121, -58336, -21397, 73326, 14249, -169077, -253635, -212758, -181490, -99498, 4612, 58477, -89034, -105323, -56649, -146444, -88000, -91593, 22928, -12744, -105198, -175764, -94335, -2586, 16681, -41312, -23497, -89558, -80035, -51312, -70203, -105720, -91887, -100711, -49540, -1899, 10835, -2696, -30244, -58698, -135376, -47286, -160808, -227825, -88236, -36274, -64527, -32918, -155322, -63533, -129482, -13767, 97968, 53858, -86441, -11513, -76547, -124252, -139635, -126629, -26902, -41203, -77208, -87339, -191136, -260323, -201721, -206396, -72191, -1289]
7594a289J20739j13947m2014L4730m9462K1919m468p098k7371o493Q3244O3380
7582G1870r903J40941p7252r7466p0958j3953J15724r200j0901k7556j2080j00247
7570a00981O7283m5168P5783K3517k6875o2114k4263P8840N9229J06136p5934
7559G5453j72711L5896m4878m459P0991K8236J49583o0880k7730l1136p7081o6121
7547a24837N5907J10823J00961j59056M9928o913j06274k0717q4311J61056k4206
7536d7639j25427m6569J07795j6305J15885J35560O4809j11368j13027m6262K2856
7525e9692O0252J07299q9837J2564M3550q1938l3014P7348M0507l8232q1630j95295
7513b38118R8180J6590m2016O7181k9242J32891n1737j3228k3688o0810j1907
$$ y = [-1289, 119450, 5503, -36511, -1781, -51243, -29324, -33792, -40890, -68261, -74754, 8490, 71870, 61967, 202908, 125656, 28190, -42768, -56721, 59003, 49803, 38902, 11346, -734, -100981, -33698, -78866, -3083, 20434, -6441, -68555, -92818, -13978, 45251, 151387, 75453, -97258, -61362, -106240, -110699, -39708, -11472, 138111, 77231, 49501, 18365, -58716, -124837, -68930, 41893, 142854, -16202, 33726, 26813, -79461, -100178, -184489, -23433, -47639, -173066, -219635, -111840, -128145, -12260, 123300, 188109, 76741, -36286, -82548, -59692, 560, 107859, 18022, 30586, 74136, -7802, -40816, 36532, 77039, 38807, -42823, -238118, -139938, -123348, -165364, -98183, -127425, 5466, -46271, -59499, -83187, -143997, -155904]
7502a55904K9676J15931J814k8343K6278Q1044M8731j6677q3030O1107K6549q4500
7490B2676j0110M2342J8665p4837L657L7320L1506j01893k123J82995K7270m5910
7478A31558o4883K0425n5882J00351j40530j37950N0501R1775L5002o7019k2701
7467e9353J40409N479n2807r0237K9691p8795m1146J09337l0467L7561P7602m4944
7455B330p4308N5847Q6661n1297P8241m6497o5882J9732p7455N0637K7199j0163
7443d955j927N7447j21657j4584J4704j6730r3528Q7665J08517o5409l129l0146
7431h3732J18445N155O3976j9135m0830q5048M6540J00956K673K11074j79064
7420A41010k09322p8583l2353N4732Q5991Q7058k6551r7343j5341j27768N2112
$$ y = [-155904, -126228, -10297, -8483, -36826, -10548, 70496, 119227, 102550, 19520, 80627, 107176, 22676, 12566, 54908, 73573, -1264, 2393, 39713, 71219, -30674, -32797, 150198, 177468, 131558, 66675, 87100, 31218, 131569, -8961, -146911, -96410, -4635, 30367, -36652, -59353, 81056, 86535, 33728, -56509, -26818, -105613, -146759, -37422, -67889, -30328, 47274, 2330, -71978, -16131, 70530, 19233, 97474, 50977, -14905, 4827, -72628, -21991, 5208, -4955, -6882, 50565, -71092, -85676, -70972, -87702, -181230, -93565, 14952, -50457, -53586, -83732, 34713, 39868, 103844, 84709, 43879, -41169, 5371, 106327, 109000, 320074, 141010, -68312, -146895, -179248, -124516, -38525, 48533, 21982, -75361, -90702, -218470, -166358]
7409a66358J15719K3274Q6646j24322j18192L0707J17978R1387P2051j58798j22479
7398a52387J02158r659N2678p2714P3877K7686p2933M2513j16166J04302J03520
7387H2875Q2267q5752j17432q6601j451J01029L6348k6835n8696l849j8528L6642
7375e9983l5152j8969J74182j1888J8545p8162l9572Q0630K125J8353N2084P719
7363A09912k2371j17685m6461J05726m2517p5695k8422N3617J5204k0818j44223
7352b13733P4736J71970Q361j35286j71242J35618P619L509J98804N1050j08667
7341B2739r5954k3830L661m103n2676N1371Q6804J0330j17661n016J26151O099
7329G915n2867K0513J11605P7855k83740l3019k7437J37072N0064j15137k1645
$$ y = [-166358, -50639, -27365, 59281, -65041, -183233, -152526, -34548, 56839, 128890, -29908, -152387, -50229, -59888, -7210, -79924, -6047, 21639, -51294, -8781, -124947, -20645, 82875, 165142, 79390, -38042, -124643, -126094, -25065, 11283, -15552, -74248, -78097, -96625, -59983, -95135, -114104, 60078, 48190, 66735, -11427, -50999, 29631, 31756, 50109, 102193, 109912, 87541, -30144, -76605, 29121, -13396, -89091, -117513, -63896, -48692, -69510, -213733, -138997, 32973, 41334, -93952, -265194, -129576, -121957, -118448, 80356, 131406, 22739, -73215, -97045, -93384, -97487, -150163, -98792, -11988, -1658, -119319, -124335, 1816, 7915, -44952, -24439, 87166, 165021, -118719, -151738, -179175, -42103, 7961, -107176, -128821]
7318a28821N6372j827j13793O2258J57708o1024j34321M9094p462R1452J01217
7307G0853q231J7106j1355m8228j86578J23172Q3640j2449r1683O6679l0794r8028
7295a25896J41918j6868j5871q0399Q2500m2455o6938M9114Q1466R4273M1024
7284A41868m3852j33094k13771N6257K0379Q5791J1855N9748j3222n1124j30931
7273b10096N9268N2166K2657Q265M2873M9044j1901q4828k1382Q1759J64720q1088
7261G1457j62797R5681q707l488j5217r5806l7221J24266o7292M8914M1812n8271
7249f6669M3449j3565M2280P1053l6765N2802p884Q9252N8554j06289j09277m759
7237A2182o209q6415k4806N2766L6490L839r1511O541k6802N8563o1631J5873
$$ y = [-128821, -72449, -74276, -188069, -125811, 31897, -29127, -163448, -114354, -121816, -30364, 70853, 62622, 79728, 68373, 20145, -166433, -43261, 40379, 27930, -63753, 2926, -27868, -125896, 16022, -846, -16717, -97116, -14616, -57071, -124009, -74895, 6571, 100844, 141868, 98016, -35078, -248849, -192592, -172213, -86422, -74567, -14819, -28041, -79165, -210096, -150828, -98662, -76005, -67740, -24867, 24177, 12276, -72552, -93934, -12175, 152545, 71457, -91340, 4341, -4366, -7854, -23071, -118877, -156098, -31832, -99124, -50210, -8398, -66669, -23220, -36785, 5495, 76548, 39783, 92585, 84701, 173953, 232507, 126218, 16941, 12182, 5973, -80442, -105248, -52482, -15992, -12153, -103664, -97123, -123925, -65362, -126993, -111120]
7225a11120P7020O201j6186K5919J21624J9337n1634l2517J7363n0285q4736R1922
7213A2908K3462O0214j06165j14869O1846J0714J42241q3176j27571M288k6044
7202a42152j179O4898m3371K3661M3257O9573j05642J26867k3407p6025J6385
7191d7135P4630p2027n7958Q3866J12568Q588p2327P8966j27827J9878j49566
7180a48344j36939J03917J54094Q7449j0284j21942P8170J6296j3409J49546M1376
7169A99930l6458p7238l3421m4956J27842J7807n0859P1039N5287r0835j9432
7158A18706j0146o7242P8140L1928j6948j26454M2314O6588R8419O3172Q2549
7147C61026j32448j06979O1465j9923n4024N4239J24022r934O141j11944p3268
$$ y = [-111120, -34100, -27899, -44085, -18166, 103458, 122795, 71161, 38644, 56007, 5722, -79014, 12908, 36370, 96584, -9581, -124450, -62604, -51890, 90351, 7175, -120396, -116108, -142152, -143331, -78433, -121804, -98143, -54886, 14687, -90955, 35912, 12505, -63520, -47135, 27495, -44532, -102490, -18624, 93944, 102532, 30205, 109171, -18656, 1222, -148344, -285283, -181366, -27272, 60177, 49893, -72049, 6121, 22417, 9008, 158554, 199930, 163472, 86234, 52813, 7857, 135699, 153506, 102647, 173686, 228973, 138138, 118706, 108560, 41318, 119458, 151386, 134438, 7984, 50298, 116886, 215305, 278477, 361026, 228578, 121599, 183064, 163141, 109117, 163356, 287378, 277444, 283585, 171641, 98373]
7136I8373l7442M4396J21174M6275n9840O8854j4881n6527J20868p6960m4642
7125B09648j1157N7036K2186N0413J4600J0390k3401q9272J2002P1609N5705m6387
7113C33372N3886m2549L2845O2864R1359O4396M5060M5494J01701k1692k6900
7102G39836n411J10660M4801O1186J4606J5374J10035k0005J03910J93356J94309
7091A562657K70629N9427J28631L83852M19329M92665O98642P86939J043015R40625
7081F786411Q31171P03985N1466p24500r96452j175284j113011q59778p39463
7072B764545k63892l35344k78721r0255k20652k27069j51717j55536j4061j8611
7062A008687p1628n1207r7162j5116q7358k34231m4883Q7999P8592o1220N4347
$$ y = [98373, 60931, 105327, 226501, 272776, 212936, 281790, 266909, 210382, 331250, 254290, 209648, 198491, 255527, 277713, 328126, 342726, 353116, 329715, 240443, 252445, 324054, 379759, 333372, 387258, 344709, 377554, 440418, 531777, 596173, 641233, 686727, 788428, 766736, 739836, 734425, 845085, 889886, 951072, 965678, 981052, 1091087, 1071082, 1174992, 1368348, 1562657, 1833286, 1892713, 2021344, 2405196, 2824525, 3317190, 4015832, 4802771, 5845786, 6786411, 7617582, 8321567, 8373033, 7648533, 6652081, 5476797, 4363786, 3504008, 2764545, 2500653, 2165309, 1886588, 1796333, 1575681, 1348612, 1196895, 1041359, 1027298, 1008687, 937059, 885852, 788690, 773574, 686216, 451985, 407102, 495101, 573693, 512473, 566820]
7051E66820m9228q8902K8375r299j35593j5288l9691n852M1356N9669j30240J1749
7039B33876q995N6022j44517k2733J7022O0667J20429N775j09138j08378L1991
7028A32021R5833n1791k2330J613N3422L4147P337M382n2836R9663r5336q3809
7016A22316l8760M0302n5082M609Q0555l2123M1239Q2869k43225l8806M9937Q879
7004B2710M671N7363j30475K8028J5788N5038J29257j35141K6178L1638n6907
6993D8148M2325k8949j09540l054J33859J31721o7257q387l3181j40979L9269
6982C975p9385Q0416L3012K9638o7600j01256J06169P5851M1012n2824L2928n9709
6970D2227j01583N7860K4641r5205p7666Q0275o0403k7326J25798J04869L1936
$$ y = [566820, 517592, 428690, 457065, 447766, 312173, 296885, 257194, 251342, 292698, 352367, 222127, 233876, 224881, 280903, 136386, 113653, 130675, 191342, 311771, 317546, 208408, 100030, 132021, 227854, 176063, 153733, 155346, 208768, 242915, 250252, 254634, 201798, 301461, 206125, 122316, 83556, 123858, 68776, 73385, 153940, 121817, 163056, 245925, 2700, -36106, 13831, 22710, 27381, 84744, -45731, -17703, -1915, 53123, 182380, 47239, 73417, 105055, 48148, 90473, 61524, -48016, -51070, 82789, 214510, 147253, 138866, 105685, -35294, 3975, -75410, 5006, 38018, 67656, 56, -101200, 4969, 80820, 121832, 69008, 101936, 42227, -59356, -1496, 23145, -72060, -149726, -69451, -129854, -157180, -31382, 73487, 105423]
6959A05423j48650l8116J00632Q0815m7818n4104J21769k023r1132j61448J02612
6948c2040J5719P7561N5530k8215o7252K6330m2858R651R6263P938J499j1151
6936A08975n6792r5896L707K4845J38101K1130j32598J4061R9542j06543l685
6925A4847p9748R4264P4470j37524J47072L2719j60144N2456k5781p796q7323
6914h2488k838M7899p5J19015M3067j37177q2231j038K5956K3402O375K7100P3015
6901E9982o3279L0103L6837K2494p8009P5811J6662m5181q1158K338j2752l8503
6889g4655L7872O6288K351j08262L4150J0391M7331J04313j4310j37331j71174
6878b03036R2693K03370j21344L565N2306j03823R098Q3033N0876k9495p6119
$$ y = [105423, -43227, -81343, 19289, 100104, 52286, -1818, 119951, 117928, 26796, -134652, -32040, -16321, 61240, 116770, 88555, 21303, 47633, 4775, 14426, 110689, 118627, 120126, 108975, 52183, -43713, -40006, -15161, 122940, 144070, 11472, 25533, 125075, 18532, 14847, -64901, 29363, 103833, -33691, 113381, 146100, -14044, 38412, 12631, 4835, -82488, -85326, -37427, -37502, 81513, 124580, -12597, -94828, -95866, -69910, -46508, -40133, -13033, 59982, -3297, 26806, 63643, 86137, 8128, 83939, 100601, 55420, -25738, -23400, -36152, -74655, -36783, 29505, 31856, -76406, -42256, -31865, 15466, 119779, 105469, -31862, -203036, -110343, 93027, -28317, -24752, 27554, -76269, -67171, 15862, 66738, 37243, -38876]
6867c8876q793j1622J49163r5995J9803K6935n7998J06878R1264l4176m8055q953
6855H9575k5763l4259l2009J44322j21336J0139O7101j2372L8074j572q6340K5045
6843F0605Q776p603j06319l199M7552k7084O2308k0160j81959k8746J8394l5046
6831b12481P0277M4285l023P6465K1031j58553J12913O2807k1911k2830J6454
6820a4566j02032J02953m0807L153J90701J25859j05836j61502l7427N1717N726
6809A7939m2225l0879L7154L9132L8261l4502M6776Q3456K0082r4262O135k0654
6797F6413J1376O9996r0268K7204m3351o7539m4924o8732O6591J56966J3421K5818
6785A22971j9747j12078j34525R8094J35762J25221O5444j2062n7091K9968l1855
$$ y = [-38876, -47669, -59291, 89872, -6123, 13680, 40615, -17383, 89495, 180759, 146583, 98528, 89575, 63812, 29553, -2456, 141866, 20530, 30669, 97770, 85398, 123472, 121900, 35560, 60605, 69381, 61778, -44541, -47740, -188, -27272, 35036, 14876, -167083, -195829, -177435, -212481, -142204, -97919, -100942, -24477, -3446, -161999, -49086, 13721, -8190, -31020, -14566, -116598, -13645, -54452, -51299, 139402, 265261, 159425, -2077, -39504, 12213, 17939, -24286, -55165, -18011, 21121, 59382, 24880, 71656, 155112, 175194, 80932, 87067, 66413, 77789, 147785, 57517, 84721, 41370, -26169, -71093, -139825, -73234, 83732, 97153, 122971, 103224, -8854, -143379, -45285, 90477, 215698, 281142, 269080, 211989, 241957, 210102]
6774B10102m2297m9609K894Q845j0119j8719R7043J7196j54509J07754J26745
6763B95326j70554n0531L9546j0587q100K9448o7320L3371p6170q9032J9097N9995
6751D489j214o7228J0297l1123K4532N5472m1446J55778J07199j39622p1253j5059
6739i178M005N5527J35352J1694j23590j37186P419k6921m6271L614L3249J42962
6727E0676J34692n2191j3422l8970K03Q4503r030j67524k2521q9376J3200J27928
6715A8168Q4566M2255N3055j70195L9398q2648M4859J1255N7804l3901k5405O7974
6703A07185j84894N8137J1816k8258J38731j13866M4585n387Q7740N5485q6027
6692H5247l4692m9100N4176j77362J99725J30592k9185m8328L7434o0771j39616
$$ y = [210102, 167805, 118196, 121090, 129935, 119816, 101097, 198140, 215336, 60827, 168581, 295326, 124772, 74241, 113787, 103200, 95100, 124548, 57228, 90599, 14429, -74603, -55506, 4489, 3275, -63953, -53656, -84779, -60247, -4775, -46221, 109557, 216756, 77134, 5881, -9178, -5173, 50354, 185706, 197400, 73810, -63376, -55957, -82878, -129149, -125535, -92286, 50676, 185368, 133177, 119755, 80785, 80988, 165491, 156461, -11063, -33584, -122960, -109760, 18168, 102734, 144989, 198044, 27849, 67247, -15401, 29458, 40713, 98517, 64616, 39211, 107185, -77709, -19572, -7756, -36014, 102717, -11149, 33436, 28049, 115789, 171274, 85247, 50555, 1455, 55631, -121731, 77994, 208586, 179401, 131073, 168507, 107736, -31880]
6681c1880O1280P5945r121k5609j23913M25m2782o5100R0039L7935N968N1315
6669B4502k4305o4084k26036K17286M3675M8076Q1002J3118j90144j7176M5231
6658d8855L7768R9993j2400J45286o4673J1718q3760o2900m9839M1746Q7583p5717
6646B5950N346j8451P9510N2214m043j02957M574n2134o9824M2589J2049p956
6634c3133p9682k0700n7920K9705N2044O944O9219J8812P42M0326o8763n4180
6622i6586j18708M3216j7172J05883O9676M7804m8514R3020J00895O1334r1453
6611A49395l0394j13302n5507L9096J39606P88o8971J3296j53584O2776m5809
6600f2610J1918m9432l0970O2841l9968j19049L2722Q0973K6010j03326N1450
$$ y = [-31880, 29400, 105345, 96224, 70615, -53298, -52873, -95655, -160755, -70716, -32781, -26813, 24502, 197, -63887, -289923, -72637, -28962, 19114, 100116, 113234, -76910, -94086, -48855, -11087, 88906, 76506, 221792, 157119, 168837, 85077, 22177, -27662, 14084, 101667, 25950, 31296, 12845, 92355, 144569, 140526, 37569, 42143, -9991, -79815, -37226, -25177, -33133, -112815, -133515, -191435, -161730, -109686, -102742, -33523, -14711, -13969, 26357, -42406, -96586, -215294, -172078, -189250, -83367, -13691, 34113, -14401, 78619, 179514, 240848, 149395, 119001, 5699, -49808, -10712, 128894, 129682, 60711, 74007, -79577, -16801, -62610, -50692, -100124, -131094, -68253, -108221, -227270, -194548, -113575, -87565, -190891, -139441]
6589a39441P7111l7630m184O2307J0351J59860r0886m9398p5015N3729n0898p477
6577i1571K21201L0619j52004J5084j22809R5331J0811m7690N2742j34808J60236
6566C7142r3014m2496J41677k0093j26076m8975r8618R0012J90115J70991j9564
6555A81101n9090k00153p6867m5739K57407J16344o289n0915J2397N9127M415
6544A91738O090j07528J3557j12891M3842o729q5735j35894J24686J10016Q0520
6533A21672L4374j26882n2182J2291l3316K5330J55843K167j43923J6752Q7891
6522A00017j01356P546R4349J25596K1240l1926j12761m1286k5225p519L1747
6511F0422N3295j15382J3009j4795P9996N5377M1120q5911r4399Q583j27102K6162
$$ y = [-139441, -62330, -99960, -104144, -41837, -31486, 128374, 37488, -11910, -86925, -33196, -84094, -91571, 129630, 160249, 8245, 23329, -99480, -4149, 6662, -41028, 11714, -123094, 37142, -55872, -98368, 43309, 23216, -102860, -151835, -250453, -160441, 29674, 200665, 181101, 122011, -78142, -155009, -200748, 56659, 173003, 166714, 115799, 128196, 187323, 191738, 197828, 90300, 103857, -9034, 34808, 28079, -57656, -193550, -68864, 41152, 121672, 156046, 29164, -23018, -10727, -44043, -18713, 137130, 139297, -4626, 12126, 100017, -1339, 6207, 100556, 226152, 247392, 215466, 102705, 61419, 36194, 28675, 60422, 113717, -1665, 11344, -3451, 76545, 131922, 173042, 87131, -7268, 1315, -125787, -99625]
6499i9625J61196n5280L821R2501O0498j25495j46254n8368J87067J32676m0084
6488A12653R6172j53920o3109N7518P5984L9665J8242p1506j01592R2714m1120
6477F1701m6867P7227n8070l547r6036n6340j3387L0710P5071R6382q0075m0431
6465e3662j6697L282J46595l6166j39148n9994L8799K0774k2673R9876N0130J1694
6453D2810o6642k3q995j9145l65j6246Q3707r4157q6554J16509j39925j620J3927
6440a76719J07172p4793K6942N5619n0586Q3647M5892q708J1674J5150L7063O2089
6428A34442j26898j02038n2969l3812J21064k002O1273J02822j14090j13794K9609
6417i6393p695O836r244p5157O5887j2531O0366J0423j9282j8626M8453J16080
$$ y = [-99625, 61571, 6291, 10112, 102613, 163111, 37616, -108638, -167006, 20061, 152737, 112653, 208825, 54905, -8204, 49314, 125298, 164963, 183205, 111699, 10107, 102821, 61701, 14834, 92061, 33991, 30444, -65592, -121932, -135319, -104609, -29538, 66844, -13231, -53662, -70359, -67077, 79518, 43352, -95796, -155790, -116991, -96217, -118890, -19014, 31116, 42810, -23832, -23855, -32850, -51995, -52360, -68606, 15101, -79056, -165610, -49101, -189026, -190646, -176719, -69547, -144340, -117398, -61779, -112365, -28718, 17174, 8466, 20140, 35290, 72353, 134442, 7544, -94494, -147463, -181275, -60211, -62213, -940, 101882, -12208, -126002, -96393, -104088, -97252, -106496, -181653, -115766, -128297, -67931, -57508, -76790, -95416, -46963, 69117]
6405F9117p8308L079L8462Q8089j24104q3384L1507J01041P2751m7166p8122j06916
6393a13954L5317M9137m607r6095l0126J77068R3310j29470L4363R562M1161o5569
6381I7Q8652o6276o2912q4318J09487M3980M5329Q6709j18583R4360M877j16691
6369B4711K6460O01M7750k8742q7888R4843j7711j22687O1007Q8318l073o4973
6357A8616r6602P2575o704J82486n728k7633n363n5086j8025q8298j330O2809
6345C1717L0955p4470J493L1608M1357K5962L8891J25534J9164j66403r4475k7323
6333a5990J52966q6628J22567N5181j49800j16832J970N5786j834J20693j21018
6322A7061k0896J08992m590p8289N0356J087o2546J00672j19771q7027K07629
$$ y = [69117, -9191, -6112, 32350, 120439, -3665, -87049, -55542, 45499, 118250, 71084, -7038, -113954, -78637, -29500, -34107, -130202, -160328, 16740, 110050, -19420, 14943, 24505, 65666, 97, 88749, 22473, -40439, -124757, -15270, 28710, 74039, 160748, 42165, 136525, 141402, 24711, 51171, 51772, 99522, 70780, -17108, 77735, 60024, -62663, -1656, 86662, 83589, 18616, -77986, -5411, -12115, 170371, 164643, 137010, 131647, 76561, 58536, -29762, -31092, 31717, 62672, -11798, -10305, 21303, 62660, 88622, 127513, 253047, 272211, 105808, 11333, -15990, 136976, 50348, 172915, 228096, 78296, -38536, -36566, 19220, 17386, 138079, 17061, -3835, 105157, 100567, 22278, 72634, 73721, 11175, 111847, -7924, -94951, 112678]
6311A12678O1342L0153p2886o5228k7994m2479P7407J14233P1257k9757n7103
6300A71623o9259m4078q6293P9010J52219K0685n9984p7712l5342o0310j38551
6289a47992N6537K5458R0869O6417j24413J5755o4154J48163K27903N8371j44036
6278B08878j90981k555P744J64297J02501j41234o9707k2723l8470L5730L9289
6267I2769k8254J04552o3685j8662N6222n5215p4296L0669R5618O2474R9105p3641
6255B27656o3393j33538N1454J22664L8688k7485m9420q7810j83954J74875n3648
6244A6089O2691K7495p3721m6510L5663J9994O2597R8962k8417o3885j94438J75498
6232I2018j0455L0687K9984O2269j74644l4296J43520j55386J10874J23432j13668
$$ y = [112678, 174020, 204173, 131287, 66059, 38065, -4414, 72993, 187226, 258483, 228726, 171623, 102364, 58286, -28007, 51003, 203222, 223907, 163923, 86211, 50869, -9441, -147992, -91455, -65997, 24872, 91289, -33124, -17369, -81523, 66640, 294543, 352914, 208878, 17897, 15342, 23086, 187383, 289884, 148650, 78943, 56220, 17750, 53480, 92769, 64515, 169067, 105382, 86720, 142942, 87727, 13431, 44100, 139718, 202192, 301297, 227656, 164263, 30725, 82179, 204843, 243531, 216046, 166626, 78816, -105138, 69737, 16089, 78780, 106275, 32554, -13956, 21707, 41701, 104298, 203260, 174843, 110958, -83480, 92018, 81563, 112250, 142234, 204503, 29859, -4437, 139083, -16303, 94571, 218003, 104335]
6221A04335j6885j5391n7580P4113R5944k9063o6992J20977m2325j29845m5403
6210h115Q7811M4599J08573L3326K5487l5408n326k5948M7515O8938q6423j40414
6198A14615l5378P5241M5708k864M6168K8621m7867j80984m1423m706J04581M1913
6186A43625O8877p9616j8926l9570l6071L1142J0046R2060r5946j0862j83114
6175a18355L3J14101N6042J10140n642j22816R5572n7562K4054L1998k3931R5487
6163A99121N298p2464r439J53505J17785p1513n6858m0259r0077j70089J22011
6152H7021K51519r4553j00459K0739k1065j16331l8756N4695O0267N7696q801
6141A51972j453p7949K3382J12488J33636q6802j37201P24J0300n265M7060J08205
$$ y = [104335, 87450, 72059, 14479, 88592, 184536, 155473, 88481, 209458, 167133, 37288, -8115, 79696, 124295, 232868, 266194, 291681, 256273, 250947, 224999, 272514, 341452, 255029, 114615, 79237, 154478, 200186, 197322, 243490, 272111, 224244, 43260, 1837, -2869, 101712, 143625, 212502, 132886, 113960, 74390, 38319, 69461, 79507, 171567, 75621, 64759, -118355, -118322, -4221, 51821, 161961, 156319, 33503, 129075, 71513, 95567, 127565, 103634, 199121, 204419, 131955, 122516, 276021, 393806, 322293, 265435, 225176, 135099, -34990, 87021, 338540, 243987, 143528, 164267, 143202, 26871, -11885, 42810, 103077, 160773, 151972, 150519, 72570, 95952, 208440, 342076, 255274, 118073, 118797, 129097, 123832, 170892, 279097]
6129B79097Q3548J3759q5868p0190J04556J4099K963O3229j07636J5829J3535
6118C26921j20094M1418L8295q459j6907k9811L9078j25940M2922J20090J05036
6107D12549M0338j866j31872j670O6443j5646J2719O1170J19404j5579o3598j39799
6095C42593J5731n5134P3981l6862j4697n5172k54J35787N7037j1904M5909K0117
6083E17132o0091p5843l9447N102M7402O2584j6023P326L7782o6674J03942P143
6071E30335q5975J73726P5963l112j95944m2778J11106J78055m8796j79186K8525
6060E41919M6542N5994J2625n1437J60143J0775r3111j82046J06102J07964J19914
6049H35384l4931p2517N7940O5581J0012Q7414J18728J30369n0525j07550N7987
$$ y = [279097, 362645, 376404, 290536, 220346, 324902, 339001, 341964, 405193, 297557, 313386, 326921, 206827, 248245, 286540, 278081, 261174, 231363, 270441, 144501, 187423, 307513, 412549, 452887, 451021, 319149, 317479, 383922, 368276, 380995, 442165, 561569, 545990, 482392, 342593, 358324, 303190, 377171, 340309, 325612, 270440, 270186, 405973, 463010, 451106, 497015, 517132, 457041, 381198, 341751, 346853, 394255, 456839, 440816, 448142, 485924, 419250, 523192, 530335, 444360, 618086, 694049, 690937, 494993, 452215, 563321, 741376, 692580, 513394, 541919, 588461, 644455, 657080, 605643, 765786, 776561, 683450, 501404, 607506, 715470, 835384, 800453, 727936, 785876, 851457, 861469, 948883, 1067611, 1197980, 1147455, 1039905, 1097892]
6038A097892k00114J53095Q6210Q8860M0693Q0j37359j6993J27863l9773j01931
6027A098523j04344j77010j8767k6362J11410M6123l8741N5759r623O4196L2493
6016A033657N8509J37413J20419J20826n0686o9890o2361p0936J43052Q8046N7864
6005A505913m6652O4407o5797q4804k12771Q9899J23277R844r7382j27862j21911
5994A036161J2292O3944q5565N7836K7447J8693J8362M442L6443J08541O4477
5983A363073L0634M1530j13775J0508J76243j44799O7632J71239N6301j43265
5973A515321m2339J27828n3968N7126M0144j65979j17247K0437M6636j0006K8247
5962A446200m5792j6526M3013j60286J17110L2992o5785j2901k5272Q8023K6712
$$ y = [1097892, 897778, 1050873, 1137083, 1225943, 1266636, 1266716, 1129357, 1112364, 1240227, 1200454, 1098523, 994179, 817169, 798402, 772040, 883450, 929573, 890832, 946591, 936968, 1001164, 1033657, 1092166, 1229579, 1349998, 1470824, 1420138, 1350248, 1287887, 1216951, 1360003, 1448049, 1505913, 1459261, 1523668, 1457871, 1373067, 1160296, 1250195, 1373472, 1383316, 1285934, 1158072, 1036161, 1048453, 1112397, 1026832, 1084668, 1112115, 1130808, 1149170, 1153612, 1190055, 1298596, 1363073, 1393707, 1435237, 1321462, 1331970, 1508213, 1363414, 1431046, 1602285, 1658586, 1515321, 1472982, 1600810, 1546842, 1603968, 1644112, 1478133, 1360886, 1381323, 1427959, 1417953, 1446200, 1400408, 1383882, 1426895, 1266609, 1383719, 1416711, 1350926, 1338025, 1312753, 1400776, 1427488]
5951A427488P404M8603N6794Q014K9214N8531m5149N3632l4792L8597Q8055p7502
5939A658889r005J07115K2254P7183J03222Q1272J6902N7946M0311J5331L8141
5928B209561R3956J99104J50713K17899J26639K53542L54283R2484j45990o8222
5918C483969k81005l37651k08892j15712J7582o8688l6790j40536j41712J7298
5908B187863l4424J36642J15322J16838L9940J00182q2311n8659O6912J07035
5898B695340L64974L39457L59516L72608M45921N02462Q49091J112001P87388
5889G828758M51874l52360j080376j122775p51799n37069l62391m07836l35004
5880C331022k65462k34976K0474j7730j43554r673R9774j40150k3203j4455J30921
$$ y = [1427488, 1434892, 1483495, 1540289, 1548303, 1577517, 1636048, 1590899, 1644531, 1609739, 1648336, 1736391, 1658889, 1649884, 1756999, 1779253, 1856436, 1959658, 2040930, 2057832, 2115778, 2156089, 2171420, 2209561, 2303517, 2502621, 2653334, 2871233, 2997872, 3251414, 3605697, 3698181, 3552191, 3483969, 3202964, 2865313, 2656421, 2540709, 2558291, 2489603, 2452813, 2312277, 2170565, 2187863, 2153439, 2290081, 2405403, 2522241, 2562181, 2662363, 2580052, 2521393, 2588305, 2695340, 3060314, 3399771, 3759287, 4131895, 4577816, 5080278, 5929369, 7041370, 7828758, 8280632, 7928272, 6847896, 5725121, 4973322, 4436253, 4073862, 3666026, 3331022, 3065560, 2830584, 2851058, 2833328, 2689774, 2680101, 2779875, 2639725, 2616522, 2602067, 2732988]
5869B732988K11897Q0929J52268K9341K76420K48177L46009M14104Q23720P86289
5859F102142Q32537Q79834L35456n13070j192908q78904p71566o24515m48968
5850C720038n06720k18128j50420j18754n0872j93877j58550k28420o235Q182
5840B096244j6831r8665m787J47356o3971o5436J96453l9539O1283J33692J73888
5829B519687J11705J96043K75028L87322R4091o1527k64087n17648k57947l17925
5819B164742j60576j97550r1518M5668Q3279q6748o4521M2471L8136J02439Q6495
5808A962317J22529j3303r5603J83660M3187L0946j1764r5721o3530m2198J16991
5797B137511R2603p443j44181r6172j29039k40956k0159n146q7305l6474j62746
$$ y = [2732988, 2944885, 3025814, 3178082, 3207423, 3483843, 3732020, 4078029, 4492133, 5315853, 6102142, 6934679, 7814513, 8149969, 7636899, 6443991, 5565087, 4793521, 4169006, 3720038, 3213318, 2995190, 2844770, 2726016, 2675144, 2481267, 2322717, 2094297, 2088062, 2096244, 2079413, 1980748, 1975961, 2123317, 2059346, 1993910, 2190363, 2150824, 2212107, 2345799, 2519687, 2631392, 2827435, 3102463, 3489785, 3583876, 3522349, 3258262, 2740614, 2482667, 2164742, 2004166, 1806616, 1715098, 1760766, 1844045, 1757297, 1692776, 1735247, 1773383, 1875822, 1962317, 2084846, 2071543, 1975940, 2159600, 2202787, 2233733, 2221969, 2126248, 2062718, 2020520, 2137511, 2230114, 2222671, 2078490, 1982318, 1853279, 1612323, 1592164, 1587018, 1499713, 1463239, 1300493]
5786A300493q9762O805L1929n0337N7695k1710n9257m4178r539P2540R8600O7797
5774A361076p7668p06j91143l7239P3598M8439J04429P4448J12746j16626m0192
5763A311162J1630J39076K38542K27000J28532R4687k6001K8481J4583J68034
5753B335726J4573m4013j7799j43518M1132J67537o0282l0360j46866k47741r7665
5742A770724j17718j12488k3480K1474J3406j03352j87462j10678M7425o6865
5732A130986m4574N9351J26960k7493n5826N0913m5722q4087N4312N4704j12599
5721A106925J48346n8795O017O5541l2439O9249r935j16627m0597K7598N4771
5710A220054Q362L7829J04717r9590j68373j38589J05323K15304j11048J75938
$$ y = [1300493, 1210731, 1217536, 1249465, 1199128, 1256823, 1235113, 1175856, 1131678, 1122139, 1194679, 1293279, 1361076, 1283408, 1282702, 1091559, 1054320, 1127918, 1176357, 1280786, 1355234, 1467980, 1351354, 1311162, 1322792, 1461868, 1700410, 1927410, 2055942, 2150629, 2124628, 2153109, 2167692, 2335726, 2350299, 2306286, 2288487, 2144969, 2186101, 2353638, 2293356, 2262996, 2116130, 1868389, 1770724, 1653006, 1540518, 1517038, 1538512, 1551918, 1448566, 1261104, 1150426, 1197851, 1130986, 1086412, 1145763, 1272723, 1245230, 1189404, 1240317, 1194595, 1110508, 1164820, 1219524, 1106925, 1255271, 1196476, 1202493, 1268034, 1235595, 1304844, 1294909, 1178282, 1137685, 1165283, 1220054, 1228416, 1266245, 1370962, 1271372, 1102999, 964410, 1069733, 1285037, 1173989, 1349927]
5700A349927M1221j72747J3973L8291P6673J22251o2862k2900j34792K4187L4163
5689A307385P7494J98536J07757j12617j17139j25593Q7099J2966M5682Q7896
5679A569466n0447r7726O2834m4q0616J38011J54512K3721j41449j09625l44q0393
5667A387900K00082M0484o3447m9631L412M1982R8675M2615J28713j6025j47153
5656A667607J1664L2125L1211R0967J52223j604R529Q7641J7274j8092J09143
5645B189688r6577J38460j9066j5226k2519J927L3496J14685L0147J3000j08652
5634B259363p0283j3771Q1321J77955m2690L055P698j25703M0683m7717O9558
5623B339469Q4108M3885o8360q71j31856k0999K8641J22357o8339m4770P8731
$$ y = [1349927, 1391148, 1218401, 1232374, 1270665, 1347338, 1469589, 1406727, 1383827, 1249035, 1273222, 1307385, 1384879, 1583415, 1691172, 1578555, 1461416, 1335823, 1422922, 1435888, 1481570, 1569466, 1519019, 1421293, 1484127, 1484083, 1403467, 1541478, 1695990, 1719711, 1578262, 1468637, 1468293, 1387900, 1587982, 1628466, 1565019, 1515388, 1518800, 1560782, 1659457, 1702072, 1830785, 1814760, 1667607, 1679271, 1711396, 1742607, 1833574, 1985797, 1984193, 1993722, 2081363, 2098637, 2080545, 2189688, 2093111, 2231571, 2212505, 2197279, 2174760, 2176687, 2210183, 2324868, 2355015, 2368015, 2259363, 2189080, 2175309, 2256630, 2434585, 2391895, 2394950, 2402648, 2276945, 2317628, 2269911, 2339469, 2423577, 2467462, 2399102, 2398231, 2266375, 2245376, 2274017, 2396374, 2328035, 2283265, 2361996]
5612B361996k7844M0167Q3381K02687J08817N6292j71733j7954K6947l481o5559
5601B593716O0553J30176m5402R8352J19752o7652J0235R8642J942q1180O9969
5590B989103j6571K28567K97809J29402J96891J44784R3738o5348J27733K54581
5580D380689Q3721N6331K84410L50637K27362L39235L99935O23827P46062Q60351
5570H352560P38032O81465L79288R2644L0204n76000q04133q31805m76967k49429
5560G335859p5964L2927K35519J16127K55433L50731L83424P92442J184956J479250
5550A2090704J384489R02799k321q69593j525786j563336j083477q06591p88084
5541G738804o64097o42916m67995j54021j58117j89886j87101l09293j82507j48267
$$ y = [2361996, 2334152, 2374319, 2457700, 2660387, 2769204, 2825496, 2653763, 2635809, 2662756, 2659275, 2593716, 2654269, 2784445, 2739043, 2837395, 2957147, 2889495, 2899730, 2998372, 3000314, 2919134, 2989103, 2972532, 3201099, 3498908, 3628310, 3825201, 3969985, 4063723, 3998375, 4126108, 4380689, 4464410, 4520741, 4805151, 5155788, 5383150, 5722385, 6122320, 6746147, 7492209, 8352560, 9090592, 9772057, 10151345, 10243989, 10274193, 9698193, 8894060, 8062255, 7585288, 7335859, 7259895, 7292822, 7528341, 7644468, 7899901, 8250632, 8634056, 9426498, 10611454, 12090704, 13475193, 14377992, 14375671, 13506078, 11980292, 10416956, 9333479, 8526888, 7738804, 7074707, 6431791, 5963796, 5809775, 5651658, 5461772, 5274671, 4965378, 4782871, 4634604]
5531D634604K4600j6630J7008m020p4131r5339P7245J44270J19420R5161Q6593
5520E008781j01020l97227l80573j53295q9886n231j29778k1268l4063j90820
5510C505620m7193r2270r931J04636K4130M1582l916J20651J7315R5670J39569
5499C895863l8287N9249j9276r3760k86683l0865J71469l7340m7194j1728k7414
5488C534034J2341j0549J80578O5707J22608M6958J30589J32631J14876J78054
5478D507827K42058J55191J37363K34882M20006K95772K48476M000j10756j18666
5468F016153j67991o3480l8847M0081R1372R2780J1765k4632j73053k9604M6128
5457E800672j32134K507K58634J26111J87924K09626L82655m5814j66321l28648
$$ y = [4634604, 4659204, 4642574, 4659582, 4655562, 4581431, 4486092, 4563337, 4707607, 4827027, 4922188, 5008781, 4907761, 4510534, 4129961, 3976666, 3886780, 3881549, 3751771, 3730503, 3696440, 3505620, 3458427, 3366157, 3356226, 3460862, 3484992, 3526574, 3522658, 3643309, 3660624, 3756294, 3895863, 3857576, 3916825, 3897549, 3803789, 3517106, 3486241, 3657710, 3620370, 3573176, 3561448, 3534034, 3546375, 3535826, 3716404, 3782111, 3904719, 3951677, 4082266, 4214897, 4329773, 4507827, 4749885, 4905076, 5042439, 5277321, 5697327, 5993099, 6241575, 6245575, 6134819, 6016153, 5848162, 5784682, 5745835, 5785916, 5877288, 5970068, 5981833, 5957201, 5784148, 5754544, 5800672, 5668538, 5671045, 5929679, 6055790, 6243714, 6453340, 6835995, 6790181, 6623860, 6295212]
5447F295212l38445j86222j59131k9037K8909L6069J35549O7825L1789O0156l0522
5436E912152j33314j32936j43366o6409j41312q5028p2491j17888J44255J24414
5426E288077r1622q4590r2858J25903L3508J06351J19749k6864k6858j71804j31195
5415E047797j36596M1782q7908p4515K0429j29913N479K10439J24160N5667n6127
5404E020694J99003J93762N4490P9062K10144J77799K41159J44713K92553J22366
5394F735745K20673K67478r7686j60663k65725j59303N5045p9688J67831J63412
5384F847119L0871J84653J23968Q9841J96948K81771M64682O11777N90443M56666
5374I878739M98503P14237O29635Q13007J049360R43340Q20560J0651n97809n39073
$$ y = [6295212, 5956767, 5770545, 5611414, 5582377, 5611286, 5647355, 5782904, 5850729, 5882518, 5942674, 5912152, 5778838, 5645902, 5502536, 5436127, 5294815, 5209787, 5137296, 5019408, 5163663, 5288077, 5196455, 5111865, 5019007, 5144910, 5178418, 5284769, 5404518, 5377654, 5350796, 5178992, 5047797, 4911201, 4952983, 4865075, 4790560, 4810989, 4681076, 4686555, 4896994, 5021154, 5076821, 5020694, 5219697, 5413459, 5467949, 5547011, 5757155, 5934954, 6176113, 6320826, 6613379, 6735745, 6956418, 7223896, 7126210, 6965547, 6699822, 6540519, 6595564, 6515876, 6683707, 6847119, 6877990, 7062643, 7186611, 7276452, 7473400, 7755171, 8219853, 8831630, 9422073, 9878739, 10377242, 11091479, 11721114, 12534121, 13583481, 14526821, 15347381, 15358032, 14760223, 14221150]
5364A4221150p39336n69938n15517l29286k19762N2214J61182L53299M35850O29189
5354A3479045P74949P22229P52522Q17512R16480J517544K077388J997836J812897
5345B4868402J055182K67061j4318K2859j94075k99571r65441j446333j667269
5336B1626497j345251j035053o10729j51547r5517K78683N96890Q31100R54501
5327B1049574R77416Q25524O78003P37285J349626J972306K527549K412099J540654
5318C4070036K12064j070715j859205j867980j614519j321255j437043j499888
5310B3611495j495017j372866r15580p05632j91943N8309L05167N66508P72968
5301B0633409Q30762O00112Q30352P32292K81385j00179m7209N61269J225815
$$ y = [14221150, 13481814, 12911876, 12396359, 12067073, 11847311, 11899525, 12060707, 12414006, 12849856, 13479045, 14253994, 14976223, 15728745, 16546257, 17462737, 18980281, 21057669, 23055505, 24868402, 25923584, 26190645, 26176327, 26199186, 26005111, 25705540, 24740099, 23293766, 21626497, 20281246, 19246193, 18635464, 18483917, 18388400, 18667083, 19263973, 20095073, 21049574, 22026990, 22852514, 23530517, 24267802, 25617428, 27589734, 30117283, 32529382, 34070036, 34282100, 33211385, 31352180, 29484200, 27869681, 26548426, 25111383, 23611495, 22116478, 20743612, 19828032, 19122400, 18930457, 18988766, 19293933, 19860441, 20633409, 21464171, 22064283, 22894635, 23626927, 23908312, 23808133, 23760924, 24322193, 25548008]
5292B5548008J139148M30957n44077j872272k425167j980583j511512j152144
5284A7632358p11355n77372o13703l23927l71019j57734M0404O7095M79917O17479
5274A6082143O37541P63782Q04810Q19369N77237l28590q28527q82563o58127
5265A6987075l43427m3777j42040J30695J08336j8376r3050j49175j83496M2720
5255A6295485L11070M04774K75432K42860K80184K12857L04048L93282K13824
5246A8933816j6637j2073j4366J62727L44017N51231N83092N83754N80756L90134
5236B2086451N34417N84984O70986Q01847Q35299R78663O95715Q01210Q63856
5227B8853428J025885J006686J292354J529439J504032J756578J999027K311635
$$ y = [25548008, 26687156, 27118113, 26574036, 24701764, 22276597, 20296014, 18784502, 17632358, 16921003, 16343631, 15729928, 15406001, 15034982, 14877248, 14917652, 14984747, 15464664, 16082143, 16719684, 17483466, 18288276, 19107645, 19684882, 19356292, 18527765, 17645202, 16987075, 16643648, 16599871, 16457831, 16588526, 16696862, 16678486, 16585436, 16436261, 16252765, 16295485, 16606555, 17011329, 17286761, 17529621, 17809805, 18022662, 18326710, 18719992, 18933816, 18917179, 18905106, 18890740, 19053467, 19397484, 19948715, 20531807, 21115561, 21696317, 22086451, 22620868, 23205852, 23876838, 24678685, 25513984, 26492647, 27188362, 27989572, 28853428, 29879313, 30885999, 32178353, 33707792, 35211824, 36968402, 38967429, 41279064]
5219D1279064K669003K791621L105975L411758M422509N677874P038232Q341789
5211G8737825R616228J1406270J4738939K0062083K7188557L3841654L6170606
5204B31762162K9051870J1573331j4449324l4753093l6850381k9417066k1192096
5197A35725403j5226118j1273501q643285o049009m145439k796326j434052k30985
5189H5926688J573092L846131O357627R477850J2567303J4565541J4270571J1297257
5181A59882060O411216L3813m697773p895062j1768539j3616108j3116288j1392143
5173A03841176j0131796r807639r216637q220764o713264n236414m146930l532310
5165D6835422k831784k557040k314251j889681j493932j218506r66180r06295
$$ y = [41279064, 43948067, 46739688, 49845663, 53257421, 57679930, 63357804, 70396036, 78737825, 88354053, 99760323, 114499262, 134561345, 161749902, 195591556, 231762162, 260814032, 272387363, 257938039, 223184946, 186334565, 156917499, 135725403, 120499285, 109225784, 100582499, 94533490, 90388051, 87591725, 86157673, 85926688, 87499780, 91345911, 97703538, 107181388, 119748691, 134314232, 148584803, 159882060, 166293276, 166327089, 161629316, 153734254, 141965715, 128349607, 115233319, 103841176, 93709380, 83901741, 74685104, 66464340, 59751076, 54514662, 50367732, 46835422, 44003638, 41446598, 39132347, 37242666, 35748734, 34530228, 33564048, 32657753]
5157C2657753j108993j105342j079760r49821r50202r75651j199571j081197j061301
5148B3145915p53414n62096l21671l17220j83070O8635L39642O88945R66901J133048
5138B4205615Q72426l6660j069941j360435j371611j110632p94364p40082p89228
5129A7805088r87654q57659o01664o72271n06913l57347l06002m39337l70725
5120A2705516j03677m0014j7850j5194K7434K9593L84855L84175N59386N02020
5110A4416244K87294j05666k42933j93754k39082m39320r84672j031597p65080
5101A0701434p16933o80892m67521m22734j52433j81707k71142k28957j38681
5092G440434p8019K7014j24703j56382j40523j27082k50934k24287j18181j14880
$$ y = [32657753, 31548760, 30443418, 29363658, 28413837, 27463635, 26487984, 25288413, 24207216, 23145915, 22392501, 21830405, 21508734, 21191514, 21008444, 21077079, 21416721, 22105666, 23072567, 24205615, 25078041, 25041381, 23971440, 22611005, 21239394, 20128762, 19334398, 18594316, 17805088, 16817434, 15959775, 15358111, 14685840, 14178927, 13821580, 13515578, 13076241, 12705516, 12601839, 12561825, 12543975, 12528781, 12556215, 12585808, 12970663, 13354838, 13914224, 14416244, 14703538, 14597872, 14354939, 14161185, 13922103, 13482783, 12498111, 11466514, 10701434, 9984501, 9303609, 8836088, 8413354, 8260921, 8079214, 7808072, 7579115, 7440434, 7362415, 7389429, 7264726, 7108344, 6967821, 6840739, 6589805, 6365518, 6247337, 6132457]
5082F132457o4059j42475k77885j74211k21298k31499j31754P1943Q3695n0188
5072D994726j26455j33616l5746M1289J12019K9328M5042n7683j36425O2467j03647
5061D691299n5932J2139J12073q9191j51523j17428j59146j62865r0317O1238
5051D050347r9564j23586k7958O5799O3853J6834r9578j10954M2748J378P4879
5040C854198M3271P8553q7875j04001J70723j13641j62815j45589J69658j43892
5030C558590j04033o092l3514l7789j33743n9869O9775p4069r8235m5343J7561
5019C053239J14446o0295P602J16968N000j41838j15590m2392q6527M1962R4648
5008B987223L1576p0100j85263J1265j02174j20640k7829M6240o4040J0006k9639
$$ y = [6132457, 6068398, 5925923, 5648038, 5473827, 5252529, 5021030, 4889276, 4961219, 5044914, 4994726, 4868271, 4734655, 4698909, 4740198, 4852217, 4881545, 4926587, 4868904, 4732479, 4794946, 4691299, 4635367, 4647506, 4759579, 4670388, 4518865, 4401437, 4242291, 4079426, 3989109, 4050347, 3950783, 3827197, 3799239, 3865038, 3928891, 3945725, 3846147, 3735193, 3777941, 3779319, 3854198, 3897469, 3976022, 3888147, 3784146, 3954869, 3841228, 3678413, 3532824, 3702482, 3558590, 3454557, 3448465, 3414951, 3377162, 3243419, 3183550, 3253325, 3179256, 3081021, 3035678, 3053239, 3167685, 3107390, 3114992, 3231960, 3236960, 3095122, 2979532, 2937140, 2850613, 2892575, 2987223, 3018799, 2948699, 2763436, 2774701, 2672527, 2551887, 2524058, 2570298, 2506258, 2516264, 2486625]
4997B486625r4717p2583Q0577j11470l0646p7668J8266J815l4073R5144j2415
4986B248855n1620q1930l7495m892R9681Q1541J6852O5617n8729j71685J6621
4975B122816M3914K1136K451K5514N9711o723j15091j58852l6736Q8706j8901
4964B027945K0642l1972P1337j1048J3207Q7012K14399L801k46624j10205n3812
4953A984682J0847Q469J69188J10097k39910j5206M5965j49328N7232q6348K877
4942A898565p0094j2672Q6204O4045K13600k8133k7880o0600N1935L8672L888
4931B157530Q3999J02459J25584R0673o7477N0876Q8909J79036K82737J84018
4921C278344K88294L85617N54582P16095O49090N08289j22978p77195p09002o95583
$$ y = [2486625, 2391908, 2319325, 2399902, 2288432, 2257786, 2180118, 2198384, 2200199, 2166126, 2261270, 2248855, 2197235, 2115305, 2077810, 2072918, 2172599, 2254140, 2270992, 2336609, 2277880, 2106195, 2122816, 2166730, 2187866, 2190317, 2215831, 2275542, 2268819, 2153728, 1994876, 1958140, 2046846, 2027945, 2048587, 2016615, 2087952, 2076904, 2090111, 2177123, 2391522, 2395323, 2148699, 2038494, 1984682, 1995529, 2003998, 2173186, 2283283, 2043373, 2028167, 2074132, 1924804, 1982036, 1895688, 1898565, 1828471, 1815799, 1902003, 1966048, 2179648, 2151515, 2123635, 2063035, 2114970, 2153642, 2157530, 2241529, 2343988, 2469572, 2560245, 2492768, 2543644, 2632553, 2811589, 3094326, 3278344, 3566638, 3952255, 4506837, 5222932, 5872022, 6380311, 6257333, 5480138, 4771136, 4075553]
4911D075553n81045k16778k13924k62806q6793l9319k5088j33194j01174L0695
4901B446127K3007J44974O0565O9376P0843K32484K78182N20636O04321N24880
4891D975395N15737J27863m93402n82957o93319m80710k38586l90669k38453k28204
4881B272695j16180j41262l4408n6597q494r7193j79169r4980N4296J34587M0600
4870A773895n5442L1337o5848J78484J11835J28783j20992J06225K29360K08274
4860B525911o9411k33920j01470j10692j19846j85603n4209j16777P4129p5157
4850A532955M2391L0830k27306j49725l6325r207J52894J03985J04545k1543j3460
4839A510034J44647J40606K8710N9283R428q0059j98280j40835k00137j25142
$$ y = [4075553, 3494508, 3277730, 3063806, 2801000, 2714207, 2674888, 2649800, 2516606, 2415432, 2446127, 2469134, 2614108, 2674673, 2744049, 2814892, 3047376, 3325558, 3846194, 4450515, 4975395, 5491132, 5618995, 5125593, 4542636, 3849317, 3368607, 3130021, 2739352, 2500899, 2272695, 2156515, 2015253, 1980845, 1924248, 1915754, 1818561, 1639392, 1544412, 1598708, 1733295, 1773895, 1718453, 1749790, 1683942, 1862426, 1974261, 2103044, 1982052, 2088277, 2317637, 2525911, 2456500, 2222580, 2121110, 2010418, 1890572, 1704969, 1650760, 1533983, 1608112, 1532955, 1575346, 1606176, 1378870, 1229145, 1192820, 1183613, 1336507, 1440492, 1545037, 1523494, 1510034, 1654681, 1795287, 1823997, 1883280, 1892708, 1812649, 1614369, 1473534, 1273397, 1148255]
4829A148255j02395J33290o7990j26024r4905j56772J359J00557M0622j7670K519
4818H60846O6410o3943m4396k4761L7415K3163j94545j9885p9025O289L4584J55875
4806G58027l34784Q2599J61522j05984L5696R7826m0304l7704J4955j43671M1961
4795E30139O7161j4309P2262l9984J1574n453n4624l1905k9980j33840m5103K1668
4783C47606Q4134M5702n4098L0923Q8192q5205O8851p3621r2673Q5004l4795M7066
4771D57086O3291j6696o0023Q033p8450O172p9570j2653L2788p0653q0567m8258
4759A20500J0755L6676L3892J07889q3208O5732o9676j86063Q0013Q3076R019
4748B08605R7730n0248l9178N4196J9389J7527m2962j30665K8580P1612o431K6843
$$ y = [1148255, 1045860, 1179150, 1111160, 985136, 890231, 733459, 734818, 835375, 875997, 858327, 860846, 927256, 863313, 818917, 794156, 831571, 854734, 660189, 640304, 561279, 567568, 602152, 758027, 423243, 505842, 667364, 561380, 597076, 694902, 654598, 616894, 631849, 488178, 530139, 597300, 582991, 655253, 615269, 626843, 621390, 566766, 534861, 504881, 371041, 325938, 347606, 431740, 477442, 423344, 454267, 542459, 457254, 526105, 452484, 359811, 444815, 410020, 457086, 520377, 503681, 443658, 451691, 373241, 379413, 299843, 287190, 319978, 249325, 168758, 120500, 131255, 167931, 201823, 309712, 226504, 292236, 222560, 36497, 116510, 199586, 208605, 306335, 256087, 216909, 271105, 290494, 308021, 265059, 134394, 162974, 234586, 228155, 254998]
4736B54998p7327J13895O1630o4142K4417j08167L330Q4648L5855m0244P1358
4725C60251l1867N4283n2353M371q034p3409J16600m2598j13640R006J31023J2430
4713C66063j06370Q2172P1108j5914K2269J3305L05o4744Q2766J50143k11307
4702C89796j34373J30299N9312n5089J0964M4637j23819n8052j1087M3102M65
4691B96155k87n7596J8556j2979P6865J2845K0074K40744O6474Q4676j03876o6274
4679E75377q24k7786q3356j4861O6958j6939r0283n9769P4468j6865L8377K5234
4667D69731J9214o8038o1802m708N8435O7488o0453j09100O6988l7866J0928K9149
4655C79966k2724p5453J47206m0540k7981r4120P5494O8068q0520l8340p7950
$$ y = [254998, 177671, 291566, 353196, 289054, 313471, 205304, 208634, 293282, 329137, 288893, 360251, 328384, 382667, 330314, 334685, 326651, 253242, 369842, 327244, 213604, 222610, 353633, 366063, 259693, 341865, 412973, 397059, 419328, 432633, 432938, 368194, 450960, 601103, 389796, 255423, 385722, 445034, 389945, 400909, 445546, 321727, 263675, 252588, 295690, 296155, 295868, 238272, 256828, 243849, 320714, 333559, 353633, 594377, 660851, 745527, 641651, 575377, 574553, 546767, 463411, 448550, 515508, 498569, 408286, 348517, 422985, 406120, 444497, 469731, 488945, 420907, 359105, 354397, 412832, 480320, 419867, 310767, 377755, 339889, 350817, 379966, 357242, 281789, 428995, 388455, 360474, 266354, 341848, 409916, 329396, 291056, 213106]
4644B13106J64583P1060j06031l9396l687L5890O2711j14114j9193P2305N6456
4633C93690l1671K0812q8986p8855j0206N2272L6578L255J5876J2685j08628J7021
4621B33843Q6261l4650N9885L0511l1351k7970j31526n9905K0416L1771P041J50532
4609C34858P0526p1779j05922n8343N7003J3309O1759j6421O069L8270n5998l4026
4597B39305j0691J29550p54j16500J17171k7075J26365N9662k2397q8353p4943
4586C31340J0106J00765m1818n8445j06900j17156J37019R499r142P0671K3878
4575C49817J72900j1489j30646j565n0332O8159k4178k0500O8055K15192j57762
4564D77651j18108J49935J35014j0013m0814l6510K7639r318q9209j2438j0822
$$ y = [213106, 377689, 448749, 342718, 303322, 299635, 335525, 398236, 284122, 264929, 337234, 393690, 362019, 382831, 293845, 214990, 204784, 257056, 293634, 296889, 312765, 325450, 216822, 233843, 320104, 285454, 345339, 375850, 344499, 316529, 185003, 125098, 145514, 177285, 184326, 334858, 405384, 333605, 227683, 169340, 226343, 239652, 301411, 284990, 291059, 329329, 273331, 239305, 228614, 358164, 357410, 240910, 358081, 331006, 457371, 517033, 494636, 406283, 331340, 341446, 442211, 400393, 341948, 235048, 117892, 254911, 264410, 255268, 325939, 349817, 522717, 511228, 380582, 379017, 328685, 396844, 372666, 352166, 420221, 635413, 477651, 359543, 509478, 644492, 634479, 593665, 557155, 584794, 575476, 486267, 473829, 463007]
4553D63007n069K7088j7767M9019P28J2710O3138M2698m1342o9842L2838J30645
4541F87851J5421M8386J344j50506j37890J65605J6593p4313J01251N1730o6114
4530F59358M7998j02219o5661J2073M9975J67023j9057j21071p2152L9140k1332
4519E74075J28069O940n8591j08090R2060o2071R3124N4984j0606K9972j21017
4508F18849m8650k7673K3726j7493j925k2479q303n5405k1850n6538J50807J18808
4496F51874j3708k5174j22815J41375K2982k3892k9391J21508J7742m7938o5733
4485F26830j6995P664J3945k740N6923l0644p4106L6504j4424J37341J80289p8699
4473H41888j11027l6223o9528r2356J37398K08896j28752q8956J478L6742N3892
$$ y = [463007, 457938, 485026, 467259, 516278, 517006, 529716, 592854, 635552, 594210, 524368, 557206, 687851, 703272, 751658, 753002, 602496, 464606, 630211, 646804, 572491, 673742, 725472, 659358, 707356, 605137, 539476, 551549, 601524, 768547, 749490, 628419, 556267, 595407, 574075, 702144, 709084, 650493, 542403, 634463, 572392, 665516, 720500, 709894, 739866, 618849, 570199, 542526, 566252, 548759, 546834, 524355, 516052, 460647, 438797, 382259, 533066, 651874, 638166, 612992, 490177, 631552, 654534, 630642, 601251, 722759, 740501, 692563, 626830, 609835, 617499, 631444, 628704, 685627, 654983, 580877, 617381, 602957, 740298, 920587, 841888, 730861, 694638, 625110, 532754, 670152, 879048, 750296, 661340, 662818, 699560, 753452]
4462G53452K9323M7742k401n5862j34381j0247O0487J56055k4918j043R7165m4057
4450H71315K72624k6004q0791l5461L7748q9486M8232p4817j19162O0936M5698
4439I10832l9674J13045J3098j24891K4567Q5729R5638r161R7676m5121J4043
4428A135781k398J14706J34124J31701m7912R6023q452j11554J55739O3535N1667
4417A712960J00726j1004p9270J59277J0372M9992J71605J90542J11710r953O4577
4406B471534l8529Q2800J15674J8878J5775o227k5687N1600J02695J64124P3264
4395C025901J21889K21836N7448o0071N3453J15241J74512J76620J90566K55462
4385D332857J17198P9860K89172K27009K21467J58333J04193K69837J32269J44511
$$ y = [753452, 782775, 830517, 828116, 772254, 637873, 627626, 688113, 844168, 819250, 818207, 915372, 871315, 1143939, 1117935, 1037144, 1001683, 1039431, 949945, 998177, 923360, 804198, 865134, 910832, 871158, 984203, 997301, 872410, 896977, 982706, 1078344, 1069183, 1166859, 1121738, 1135781, 1133383, 1248089, 1382213, 1513914, 1466002, 1562025, 1553573, 1442019, 1597758, 1661293, 1712960, 1813686, 1802682, 1723412, 1882689, 1893061, 1943053, 2114658, 2305200, 2416910, 2406957, 2471534, 2433005, 2515805, 2631479, 2650357, 2666132, 2659905, 2634218, 2685818, 2788513, 2952637, 3025901, 3147790, 3369626, 3427074, 3367003, 3420456, 3535697, 3710209, 3886829, 4077395, 4332857, 4450055, 4529915, 4819087, 5046096, 5267563, 5425896, 5530089, 5799926, 5932195, 6076706]
4375F076706K54442K52342J57964J20850J28444K06795L42502L69569L42914M05206
4365H657734M49969L86032N46076O88723Q26255Q89829P36501Q59453N17327L55905
4355A4913804O51266P34561J020351J099174J051435J481414J727117K070819
4347B4749941K557436K393402J733591M66462p30797j166989p44841k80260l93318
4338B8584627q29696j083356q20180n80129M0353M62865Q56590O39188K70283
4329B7540545j93237l77371m03660k62929j517M3517L29874N84137R41071J214673
4319B9415103J288766J325427R14054Q6180j181840j772280j289346r88930q70199
4310B6926935j091933j455197j430846j363339n79535l9679q7363j27913j30067
$$ y = [6076706, 6331148, 6583490, 6741454, 6862304, 6990748, 7197543, 7540045, 7909614, 8252528, 8657734, 9107703, 9493735, 10039811, 10728534, 11554789, 12444618, 13181119, 14040572, 14557899, 14913804, 15565070, 16299631, 17319982, 18419156, 19470591, 20952005, 22679122, 24749941, 27307377, 29700779, 31434370, 31900832, 31170035, 30003046, 29258205, 28977945, 28584627, 27754931, 26671575, 25851395, 25271266, 25311619, 25774484, 26631074, 27270262, 27540545, 27347308, 26969937, 26566277, 26303348, 26301831, 26345348, 26675222, 27259359, 28200430, 29415103, 30703869, 32029296, 32943350, 33029530, 31847690, 30075410, 28786064, 27797134, 26926935, 25835002, 24379805, 22948959, 21585620, 21006085, 20966406, 20879043, 20751130, 20621063]
4301B0621063l03687p74529j004944q58137n46432n78797l23926m60199m08155
4292A5362257n57293n61807o67585n74615l99990k99252k52806j168J28111J25995
4282A2301847J72138M68914P18201Q43711R92468J102809J200014J354718J971762
4273B1126582K815873L582116M295379M060262K505832m06196l770075n060467
4265B9149306m483229l564858k803813k267762j806217j376818j237976r81999
4257A0626634o91837p13542p16969n59124l44422l60407m17280l68097l41378
4248F113578k89369k89036o0668k16383j50410j70744l17040q8228n5499j83096
4238D293105K5421j98733j09340j14982j16919l8853k26735m7200O0705r554J3422
$$ y = [20621063, 20317376, 19542847, 18537903, 17679766, 17133334, 16554537, 16230611, 15770412, 15362257, 14804964, 14243157, 13575572, 13000957, 12600967, 12301715, 12048909, 12047741, 12175852, 12301847, 12473985, 12942899, 13661100, 14504811, 15497279, 16600088, 17800102, 19154820, 21126582, 23942455, 27524571, 31819950, 35880212, 38386044, 37979848, 34209773, 29149306, 24666077, 21101219, 18297406, 16029644, 14223427, 12846609, 11608633, 10626634, 9934797, 9221255, 8504286, 7945162, 7600740, 7240333, 6823053, 6454956, 6113578, 5824209, 5535173, 5474505, 5258122, 5107712, 4936968, 4619928, 4531700, 4476201, 4293105, 4318526, 4119793, 4010453, 3895471, 3778552, 3739699, 3512964, 3465764, 3526469, 3516915, 3530337]
4227C530337o3122n8751j5129j0065Q6983q538j0747l8147j82484o0769J26687
4216C296255q8758K7894k7054m4572k7002K5442J56670K9512J21947J30453L50032
4205C950819K47059J17142K17428K17376J19236k87978k69569j47493j77423o5825
4195C920772Q098j42729P2113j20760j72712m757J41829L6457O2166L5779K7282
4184C863538P1760J41558J03096J19082J47823K56294J55599J04881K60537K57368
4174E481536K13927L38262N16889O51963P44366R63066R88679J408663K099774
4165A3407125K578282L572148L746262L639965J906699q22518l155583m103806
4157B0768574l700336k757733k215012j723075j152222q30202q39539o07130m37980
$$ y = [3530337, 3467215, 3408464, 3393335, 3383270, 3470253, 3461715, 3450968, 3412821, 3230337, 3169568, 3296255, 3207497, 3235391, 3208337, 3163765, 3136763, 3162205, 3318875, 3348387, 3470334, 3600787, 3950819, 4197878, 4315020, 4532448, 4749824, 4869060, 4581082, 4311513, 4164020, 3986597, 3920772, 3928870, 3786141, 3858254, 3737494, 3564782, 3560025, 3701854, 3738311, 3800477, 3836256, 3863538, 3935298, 4076856, 4179952, 4299034, 4446857, 4703151, 4858750, 4963631, 5224168, 5481536, 5695463, 6033725, 6550614, 7202577, 7946943, 8910009, 9898688, 11307351, 13407125, 15985407, 19557555, 23303817, 26943782, 28850481, 28027963, 24872380, 20768574, 17068238, 14310505, 12095493, 10372418, 9220196, 8389994, 7550455, 6943325, 6505345]
4148F505345m40090n63526l70047k13394j68507k77175k54015l26767l45447j01175
4138C445202j07583k33673n4847q9498k73216p8585q7267j69318M2253p4162j87826
4127B131480j26907j70767M1913J3775j3059q1018R8380j3879l2336j02718k2671
4116A722193l2541p9483q0090R2356k5557j00183J0323r8629N5389L0854j65806
4105A328826o0338M656r2241j03587n8966R9545J9435q2614K444n1061J3491J15660
4093A135250K9695j09666J4294L8959p0559l4941m300M3605L608J53121N2442
4082A251508l4530L862j89022j8324Q7211J9077q5975j04141K0156q4454N5157
4071I20525Q5741N482m3478j57218q3085M8815N7307o7007J16144r4076p4653
$$ y = [6505345, 6065255, 5501729, 5131682, 4918288, 4749781, 4472606, 4218591, 3891824, 3546377, 3445202, 3337619, 3103946, 3049099, 2959601, 2686385, 2607800, 2520533, 2351215, 2393468, 2319306, 2131480, 2004573, 1833806, 1875719, 1889494, 1876435, 1795417, 1893797, 1879918, 1847582, 1744864, 1722193, 1689652, 1610169, 1530079, 1622435, 1596878, 1496695, 1507018, 1408389, 1463778, 1494632, 1328826, 1268488, 1273144, 1180903, 1077316, 1018350, 1117895, 1137330, 1054716, 1057160, 1006099, 1019590, 1135250, 1164945, 1055279, 1069573, 1108532, 1037973, 1003032, 998732, 1042337, 1045945, 1199066, 1251508, 1216978, 1220840, 1031818, 1013494, 1100705, 1119782, 1033807, 929666, 949822, 865368, 920525, 1006266, 1011748, 968270, 811052, 727967, 776782, 834089, 767082, 883226, 789150, 714497]
4060G14497J9979o8389j20596K07075L0563p8164q2787j69667J78684j11199P5081
4049E95077o7736O7202P3699k23300n5616N9884J4092M4085Q4615k7702L7107
4038F01407m203K31J5527J2283O8659j08415j56380k2010M8737Q0087Q4377o9731
4026E50569n8678o7974k8381j7072P8977J58326n0732k4959k9396m2320N3470
4015E21830k2395r4242P219j0957J33925n1680N6034m1747m1146N6627l6979J09498
4003E85987M3253p4444M093j07840Q0839Q9486O1267o9216j55145J76915J29479
3992G64674q6724P3551J1920k8413j12830j7206k6384j7724Q3539R999j0953j28209
3980E15240M967J13076J11728O326J93770J0287j1265m0581r54J29483R2604l6349
$$ y = [714497, 734476, 666087, 545491, 752566, 783129, 704965, 622178, 452511, 631195, 519996, 595077, 527341, 594543, 668242, 444942, 389326, 449210, 463302, 507387, 592002, 564300, 601407, 597204, 597435, 612962, 625245, 693904, 585489, 429109, 407099, 455836, 535923, 620300, 550569, 491891, 423917, 395536, 378464, 457441, 615767, 565035, 540076, 510680, 468360, 521830, 499435, 405193, 412412, 401455, 535380, 483700, 539734, 497987, 456841, 513468, 476489, 585987, 629240, 554796, 558889, 451049, 531888, 621374, 682641, 613425, 458280, 635195, 764674, 677950, 751501, 763421, 735008, 622178, 604972, 578588, 560864, 644403, 654402, 643449, 515240, 520207, 633283, 745011, 751337, 945107, 955394, 944129, 903548, 902594, 1032077, 1124681, 1088332]
3968A088332o7022J3783J02577N547M7385Q9186n5501L7111q958J9819R2507L6737
3956A401503J14257L4232m6579o0535o5314l9218O0252K4480l4820j01451M1468
3945A328275K2786p7743j52125Q9080j39890k30528m7625o8408K6517M6866k6459
3934G70746m2829K618k8749j21433p9259L7363k4207K9492j2070K9862k2592j05593
3922D33349j01003q2319P7217J63583O5418k34362n3749K1275J18750M8961r6857
3911C60263j06332L1594M3350j00071j8254Q1532J38657p2965q6004j94119J7932
3900I5583L4324L9161m3639O9455J84039n0864j50755j9958J07359J9565n5358
3889B28912J36933j51846j64219K8894O3251M7335N5474K6175r2607O6753l5217
$$ y = [1088332, 1021310, 1035093, 1137670, 1143217, 1190602, 1279788, 1224287, 1261398, 1252440, 1272259, 1364766, 1401503, 1515760, 1549992, 1503413, 1442878, 1377564, 1338346, 1398598, 1423078, 1388258, 1286807, 1328275, 1351061, 1273318, 1121193, 1210273, 1070383, 839855, 792230, 723822, 750339, 797205, 770746, 727917, 730535, 701786, 580353, 501094, 538457, 514250, 543742, 531672, 561534, 538942, 433349, 332346, 250027, 327244, 490827, 556245, 321883, 268134, 289409, 408159, 457120, 360263, 253931, 285525, 328875, 228804, 210550, 292082, 430739, 357774, 271770, 77651, 95583, 129907, 169068, 125429, 194884, 378923, 328059, 177304, 157346, 264705, 284270, 228912, 365845, 213999, 49780, 78674, 141925, 189260, 244734, 270909, 178302, 245055, 209838]
3878B09838j04199J5262Q0151k1381m5632l3831J818K60741L3705k1855L7549
3867D12166o2517K8219j364j30312o1719m3656J34191j21341k17129J3417J7950
3856c2095J43050j5312k8959P1083J0702l7791J22616q5366L2682M1892r0402
3845A32100Q9p2820N9409J75189p9208Q58J39318O435k04184o8612M6971J17365
3833B52910r9186k4387m119o0081P2097r526j3339L5433n3765J5791j1948m6429
3821E3451N4795Q1204m0601j03093m0978O2779J45401k8470k4858K4696K9576
3810B13902J0518L8316M1460m1928j07271n6161M6546J53616p3128k63q0198j2791
3798A32618l5112N3119J08675j7248n5136j00840Q6163R944K215Q2030o9459j51500
$$ y = [209838, 105639, 120901, 201052, 179671, 134039, 100208, 102026, 362767, 396472, 374617, 412166, 349649, 377868, 376504, 246192, 184473, 140817, 275008, 153667, -63462, -50045, -32095, 110955, 95643, 66684, 137767, 148469, 110678, 233294, 147928, 180610, 222502, 132100, 132189, 59369, 118778, 293967, 214759, 215617, 354935, 361370, 157186, 88574, 135545, 252910, 153724, 129337, 125218, 65137, 137234, 127708, 114369, 149802, 96037, 111828, 99880, 53451, 108246, 189450, 148849, 45756, 4778, 67557, 212958, 184488, 159630, 184326, 213902, 224420, 262736, 304196, 262268, 154997, 98836, 145382, 298998, 225870, 225607, 145409, 132618, 97506, 150625, 259300, 242052, 186916, 86076, 172239, 182183, 184398, 266428, 196969, 45469]
3786D5469p1368J53911N0408m2646L0305j0133M7809M548j6768M5912q453L6749
3774B65743q9422J2757J8551R1299j70282J4953Q8693j3530j05315m0852K7285
3763I9880J13567J31600l1871Q0248J627K4619j31629j5447J19965p594n4728
3752C30237m9345M6203o4709l6349k1104J41508R2226r4076N9882J9793O982l0829
3740D00419m6063j17454j3288K1292Q1781O6459l3387L6864J23621n3919N7969
3729E24294j71882k9766J04729L1368o4936N8846K0939j40475J6164N4091J7171
3718D20543l5203P2435Q2659k6138m2927N4282o9907Q6305J17219n4085q3044
3707E22139n4774J2789n1892J40787J1672J12206N9883M6394M2944J6104n4500
$$ y = [45469, -25899, 128012, 178420, 135774, 166079, 155946, 203755, 208303, 191535, 237447, 228994, 265743, 176321, 189078, 207629, 298928, 128646, 143599, 232292, 218762, 113447, 72595, 99880, 213447, 345047, 313176, 393424, 395051, 419670, 288041, 272594, 392559, 384965, 330237, 280892, 327095, 262386, 226037, 204933, 346441, 438667, 344591, 404473, 424266, 431248, 400419, 354356, 236902, 223614, 244906, 326687, 393146, 359759, 396623, 520244, 466325, 524294, 352412, 322646, 427375, 458743, 393807, 452653, 473592, 333117, 349281, 403372, 420543, 385340, 457775, 540434, 514296, 471369, 525651, 455744, 542049, 659268, 605183, 522139, 467365, 480154, 428262, 569049, 580721, 692927, 752810, 799204, 842148, 858252, 803752]
3696H03752M3204m8800j6791n1602m333m307N0663P2431O9314m5169q2992L582
3684G88952M8805Q3410J32034Q9833R949j7760l0101Q288L4538J79665J07416
3673A435029k9156m1059J02473l4474j5866J49769J76976J0130O3514M5821N7774
3662A920931P2562J14283M5683L0986L3443L6224J6773K10064K34344O72m9145
3651B666820P2297O9899K59647J64149j4532O1765J61176J65847J56996K34029
3641C998093L28729K72817L40493L41718L42526M49260M60454L63633N88675M67057
3631G953455M61844N74766P12261O92401R45962J312361J437650J366464R25517
3622A6382681o3475o70717m76284l06963l51699q14182q15952p22109m84481r5700
$$ y = [803752, 846956, 798156, 781365, 729763, 725430, 721123, 771786, 844217, 913531, 868362, 785370, 788952, 837757, 921167, 1053201, 1143034, 1152983, 1135223, 1105122, 1113410, 1147948, 1327613, 1435029, 1405873, 1364814, 1467287, 1432813, 1416947, 1566716, 1743692, 1753822, 1817336, 1863157, 1920931, 1993493, 2107776, 2153459, 2184445, 2217888, 2254112, 2270885, 2480949, 2715293, 2715965, 2666820, 2739117, 2809016, 3068663, 3232812, 3218280, 3280045, 3441221, 3607068, 3764064, 3998093, 4326822, 4599639, 4940132, 5281850, 5624376, 6073636, 6534090, 6897723, 7486398, 7953455, 8415299, 8990065, 9702326, 10394727, 11340689, 12653050, 14090700, 15457164, 16382681, 16319206, 15648489, 15172205, 14865242, 14513543, 13699361, 12883409, 12161300, 11676819, 11581119]
3612A1581119J65094q5940l85849n96562n47270n21065o12322n98749m57797n45560
3602G395099l82077n11890o22224o87363o19347k55895k87522j96971k59363k84719
3592C287728k49109k04391j6375j09616j22986j24329o6359j27009p3399l2260
3582B161895j75945l4666j34265m657K9658j79769r8897o8550q6295Q1198j10351
3571A379356L3520O586j07409j00646K8422j06938k6266j0558O3255J04744m3322
3560A220744j68607P643L7357q5216j05632J47037m2719o7366K4418j9035j20583
3549H28041m1504R0863p836Q2094L1814j00610M5367l9889j89158K4110J6585
3538G39877L0811l3794N4708j32756k8347j28377J42768L7797n7311j7664J6576
$$ y = [11581119, 11746213, 11660273, 11274424, 10677862, 10130592, 9609527, 8997205, 8398456, 7940659, 7395099, 7013022, 6501132, 5878908, 5191545, 4572198, 4316303, 4028781, 3831810, 3572447, 3287728, 3038619, 2834228, 2817853, 2708237, 2585251, 2460922, 2394563, 2267554, 2194155, 2161895, 1985950, 1951284, 1817019, 1812362, 1842020, 1662251, 1563354, 1494804, 1408509, 1489707, 1379356, 1412876, 1419462, 1312053, 1211407, 1239829, 1132891, 1106625, 1096067, 1159322, 1264066, 1220744, 1052137, 1059780, 1097137, 1011921, 906289, 1053326, 1010607, 943241, 967659, 948624, 828041, 786537, 877400, 869564, 951658, 983472, 882862, 928229, 888340, 699182, 723292, 739877, 770688, 736894, 791602, 658846, 630499, 502122, 644890, 682687, 625376, 607712, 624288]
3527F24288o5412O5076J57032J0388r6712K44342j39924j18664j8203l5442K50505
3516H77274m9336R1019J3617k06419o532J8074k1856J41416O7565j1482j1537
3505I01803m220l1669p7863L722p9018J32021M2807p6552o5562J55964M0111J9741
3493I61285J17072j30221J5391j25600J5953K13345J33048N3379N62j67409P2453
3482A159258K3418l0171O9888N5377M9779O2669J36749P3075j3846K24184Q3358
3471A893738m9440n7395O0660K52311K56119K18898J91152M02376L16827L79618
3461C864864N54516Q09399R81485R62982Q18207M33828m39317r20186r20292q56981
3451E288505n07317k18666l70267l15748l15635j00489j01898p8847k2790q1046
$$ y = [624288, 558876, 623952, 780984, 791372, 694660, 939002, 799078, 680414, 662211, 626769, 877274, 827938, 918957, 932574, 726155, 719623, 737697, 715841, 857257, 924822, 913340, 901803, 897583, 865914, 788051, 791773, 712755, 844776, 887583, 811031, 745469, 901433, 941544, 961285, 1078357, 948136, 963527, 837927, 853880, 1067225, 1200273, 1253652, 1254214, 1086805, 1159258, 1182676, 1152505, 1222393, 1277770, 1327549, 1390218, 1526967, 1600042, 1586196, 1810380, 1893738, 1844298, 1786903, 1847563, 2099874, 2355993, 2574891, 2766043, 3168419, 3485246, 3864864, 4419380, 5228779, 6210264, 7173246, 7991453, 8425281, 7985964, 7065778, 6145486, 5288505, 4781188, 4562522, 4192255, 3876507, 3560872, 3460383, 3358485, 3279638, 3256848, 3175802]
3441C175802P9633J29112J36900P1257J26195K12389L26799K21804M40033N00583
3431E420507N30546O92648J012383J434507J883866J958599J601078P97419q42292
3422A4489261k133361k047553j550755j122739r21947o88978n73729m39510k75447
3413D735242j67148k53979k99925j44701j63078o7081M9746M6111K8587p1322
3403C692452O2981L6056J34118K85606K81971L91813M05114O58423Q06054Q30915
3393G585503Q05960L22747m32412j105083j164282p63426n67771l45368l07417
3384D028451j46391j99239l04386n6742j57927o288J8216j39168J3464j4438k75877
3373B759675j14265q8851j80164r6905k5188j62437j76877L3987J36127r692p6784
$$ y = [3175802, 3255435, 3384547, 3521447, 3592704, 3718899, 3931288, 4258087, 4479891, 4919924, 5420507, 5951053, 6643701, 7656084, 9090591, 10974457, 12933056, 14534134, 15331553, 14489261, 12355900, 10308347, 8757592, 7634853, 6712906, 6023928, 5450199, 5010689, 4735242, 4568094, 4314115, 4014190, 3869489, 3706411, 3639330, 3689076, 3735187, 3763774, 3692452, 3755433, 3791489, 3925607, 4211213, 4493184, 4884997, 5290111, 5948534, 6754588, 7585503, 8391463, 8714210, 8281798, 7176715, 6012433, 5249007, 4681236, 4335868, 4028451, 3882060, 3682821, 3378435, 3321693, 3163766, 3157478, 3175694, 3036526, 3049990, 3035552, 2759675, 2645410, 2556559, 2376395, 2279490, 2254302, 2091865, 1914988, 1948975, 2085102, 2075410, 1998626]
3362A998626j95143r725J71103o3580q9179l194O3947l9761q4887R0673k9488
3351A809392J15119P7464K21220p2n8103K00448J82151J00024M7040P9031j87124
3340B586590k67581j54609L0718o2647r1971O330n1460O1733J4781k25758M5252
3329A891378j6653M7102J17302k4717r6055o3224n2543M2857o154J40732q6476
3318A893549L6815J97436J39535J39837J71663J53078J88368J57702l4377j85113
3308B858493o4824p9849r6217m9044j54748n7055p4928j38063R4995J76852M7589
3297B463201p9631Q6184n9284J1858l3040J8816J55264q310L8658q1650l2000
3286B480066M6387J94279J24946K0438l3086N1213j27616Q2998J05294J28352
$$ y = [1998626, 1803483, 1793758, 1964861, 1901281, 1812102, 1808908, 1872855, 1833094, 1748207, 1838880, 1809392, 1924511, 2001975, 2223195, 2223123, 2165020, 2365468, 2547619, 2647643, 2694683, 2773714, 2586590, 2319009, 2164400, 2195118, 2132471, 2040500, 2046830, 1995370, 2057103, 2071884, 1846126, 1891378, 1874725, 1921827, 2039129, 2014412, 1918357, 1855133, 1802590, 1845447, 1839293, 1980025, 1893549, 1930364, 2127800, 2267335, 2407172, 2578835, 2731913, 2920281, 3077983, 3043606, 2858493, 2793669, 2713820, 2617603, 2568559, 2413811, 2356756, 2281828, 2143765, 2238760, 2415612, 2463201, 2383570, 2469754, 2410470, 2422328, 2389288, 2408104, 2563368, 2555058, 2593716, 2512066, 2480066, 2526453, 2720732, 2845678, 2866116, 2833030, 2884243, 2756627, 2839625, 2944919, 3073271]
3276C073271q7630M9211Q293j57104q5332L6698P9444M901Q4226j68299o0261
3265B777418Q0842Q7776Q0405K05472J9180r6422n0658Q2536J03221O904Q8432
3254C385106J87454P8405M3848J55322J23043J70299J58369L7760J68904J63286
3244D671796K03723J14677J92362M1077q1618j14878k93264m62006m62392k57350
3234C552127p2560k23531k47149l11764k27573j70238J4940p4287n522J33565
3224B368008j57717j64652J3655o3861P771K6964j26871J25982p1162k7075Q3180
3213B014222o421o0695j3701j41226k09102j31799M7911k6302l3430m9192L8718
3202A428983j24837k8800O5164l3420m0156M6244r7389l642j71653J38288P9930
$$ y = [3073271, 2985641, 3034852, 3043145, 2886041, 2800709, 2837407, 2916851, 2921752, 3005978, 2837679, 2777418, 2858260, 2946036, 3026441, 3231913, 3251093, 3154671, 3104013, 3186549, 3289770, 3296674, 3385106, 3572560, 3650965, 3694813, 3850135, 3973178, 4143477, 4301846, 4339606, 4508510, 4671796, 4875519, 4990196, 5182558, 5223635, 5142017, 5027139, 4733875, 4271869, 3809477, 3552127, 3479567, 3256036, 3008887, 2697123, 2469550, 2299312, 2314252, 2239965, 2234443, 2368008, 2210291, 2045639, 2059294, 1995433, 2003204, 2030168, 1903297, 2029279, 1958117, 1931042, 2014222, 2007801, 1947106, 1933405, 1792179, 1583077, 1451278, 1499189, 1472887, 1439457, 1390265, 1428983, 1304146, 1275346, 1340510, 1307090, 1266934, 1313178, 1215789, 1212147, 1040494, 1178782, 1258712]
3191A258712j25375j534r914j04332j06097Q894R0519J03627K4084k8089j01117
3180A009378J37580l5266o4992j8042m8893l8716K4211j00541m4119J10580k6856
3169I04324j5980N0733r0438m7374J17701m9205k5368L2401k3994p4947o9548
3158G08305N4264l9335j42655J1509J09491J46805j85829l4074R7700K4564O8091
3147H18836r4247j06277q5610K6647K3982M9500n4814N7576R6265k4202K1732
3136G29388j59553j57761R7698J10430m4820m1274j14372j3395O3672q7597O2195
3125D44611j0143j3855Q7010J7085o6201o7313j5348O5068K1636q2709p8707K7144
3113C28278O7897P9491p8135j05061O4703L3939j1220R7980o736J60055q6523
$$ y = [1258712, 1133337, 1131803, 1121889, 1017557, 911460, 920354, 1010873, 1114500, 1138584, 1110495, 1009378, 1146958, 1111692, 1046700, 1028658, 979765, 941049, 965260, 864719, 820600, 931180, 904324, 888344, 939077, 848639, 801265, 918966, 869761, 844393, 876794, 852800, 777853, 708305, 762569, 723234, 580579, 592088, 701579, 848384, 662555, 628481, 726181, 750745, 818836, 724589, 618312, 532702, 559349, 583331, 632831, 578017, 635593, 731858, 707656, 729388, 569835, 412074, 509772, 620202, 575382, 534108, 419736, 406341, 470013, 382416, 444611, 434468, 420613, 507623, 524708, 458507, 391194, 375846, 440914, 462550, 379841, 301134, 328278, 396175, 475666, 397531, 292470, 357173, 391112, 379892, 477872, 471136, 631191, 544668]
3102E44668j55293M1660L3923O412j7858n6013q8601P7869N2873l6182j09767
3091B93691k01085Q0240L2975k3593Q1374K0262l3185l769j472N8324m812m5587
3079B53363n7785R4559p1682m6902J11713J3220K7816K580n2573q1446R3324J29568
3067D15755O8022o1416j88623o9672O6187m5067J64661n6527L0692q4818o7375
3056A71819q4444J5032J54184P2651q7231o310l5719M2707l8148K4014m3189k6405
3044A58961J54943j01376M4394r4486J23337J01673n810j6676p2293j19534J5449
3033A88582J395M75l1305P4945Q473O8007Q346K532Q8451O0825j45691p4759M6425
3020B96701N2063P138O5490n9053l1055o985j1351J93339l8590L85J45348R9877
$$ y = [544668, 389375, 431035, 464958, 471370, 453512, 397499, 308898, 386767, 439640, 403458, 293691, 92606, 172846, 205821, 182228, 263602, 283864, 250679, 246910, 245438, 303762, 298950, 253363, 195578, 290137, 218455, 171553, 283266, 296486, 324302, 326882, 274309, 192863, 286187, 415755, 483777, 422361, 233738, 164066, 230253, 185186, 349847, 293320, 324012, 239194, 171819, 87375, 102407, 256591, 329242, 242011, 235701, 199982, 242689, 204541, 228555, 185366, 158961, 313904, 212528, 256922, 162436, 285773, 387446, 381636, 364960, 292667, 173133, 188582, 189977, 190452, 159147, 234092, 242565, 310572, 318918, 321450, 409901, 470726, 325035, 250276, 296701, 348764, 355902, 421392, 362339, 331284, 324299, 312948, 506287, 467697, 468082, 613430, 713307]
3008G13307n0523k46464m2621J31225q9266J18207j15107O6485J62861k13687
2998D34417Q105q826m9952P1565J0472j02419k1609J19967N7034m3241j2772L6010
2986D98751K2212J1206o7661O860J62138N2230j3933J68479N9109Q3035j21256
2975H61170j0861R7193j9802j22687o1140j51578M4589R4190o7927j15449l3092
2964E14606k0382L1149L5954p0603J4775J91637j8927l9344Q749j2238N4014m3984
2952F45406j30818J0157J83282q7737N010N0589O3825R9270J53250J661l9503
2941I54392o566M8804j17467o1355N4032P4099R5926k250q0056j63311J1110O4059
2929H71417m8458N2030N8371j32097r5547M1321J07190k6049p6279J05963N8472
$$ y = [713307, 662784, 416320, 373699, 504924, 415658, 533865, 418758, 485243, 648104, 434417, 442522, 433696, 383744, 455309, 465781, 363362, 341753, 461720, 518754, 475513, 462741, 498751, 520963, 532169, 464508, 471368, 633506, 685736, 671803, 840282, 899391, 982426, 861170, 850309, 947502, 927700, 805013, 743873, 592295, 636884, 731074, 663147, 547698, 514606, 494224, 525373, 561327, 490724, 505499, 697136, 678209, 638865, 647614, 635376, 689390, 645406, 514588, 524745, 708027, 620290, 625300, 675889, 739714, 838984, 992234, 993895, 954392, 947826, 996630, 879163, 817808, 871840, 945939, 1041865, 1039615, 959559, 796248, 807358, 871417, 822959, 874989, 933360, 801263, 705716, 747037, 854227, 828178, 751899, 857862, 916334]
2918I16334k1000M9646j8028N8776n1835k8883j3594r7253R0591J11916J8384
2907A015054n8673N4046R7425j02896j294N2652n9124m2860j22513r8442M3181
2896G76556K8108J9309o850j20000r7228Q4683R7747q1839K5326k0991Q5803J2809
2884H03433n3623M370k3256k4116l0421P7465Q5786n818j07673Q9921O5691j43112
2872G38647k3149M7856l9460j36402j26985N7326P0551o2840o2495m4182J0849
2861D29716j21600J04871M6872J3021J75913j7035j54336j25368J04584N2779
2851E09417r9256k5517J1002q7378m884k1208q1950j6212R7228O0112o7433p4785
2839A99136m1258K434j922J60666m0974r3967j62113N8917Q2700O342J43607r8880
$$ y = [916334, 895334, 944980, 926952, 985728, 933893, 905010, 891416, 794163, 884754, 996670, 1015054, 956381, 1010427, 1107852, 1004956, 1003662, 1056314, 997190, 954330, 831817, 733375, 776556, 804664, 823973, 817123, 697123, 599895, 684578, 782325, 700486, 725812, 704821, 790624, 803433, 749810, 754180, 730924, 706808, 676387, 753852, 839638, 833820, 726147, 816068, 881759, 738647, 715498, 763354, 723894, 587492, 460507, 517833, 588384, 525544, 463049, 418867, 429716, 308116, 412987, 459859, 472880, 648793, 631758, 477422, 352054, 456638, 509417, 410161, 384644, 395646, 308268, 303384, 282176, 200226, 184014, 281242, 341354, 273921, 199136, 157878, 160312, 158390, 319056, 278082, 184115, 22002, 80919, 163619, 169961, 313568, 214688]
2827B14688j03719j05850Q1892k5463J36085k0144j37517J08641R2121k3049j35479
2816H2206R393q6222J76992j7565j52374j7217J8248K6600Q3694K0948J06906
2805B51609k3850L4850m6610p6711Q005m1817M2895k2388n7604j11223K4566L5622
2793A7344m6356J46892J27415q8981r2651j81224N0522R0249J34595k6918n0833
2782H0054N5022j02230N7752Q0117o5413J38830J9912J4043k14967j2690J208
2771E1638q3770K9974J9537m4898L9325j1230n1133P6824M0486m1324l2812L0458
2759B3075L0508N1352M8267r1240n933j11814j27693O472J13115P0730J41638
2748A48477K4677q1957n4312q4853N6161k7580n760m4222N6247l4340m4807J02245
$$ y = [214688, 110969, 5119, 87011, 61548, 197633, 177489, 39972, 148613, 240734, 217685, 82206, 91599, 5377, 182369, 164804, 12430, -4787, 13461, 40061, 123755, 144703, 251609, 227759, 262609, 215999, 139288, 147293, 105476, 148371, 125983, 68379, -42844, -18278, 17344, -29012, 117880, 245295, 156314, 63663, -117561, -67039, 23210, 157805, 130887, 80054, 135076, 32846, 90598, 170715, 105302, 244132, 264044, 278087, 63120, 50430, 51638, -32132, -2158, 17379, -27519, 11806, 576, -50557, 26267, 66753, 25429, -7383, 23075, 53583, 104935, 153202, 61962, 56029, -55785, -183478, -177006, -63891, 6839, 148477, 173154, 91197, 36885, -47968, 8193, -19387, -25147, -69369, -13122, -47462, -92269, 9976]
2736I976J3677r619P445k089j1237j36449K725R0527P2292l431K0298l1058J840
2723B4897R4382L1528n5081L0626j0755L9333m5662m1261k819o9472N4994J5202
2711F5912k9556p9946Q160L1043l1988Q3890M7783r5489n8366q2161M2502J59611
2699F1395j7462j7693k1836J68500j25130q2262m6587n1706P699M1174K9610j08324
2687a62622p1025j0494K80331M4140O573q6775J1327o0976L5305k9337q5442J83819
2675E4824q0419k1112l1723M5184K6558m2360J47948j25895n7629P8398j1782
2664a8008Q9127M1018r5986r6779j2092j13260J22545J6435Q1544J26757n4059
2653H7242m0882p7069l6712P899M4969P2523R5049j31691L3729L1660k3747j0806
$$ y = [9976, 23653, 14034, 21479, 19390, 8153, -128296, -125571, -35044, 37248, 33817, 54115, 23057, 24897, 119279, 150807, 95726, 126352, 115597, 154930, 109268, 68007, 65188, -4284, 50710, 65912, 36356, -43590, -35430, -4387, -36375, 47515, 95298, -191, -58557, -140718, -98216, 61395, 43933, 26240, 4404, 172904, 47774, -34488, -81075, -132781, -125082, -83908, -54298, -162622, -233647, -244141, 36190, 80330, 86903, 128, 11455, -49521, -14216, -43553, -128995, 54824, -25595, -46707, -78430, -33246, -6688, -49048, 98900, -26995, -84624, -6226, -18008, 71119, 112137, 16151, -80628, -92720, -205980, -83435, -67000, 14544, 141301, 87242, 46360, -30709, -67421, -59522, -14553, 57970, 153019, 21328, 55057, 86717, 62970, 52164]
2641E2164J26621n9468j42246q0395j19796n3577J64541J12089o5188O9971o5302
2630f0586o7652k680m5559J15855O8795M2906p1888j8890M8826j15469Q9123L4873
2618A7654l2752k4207O7750N9747o3679n2333M9615q2261K9407L0631J45344P397
2606A52313J7778k5011k8454p7036M6507j49357K1497K27426n5685l7277o3815
2595B8886k7930j36746J05831L7020N7567l5243K062p2421r0652O2876j1581J43686
2583F3355J56184r354j85756R5126K682p2986j68788K0659N6028q2857O2499n1710
2571a14918O840J0583J27337m9667p2802R1065N2161m6458N4695Q3717N3985m4430
2559A52108j26157r9057l4720M2898L9767L4899M4448j51719N6295J7576k3106
$$ y = [52164, 178785, 119317, -22929, -103324, -223120, -276697, -112156, -67, -65255, 4716, -60586, -128238, -130918, -176477, -60622, 8173, 51079, -20809, -39699, 9127, -106342, -17219, 17654, -15098, -39305, 28445, 88192, 24513, -27820, 21795, -60466, -31059, -428, 144916, 152313, 170091, 145080, 116626, 39590, 86097, -63260, -41763, 185663, 129978, 92701, 28886, 956, -135790, -29959, 7061, 64628, 29385, 31447, -40974, -131626, -68750, -80331, 63355, 219539, 210185, 24429, 119555, 122237, 49251, -119537, -98878, -42850, -125707, -63208, -114918, -108078, -97495, 29842, -19825, -92627, -1562, 50599, 4141, 58836, 142553, 196538, 152108, 25951, -73106, -107826, -64928, -25161, 9738, 54186, -97533, -41238, -23662, -46768]
2548d6768Q2919J11534M7917l7006k07746m6981q3495J46828J7743P1413n475
2537E0883j03432Q5794q6727K5015m5244K8110j959m8844j0091p5996n4363J85233
2525e1621O464J04235r3872o1819p408n4392P1712J93978l1306n2104m3643q2986
2513a02762J10716q8988n8355K2402J11763R801o4550j7102j2364N9052J5090
2502a5297j27340J03764J168o6861m7555J41100n716j65567J70191p5793J5925
2491g1981k8588N696Q7452p6362O2519l2624l4453j9866J09483k2458p4430o3318
2479a58930r1845J02653M8924L7981j25076m7413J05430K3109K5629P2414j9497
2468b6621L1373N2344m784l5625j55293j0125m5309J04000J99677r3603R9813
$$ y = [-46768, 36151, 147685, 195602, 158596, -49150, -96131, -179626, -32798, -15055, 56358, 50883, -52549, 33245, -53482, -28467, -73711, -45601, -47560, -96404, -106495, -182491, -236854, -51621, -45157, 59078, -34794, -96613, -104021, -158413, -86701, 107277, 75971, 23867, -19776, -102762, 7954, -81034, -139389, -116987, -5224, 4577, -59973, -77075, -89439, -30387, -15297, -142637, -38873, -37705, -104566, -152121, -11021, -16737, -182304, -12113, -87906, -71981, -100569, -94873, -7421, -83783, -21264, -53888, -88341, -108207, 1276, -21182, -95612, -158930, -250775, -148122, -99198, -61217, -186293, -233706, -128276, -105167, -79538, -7124, -26621, 4752, 57096, 52312, 16687, -138606, -148731, -194040, -90040, 109637, 16034, 115847]
2457A15847n3744j49860K3177N8354o7163o6968J4459J08992o8487l0484r854
2446a25731Q1746j0929O605M5325j7335j46148O0007M2898j06025J67266m9228
2435e1549J7464k6834j9152Q6020J03402M6091m2155j21495j12136O100K07113
2424I2869K9973K9867n9496j27422n668p9241L1869Q5126N5117K876o5694n0602
2412f0426J7765J17140K0461m7185o044J4343j75370j71930K55334N525q1664
2401a12051K467m3206N7656K9807j35426J36303M4687p5228m776P0768q1066m0814
2389a50879R875l1738K12094m9795o2885N3254p589p9211Q6434M2235J29718N3963
2377B05476j44284j45605P3103J16100K18J6294N3463q5511N9941Q8167p0902
$$ y = [115847, 62103, -87757, -64580, -6226, -73389, -140357, -125898, -16906, -85393, -115877, -125731, -43985, -54914, -48309, -2984, -20319, -166467, -106460, -63562, -169587, -2321, -51549, -34085, -60919, -80071, 5949, 109351, 155442, 113287, -8208, -120344, -114244, 92869, 122842, 152709, 93213, -34209, -39877, -119118, -87249, -2123, 52994, 55870, -9824, -60426, -42661, 74479, 94940, 47755, 41711, 56054, -119316, -291246, -35912, -30387, -112051, -109584, -152790, -95134, -65327, -200753, -64450, -19763, -94991, -99767, -28999, -110065, -150879, -141004, -172742, 39352, -10443, -73328, -20074, -27663, -106874, -20440, 21795, 151513, 205476, 61192, -84413, -11310, 104790, 105008, 121302, 174765, 89254, 149195, 237362, 166460]
2366A66460m7344J51696k15122o4977k4671l9841J527N0461J22560l6937m4515
2355A9297j0595M2030j73136l6549R8509J03706j12377j2857J64027J4452O8043
2344A64550m6317j08198P0134M7208k56641j3216M0473m0944J61467L7668J51281
2333B07465o9042r2948Q167M6190q0605Q289K8364J6596j41762j65096P5739K74050
2321A15407k0040k6523J502r6634J8866j4219M755n2070J07973p9532j11340N3941
2309i7914M3504J2184P1428m6061p9615O0972k5963P5960P6782J032K1179L2706
2297A46194j78141n8414J2611J11568o7415l7679L5139O1410k8579j7436k1025
2286d1767P8857j4156p6342P9497k5624k9502l0700J64753o3432J07757k28568
$$ y = [166460, 119116, 270812, 55690, -9287, -33958, -73799, -72272, -21811, 100749, 63812, 19297, 8702, 50732, -122404, -158953, -60444, 43262, -69115, -81972, 82055, 96507, 164550, 118233, 10035, 80169, 127377, -129264, -142480, -102007, -142951, 18516, 56184, 207465, 138423, 45475, 53642, 99832, 19227, 27516, 55880, 72476, -69286, -234382, -158643, 115407, 95367, 68844, 70346, -26288, -7422, -21641, -16886, -68956, 39017, -40515, -151855, -97914, -54410, -42226, 29202, -16859, -96474, -35502, -61465, 14495, 91277, 92309, 113488, 146194, -31947, -90361, -77750, 33818, -33597, -71276, -36137, 25273, -3306, -20742, -41767, 37090, 22934, -53408, 26089, 465, -29037, -59737, 105016, 41584, 149341, -79227]
2275g9227j01556k3585K12185P2489j79341J05941K3501m809R6504r4421n2476
2264b4795O0410M8872k0707j0864M8258l2322K7597j69163L4194N3267O7976m9141
2252C3582j48927J24212k8521o0008p9589j60M6040K8713J50612k5998R9322n6658
2240H2620j25700O4250M47l9659J61351O0411j1728m3086M7109L804J199M3012
2228B44030l1119k6854j57043J4086R73J88629j16155j9200J17600j48844o541
2217E9562j8754J1909j9268K02515l6196j4256P0459p7733P2109J90457j12271
2206C28533q0791J18006K8852j95073n3747J56063j6340P3903J2125L3301k3337
2195C81495M9129K5385Q5451J08068r457l5515l616o2747j822l3896O1488J49545
$$ y = [-79227, -180783, -204368, 7817, 80306, -99035, 6906, 30407, 25598, 122102, 27681, -24795, 35615, 84487, 63780, 52916, 101174, 68852, 96449, -72714, -38520, 14747, 82723, 33582, -115345, 8867, -19654, -79662, -159251, -159411, -113371, -84658, 65954, 39956, 139278, 82620, -43080, 21170, 21617, -18042, 143309, 203720, 191992, 148906, 196015, 199819, 201018, 244030, 212911, 186057, 29014, 43100, 44073, 232702, 116547, 97347, 214947, 66103, 59562, 40808, 52717, 33449, 235964, 199768, 185512, 255971, 178238, 250347, 440804, 328533, 247742, 365748, 394600, 199527, 145780, 301843, 285503, 359406, 371531, 404832, 381495, 430624, 456009, 541460, 649528, 640071, 604556, 600940, 538193, 536371, 502475, 563963, 713508]
2183G13508l8158p5435J85j6809Q0963J44358j0738P1752o1676p4298J97817j9228
2171I12241n8379P5582O7586N6148j1114o2706K01014j0160n591Q8310j43224
2160A109707j18326J06723L7512l5630L6314j1649O1517O3610p349p6293P9568
2149A245704J96745O414k614O5352P1292J31999M0999J47944J76282K19179J12020
2138B411316j8042J58974J15247J38241K02069J25231J26172J84431K46126J05926
2128C795691J51659K06174L04215L10564L34066L00127M49439M83543N70315N73705
2118G479498M61108J27093K50222N61872J157285J407055J687267J866753K323116
2109A7321269L427762N016611O698924Q606227Q622499O718360k054270j0410416
$$ y = [713508, 675350, 599915, 600100, 583291, 664254, 808612, 797874, 869626, 807950, 733652, 931469, 912241, 853862, 929444, 997030, 1053178, 1042064, 979358, 1180372, 1170212, 1164621, 1252931, 1109707, 991381, 1098104, 1135616, 1099986, 1136300, 1124651, 1186168, 1249778, 1242429, 1166136, 1245704, 1442449, 1448863, 1446249, 1511601, 1582893, 1714892, 1755891, 1903835, 2080117, 2299296, 2411316, 2393274, 2552248, 2667495, 2805736, 3007805, 3133036, 3259208, 3443639, 3689765, 3795691, 3947350, 4153524, 4457739, 4768303, 5102369, 5402496, 5851935, 6335478, 6905793, 7479498, 7940606, 8067699, 8317921, 8879793, 10037078, 11444133, 13131400, 14998153, 17321269, 20749031, 25765642, 32464566, 41070793, 49693292, 56411652, 54357382, 43946966]
2101D3946966r153743o779063m767547l615222k684295k252690j660593j247124
2093A1786689q08667q18259p03953n91401n75437m75245o96656p59242n27001
2084E830828l08160l40588l69730l01484k79927k23310k21184p7069r602k62604
2074C437170j16416j68516k36921j28075j62612q3542j49870r6342j06681M5550
2064B233745j66290N2813J7447j07807R389j02046n9772j86007K3411n0338J7135
2053A681680R298j07296l66131j9091R0499O1617r168l6136k5840j24436j36562
$$ y = [43946966, 34793223, 28014160, 23246613, 19631391, 16947096, 14694406, 13033813, 11786689, 10978022, 10159763, 9455810, 8864409, 8288972, 7813727, 7117071, 6357829, 5830828, 5522668, 5182080, 4812350, 4510866, 4230939, 4007629, 3786445, 3709376, 3699774, 3437170, 3320754, 3152238, 2915317, 2787242, 2624630, 2541088, 2391218, 2294876, 2188195, 2233745, 2067455, 2120268, 2137715, 2029908, 2039297, 1937251, 1877479, 1691472, 1714883, 1664545, 1681680, 1690978, 1583682, 1217551, 1198460, 1288959, 1350576, 1341408, 1305272, 1279432, 1154996, 1018434]
$$ [...]
##END NTUPLES=NMR SPECTRUM
##END=
