##TITLE=1H_TG-2357-A-5 
 CDCl3
 8 sc, 
 1.09.2022
##JCAMPDX= 6.0         $$ Bruker NMR JCAMP-DX V2.0
##DATA TYPE= NMR SPECTRUM
##DATA CLASS= NTUPLES
##ORIGIN= UXNMR, Bruker Analytische Messtechnik GmbH
##OWNER= root
$$ XWIN-NMR		Version 3.5
$$ Thu Sep  1 09:41:13 2022 Russian Standard Time (UT+4h)  she@DPX200
##.OBSERVE FREQUENCY= 200.1313499994
##.OBSERVE NUCLEUS= ^1H
##.ACQUISITION MODE= SIMULTANEOUS
##.ACQUISITION SCHEME= undefined
##.AVERAGES= 8
##.DIGITISER RES= 18
##SPECTROMETER/DATA SYSTEM= spect
##.PULSE SEQUENCE= zg30
##.SOLVENT NAME= CDCl3
##.SHIFT REFERENCE= (INTERNAL, CDCl3, 0, 15.7546)
##AUDIT TRAIL= $$ (NUMBER, WHEN, WHO, WHERE, WHAT)
$$ ##TITLE= Audit trail, XWIN-NMR		Version 3.5
$$ ##JCAMPDX= 5.01
$$ ##ORIGIN= Bruker BioSpin GmbH
$$ ##OWNER= she
$$ F:/spectra/data/she/nmr/H-F/1/pdata/1/auditp.txt
$$ ##AUDIT TRAIL=  $$ (NUMBER, WHEN, WHO, WHERE, WHAT)
(   1,<2022-09-01 09:39:47.95 +0400>,<she>,<DPX200>,
      <created by zg, POWCHK disabled, PULCHK disabled
       configuration hash MD5:
       00 E9 B6 7A A2 85 ED C7 34 08 36 98 17 FE 4E 26
       data hash MD5: 16K
       A4 C4 B2 35 5E 0D 7C DB 64 24 62 20 67 B5 50 F6>)
(   2,<2022-09-01 09:39:53.89 +0400>,<she>,<DPX200>,
      <Start of raw data processing
       efp BC_mod = 2 LB = 0.24 FT_mod = 6 PKNL = 1 PHC0 = -18046.44 PHC1 = 26.00069 SI = 16K 
       data hash MD5: 16K
       FA E9 97 C2 48 09 AC 56 A5 ED EE 3A B9 24 3E 08>)
(   3,<2022-09-01 09:40:18.57 +0400>,<she>,<DPX200>,
      <pk PHC0 = 9.02102 PHC1 = -12.4 
       data hash MD5: 16K
       B7 73 A8 74 02 77 25 11 05 A1 21 5E 8F EE 1C 13>)
(   4,<2022-09-01 09:40:21.90 +0400>,<she>,<DPX200>,
      <abs ABSG = 5 
       data hash MD5: 16K
       21 F9 6B 40 51 80 0F 92 5A C5 2B 17 12 D0 24 8C>)
$$ ##END=
$$ 
$$ hash MD5
$$ 85 31 B1 44 4D 8D 3F 2B AF 65 3D 26 8B 58 30 7D
##$RELAX= 
##$RELAX= 
##$RELAX= 
##$RELAX= 
##$RELAX= 
##$RELAX= 
$$ Bruker specific parameters
$$ --------------------------
##$DU= <F:/spectra>
##$EXPNO= 1
##$NAME= <H-F>
##$PROCNO= 1
##$TYPE= <nmr>
##$USER= <she>
##$AMP= (0..31)
100 100 100 100 100 100 100 100 100 100 100 100 100 100 100 100 100 100 
100 100 100 100 100 100 100 100 100 100 100 100 100 100 
##$AQSEQ= 0
##$AQ_mod= 1
##$AUNM= <au_zg>
##$AUTOPOS= <>
##$BF1= 200.13
##$BF2= 200.13
##$BF3= 200.13
##$BF4= 200.13
##$BF5= 200.13
##$BF6= 200.13
##$BF7= 200.13
##$BF8= 200.13
##$BYTORDA= 1
##$CFDGTYP= 0
##$CFRGTYP= 5
##$CHEMSTR= <none>
##$CNST= (0..31)
1 1 145 1 1 1 1 1 1 1 1 1 1 1 1 1 1 1 1 1 1 1 1 1 1 1 1 1 1 1 1 1 
##$CPDPRG= <>
##$CPDPRG1= <>
##$CPDPRG2= <>
##$CPDPRG3= <>
##$CPDPRG4= <mlev>
##$CPDPRG5= <mlev>
##$CPDPRG6= <mlev>
##$CPDPRG7= <mlev>
##$CPDPRG8= <mlev>
##$CPDPRGB= <>
##$CPDPRGT= <>
##$D= (0..31)
0 1.2 0 0 0 0 0 0 0 0.06 0 0.03 0 0 0 0 0.0002 0 0 0 0 0 0 0 0 0 0 0 0 
0 0 0 
##$DATE= 1662010787
##$DBL= (0..7)
120 120 120 120 120 120 120 120 
##$DBP= (0..7)
150 150 150 150 150 150 150 150 
##$DBP07= 0
##$DBPNAM0= <>
##$DBPNAM1= <>
##$DBPNAM2= <>
##$DBPNAM3= <>
##$DBPNAM4= <>
$$ [...]
##$SUBNAM3= <"">
##$SUBNAM4= <"">
##$SUBNAM5= <"">
##$SUBNAM6= <"">
##$SUBNAM7= <"">
##$SUBNAM8= <"">
##$SUBNAM9= <"">
##$SW= 18.0517283424941
##$SWIBOX= (0..15)
0 0 2 0 0 0 0 0 0 0 0 0 0 0 0 0 
##$SW_h= 3612.71676300578
##$TD= 16384
##$TD0= 1
##$TE= 0
##$TE2= 300
##$TE3= 300
##$TEG= 300
##$TL= (0..7)
0 120 120 120 120 120 120 120 
##$TP= (0..7)
150 150 150 150 150 150 150 150 
##$TP07= 0
##$TPNAME0= <>
##$TPNAME1= <>
##$TPNAME2= <>
##$TPNAME3= <>
##$TPNAME4= <>
##$TPNAME5= <>
##$TPNAME6= <>
##$TPNAME7= <>
##$TPOAL= (0..7)
0.5 0.5 0.5 0.5 0.5 0.5 0.5 0.5 
##$TPOFFS= (0..7)
0 0 0 0 0 0 0 0 
##$TUNHIN= 0
##$TUNHOUT= 0
##$TUNXOUT= 0
##$USERA1= <user>
##$USERA2= <user>
##$USERA3= <user>
##$USERA4= <user>
##$USERA5= <user>
##$V9= 5
##$VALIST= <valist>
##$VCLIST= <CCCCCCCCCCCCCCC>
##$VD= 0
##$VDLIST= <DDDDDDDDDDDDDDD>
##$VPLIST= <PPPPPPPPPPPPPPP>
##$VTLIST= <TTTTTTTTTTTTTTT>
##$WBST= 1024
##$WBSW= 4
##$XGAIN= (0..3)
0 0 0 0 
##$XL= 0
##$YL= 0
##$YMAX_a= 318126
##$YMIN_a= -552561
##$ZGOPTNS= <>
##$ZL1= 120
##$ZL2= 120
##$ZL3= 120
##$ZL4= 120
##$ABSF1= 15.7502
##$ABSF2= -2.301649
##$ABSG= 5
##$ABSL= 3
##$ALPHA= 0
##$AQORDER= 0
##$ASSFAC= 0
##$ASSFACI= 0
##$ASSFACX= 0
##$ASSWID= 0
##$AUNMP= <proc_1d>
##$AZFE= 0.1
##$AZFW= 0.1
##$BCFW= 0
##$BC_mod= 2
##$BYTORDP= 0
##$COROFFS= 0
##$CY= -3
##$DATMOD= 1
##$DC= 0
##$DFILT= <>
##$DTYPP= 0
##$F1P= 0
##$F2P= 0
##$FCOR= 1
##$FTSIZE= 16384
##$FT_mod= 6
##$GAMMA= 0
##$GB= 0
##$INTBC= 1
##$INTSCL= 3.70164e-10
##$ISEN= 128
##$LB= 0.24
##$LEV0= 0
##$LPBIN= 0
##$MAXI= 10000
##$MC2= 0
##$MEAN= 0
##$ME_mod= 0
##$MI= 1.114404
##$NCOEF= 0
##$NC_proc= -6
##$NLEV= 6
##$NOISF1= 3.799351
##$NOISF2= 2.8
##$NSP= 0
##$NTH_PI= 0
##$NZP= 0
##$OFFSET= 15.7546
##$PC= 1
##$PHC0= -18037.42
##$PHC1= 13.60069
##$PH_mod= 1
##$PKNL= yes
##$PPARMOD= 0
##$PSCAL= 0
##$PSIGN= 0
##$REVERSE= no
##$SF= 200.130003389312
##$SI= 16384
##$SIGF1= 3
##$SIGF2= 2
##$SINO= 5.538805
##$SIOLD= 16384
##$SREGLST= <1H.CDCl3>
##$SSB= 0
##$STSI= 16384
##$STSR= 0
##$SW_p= 3612.71676300578
##$SYMM= 0
##$S_DEV= 0
##$TDeff= 16384
##$TDoff= 0
##$TI= <>
##$TILT= no
##$TM1= 0
##$TM2= 0
##$TOPLEV= 0
##$USERP1= <user>
##$USERP2= <user>
##$USERP3= <user>
##$USERP4= <user>
##$USERP5= <user>
##$WDW= 1
##$XDIM= 16384
##$YMAX_p= 474202055
##$YMIN_p= -766795
$$ End of Bruker specific parameters
$$ ---------------------------------
##NTUPLES= NMR SPECTRUM
##VAR_NAME=  FREQUENCY,     SPECTRUM/REAL,   SPECTRUM/IMAG
##SYMBOL=    X,             R,               I
##VAR_TYPE=  INDEPENDENT,   DEPENDENT,       DEPENDENT
##VAR_FORM=  AFFN,          ASDF,            ASDF
##VAR_DIM=   16384,         16384,           16384
##UNITS=     HZ,            ARBITRARY UNITS, ARBITRARY UNITS
##FACTOR=    0.220516191357247, 1,           1
##FIRST=     3152.96806558712, 0,            0
##LAST=      -459.748697418662, 0,           0
##MIN=       -459.748697418662, -766795,     0
##MAX=       3152.96806558712, 474202055,    0
$$ Real data points
##PAGE= N=1
##DATA TABLE= (X++(R..R)), XYDATA
$$ [...]
7026A2642197N22776P15732O87981Q48348R37906R85610J096072J409923J561665
7017B1408210J732604J999162K107395J867525J419248J183855Q49033Q39332
7009C3406364N13774L17826O3520k08960N5413J98874j01327p75378j427867j363013
6999C0679226j379132j420264j456452j620343j759630j534505j317339j313698
6991A8877863r22119q14782q52525o52653o50803m82068l36147k24240j58426
6982A3784100r7398j2985m2746J02419J60197J19080K52991L09595M48357N05359
6972A5528969M81140O31779Q27525P87257R50841J075113J140750J352913J559144
6963B4335431J865012K157878K624555L094039L507375L807160M079326M161890
$$ y = [12642197, 13164973, 13880705, 14568686, 15417034, 16354940, 17340550, 18436622, 19846545, 21408210, 23140814, 25139976, 27247371, 29114896, 30534144, 31717999, 32567032, 33406364, 33920138, 34237964, 34301484, 34092524, 34147937, 34346811, 34245484, 33470106, 32042239, 30679226, 29300094, 27879830, 26423378, 24803035, 23043405, 21508900, 20191561, 18877863, 17955744, 17140962, 16288437, 15635784, 14984981, 14502913, 14166766, 13942526, 13784100, 13686702, 13673717, 13630971, 13733390, 13893587, 14012667, 14265658, 14575253, 15023610, 15528969, 16010109, 16641888, 17469413, 18256670, 19207511, 20282624, 21423374, 22776287, 24335431, 26200443, 28358321, 30982876, 34076915, 37584290, 41391450, 45470776, 49632666]
6955D9632666M667693N489357O396254P447065Q154320Q026393O549763L867124
6947A00230635J229156o53914j603287k166200k239534k014511q82122o78451
6939I1221772k885201n948341q812232r532417q580262p283588n880867m702906
6931C7595958l829709l119773k721044k563837k079588j696735j548353j318834
6923A8718085j269309j194585r25796q06560q10111p77740o03527n89963m94683
6914A1245811m85464m11502m22980l82620l67605m09226m12092m04556l85333
6905G564433l65597k99425k00485k70888k52816j51965l21946j81337j31919r2007
6895E296048o5794j90101j19990l2051j09569j09764j41782j54374n6964n8225
$$ y = [49632666, 54300359, 59789716, 66185970, 73633035, 81787355, 89813748, 96363511, 100230635, 101459791, 100805877, 99202590, 97036390, 94796856, 92782345, 91900223, 91221772, 88336571, 82388230, 73575998, 64043581, 55463319, 48179731, 42298864, 37595958, 33766249, 30646476, 27925432, 25361595, 23282007, 21585272, 20036919, 18718085, 17448776, 16254191, 15328395, 14521835, 13711724, 12933984, 12330457, 11740494, 11245811, 10760347, 10348845, 9925865, 9543245, 9175640, 8766414, 8354322, 7949766, 7564433, 7198836, 6899411, 6698926, 6428038, 6175222, 6023257, 5701311, 5519974, 5388055, 5296048, 5230254, 5040153, 4920163, 4888112, 4778543, 4668779, 4526997, 4372623, 4315659, 4257434]
6885D257434k976p5787o1022k5126j15361o788L4833K4002j35411K8382m4034
6874C878146l1841p7313J3886p3010j07983L819j14174K680r9478r2545n6676
6863C245511l5676j13603q2171j08799p6300L8417o5217j45166n2589l2370j931
6852B570106O236m3015O105n0811L3614m2577j4810P8578j27833j32014Q7925
6841B371504m4548Q7965r4204o3337j7183r8369k1268j4331n7917m8084j2686
6830A987542R638k2257L8337o6539l3744o4337k9150R8076o1877m6879l8211K4104
6818A794703O9443M3209p7360O6337O3656j07298m5116M5618N2633k9213k7348
6807A849264r010l8034M2414r855R8282r0381N7692Q756J584J8452M7638k6621
$$ y = [4257434, 4254458, 4178671, 4117649, 4092523, 3977162, 3970374, 4005207, 4029209, 3893798, 3922180, 3878146, 3846305, 3768992, 3782878, 3709868, 3601885, 3605704, 3491530, 3494210, 3394732, 3302187, 3245511, 3209835, 3096232, 3014061, 2905262, 2828962, 2867379, 2802162, 2656996, 2604407, 2572037, 2570106, 2576342, 2533327, 2539432, 2488621, 2522235, 2479658, 2464848, 2543426, 2415593, 2283579, 2371504, 2326956, 2414921, 2320717, 2257380, 2240197, 2141828, 2120560, 2106229, 2048312, 2000228, 1987542, 1997180, 1974923, 2013260, 1946721, 1912977, 1848640, 1819490, 1917566, 1855689, 1808810, 1770599, 1794703, 1864146, 1907355, 1829995, 1896332, 1959988, 1852690, 1807574, 1853192, 1905825, 1876612, 1849264, 1840254, 1802220, 1844634, 1834779, 1933061, 1842680, 1900372, 1909128, 1910712, 1929164, 1976802, 1950181]
6795A950181k7418j05658N7752J21347o7462l2216J39917R9005K0418o9671m6847
6784B039348K7566J4737Q9322p3585k8189J6846m5628M1531J01376n6849L4652
6773B161127k8764r5670M4654J2003j2338N8527n8513O4371L9607p9523P7486
6762B182967m3070j1907L173J02871J00725o2384n5421N4695P656p6312J7427
6751B220420N786K8219l6861j9212l1221J09063L3916P7517O9826p1320j9936
6740B366197N6198R1540M8591l1078m5280M669K1555Q9045l3295Q9530l2771m1553
6728B583348R9598j0495K2621R5730M3170n5785O074L6862O1333Q786m977K7420
6716B913685L0712O9115l3173L5197P0236N9442M4632P4620l9373M2707J33076
$$ y = [1950181, 1922763, 1817105, 1874857, 1996204, 1928742, 1896526, 2036443, 2135448, 2155866, 2086195, 2039348, 2066914, 2081651, 2170973, 2097388, 2069199, 2086045, 2040417, 2081948, 2183324, 2126475, 2161127, 2132363, 2036693, 2081347, 2093350, 2081012, 2139539, 2081026, 2145397, 2185004, 2105481, 2182967, 2139897, 2127990, 2131163, 2234034, 2334759, 2272375, 2216954, 2271649, 2279305, 2202993, 2220420, 2226206, 2254425, 2217564, 2198352, 2167131, 2276194, 2310110, 2387627, 2457453, 2386133, 2366197, 2422395, 2513935, 2562526, 2531448, 2486168, 2490837, 2512392, 2601437, 2568142, 2657672, 2624901, 2583348, 2682946, 2672451, 2695072, 2790802, 2833972, 2778187, 2784261, 2821123, 2882456, 2891242, 2886265, 2913685, 2944397, 3013512, 2980339, 3015536, 3085772, 3145214, 3189846, 3264466, 3225093, 3267800, 3400876]
6705C400876l770J13072R5268K6172Q8265P1885Q3893J23004K0345M3193M9755
6694D111958M7551J00079K6375O2150m6639Q1785J60980j20388m4904K9336Q3550
6683D491833Q9423N1578M2936J16666K7830Q4718O3090O1301l9849O9884K2620
6672E082030K5254P3985Q5313O0932k2081j13045J19666N4510j15761n8102N4402
6661E247103R7094k6978n0562J24832Q070m352O5099m5222N7562K651N7842P4247
6649E607386M4820r6855Q9373J20475O2491J19682M6996L4097M8341N2041J06455
6638F235302K5714o7387J14286R5804K7232R3229R0633P1811J95458J65188O9722
6627G116992N7698J06523R6042L9790N1526O5706J24025N8120J80565M7712O7356
$$ y = [3400876, 3397106, 3510178, 3605446, 3631618, 3719883, 3791768, 3875661, 3998665, 4019010, 4062203, 4111958, 4159509, 4259588, 4285963, 4348113, 4301474, 4383259, 4544239, 4423851, 4378947, 4408283, 4491833, 4581256, 4632834, 4675770, 4792436, 4820266, 4904984, 4968074, 5029375, 4989526, 5059410, 5082030, 5107284, 5181269, 5266582, 5327514, 5305433, 5192388, 5312054, 5366564, 5250803, 5192701, 5247103, 5344197, 5317219, 5266657, 5391489, 5399559, 5395207, 5460306, 5415084, 5472646, 5475297, 5533139, 5607386, 5652206, 5555351, 5644724, 5765199, 5827690, 5947372, 5994368, 6028465, 6076806, 6128847, 6235302, 6261016, 6193629, 6307915, 6403719, 6430951, 6524180, 6614813, 6686624, 6882082, 7047270, 7116992, 7174690, 7281213, 7377255, 7417045, 7468571, 7534277, 7658302, 7716422, 7896987, 7944699, 8012055]
6616H012055J83026M5316o8441J66197J01538n208o0640J61155J67158R9853J48012
6605H950021L21633J62891P6214R0686m8236N6933M6252j9086K9482J48636J58692
6594I974118J53456J10907J56948R8695N2020O5810L7260K2914r0347k0126p1630
6583A0490025M5777N4330o8660M7878J25292J58223l991n9119j51812p2585k2646
6572A0542712r9047J5727q432m1753N3940M3346J18659m3356J458J17039Q6190
6561A0786483q6099J7090m4343K8184N8141N0212M7049M456j18495o1126r6466
6550A0585086k05083j83362k53535j10642j98827j34262o8801J2550j12212l6068
6540I294844m2600j2182j8814j7879J69396J68898m575J13660K49306L01349L42266
$$ y = [8012055, 8195081, 8240397, 8171956, 8338153, 8439691, 8434483, 8373843, 8534998, 8702156, 8802009, 8950021, 9271654, 9434545, 9510759, 9601445, 9553209, 9610142, 9656394, 9637308, 9666790, 9815426, 9974118, 10127574, 10238481, 10395429, 10494124, 10546144, 10611954, 10649214, 10672128, 10581781, 10561655, 10490025, 10535802, 10590132, 10521472, 10569350, 10694642, 10852865, 10848874, 10789755, 10637943, 10565358, 10542712, 10443665, 10459392, 10450960, 10409207, 10463147, 10506493, 10625152, 10581796, 10583254, 10700293, 10786483, 10700384, 10717474, 10673131, 10701315, 10759456, 10809668, 10856717, 10861173, 10742678, 10681552, 10585086, 10380003, 10196641, 9943106, 9832464, 9633637, 9499375, 9430574, 9443124, 9330912, 9294844, 9252244, 9240062, 9221248, 9203369, 9372765, 9541663, 9537088, 9650748, 9900054, 10201403, 10543669]
6529A0543669K16113J32282j2377l079m9064k48650k05328j94753l77067k68623
6519I533123j65104q0850j11752j27681l8082M4378m1454j5116P7010L9966P5400
6508I189838K40909K19332J71602L06846L98379L95381M31901M07301K46288K7910
6498A2035687o2772j41741j3990j33152n02389n25383m35357k43343k45711p2112
6488I659737j77485r0773k02643r3624j28251j12979j03268n1565r821K8463J45244
6477H863035Q7088L71935K16204K54019K73421K98349Q2823J029j01006k16415
6467A0130482j99839j60596k71803j33211l05783k84057j08954q2960j5594k02102
6457H365583l01912j87571k9915j83290j18755j19893r2427j0049l5380J404R4672
$$ y = [10543669, 10759782, 10892064, 10879687, 10876608, 10827544, 10578894, 10373566, 10178813, 9801746, 9533123, 9368019, 9287169, 9175417, 9047736, 9009654, 9054032, 9012578, 8997462, 9074472, 9114438, 9189838, 9430747, 9650079, 9821681, 10128527, 10526906, 10922287, 11354188, 11761489, 12007777, 12035687, 11972915, 11831174, 11817184, 11684032, 11181643, 10656260, 10220903, 9977560, 9731849, 9659737, 9482252, 9391479, 9188836, 9095212, 8966961, 8853982, 8750714, 8699149, 8689328, 8717791, 8863035, 8950123, 9322058, 9538262, 9792281, 10065702, 10364051, 10446874, 10447903, 10346897, 10130482, 9930643, 9770047, 9498244, 9365033, 9059250, 8775193, 8666239, 8583279, 8567685, 8365583, 8063671, 7876100, 7846185, 7662895, 7544140, 7424247, 7331820, 7321771, 7286391, 7287795, 7382467]
6446G382467J01879K16312R9023k7772J20938r6820j16435O2687n2028j19405
6436G570846j69319p6504o2187k6237r3001J5129n97j80453l2923j09113k9099
6425F806542p6341j04814m6027j47704k9062p9244o5868P6147l4861o2423R6548
6414F332893o3583L706m3775n2788M2764m6753r072q6760J06690J40151L2966
6403F356439j477l5819m2106j03629j8616l6059n999N3960r9788n6920k2077j0254
6391E977655m4833N3166m2997k9304j18250N5921L7767j18908m0155K0508l4764
6380E715806Q1565n7310k0942R7285j18474L4039j6221j986j2888p7559n2207
6369E571108j7118q0347l4408L3529o029j08045m6073r5173N9888l4652j21438
$$ y = [7382467, 7484346, 7700658, 7799681, 7771909, 7892847, 7796027, 7679592, 7742279, 7690251, 7570846, 7401527, 7325023, 7262836, 7236599, 7143598, 7158727, 7158130, 6977677, 6944754, 6835641, 6806542, 6730201, 6625387, 6579360, 6431656, 6402594, 6323350, 6257482, 6333629, 6298768, 6236345, 6332893, 6269310, 6273016, 6229241, 6176453, 6219217, 6172464, 6163392, 6076632, 6183322, 6323473, 6356439, 6354962, 6319143, 6277037, 6173408, 6154792, 6118733, 6112734, 6166694, 6066906, 6009986, 5987909, 5977655, 5932822, 5985988, 5942991, 5913687, 5795437, 5851358, 5889125, 5770217, 5730062, 5750570, 5715806, 5797371, 5740061, 5719119, 5816404, 5697930, 5731969, 5715748, 5713762, 5700874, 5623315, 5571108, 5553990, 5473643, 5439235, 5472764, 5466735, 5358690, 5312617, 5217444, 5277332, 5242680, 5121242]
6358E121242o2425L125O227l6922l07n6762k4577o1796k3293m0635l6127N0478
6346D838228j09662m344l1582m7289r0623k3582o116j08635l4972N4097j8853
6335D416667l3352P4882m6914j08175k6378L7080l4645k4298j7073j11791N0080
6324D176083L078l5960j07849o632Q2210J8340L0183O685j08155j08174O1453
6313D011262J11524J06318p8959o4786m4201J33813k0968O0265l5372n2680R1569
6302D217785n5362L7099m4889J6455Q1028O152o4157j5440J9564k375P0076L699
6290D269635n0444q4116J0615j592Q4498J13232n872J1704M4470P6012q2822m8592
6278D336728L1918O9847P9565q2187L0147J78957p8020j4530J4873M2439J39237
$$ y = [5121242, 5058817, 5061942, 5068169, 5031247, 5030940, 4974178, 4949601, 4887805, 4864512, 4823877, 4787750, 4838228, 4728566, 4724222, 4692640, 4645351, 4554728, 4531146, 4525030, 4416395, 4381423, 4435520, 4416667, 4383315, 4458197, 4411283, 4303108, 4276730, 4313810, 4279165, 4254867, 4237794, 4126003, 4176083, 4179161, 4143201, 4035352, 4028720, 4110930, 4129270, 4159453, 4166138, 4057983, 3949809, 4011262, 4122786, 4229104, 4150145, 4085359, 4041158, 4174971, 4154003, 4214268, 4178896, 4126216, 4217785, 4162423, 4199522, 4154633, 4171088, 4252116, 4258268, 4194111, 4178671, 4198235, 4195860, 4265936, 4269635, 4219191, 4135075, 4145690, 4144098, 4228596, 4341828, 4335956, 4347660, 4392130, 4468142, 4385320, 4336728, 4368646, 4438493, 4518058, 4435871, 4466018, 4644975, 4566955, 4552425, 4567298, 4609737, 4748974]
6267D748974L3367m8765J12823p7970K2291J00295r3720O9670J07807L1758j11
6256E006419j6360O4659K4086p2220Q6312J30706J12486K9822N7705K27840J54324
6245E805779L1015J16429J39429J95372Q7421J65393K38788J49217J52176K41240
6235G322259J46599J43816l5950j1808O2469O6188r1095n524M1472Q6925M6962
6224G772313M5261J09141L4158j23001k28596k11548o1074m2277K4645l7346k8256
6213G253420R9315L7037P4959Q6578K24965J38226J11288L00334K14716J77732
6203H718570L26397L03140L71428M26753M32615M26181M50975M99203L37356n5557
6193A2237061j16255j22050l5221k15789j34611j49242l003J48881J57510J17639
$$ y = [4748974, 4782341, 4733576, 4846399, 4768429, 4790720, 4891015, 4797295, 4866965, 4974772, 5006530, 5006419, 4990059, 5054718, 5078804, 5006584, 5092896, 5223602, 5336088, 5365910, 5423615, 5651455, 5805779, 5836794, 5953223, 6092652, 6288024, 6375445, 6540838, 6779626, 6928843, 7081019, 7322259, 7468858, 7612674, 7576724, 7564916, 7627385, 7693573, 7602478, 7596954, 7638426, 7725351, 7772313, 7817574, 7926715, 7960873, 7837872, 7609276, 7397728, 7336654, 7294377, 7319022, 7281676, 7253420, 7352735, 7389772, 7464731, 7551309, 7776274, 7914500, 8025788, 8326122, 8540838, 8718570, 9044967, 9348107, 9719535, 10146288, 10578903, 11005084, 11456059, 11955262, 12292618, 12237061, 12120806, 11998756, 11963535, 11747746, 11613135, 11463893, 11460890, 11609771, 11767281, 11884920]
6183A1884920l7450k91607m74527m40342m97447m12200k92412j81289j42879j74679
6173H940088q9520M534m8738L371R378M5856P6297P9076L2451N6889J87373K17703
6161I514758J44944K95001K97071J40780K73163J30325j03051L2638L9076R2945
6151A0857650N2932k71914j45088K2758K7518J49541L9933j42804j40189l17146
6141A0133191k89694k89605j76610j42786o3960j70095r7924K1857M7669j3053
6131H958990j36265p3474R3718n416n9528L3391L0103j5778N5601J6387m5769
6120H851960q3858l038j5049j26766k6769J01655j6136o7909M883m5313o7549
6109H506111p3776J52433n8236K3439r8001p3563r7208N9784K2859l7239o8713
$$ y = [11884920, 11847470, 11555863, 11081336, 10640994, 10143547, 9731347, 9438935, 9257646, 9114767, 8940088, 8850568, 8855102, 8806364, 8809735, 8819113, 8864969, 8941266, 9020342, 9052793, 9109682, 9297055, 9514758, 9659702, 9954703, 10251774, 10392554, 10665717, 10796042, 10692991, 10725629, 10764705, 10857650, 10910582, 10638668, 10493580, 10516338, 10543856, 10693397, 10733330, 10590526, 10450337, 10133191, 9843497, 9553892, 9377282, 9234496, 9170536, 9000441, 8902517, 8924374, 8972043, 8958990, 8822725, 8749251, 8842969, 8837553, 8778025, 8811416, 8841519, 8825741, 8881342, 8897729, 8851960, 8768102, 8765064, 8750015, 8623249, 8596480, 8698135, 8681999, 8614090, 8618973, 8573660, 8506111, 8432335, 8584768, 8526532, 8549971, 8451970, 8378407, 8281199, 8340983, 8363842, 8326603, 8257890]
6098H257890k9617O7521Q762Q1970l2943j8931Q4840N2284l4322P9097J17874
6087H634425L7596Q9368L3115J14191R7608O9255K64227Q5715J8220J43920J07217
6076I694857L9871Q3750K17960J65152L20479K29895K36427J59572K25117K25871
6066A1598951K67171K56609L91630M56812K76225L19567K21511n50Q9854k9272
6056A3848508k3772P7267K4831o569R1959K46547J75436Q1959j28677n2859j13527
6045A4221103p9407j64814J8638J20689K80730K51353L42215L86596M94652M26508
6035A6298263L35003K97288J50453K31654L02757J44651K05270L30402M34542
6026A8730283N12061N38705L35088J12234l1443j62332j52081J1363p7580j25176
$$ y = [8257890, 8228273, 8295794, 8304556, 8386526, 8353583, 8334652, 8419492, 8471776, 8437454, 8516551, 8634425, 8672021, 8761389, 8794504, 8908695, 9006303, 9075558, 9339785, 9425500, 9443720, 9587640, 9694857, 9734728, 9818478, 10036438, 10201590, 10522069, 10751964, 10988391, 11147963, 11373080, 11598951, 11866122, 12122731, 12514361, 12971173, 13247398, 13566965, 13788476, 13787926, 13877780, 13848508, 13824736, 13902003, 13926834, 13920265, 14012224, 14258771, 14434207, 14516166, 14387489, 14334630, 14221103, 14141696, 13976882, 13995520, 14116209, 14396939, 14648292, 14990507, 15377103, 15871755, 16298263, 16633266, 16930554, 17081007, 17312661, 17615418, 17760069, 17965339, 18295741, 18730283, 19242344, 19781049, 20116137, 20228371, 20196928, 20034596, 19882515, 19893878, 19816298, 19691122]
6016A9691122Q0959P4974R1352K66950K31966J17370Q0637l7780k96114j37890
6006B0163546j44538j84197m2559J8178J48945L24666L14611M38498L05158K63544
5996B1605852J40600R3614J14237R1575K97805J65530L25455L71950L98748M22325
5986B4027691N21365N87668N49888M19666L79746M03545M91124N74924P74143
5977B8729760P03936P75618P29035P46216O58051O30404N00514L65614L30890
5968C4170038M54588L56870L61588N72439N88082N81605M77405L49816O3562k42674
5958C7733319k52698j98410j13425q5602n9483P2909P4338P7849K11568J07621
5948C7567986m4658L3577j09715j00326q7666j09398M6372k3192j0984Q2750o8968
$$ y = [19691122, 19772081, 19847055, 19938407, 20205357, 20437323, 20554693, 20635330, 20597550, 20301436, 20163546, 20019008, 19834811, 19792252, 19810430, 19959375, 20284041, 20598652, 21037150, 21342308, 21605852, 21746452, 21840066, 21954303, 22045878, 22343683, 22509213, 22834668, 23206618, 23605366, 24027691, 24549056, 25136724, 25686612, 26106278, 26486024, 26889569, 27380693, 27955617, 28729760, 29433696, 30209314, 30938349, 31684565, 32342616, 32973020, 33473534, 33839148, 34170038, 34624626, 34981496, 35343084, 35915523, 36503605, 37085210, 37562615, 37912431, 37975993, 37733319, 37480621, 37282211, 37168786, 37083184, 37023701, 37096610, 37170948, 37248797, 37460365, 37567986, 37523328, 37556905, 37447190, 37346864, 37259198, 37149800, 37196172, 37172980, 37161996, 37244746, 37175778]
5937C7175778j06060L4874k3048o0300j82473l740n4740n3330j83227r6515L1077
5926C6478296k50676o1456m742j1206N212k04325k38848k64219j55474m0203j09855
5915C5142504q3932j06666j0372j03109M7195J96168P693P4004J21731L37673
5905C5622889L36799K83167L95615N77410N95568N12499O49323P57009Q71774
5896D0602053P29984P75207P07693P31253P13605P17070O26502M72904L13608
5887D6389879J51933L9937p8294k98399l51354l91162m31984n80934o82352o75124
5877D3092146o37183o29907n53684o94425o20902m69779l67742k74697o1029k3309
5867C8759489l6393j00368r4271Q6325n493J9028Q4876J80361L35711L94472N02624
$$ y = [37175778, 37069718, 37104592, 37081544, 37021244, 36838771, 36835031, 36780291, 36726961, 36543734, 36447219, 36478296, 36227620, 36166164, 36161422, 36150216, 36155428, 35951103, 35712255, 35448036, 35292562, 35252359, 35142504, 35058572, 34951906, 34941534, 34838425, 34885620, 35081788, 35089481, 35163485, 35285216, 35622889, 35959688, 36242855, 36638470, 37215880, 37811448, 38323947, 38973270, 39730279, 40602053, 41332037, 42107244, 42814937, 43546190, 44259795, 44976865, 45603367, 46076271, 46389879, 46541812, 46581749, 46503455, 46205056, 45853702, 45462540, 45030556, 44449622, 43767270, 43092146, 42454963, 41825056, 41271372, 40576947, 39956045, 39486266, 39118524, 38843827, 38782798, 38759489, 38723096, 38622728, 38528457, 38614782, 38609289, 38628317, 38713193, 38893554, 39229265, 39623737, 40126361]
5856D0126361N51619M51893L75597L33059K04766J43925R1586J6841J23480p956
5846D2411171l0773J64929J2206O3098K71377K98398J71190J43640o5217j49867
5836D3290152j90799k1242l1803K2906L35290J91706K61845K29827L97847O58434
5826D5144163M50745N78202P62967P75886Q39457Q81779J052327J276462J333625
5817E3095613J319036J430758J533607J519294J639511K016429K287235K392399
5809F7233882K597831K995811L217829L588378L932568M168126M569658M850897
5801I7154980N009291N361304N628471O002934O129353O186394N858546N384200
5793A42715473M469158L570984K689962J847264J271858P40173L02580Q8702m40784
$$ y = [40126361, 40677980, 41129873, 41505470, 41838529, 42043295, 42187220, 42278806, 42295647, 42419127, 42411171, 42380398, 42545327, 42557533, 42620631, 42892008, 43190406, 43361596, 43505236, 43440019, 43290152, 43099353, 43078111, 43046308, 43069214, 43404504, 43596210, 43858055, 44087882, 44485729, 45144163, 45594908, 46173110, 46936077, 47711963, 48551420, 49433199, 50485526, 51761988, 53095613, 54414649, 55845407, 57379014, 58898308, 60537819, 62554248, 64841483, 67233882, 69831713, 72827524, 76045353, 79633731, 83566299, 87734425, 92304083, 97154980, 102164271, 107525575, 113154046, 119156980, 125286333, 131472727, 137331273, 142715473, 147184631, 150755615, 153445577, 155292841, 156564699, 157304872, 157607452, 157696154, 157255370]
5784A57255370q85591j376398k103804k211389k450984k130524j735895j272420
5776A43088365n68040j73079J87850M21799M18634k6780n03371j060810j361567
5767A40423001j840463k296512k721177k923344l211594l543722m008110m546290
5759A15331789n007491n307498n289706n126079m967038m785348m407938m206815
5751G6233876l999628l569307l275688l002779k754527k718097k467561k306753
5743E2139536k129079k042344j921875j722867j611180j500849j534748j341310
5735C8335284j284489j293258j220811j174180j045395r19535r82718r28809q17928
5726B8668161p91694p83650o95829o43329n57485n87794o72820n82297n30514
$$ y = [157255370, 156369779, 154993381, 152889577, 150678188, 148227204, 146096680, 144360785, 143088365, 142520325, 142347246, 142535096, 142956895, 143375529, 143348749, 142845378, 141784568, 140423001, 138582538, 136286026, 133564849, 130641505, 127429911, 123886189, 119878079, 115331789, 110324298, 105016800, 99727094, 94601015, 89633977, 84848629, 80440691, 76233876, 72234248, 68664941, 65389253, 62386474, 59631947, 56913850, 54446289, 52139536, 50010457, 47968113, 46046238, 44323371, 42712191, 41211342, 39676594, 38335284, 37050795, 35757537, 34536726, 33362546, 32317151, 31397616, 30414898, 29486089, 28668161, 27876467, 27092817, 26396988, 25753659, 25196174, 24608380, 23935560, 23353263, 22822749]
5717B2822749n56196o63833n34213m75372l99567m95844m65521n50886m29204
5708A8252113l83234l66229m58571l61234k37250l74230l19989k71451k69916
5699A5210009k26932k03417j35171j95311j27990k09749r4670j48646j47101L281
5689A3724303j24202p3008o1892j03380j38392j02133J3624m8479j51505O5677
5679A3000613j2757k47379j50247k42080j00107o9392j86457j99890k00324j004
5669A1590976p6416j95165l7496j62259j66200J853n6872k5972j26174j20002
5659A0626273Q0853K9155r1254k9003p9464k584k6186q4049J1751q1866j5548
5648A0338078r4693R9643o004J5994o444l2970j8735m6502L0982Q0315M6607J5502
$$ y = [22822749, 22266553, 21602720, 21068507, 20593135, 20193568, 19697724, 19232203, 18681317, 18252113, 17868879, 17502650, 17044079, 16682845, 16445595, 16071365, 15751376, 15479925, 15210009, 14983077, 14779660, 14644489, 14449178, 14321188, 14111439, 14016769, 13868123, 13721022, 13724303, 13600101, 13527093, 13465201, 13361821, 13223429, 13121296, 13134920, 13086441, 12934936, 13000613, 12987856, 12740477, 12590230, 12348150, 12248043, 12178651, 11992194, 11792304, 11591980, 11590976, 11514560, 11319395, 11281899, 11119640, 10953440, 10955293, 10898421, 10872449, 10746275, 10626273, 10707126, 10736281, 10645027, 10616024, 10536560, 10533976, 10507790, 10423741, 10435492, 10353626, 10338078, 10243385, 10343028, 10337024, 10353018, 10346574, 10313604, 10294869, 10248367, 10279349, 10359664, 10406271, 10421773]
5636A0421773O5985O9799J2363p160J06470O0294M0205J16952O6614N7615J05320
5625A1116230J84634K39687J32587R2668N2679R0259R7288J67334P6753N8167
5615A2308286O3661J60043O7614l5806m0491O5383R7726J10045M8696J8105K0112
5604A2883374J00778j3841j9460L0013K8810M5603O5527P6184J3439j18945m5298
5593A3046184O317J35219J5679M5778j01089j17699J4013n7915K7756Q162k0902
5582A3001503k01889o2042O7650j57395M4217p1611p0123o92l4713j02223j9589
5571A2393093K9667L980K2181j0226K3664k6086o4169l1507n2727o1948j02895
5560A2123027p3192l5922n2868J31877N5514j05709K7948N156r9111J0811o4438
$$ y = [10421773, 10487758, 10557557, 10569920, 10562760, 10669230, 10729524, 10769729, 10886681, 10953295, 11010910, 11116230, 11300864, 11540551, 11673138, 11765806, 11818485, 11908744, 12006032, 12173366, 12250119, 12308286, 12371947, 12531990, 12599604, 12563798, 12523307, 12588690, 12686416, 12796461, 12845157, 12863262, 12883374, 12984152, 12970311, 12950851, 12980864, 13009674, 13055277, 13120804, 13196988, 13210427, 13091482, 13046184, 13052501, 13187720, 13203399, 13249177, 13148088, 13030389, 13044402, 12986487, 13014243, 13022405, 13001503, 12799614, 12737572, 12805222, 12647827, 12692044, 12620433, 12550310, 12549618, 12514905, 12412682, 12393093, 12422760, 12426740, 12448921, 12438695, 12462359, 12436273, 12372104, 12340597, 12287870, 12225922, 12123027, 12049835, 12013913, 11961045, 12092922, 12148436, 12042727, 12070675, 12075831, 11976720, 11987531, 11923093]
5549A1923093L9350j4210J9270n6013L7167J1317L380P1596K9428K8699m7430
5538A2045647m4596Q5486P668K5247o494O9782Q1788k1921J0469Q9134j0942q8750
5526A2242518K475J26773J51144l3708L1100K9538K8583K7912L3750L4586O4259
5515A2738930O4599o3278j23419k3204l2397o3429J0127o5406o5124j65973k6868
5504A2184558m1609m0633p5228o4358o9626j10965J6914J9279q7046j08247j4950
5493A1608089q9357k1779k020q2487j67074q4650j15573j73694o8476n2125m006
5482A0746848q720k05118j44079K8641j37455p1068j60323o8657K7055m7603j76177
5471I783344M2602j6745r3206o5364p4076P484p1512J19767l1677j7431K8530
$$ y = [11923093, 11962443, 11948233, 11967503, 11911490, 11948657, 11959974, 11963354, 12034950, 12064378, 12093077, 12045647, 12001051, 12086537, 12094205, 12119452, 12112958, 12182740, 12264528, 12242607, 12253076, 12342210, 12331268, 12242518, 12244993, 12371766, 12522910, 12489202, 12520302, 12549840, 12578423, 12606335, 12640085, 12674671, 12738930, 12803529, 12740251, 12616832, 12593628, 12561231, 12497802, 12507929, 12442523, 12377399, 12211426, 12184558, 12142949, 12102316, 12027088, 11962730, 11893104, 11782139, 11799053, 11818332, 11731286, 11623039, 11608089, 11518732, 11496953, 11494933, 11412446, 11245372, 11160722, 11045149, 10871455, 10802979, 10750854, 10746848, 10738128, 10533010, 10388931, 10417572, 10280117, 10209049, 10048726, 9980069, 10007124, 9959521, 9783344, 9825946, 9809201, 9715995, 9650631, 9576555, 9584039, 9512527, 9632294, 9600617, 9583186, 9611716]
5460I611716Q7784k1338L0183j145q9668l9894L6945p6443m2815N1186N0860o8978
5448I528393j07168o9964K5532R7293j9423r5791l3885L1115q0188J37757q7097
5437I326574J27918L4370n2658J01823j799k899j6386N4853L2750m9709q2789
5426I472048J45377K1272j6153L0846M068J4841o8658P6397m3004q0575R9285
5415I655744r898j07961m1073M8988m9475j8399n4665r6100R3075P5806k2080
5404I473962M666l2635J8548p9141n3146n1990M9415J424L2975k9048l8257j8222
5392I278551p6646n0070n9551J144p0454J8048m1428J8921q9345o4610Q4141k0179
5380H928522j17396M5578J21709N4697J07253q9290l2487K1208N0701P5396l9178
$$ y = [9611716, 9699500, 9678162, 9708345, 9707200, 9617532, 9577638, 9614583, 9538140, 9495325, 9546511, 9597371, 9528393, 9421225, 9351261, 9376793, 9474086, 9454663, 9358872, 9324987, 9356102, 9275914, 9413671, 9326574, 9454492, 9488862, 9436204, 9538027, 9536228, 9533329, 9516943, 9571796, 9604546, 9554837, 9472048, 9617425, 9638697, 9622544, 9653390, 9657458, 9672299, 9603641, 9680038, 9637034, 9556459, 9655744, 9645846, 9537885, 9496812, 9545800, 9496325, 9477926, 9423261, 9327161, 9420236, 9496042, 9473962, 9478628, 9445993, 9464541, 9385400, 9332254, 9280264, 9329679, 9331103, 9364078, 9335030, 9296773, 9278551, 9201905, 9151835, 9092284, 9093428, 9022974, 9041022, 8999594, 9018515, 8929170, 8864560, 8948701, 8928522, 8811126, 8856704, 8978413, 9033110, 9140363, 9051073, 9018586, 9039794, 9090495, 9165891, 9126713]
5369I126713P8648k8427n1161L2866K6577r1705r0025k1338K9587p7529r6527
5358H837679L3902k9663J6737l6400P6525J3153n1818N7773K2642q923M1098M3917
5346I016622O3752N6587R9939m1528R5152l4438k3813N4615N5420N5497R66L2631
5334I431402m5760j9576q0711m828O3012N4571k5034J3248O555O6777J15450J07699
5322I682805J17799l1713q376o7957L9586J26165M8747J33857J8903N0384J62998
5311A0273198N909J09505J7584n2218J19623J2069R2659P1112P1311j03805k01064
5300A0415883k4024N3479l9655k4320n0316M73j12549o0616j7511j16890q1283
5289I942671N5402K6746K9696J29596M9389J04914J54692J25728K31697K20916
$$ y = [9126713, 9205361, 9176934, 9125773, 9158639, 9185216, 9093511, 9003486, 8982148, 9011735, 8934206, 8837679, 8871581, 8841918, 8858655, 8822255, 8898780, 8911933, 8860115, 8917888, 8940530, 8931607, 8972705, 9016622, 9080374, 9136961, 9236900, 9195372, 9290524, 9256086, 9232273, 9286888, 9342308, 9397805, 9398771, 9431402, 9385642, 9366066, 9285355, 9280527, 9343539, 9398110, 9373076, 9386324, 9392879, 9459656, 9575106, 9682805, 9800604, 9768891, 9760515, 9692558, 9732144, 9858309, 9907056, 10040913, 10059816, 10110200, 10273198, 10279107, 10388612, 10406196, 10353978, 10473601, 10485670, 10578329, 10649441, 10720752, 10616947, 10415883, 10391859, 10445338, 10405683, 10381363, 10331047, 10331520, 10218971, 10158355, 10140844, 10023954, 9942671, 9998073, 10024819, 10054515, 10184111, 10233500, 10338414, 10493106, 10618834, 10850531, 11071447]
5279A1071447K44990K39589K38270J57775J88870K17611K14586K04454O7124J5272
5269A2859988J21397R4719l258J1422P4970P376J32865j7685j25448j04287J9772
5258A3071831J19915L3624K427J03670J62063K3070J66014J47196K04882K63712
5248A4298404J48487R9771R8677K78714J87837Q5509Q7654M8694L1028l1128j54483
5237A5179164k93413k02719k84123j40304k31083k93561l29799k34355l88442
5228A2781365l82818k90341k37386k26063j12829k05083j89776j37867j71080
5219A0828122j71771r4053n539j55858j39933n6294j875M1777j61842j2298m8736
5208A0021700k0314o6410j3944j73521r3223J0287p8927l8092j59735j63404n2648
$$ y = [11071447, 11316437, 11556026, 11794296, 11952071, 12140941, 12358552, 12573138, 12777592, 12844716, 12859988, 12981385, 13076104, 13072846, 13084268, 13159238, 13166614, 13299479, 13281794, 13156346, 13052059, 13071831, 13191746, 13225370, 13227797, 13331467, 13493530, 13516600, 13682614, 13829810, 14034692, 14298404, 14446891, 14546662, 14645339, 14924053, 15111890, 15197399, 15285053, 15333747, 15364775, 15333647, 15179164, 14885751, 14683032, 14398909, 14258605, 14027522, 13733961, 13404162, 13169807, 12781365, 12398547, 12108206, 11870820, 11644757, 11531928, 11326845, 11137069, 10999202, 10828122, 10656351, 10562298, 10556759, 10400901, 10260968, 10204674, 10202799, 10244576, 10082734, 10070436, 10021700, 10001386, 9934976, 9921032, 9747511, 9654288, 9664575, 9585648, 9547556, 9387821, 9224417, 9171769]
5197I171769r9337k11192o9568j17893J34592l553j21964p3811K7042m5385n0684
5186H540016p3930Q5169R360L9784L3462k5007j6928R2108j6256n6928k3310n8187
5174H529353l3036l942q9358o2513R9427n9944J9479Q641L6105k3018m5962j04661
5162H270571L3707l0207o6700J99J2230P8807k25348j4569j07216k9882j26137
5151G795455j1574O4151l0054o5756O6407P7596j19652r1125M6537R972j32555
5140G609402j9161l4395m1744J3687l022j11942p0305j36323N562K4152n5958
5129G179953r1923L5579j85124l6095p498n7066K3253k3186r406j87951l8188
5118F602348Q619o7564q2747L3320K2150r9090p0431k0030j16022j08628p0731
$$ y = [9171769, 9072432, 8861240, 8791672, 8673779, 8808371, 8804818, 8682854, 8609043, 8636085, 8590700, 8540016, 8466086, 8551255, 8560615, 8600399, 8633861, 8608854, 8591926, 8684034, 8667778, 8610850, 8587540, 8529353, 8496317, 8492375, 8403017, 8340504, 8439931, 8379987, 8399466, 8408107, 8444212, 8421194, 8375232, 8270571, 8304278, 8274071, 8207371, 8207570, 8219800, 8298607, 8073259, 8058690, 7951474, 7921592, 7795455, 7783881, 7848032, 7817978, 7752222, 7818629, 7896225, 7776573, 7685448, 7731985, 7741957, 7609402, 7590241, 7555846, 7514102, 7527789, 7524767, 7412825, 7342520, 7206197, 7211759, 7235911, 7179953, 7088030, 7123609, 6938485, 6902390, 6894892, 6837826, 6861079, 6837893, 6828487, 6640536, 6602348, 6610967, 6543403, 6460656, 6493976, 6516126, 6417036, 6346605, 6326575, 6210553, 6101925, 6031194]
5107F031194p048R514l9122K4870o6329J6918j8186j42265l2790J2317N9129l0429
5095E817773m2843k5704o5815O2975Q990L2156M2423M1437L8268l8178M6665O5731
5083E983878n477J7210O7082j9490l3203l1738K2575N4237r2670l3416L6796M212
5071E969996k3407k6722J64157N6223o8787N3319j41502p9296O6623J07981J10503
5060F189088J28437j8659J16693J47212K29791J32036J02662R0919L3705J48403
5050G300287J78275K01831K58403K56610K61854L91102L39677L42940K19922K99766
5040A0050667J88914K76249M44149M34564M69982N54373M11273K82591J59126
5031A3271888J83236J88763K28557K71264K06712K21227J78051M73980M27953
$$ y = [6031194, 6024146, 6033660, 5994538, 6019408, 5953079, 5969997, 5951811, 5809546, 5776756, 5789073, 5848202, 5817773, 5774930, 5749226, 5683411, 5746386, 5755376, 5787532, 5829955, 5871392, 5909660, 5871482, 5918147, 5983878, 5978401, 5995611, 6062693, 6043203, 6010000, 5978262, 6000837, 6055074, 5962404, 5928988, 5965784, 5969996, 5946589, 5919867, 6084024, 6140247, 6071460, 6124779, 5983277, 5903981, 5970604, 6078585, 6189088, 6317525, 6298866, 6415559, 6562771, 6792562, 6924598, 7027260, 7118179, 7151884, 7300287, 7478562, 7680393, 7938796, 8195406, 8457260, 8848362, 9188039, 9530979, 9750901, 10050667, 10239581, 10515830, 10959979, 11394543, 11864525, 12418898, 12830171, 13112762, 13271888, 13455124, 13643887, 13872444, 14143708, 14350420, 14571647, 14749698, 15223678, 15651631]
5022A5651631M59651M13822L60980K30126J31140J59836p779p612M7867n4732
5012A7384930J62512K50459K5092J25935Q3651Q5277j60017k71353l07460l61034
5002A7017992m50418l89337m46536k25407p744k08589k18709j26668j42729l09521
4992A4492334k65610k98808m00257l86710l30967l09491m32941l73522k37701
4983A1456327k37787k42961j78996l41970m13286l84068n51986m77923m38867
4974H188483l74766l46778k52876j67220k25397k30612j69221j29145k26078r5194
4964E971196k67384j45264k17133m7627J2600r5793n7662j28371j73841j67243
4954D683478k2655k02025j09816o2510m0836l6817p4856l3974L9390R227m1454
$$ y = [15651631, 16111282, 16525104, 16886084, 17116210, 17247350, 17407186, 17399407, 17391795, 17439662, 17384930, 17547442, 17797901, 17822993, 17948928, 18032579, 18117856, 17957839, 17686486, 17379026, 17017992, 16567574, 16178237, 15731701, 15506294, 15498550, 15289961, 15071252, 14944584, 14801855, 14492334, 14226724, 13927916, 13527659, 13140949, 12809982, 12500491, 12067550, 11694028, 11456327, 11218540, 10975579, 10796583, 10454613, 10041327, 9657259, 9105273, 8627350, 8188483, 7813717, 7466939, 7214063, 7046843, 6821446, 6590834, 6421613, 6292468, 6066390, 5971196, 5703812, 5558548, 5341415, 5293788, 5306388, 5210595, 5152933, 5024562, 4850721, 4683478, 4660823, 4458798, 4348982, 4286472, 4245636, 4208819, 4133963, 4099989, 4139379, 4148606, 4107152]
4943D107152n8371n7154k22077j9046n8969N3179m8679j83287l4347q7190j1062
4932C380149k01854j70485q9496p7680m8449q8313j01364n6339l317N0207l7696
4921B555363j34229n8008n3311P059k6596o0977m5959j1839O1329n6770j56004
4910B020058o012L6544j44529l1210M5164K651q5165r2386L2463j6405k6633o8646
4898A665894j7435N9436k3762l0118m3057m7057J665q9794Q6873j4206j9496Q6392
4886A615335k2410m1736N121J6531o4757L1715q7324p6850j4253n3620J09174
4875A416926R244R4323K4053n0014j16886k3448R5539n9467j08366R897O8831
4864A360632j42801O8019K0384q156J07905l9953m8870L0545M6398N236n0446
$$ y = [4107152, 4048781, 3991627, 3769550, 3750504, 3691535, 3744714, 3696035, 3512748, 3478401, 3391211, 3380149, 3178295, 3007810, 2918314, 2840634, 2792185, 2703872, 2602508, 2546169, 2542852, 2593059, 2555363, 2421134, 2363126, 2309815, 2316874, 2290278, 2229301, 2183342, 2171503, 2232832, 2176062, 2020058, 2014046, 2050590, 1906061, 1874851, 1920015, 1922666, 1837501, 1745115, 1777578, 1761173, 1734540, 1665894, 1648459, 1707895, 1684133, 1654015, 1610958, 1563901, 1565566, 1475772, 1562645, 1548439, 1528943, 1615335, 1592925, 1551189, 1556310, 1572841, 1508084, 1539799, 1452475, 1375625, 1361372, 1307752, 1416926, 1426170, 1520493, 1544546, 1494532, 1377646, 1354198, 1449737, 1390270, 1281904, 1291801, 1360632, 1217831, 1285850, 1306234, 1298078, 1405983, 1366030, 1317160, 1347705, 1394103, 1399339, 1348893]
4853A348893k1434L7700L0673K5611k0066k6358o5977q4326J0652M6524O672p7333
4841A211231Q3261k8653l4997M4181Q273k1466O15O4323K2579o0211j5618o1282
4829A212236M1738r514L8029J00408r5472R5103q7993r9379J307P9456m8331m4385
4817A183203J60876M7552j00108k742K7882o1222L4907R885K0940R331m9156o38
4805A280710P8989L6307r666l5124M2623j4507l4248k2448j350k0869M680P388
4793A312485j7856K2129Q392M0849M0820L7736M5934k5514j5300j15380Q9564
4782A423859M4617p743L5952o9490M9021K9554j06894o7876J09760J03575J86385
4771A730720J6192r3763J2172j71975R0553J22814l6606K8020l2173K8289k9432
$$ y = [1348893, 1327459, 1365159, 1395832, 1421443, 1401377, 1375019, 1309042, 1224716, 1235368, 1281892, 1288564, 1211231, 1294492, 1265839, 1230842, 1275023, 1283296, 1261830, 1262445, 1326768, 1349347, 1289136, 1273518, 1212236, 1253974, 1244460, 1282489, 1382897, 1287425, 1382528, 1294535, 1195156, 1196463, 1275919, 1227588, 1183203, 1344079, 1391631, 1291523, 1288781, 1316663, 1255441, 1290348, 1300233, 1321173, 1330504, 1281348, 1280710, 1359699, 1396006, 1386340, 1351216, 1393839, 1379332, 1345084, 1322636, 1321286, 1300417, 1305097, 1312485, 1294629, 1316758, 1325150, 1365999, 1406819, 1444555, 1490489, 1464975, 1449675, 1334295, 1423859, 1468476, 1460733, 1496685, 1427195, 1476216, 1505770, 1398876, 1331000, 1440760, 1544335, 1730720, 1746912, 1653149, 1665321, 1493346, 1583899, 1706713, 1670107, 1698127, 1665954, 1694243, 1664811]
4760A664811j4137M9206J31619O0228j38356M8772L0974N057j44414q8480R4090
4749A699370Q6826J55073j16498M0739L4316k5158n4218J30202N5832J80748k6724
4738B160508M6853R940j9898k481M5099j5744k3764J29661p0663m1708P5131N9422
4726B352356k358k5302n4016o5673Q2076l9721l8556J08516m159k32m3864r15
4714B268152M7152K3491n1906K7753L7562Q5419R250L6135N1364J664o8632P206
4702B474610N5266R7484M6878o0514l7209Q7327L8071K5114M7793k9422n5375
4691B690023N219k6049O9796n5398L5363L7815l9698j2497P8665L8447J1794Q6661
4679B920141j5284j5504O1118P5362l4555j08455L7516k2950R119L5442J1081
$$ y = [1664811, 1650674, 1699880, 1831499, 1891727, 1753371, 1802143, 1833117, 1838174, 1693760, 1605280, 1699370, 1786196, 1941269, 1824771, 1865510, 1899826, 1874668, 1820450, 1950652, 2006484, 2187232, 2160508, 2207361, 2217301, 2197403, 2194922, 2240021, 2224277, 2200513, 2330174, 2259511, 2217803, 2292934, 2352356, 2349998, 2324696, 2270680, 2205007, 2287083, 2247362, 2208806, 2317322, 2313163, 2312931, 2269067, 2268152, 2315304, 2338795, 2286889, 2314642, 2352204, 2437623, 2446873, 2483008, 2534372, 2536036, 2467404, 2474610, 2529876, 2627360, 2674238, 2613724, 2576515, 2663842, 2701913, 2727027, 2774820, 2745398, 2690023, 2695242, 2669193, 2738989, 2683591, 2718954, 2756769, 2717071, 2704574, 2783239, 2821686, 2833480, 2920141, 2904857, 2889353, 2950471, 3025833, 2991278, 2882823, 2920339, 2897389, 2906508, 2941950, 2953031]
4668B953031J15911j9198N924K8475J2712J06974o8343j642N485R0364o0519m9672
4656C119502o9230N216J48034L0527J1353o7118J04241l6927M3175L3264k2127
4645C299910J23808R1407p2070n2011P9568p7945N7836O1440K608J6029l5024
4634C495556K8352Q5216J08467m4007k8585K823J22244N2849M8602L8846P3614
4623C983977K3466m7613r6405J10415N4727o4477O038M3937n6526m0023N1060
4612C968576M8777J9772j7066n2312l3599M4222O4936K4574O6485N7268p2401
4601D119232P0865M6609o9166k0002M9104no1430J31778l4354J941N5379m6536
4589D243415k9367l4866o165M0420J30973N480J09742K9131L8716J29892J0910
$$ y = [2953031, 3068942, 3049744, 3055668, 3084143, 3096855, 3203829, 3135486, 3133844, 3139329, 3229693, 3169174, 3119502, 3050272, 3055488, 3203522, 3234049, 3245402, 3178284, 3282525, 3245598, 3288773, 3322037, 3299910, 3423718, 3515125, 3443055, 3391044, 3470612, 3392667, 3450503, 3511943, 3514551, 3530580, 3495556, 3523908, 3609124, 3717591, 3673584, 3644999, 3647822, 3770066, 3822915, 3871517, 3910363, 3983977, 4007443, 3959830, 3863425, 3973840, 4028567, 3964090, 3970128, 4014065, 3957539, 3917516, 3968576, 4017353, 4037125, 4020059, 3967747, 3934148, 3978370, 4043306, 4067880, 4134365, 4191633, 4119232, 4190097, 4236706, 4167540, 4147538, 4196642, 4196637, 4135207, 4266985, 4232631, 4234572, 4289951, 4243415, 4214048, 4179182, 4173017, 4213437, 4344410, 4349890, 4459632, 4488763, 4527479, 4657371, 4668281]
4578D668281P891j3760J53653L9533l7294J39947Q346J38588J36479Q552J87583
4567E437799j3257k5849P3735J14146J16047R9354M5355n8462R3062l414P9022
4556E957538J65777J31140J5108j022J29835J21365N0658k9274J25372n0533m6203
4545F569761L5314n0508o6574n4887P2376K1903L9251q6337o9519O755l1920J8246
4533F403861j26582p6837n6138R4821l0036r3495K3104k164j9925M5712J23116
4522F285437k2107q191p5907n1267N7730P8399j09977m7489N5279Q4090J83432
4511F429429R6596M6738R407j3061R6236N6792J98310J15609J15598K07899M1361
4500G400914J07125J74136n074L7926J16820J32035L8994L6977L3979K7462K4306
$$ y = [4668281, 4676172, 4662412, 4816065, 4855598, 4818304, 4958251, 4966597, 5105185, 5241664, 5250216, 5437799, 5424542, 5398693, 5472428, 5586574, 5702621, 5801975, 5847330, 5788868, 5881930, 5878516, 5957538, 6123315, 6254455, 6269563, 6268541, 6398376, 6519741, 6570399, 6541125, 6666497, 6615964, 6569761, 6605075, 6554567, 6487993, 6433106, 6505482, 6527385, 6566636, 6480299, 6410780, 6417535, 6385615, 6403861, 6277279, 6200442, 6144304, 6239125, 6209089, 6115594, 6138698, 6136534, 6116609, 6162321, 6285437, 6263330, 6255139, 6179232, 6127965, 6185695, 6264094, 6154117, 6106628, 6161907, 6245997, 6429429, 6526025, 6572763, 6582170, 6569109, 6665345, 6722137, 6920447, 7036056, 7151654, 7359553, 7400914, 7508039, 7682175, 7677101, 7715027, 7831847, 7963882, 8002876, 8039853, 8073832, 8101294, 8125600]
4489H125600P7267K2321M6971M7404P3348J28997j7418l0453J70266Q196k3163
4478H629336J3991N0538K6629q7502k48311o4826o6520j17974n855q8062m9798
4467G991646n5046j28212j01232n8872j72721k7449j19715n5671n9724j626j22756
4456G088622p9982n4549p0857p4750j0248m1211q5428p1832k1233Q479K7144J7042
4444F631197K6745p5873k8448O8912k0561L8200o1443K2737L9726p6607K9285
4433F593870J8333o2100m4137N6682n9253q6108K5670k6771o817m6325j55245
4422F207799o3302N6604P1612N196m4054N5594r726k5758O2840P273K9670j04258
4410F249490m3608P0804N0840P8168p8973n5052q0104P9592J25261R1057m9867
$$ y = [8125600, 8202867, 8225188, 8272159, 8319563, 8392911, 8521908, 8504490, 8474037, 8644303, 8652499, 8629336, 8643327, 8693865, 8720494, 8632992, 8384681, 8319855, 8253335, 8135361, 8129506, 8041444, 7991646, 7936600, 7808388, 7707156, 7648284, 7475563, 7448114, 7328399, 7272728, 7213004, 7211378, 7088622, 7008640, 6954091, 6883234, 6808484, 6798236, 6757025, 6671597, 6599765, 6578532, 6587011, 6614155, 6631197, 6657942, 6582069, 6553621, 6622533, 6601972, 6640172, 6578729, 6601466, 6641192, 6564585, 6593870, 6612203, 6550103, 6505966, 6562648, 6503395, 6417287, 6442957, 6416186, 6409369, 6363044, 6207799, 6144497, 6201101, 6272713, 6277909, 6233855, 6289449, 6279723, 6253965, 6316805, 6324078, 6353748, 6249490, 6205882, 6276686, 6327526, 6405694, 6326721, 6271669, 6191565, 6271157, 6396418, 6487475, 6437608]
4399F437608L5833N7611J7595J81321O5532p8185N124J06454J46398M7695J05120
4388G128106J05895J33756J12364J20453J91598J79203J46272J01588K36117N7578
4378H512930J83594J55890N2612m34J18629j2319q1251j29795j29140l3124j17243
4367H520349J472l4786j15229o4297n3408o3093L3075p5751n4253L3169K226j1385
4355H118089j20954k9492j622j5539o2565m3125K855J9658L9577J52816j11301
4344G948397Q9144O4388M343J80864j7676K26027J21620O1956P0913J08717K03639
4333I062332O2271J24618K6585l2903J39360L4675J09202J92292J82308L23411
4323A0224151K14996K24429L87272K99684L59336M57229M72187L49799K63195
$$ y = [6437608, 6473441, 6531052, 6548647, 6729968, 6795500, 6717315, 6722439, 6828893, 6975291, 7022986, 7128106, 7234001, 7367757, 7480121, 7600574, 7792172, 7971375, 8117647, 8219235, 8455352, 8512930, 8696524, 8852414, 8905026, 8904592, 9023221, 9010902, 8929651, 8799856, 8670716, 8637592, 8520349, 8521821, 8487035, 8371806, 8307509, 8254101, 8191008, 8224083, 8148332, 8094079, 8127248, 8129474, 8118089, 7997135, 7967643, 7966021, 7950482, 7887917, 7844792, 7847647, 7867305, 7906882, 8059698, 7948397, 8037541, 8101929, 8106272, 8287136, 8269460, 8495487, 8617107, 8679063, 8749976, 8858693, 9062332, 9124603, 9249221, 9275806, 9242903, 9382263, 9416938, 9526140, 9718432, 9900740, 10224151, 10439147, 10663576, 11050848, 11350532, 11709868, 12167097, 12639284, 12989083, 13252278]
4314A3252278K55688K28364K55259J66209l8329j82072k12768l81686m38777m22036
4304A2482130n34195m35468l66004l88460m29477l28023k86145j46879j77019
4295I390460j75129j76302K0486r8626j48749j05661n3026p0166q8172n4018n0478
4284H390619j2691N181N0195n8415O7400N127K58n307k2115J05683j5541n6674
4272H453720O3894J65013J77215R1947K19692K48459K66305K01398K35801L45069
4262A0468513J88790L62360M19948J66833K36560J64960K7339R8566O7912J31755
4252A2333536M4785P1518J27871J01076K0985J19446K9019l365N7828N4258n161
4241A2951796J12235Q1643J25257J21826Q4999K6710j41145K03931R3631k6387
$$ y = [13252278, 13507966, 13736330, 13991589, 14157798, 14119469, 13937397, 13724629, 13342943, 12904166, 12482130, 11947935, 11512467, 11146463, 10758003, 10328526, 10000503, 9714358, 9567479, 9390460, 9215331, 9039029, 9059515, 8960889, 8812140, 8706479, 8653453, 8583287, 8495115, 8441097, 8390619, 8377928, 8383109, 8433304, 8374889, 8442289, 8447416, 8447674, 8442367, 8420252, 8525935, 8510394, 8453720, 8517614, 8682627, 8859842, 8951789, 9171481, 9419940, 9686245, 9887643, 10123444, 10468513, 10657303, 11019663, 11439611, 11606444, 11843004, 12007964, 12035303, 12133869, 12201781, 12333536, 12378321, 12449839, 12577710, 12678786, 12699771, 12819217, 12848236, 12844871, 12902699, 12956957, 12951796, 13064031, 13145674, 13270931, 13392757, 13477756, 13504466, 13363321, 13567252, 13660883, 13634496]
4231A3634496o4418p7376P1154J94856P5516K2098J07429J74064J74780K66876
4221A4579475J31483J29913J04193J9868O1072M1045K7338J16638J19597K88364
4211A5618986J05136K30372K04362J19004J46402R0108R9463J34915J20406Q4531
4201A6953685p62j00418J79901M6893Q8787K72551J40688R8797K39523L06616
4191A8226261K21063K73687L07353J45551J84653K16233L22037L39793L56159
4182B0592790M07527L98506M35576L26428K00703K67082K38350L00381L80460
4173B3547803L00542L08462L56147K82889K58966L32705L51661L33082L38167
4164B6410424L13683L71783M91359L32178M85510L80763K80367L21666K51708
$$ y = [13634496, 13570078, 13492702, 13563856, 13758712, 13834228, 13856326, 13963755, 14137819, 14312599, 14579475, 14710958, 14840871, 14945064, 14964932, 15026004, 15067049, 15094387, 15211025, 15330622, 15618986, 15724122, 15954494, 16158856, 16277860, 16424262, 16514370, 16613833, 16748748, 16869154, 16953685, 16952923, 16852505, 17032406, 17079299, 17168086, 17440637, 17581325, 17680122, 17919645, 18226261, 18447324, 18721011, 19028364, 19173915, 19358568, 19574801, 19896838, 20236631, 20592790, 21000317, 21398823, 21834399, 22160827, 22361530, 22628612, 22866962, 23167343, 23547803, 23848345, 24156807, 24512954, 24795843, 25054809, 25387514, 25739175, 26072257, 26410424, 26724107, 27095890, 27587249, 27919427, 28404937, 28785700, 29066067, 29387733, 29639441]
4155B9639441K35425L96813M26384K56472K58129K80387L69262K92819K51468
4146C2406600L07363L56047L47189M30086M10908N03511M93304P20894P93954
4137C6769856Q56100Q97661R94640J109519J205044J258573J399492J330207J331134
4128D7152226J470664J498528J651682J715022J638887J681553J809165K033621
4120F0651348K545506K976826L394606L928593M641248N159789N823199O540232
4112I5661347P286712Q213651R067360R385426Q977012P856386O837732O481367
4104A59766993O867465Q118409R921634J1244226J2113195J3160341J5669683
4097B36861946J9326159K3053627K6101406K7967486K8397258K8486583K7876487
$$ y = [29639441, 29874866, 30271679, 30698063, 30954535, 31212664, 31493051, 31862313, 32155132, 32406600, 32713963, 33070010, 33417199, 33847285, 34258193, 34761704, 35255008, 35975902, 36769856, 37625956, 38523617, 39518257, 40627776, 41832820, 43091393, 44490885, 45821092, 47152226, 48622890, 50121418, 51773100, 53488122, 55127009, 56808562, 58617727, 60651348, 63196854, 66173680, 69568286, 73496879, 78138127, 83297916, 89121115, 95661347, 102948059, 111161710, 120229070, 129614496, 138591508, 146447894, 153285626, 159766993, 166634458, 174752867, 184674501, 195918727, 208031922, 221192263, 236861946, 256188105, 279241732, 305343138, 333310624, 361707882, 390194465, 418070952]
4090D18070952K5591671K0069837J0469595q19562j0910546j7801333k1188535
4083D23482079k4558204l0468558l6253161l7503490l4357217k9555890k4746138
4076B06039421k0455484j7146815j4714592j2804986j1430044r988816r048889
4069A10449795p928778p125321o343542n730834m950359m278054l794669l239093
4061F7059145k828871k614230k470647k196866j818300j822671j742755j837613
4053D9727192j648443j429333j442772j367711j277895j378665j472879j587068
4045C8122426j544760j382801j416759j341747j228977j034445r10971q86731
4037B8375235q96895o56071o91476o87745o24185o21286o58650m46869n15802
$$ y = [418070952, 443662623, 463732460, 474202055, 473382493, 462471947, 444670614, 423482079, 398923875, 368455317, 332202156, 294698666, 260341449, 230785559, 206039421, 185583937, 168437122, 153722530, 140917544, 129487500, 119498684, 110449795, 102521017, 95395696, 89052154, 83321320, 78370961, 74092907, 70298238, 67059145, 64230274, 61616044, 59145397, 56948531, 55130231, 53307560, 51564805, 49727192, 48078749, 46649416, 45206644, 43838933, 42561038, 41182373, 39709494, 38122426, 36577666, 35194865, 33778106, 32436359, 31207382, 30172937, 29261966, 28375235, 27478340, 26822269, 26130793, 25443048, 24818863, 24197577, 23538927, 23092058, 22576256]
4028B2576256o46273n48580m17447m17006m91049l22231k44655k58964k09308
4019A9020743j46968q8244j35009j26868r2058j3592o5815M632J25490L9138l966
4008A8517483J5307J32332J52490K19496J73476K56498L43424M07673L64646L83053
3998B0965878M38060N35920N08379L38626M78846N81399N86774O24783P06836
3989B5765501O77570Q76584J140616J360734J532950J788171J846425J574924
3981C6563475R63112J09765l74591l45644k38802m83287p21339n13350L2762J15955
3971C5108056n79606j572405k296906k318728j831251j602296j210749j043697
3963B2652418r51482p30095o47952n19702m25836k99225l59698l06630k92728
$$ y = [22576256, 21929983, 21381403, 20963956, 20546950, 20055901, 19733670, 19489015, 19230051, 19020743, 18873775, 18785531, 18650522, 18523654, 18431596, 18418004, 18352189, 18356821, 18482311, 18521449, 18517483, 18532790, 18665122, 18817612, 19037108, 19210584, 19467082, 19810506, 20218179, 20582825, 20965878, 21403938, 21939858, 22448237, 22786863, 23265709, 23847108, 24433882, 25058665, 25765501, 26443071, 27319655, 28460271, 29821005, 31353955, 33142126, 34988551, 36563475, 37526587, 37636352, 37261761, 36916117, 36677315, 36194028, 35472689, 34959339, 34992101, 35108056, 34528450, 32956045, 30659139, 28340411, 26509160, 24906864, 23696115, 22652418, 21700936, 20970841, 20322889, 19803187, 19377351, 19078126, 18718428, 18411798, 18119070]
3954A8119070l26414k57226j27790j30518q6843k11299j16665k05202n3075k075
3944A6601963p8610J4690n7680j20264k19445q7250j78391k88937k01010l59755
3934A5025311m66469m53834n04314l86941l94846l79820k91355l19971k06950
3925A1620811j20804k70650l60310l38924l56152l45190j84413k06683l02336
3916I135349j77413j41007m7489j22044j30472n3186j44584k3304j48977j63223
3906G983650j71081j03129r8077j69326j59470j55628j19915j61854j54926j47768
3896F542476k14536k38090j96307j14774j8072j29577r0100Q184Q2353q2824k20762
3885E327971r753J02813k2734R480J3437J27071O7481Q5321n2497j621J52672
$$ y = [18119070, 17792656, 17535430, 17407640, 17277122, 17190279, 16978980, 16862315, 16657113, 16604038, 16601963, 16523353, 16538043, 16480363, 16360099, 16140654, 16053404, 15875013, 15586076, 15385066, 15025311, 14558842, 14105008, 13600694, 13213753, 12818907, 12439087, 12147732, 11827761, 11620811, 11500007, 11229357, 10869047, 10530123, 10173971, 9828781, 9644368, 9437685, 9135349, 8957936, 8816929, 8769440, 8647396, 8516924, 8463738, 8319154, 8295850, 8146873, 7983650, 7812569, 7709440, 7611363, 7442037, 7282567, 7126939, 7007024, 6845170, 6690244, 6542476, 6327940, 6089850, 5893543, 5778769, 5760697, 5631120, 5541020, 5549204, 5631557, 5548733, 5327971, 5318218, 5421031, 5398297, 5407777, 5421214, 5548285, 5615766, 5701087, 5648590, 5646969, 5799641]
3874E799641m7540L4932J49225J44446r0629L5537L7254O8361P8753j8876P8047
3863F269151J3200J4763n8187j20808o011j31407n0211M3380O1600Q8377K7675
3852F151522J450n5455K4328J61278M5495L7439J40787J29884J23638J38503J47214
3841G046083K05665J68643K68459J75647J38107J26154R435j424k1811O0640P2692
3830H248290K11359M1899J87133K25291K26814J86795K73446M24940M43445M43680
3820A0913092M75772N38596N36531R06454P67016Q21863Q94926Q71078J023595
3811A7748923J294483J511615J851238J957719J865475J775542J798101K041276
3803C1844372K263999K521767K801340L125677L433333L048659K046295O15136
$$ y = [5799641, 5752101, 5787033, 5936258, 6080704, 5990075, 6025612, 6062866, 6131227, 6209980, 6191104, 6269151, 6282351, 6297114, 6238927, 6118119, 6112108, 5980701, 5930490, 5973870, 6035470, 6123847, 6151522, 6152972, 6097517, 6121845, 6283123, 6328618, 6366057, 6506844, 6636728, 6760366, 6898869, 7046083, 7251748, 7420391, 7688850, 7864497, 8002604, 8128758, 8138193, 8136769, 8114958, 8175598, 8248290, 8459649, 8501548, 8688681, 8913972, 9140786, 9327581, 9601027, 10025967, 10469412, 10913092, 11388864, 11927460, 12463991, 13370445, 14137461, 14959324, 15854250, 16725328, 17748923, 19043406, 20555021, 22406259, 24363978, 26229453, 28004995, 29803096, 31844372, 34108371, 36630138, 39431478, 42557155, 45990488, 49039147, 51085442, 51700578]
3795E1700578j028025j378013o92033k75687n86513j474229j545000j078956j50616
3786D3491506J081852J180199K75324r86270k245222l363681l823269l575535
3778C2034904k919573k183104j905067j627481j563717j315864r24551r04928
3770A8690619o61207p31767p12985o97127o68924n24174m53319m54540k95372
3761A3491204l52713l86858m39935n21491k90427k72283l99759k86867k16275
3752A0324596m8553j26085j75986k25551k39178j54442l85541l86780k28008k07619
3742H146853j48840j52539j26644j30751k10546k15467j43119k73798k04595j65281
3732F375273k13728j02481j79010J5902j00954j71081k83150k67612l33868k61964
$$ y = [51700578, 50672553, 49294540, 48602507, 48326820, 47740307, 46266078, 44721078, 43642122, 43491506, 44573358, 45753557, 46028881, 45042611, 42797389, 39433708, 35610439, 32034904, 29115331, 26932227, 25027160, 23399679, 21835962, 20520098, 19595547, 18690619, 18029412, 17297645, 16584660, 15887533, 15218609, 14694435, 14241116, 13786576, 13491204, 13138491, 12751633, 12311698, 11790207, 11499780, 11227497, 10827738, 10540871, 10324596, 10276043, 10149958, 9973972, 9748421, 9509243, 9354801, 8969260, 8582480, 8354472, 8146853, 7998013, 7845474, 7718830, 7588079, 7377533, 7162066, 7018947, 6745149, 6540554, 6375273, 6161545, 6059064, 5880054, 5895956, 5795002, 5623921, 5340771, 5073159, 4739291, 4477327]
3722D477327j34106j63538k07211j63947j25027j65875q6366k20721l1009j9531
3712C159996p9480o3266q6840j22526m5400j00134o7438J6538L4850M2355j28926
3701B559729m8758J6098o6610m4327j17645m3538k0193K8573J18110q1537j46654
3690B153248j8036n710o5273o9994k4330j2064K7448M669j62798j44003O6165
3679A749322J16970n0903m8728r7576l5111n682N2870K7612o9720M3527k468K1201
3667A701314o4777l1902K4401j02937J3662O7794p1292l1410J6592o6625J43766
3656A598586P585Q127l7938j47971R0271r5317o3158m0705K7436J8482L9123L0447
3644A434968q0593q733M2478P6561j9624n9577L7711O6723R0100M0454P7098J3268
$$ y = [4477327, 4343221, 4179683, 3972472, 3808525, 3683498, 3517623, 3431257, 3210536, 3179527, 3159996, 3080516, 3017250, 2930410, 2807884, 2762484, 2662350, 2594912, 2611450, 2646300, 2688655, 2559729, 2510971, 2527069, 2460459, 2416132, 2298487, 2254949, 2234756, 2263329, 2381439, 2299902, 2153248, 2135212, 2129502, 2064229, 1994235, 1969905, 1957841, 1985289, 1989958, 1827160, 1683157, 1749322, 1866292, 1815389, 1766661, 1669085, 1633974, 1628292, 1681162, 1708774, 1639054, 1682581, 1680113, 1701314, 1636537, 1604635, 1629036, 1526099, 1539761, 1607555, 1536263, 1504853, 1521445, 1454820, 1598586, 1606171, 1614298, 1576360, 1428389, 1518660, 1423343, 1360185, 1319480, 1346916, 1365398, 1404521, 1434968, 1354375, 1345642, 1388120, 1464681, 1445057, 1385480, 1423191, 1489914, 1580014, 1620468, 1697566, 1710834]
3632A710834q8327n3122L9289R179N2340k0070k0010J0511K6891q2604l1845L4928
3620A587994M4575k9851Q399p957q6119J19821j7767k9266l2854Q5038j04416
3609A537597n3188O0692P9597j25588j11681N9967J8304q1924N4759O0402o1819
3598A437118n3815L9798m4503N4618K5791p935R916l5937R1700O4430j17847J8632
3586A481966K198M6861N2493k7620q0207k8725M0720n2558N315N8194l3999m4202
3574A420436M1339l0742m756J16407K3055j15319j0438P858j0845l5735n7359
3563A343901J15742O7516q9617m8967L5188P894K1311J06862M4371k2296o9494
3552A512411K957R9919J16677P955m3373m2685P2113m8451o7329o2786K9517N4072
$$ y = [1710834, 1622507, 1569385, 1608674, 1617853, 1670193, 1650123, 1630113, 1640624, 1667515, 1584911, 1553066, 1587994, 1632569, 1602718, 1611117, 1603160, 1517041, 1636862, 1619095, 1589829, 1556975, 1642013, 1537597, 1484409, 1545101, 1624698, 1499110, 1387429, 1447396, 1465700, 1383776, 1438535, 1498937, 1437118, 1383303, 1423101, 1378598, 1433216, 1459007, 1451072, 1460988, 1425051, 1516751, 1581181, 1463334, 1481966, 1484164, 1531025, 1583518, 1555898, 1475691, 1446966, 1487686, 1435128, 1440443, 1498637, 1464638, 1420436, 1461775, 1431033, 1426277, 1542684, 1565739, 1450420, 1439982, 1447840, 1436995, 1401260, 1343901, 1459643, 1527159, 1437542, 1388575, 1423763, 1431657, 1452968, 1559830, 1604201, 1581905, 1512411, 1515368, 1615287, 1731964, 1739919, 1696546, 1653861, 1725974, 1677523, 1610194, 1547408, 1576925, 1630997]
3540A630997k3519l7863j6877K4354L2679J393n0014l8305J03226o1365l6838
3529A527868J7135n976J22044j1507r8169J07653P2250l2711N4153J8818q0686
3518A690872Q5773p155J3202q2269r094m5961l0509K2497l0577o0998Q7575n269
3506A628087K2302j0588j2854K4961j23105j9395J22442L1532r1613L0978n979
3495A596768P116M165M0187k9607Q9796j07063k8701K6251k1489j31070m22l0652
3483A415279k6777J08753P885j00170Q7005K9105L8205k9981j18269O508o8292
3472A349251n75R800Q9039j3873O9523J03959p2781j3562l057J6540R9694L6628
3460A670586R873k3146l2457L1856J1305j38725n8488P8939J4876K0291m1059
$$ y = [1630997, 1607478, 1569615, 1552738, 1577092, 1609771, 1611164, 1561150, 1522845, 1626071, 1564706, 1527868, 1545003, 1539027, 1661071, 1649564, 1551395, 1659048, 1731298, 1698587, 1752740, 1771558, 1690872, 1776645, 1769490, 1782692, 1700423, 1691329, 1645368, 1614859, 1637356, 1606779, 1545781, 1633356, 1628087, 1650389, 1639801, 1626947, 1651908, 1528803, 1509408, 1631850, 1663382, 1571769, 1602747, 1596768, 1603884, 1608049, 1648236, 1618629, 1708425, 1601362, 1572661, 1598912, 1577423, 1446353, 1445931, 1415279, 1388502, 1497255, 1505140, 1404970, 1491975, 1521080, 1559285, 1529304, 1411035, 1417543, 1349251, 1348676, 1358476, 1447515, 1433642, 1503165, 1607124, 1534343, 1520781, 1517724, 1534264, 1633958, 1670586, 1680459, 1657313, 1624856, 1656712, 1668017, 1529292, 1470804, 1549743, 1564619, 1584910, 1543851]
3449A543851K7467j9581j5268N0175n8609k6946M2294N2531j4035J08197r194
3438A680882o2891J06313M5302L4184P16L5231O1736L8548n3614l1850O0025M6768
3426A961350m406P133O6011m156r363m9808n2411J8198N3374L0740M2483M677
3414B063822Q5627J660n7333J25555O1561q6772M006m1978o007K3515J40428q3851
3402B230233J0414J35334L3474o8514j7233J37666q7672k5070j1840k4394K8884
3391B341282J1699J11094P7249J9428J36682l2301J5871M2196N2519O0073J13951
3380B949743N6317j6839P5728N4371m148M1047L5199J24721N6140n4975J9874
3369C337178P5081j10411o42j2302n8887L8447n859m873L1401L5270M7707P3716
$$ y = [1543851, 1571318, 1551737, 1536469, 1586644, 1528035, 1501089, 1543383, 1595914, 1581879, 1690076, 1680882, 1617991, 1724304, 1769606, 1803790, 1804506, 1839737, 1901473, 1940021, 1886407, 1854557, 1914582, 1961350, 1956944, 1964077, 2030088, 2025932, 2016569, 1966761, 1914350, 1932548, 1985922, 2016662, 2059145, 2063822, 2149449, 2151109, 2093776, 2219331, 2280892, 2194120, 2198126, 2156148, 2150141, 2173656, 2314084, 2230233, 2240647, 2375981, 2409455, 2340941, 2323708, 2461374, 2373702, 2348632, 2336792, 2312398, 2341282, 2352981, 2464075, 2541324, 2560752, 2697434, 2665133, 2681004, 2723200, 2775719, 2835792, 2949743, 3006060, 2989221, 3064949, 3119320, 3115172, 3156219, 3191418, 3316139, 3372279, 3317304, 3337178, 3412259, 3301848, 3301206, 3288904, 3230017, 3268464, 3262605, 3257732, 3289133, 3324403, 3372110, 3445826]
3357C445826K2540L9373N9235O004M9319Q1852J00188J10877P9287J1658J5069
3346D021228Q2486K5384r2323m2380J11444R2538o3006J5444J8392J3333O4670
3335D247210J81560J5958Q0170M5140N8264P5606J27221J44678R1218J15712L1679
3324E214416J13440L0071N0289J19860J42186O9574J84332R5259Q6365J39876
3314F245668J10859K70145J07376J06207J37675J29287K67167J17761K86875K70438
3304H049458J66664K41555J91135J86616J86473J30197J47437J43568J61785K49656
3294I854544K77399L62283M18389M20763L53050M34974N87709O53438O23004O75946
3284A4661499P44829Q43175Q65139P66679Q68043Q60465J071934J077111J000965
$$ y = [3445826, 3468366, 3507739, 3566974, 3572978, 3622297, 3704149, 3804337, 3915214, 3994501, 4006159, 4021228, 4103714, 4129098, 4036775, 3994395, 4105839, 4198377, 4135371, 4150815, 4169207, 4182540, 4247210, 4428770, 4444728, 4524898, 4570038, 4628302, 4703908, 4831129, 4975807, 5067025, 5182737, 5214416, 5327856, 5357927, 5408216, 5528076, 5670262, 5739836, 5924168, 6019427, 6105792, 6245668, 6356527, 6626672, 6734048, 6840255, 6977930, 7107217, 7374384, 7492145, 7779020, 8049458, 8216122, 8457677, 8648812, 8835428, 9021901, 9152098, 9299535, 9443103, 9604888, 9854544, 10131943, 10494226, 10912615, 11333378, 11686428, 12121402, 12709111, 13362549, 13985553, 14661499, 15406328, 16249503, 17114642, 17881321, 18749364, 19609829, 20681763, 21758874, 22759839]
3275B2759839J085888J357858J522819K118123K263681K736885L045521L595829
3267D0486443M102236M702246N330389N729869M763933K707543P16364m93815
3259F8045208j008524j331013k268521l625370m104746l842219l035663k127637
3251D6701515j356330q92396l25685l2563N2858M27611Q19689J085424J591275
3242D8071398J795754K402783L010375L579155M214988M725681N085166M784787
3234G7670087K997825O53163r73351k080349k836371l583159n315496o344899
3226F0187450o087972n326332m328971l338829k649343k040448j594192j477682
3218C3343681j169023r65353r94174j078936j126750j157372r61909r30240p69179
$$ y = [22759839, 23845727, 25203585, 26726404, 28844527, 31108208, 33845093, 36890614, 40486443, 44588679, 49290925, 54621314, 60351183, 65115116, 67822659, 68539023, 68045208, 67036684, 65705671, 63437150, 59811780, 55707034, 51864815, 48829152, 46701515, 45345185, 44452789, 44127104, 44094541, 44147399, 44575010, 45394699, 46480123, 48071398, 49867152, 52269935, 55280310, 58859465, 63074453, 67800134, 72885300, 77670087, 80667912, 81321075, 80347724, 78267375, 75431004, 71847845, 66532349, 60187450, 54099478, 48773146, 44444175, 41105346, 38456003, 36415555, 34821363, 33343681, 32174658, 31209305, 30215131, 29136195, 28009445, 26852073, 25890164, 24959924, 24190745]
3209B4190745p27026r08310p42690n09208n24693m66852k97986l10758n395m722
3199A9693105k4797J24444J23920j279j84495j56422k06251k52240k56382k30666
3189A8628937l11484m51654j32522m6731j3477R638p6338k55377j89739l20218
3179A6841035j43650j19159j9792k2564m9166j06649j75979j59550m6372J56299
3169A6154453K46463J95159J04461j94388k80081m27188m05077m85623l32604
3160A4575575l10907l61779j03653J110J58261K89623L82995L86877M12110J49542
3150A5579754p9693k51029j74986k59738l26564k15675l80614o23810o91534n69568
3140A2006543n08782m72705l14478k04530k06154k18812k9575J19759k6014K2370
$$ y = [24190745, 23463719, 22555409, 21812719, 21303511, 20778818, 20311966, 20013980, 19703222, 19697827, 19693105, 19668308, 19792752, 19916672, 19915393, 19730898, 19574476, 19368225, 19115985, 18859603, 18628937, 18317453, 17865799, 17733277, 17686546, 17673069, 17682707, 17606369, 17350992, 17161253, 16841035, 16697385, 16578226, 16558434, 16535870, 16486704, 16380055, 16204076, 16044526, 15998154, 16154453, 16400916, 16596075, 16700536, 16506148, 16226067, 15798879, 15393802, 14908179, 14575575, 14264668, 13902889, 13799236, 13800346, 13958607, 14248230, 14631225, 15018102, 15430212, 15579754, 15500061, 15249032, 15074046, 14814308, 14487744, 14272069, 13891455, 13267645, 12576111, 12006543, 11497761, 11025056, 10710578, 10506048, 10299894, 10081082, 10051507, 10171266, 10145252, 10167622]
3130A0167622L57601K77368L01521M34116O48541O43279N12663M02829L43159
3121A4088699J06960J27423j31013k63705n04395o39586n62160p69725o38648
3112A0813850o77873o90787n27628m52071j99434j70693j46356j48445m3788K28161
3102G984936J93345J85171K73983K45775K95271L26200L13819P8280M8600k58105
3092I687275k07879k79619l30308l88630o89021p27053n64965n01002m99052m41995
3082E057751k70689k51334j78576j67336j98985k64903q2544j08724q9825j60755
3072C284080l7599j15095K3644j1068j31933L5125j11400j05178p9782j8104k1383
3061B711307L831j36986j10861O6060L4286k11662k2086n7253k5367n6154j24072
$$ y = [10167622, 10525223, 10802591, 11104112, 11538228, 12186769, 12830048, 13342711, 13745540, 14088699, 14195659, 14323082, 14192069, 13928364, 13423969, 12784383, 12222223, 11452498, 10813850, 10135977, 9445190, 8917562, 8465491, 8266057, 8095364, 7949008, 7800563, 7756775, 7984936, 8178281, 8363452, 8637435, 8883210, 9178481, 9504681, 9818500, 9896780, 9945380, 9687275, 9479396, 9199777, 8869469, 8480839, 7791818, 7064765, 6499800, 5998798, 5499746, 5057751, 4787062, 4535728, 4357152, 4189816, 3990831, 3725928, 3643384, 3534660, 3444835, 3284080, 3246481, 3131386, 3155030, 3143962, 3012029, 3047154, 2935754, 2830576, 2750794, 2732690, 2711307, 2715138, 2578152, 2467291, 2533351, 2567637, 2355975, 2333889, 2276636, 2251269, 2195115, 2071043]
3050B071043P6072J36379j17138j43077O2695q20j9577K1793l4827m4836r7721
3039A909986q9798p4399Q5826o8624j149J2380r3132j3817P984L0470O8284n0746
3027A723265j43466k4952R4245j06426K0527j3748k194L2885l7148N188L8111
3016A586287l6343j0927L0363n0909j7270n3733l541L7648l6108J43463n5525
3005A533405j32777m0700P0892M6977R1848j06404j5127q810j11453Q8276k306
2994A413821r3489M1993O3862O8911j0184L3118k4644m6699P5828n5838K2959
2983A489638L7521r9665J1282J53366J10413m9873M7628J4117p429K7334k3260
2972A711072p4442Q9039k4028j53086l8976M4307M0537n2001J3060k9774N1508
$$ y = [2071043, 2147115, 2283494, 2166356, 2023279, 2085974, 2085154, 2065577, 2087370, 2052543, 2007707, 1909986, 1820188, 1745789, 1831615, 1762991, 1761842, 1774222, 1681090, 1667273, 1675257, 1705727, 1774011, 1723265, 1579799, 1554847, 1649092, 1542666, 1563193, 1549445, 1547251, 1580136, 1542988, 1548176, 1586287, 1549944, 1539017, 1569380, 1518471, 1501201, 1447468, 1443927, 1481575, 1445467, 1588930, 1533405, 1400628, 1359928, 1430820, 1477797, 1569645, 1463241, 1448114, 1439304, 1327851, 1416127, 1413821, 1320332, 1362325, 1426187, 1495098, 1484914, 1518032, 1493388, 1446689, 1522517, 1466679, 1489638, 1527159, 1427494, 1438776, 1592142, 1702555, 1652682, 1700310, 1714427, 1706998, 1734332, 1711072, 1636630, 1725669, 1701641, 1548555, 1509579, 1553886, 1594423, 1542422, 1555482, 1525708, 1577216]
2961A577216K210K940J4870m3419L1816J2669R7432N0757j07761J2065n7110O8125
2949A661810l040K6944M5539L696N8334m9516o2889R17O0882K3163p3349n8517
2937A633974q1504R4366R6711j7967m5791l0477J6022N9164j1388l0446L435J07208
2925A793307J6015m3419o4822R9381R6438J07868K6393l470l5720K6544R84K09898
2913B229397q472L5025k2503n3407q2634P681R0566q2126M2060N755J12119P5847
2901B349308k7786K7676n2507N4637N4978M8488O0635P9969P8733K6928K3125
2890B724184J45739J05747L6754K8007J5428R9452Q9753J18574J1754m6760p3181
2879C255451r6583o7932l2537j12442J104k5426j9495l951m4269j01240j7865
$$ y = [1577216, 1579426, 1582366, 1597236, 1553817, 1585633, 1598302, 1695734, 1746491, 1638730, 1650795, 1593685, 1661810, 1658770, 1685714, 1731253, 1734949, 1793283, 1743767, 1680878, 1681795, 1742677, 1765840, 1692491, 1633974, 1552470, 1646836, 1743547, 1725580, 1679789, 1649312, 1665334, 1724498, 1713110, 1682664, 1686099, 1793307, 1809322, 1765903, 1701081, 1800462, 1896900, 2004768, 2031161, 2027691, 1991971, 2018515, 2019499, 2229397, 2220925, 2255950, 2233447, 2180040, 2097406, 2105087, 2195653, 2113527, 2155587, 2161342, 2273461, 2349308, 2321522, 2349198, 2296691, 2351328, 2406306, 2454794, 2515429, 2595398, 2674131, 2701059, 2724184, 2869923, 2975670, 3012424, 3040431, 3055859, 3155311, 3245064, 3363638, 3375392, 3328632, 3255451, 3158868, 3090936, 3058399, 2945957, 2947061, 2921635, 2902140, 2898189, 2853920, 2752680, 2734815]
2868B734815p6205J7930j1772O1582J14121p1025m0216K8144q450o0756k0372
2857B667796p6641l7692O175L0821m4350P260j4602j43631R6163l0910r7452l1132
2845B331805n7574l8622l5365r5107k8617K4866K3382j08874j02615r3468O3018
2834A882829j51463m5039m3595r5974j50632l8445n1380K3102O1712j57046J8241
2823A252310J961o0343K3523N95K740q0152q1476j2673K750p7873j2206l0268
2811I28888J0860p187j5316j8465P908l1602Q6104P2217o4351o5531k00507n7519
2799F45499O8816O2427m1634L021j00081J6800N9632P0101j44544k7971q4165
2788E27901L5204J10371l0303q3983L3381p320n9385j2962n7218P799N5385L6608
$$ y = [2734815, 2658610, 2676540, 2664768, 2726350, 2840471, 2769446, 2729230, 2757374, 2748924, 2688168, 2667796, 2591155, 2553463, 2559638, 2590459, 2546109, 2553369, 2538767, 2395136, 2491299, 2460389, 2362937, 2331805, 2274231, 2235609, 2200244, 2105137, 2076520, 2101386, 2124768, 2015894, 1913279, 1819811, 1882829, 1731366, 1686327, 1642732, 1546758, 1396126, 1357681, 1306301, 1329403, 1391115, 1234069, 1252310, 1254271, 1193928, 1217451, 1218046, 1220786, 1140634, 1059158, 1046485, 1049235, 971362, 959156, 928888, 939748, 932561, 917245, 898780, 906688, 875086, 961190, 1033407, 969056, 903525, 703018, 645499, 714315, 776742, 735108, 738129, 638048, 654848, 714480, 784581, 640037, 612066, 527901, 563105, 673476, 643173, 559190, 592571, 585251, 525866, 512904, 455686, 463485, 518870, 555478]
2776E55478p3673M2261P9310o021o1831j7584n6877o4511l2515Q3599r254p3827
2764C64555K5194O3089l6940P8814k9029q3117k7758K3136L651l909J342k0111
2752C58917L3738L5283J7550r4277K7891J3478m4056J3266K0894j16260R1509
2741C57933J7644q7951o066j5733O4596M3192m8702o6110J00267L6042j77704
2730B17408N9838N3570o6715j5522L2953L321N869J500M2618m354j5427k7602
2718B87457M636k4250j3251R2435O818q6595o6958L0708m6578J7712J13716M4100
2706C59950o2563o0470M3785m3080J12741l4958n6418M0878O2677p9655n6655
2695B26232j1522N6169m934j55922o1396J32458K0100M1081N6515q7835p816M5049
$$ y = [555478, 481805, 524066, 603376, 597355, 535524, 517940, 461063, 396552, 364037, 447636, 438382, 364555, 389749, 452838, 415898, 494712, 465683, 382566, 354808, 377944, 381595, 377686, 379028, 358917, 392655, 427938, 445488, 351211, 379102, 392580, 348524, 361790, 382684, 266424, 357933, 375577, 287626, 281560, 265827, 330423, 373615, 324913, 258803, 359070, 395112, 217408, 277246, 330816, 264101, 248579, 281532, 284853, 290722, 292222, 334840, 330486, 315059, 287457, 292093, 267843, 254592, 347027, 353845, 267250, 200292, 231000, 184422, 202134, 315850, 359950, 297387, 236917, 280702, 237622, 350363, 315405, 258987, 299865, 362542, 282887, 226232, 214710, 270879, 265945, 110023, 48627, 181085, 201185, 242266, 298781, 210946, 203130, 248179]
2683B48179m727l7495L3416p081k7599O3874o21m9825j3886L7029q9449j0102
2671A41713Q0678r8890M7547J17699L3736j01601o8248J327K9299k4635N2116
2660B10741k5298o0332k1455L0849K9274o2530J4432k1190l4466J06617n4180
2649A12462J74813K7371j45133n4574Q7652J13760N707l7045l3249l3716K3083
2638B41131k5152K883J1232K9092p2372l4993K1803L4557k9259n722J825r778
2626A65247m1297N1903Q0974R6183j8218k6307r7341q7818l9688L4167K6207o904
2614A37108l5236o3098R0333j6835K5414j7036O335K5526n3820o3628J8384M1330
2602I4777J9476O5945k2344r9012L9490P5364l416l5520k296k4316q365R1968
$$ y = [248179, 243452, 205957, 239373, 232292, 204693, 268567, 267946, 218121, 204235, 241264, 151815, 141713, 222391, 123501, 171048, 288747, 322483, 220882, 152634, 153961, 183260, 158625, 210741, 185443, 125111, 103656, 134505, 163779, 101249, 115681, 94491, 60025, 166642, 112462, 287275, 314646, 169513, 114939, 202591, 316351, 322058, 285013, 251764, 218048, 241131, 215979, 218862, 230094, 259186, 186814, 151821, 173624, 208181, 178922, 173200, 175025, 165247, 123950, 175853, 256827, 353010, 334792, 308485, 211144, 123326, 83638, 117805, 144012, 137108, 101872, 38774, 129107, 112272, 137686, 120650, 126985, 152511, 98691, 35063, 53447, 94777, 114253, 180198, 157854, 58842, 98332, 173696, 170280, 134760, 132464, 108148, 99783, 191751]
2590A91751Q716K7541l6584n8264q377Q6606J31883q1594n7400L1805r6517M0911
2578A80477M6631r7786N2219r9415O9064N3704m7204o2524k7525Q4281J7111l5742
2566A33291P801q6261N400L1068m1153J519n5033l0050R1464J04425p0231K3061
2554A15301L4776r9585J19290r3942O6352K3831K0707k4934r9909q3780K9131
2543G238K8793l0073Q596J31308m6719m0700P0627J9624j280O577L7220k5479
2531A65732o6581m3124R7514p2459j855N4802N0149Q8680q8114j80440M6038k0139
2519C0203q4291k1480R2517l8955R947M2630M5151P5512L1846K4728j46603o0270
2507I35M8246J24848J8699q7275L3290R3372l8680j4481n1265r9785o5777R8590
$$ y = [191751, 200467, 228008, 191424, 133160, 124783, 211389, 343272, 261678, 204278, 236083, 139566, 180477, 227108, 129322, 181541, 82126, 151190, 204894, 157690, 95166, 67641, 151922, 169033, 133291, 141092, 54831, 60231, 91299, 50146, 51665, -3368, -33418, 58046, 162471, 92240, 115301, 150077, 50492, 169782, 75840, 142192, 166023, 186730, 161796, 61887, -21893, 7238, 36031, 5958, 14554, 145862, 99143, 58443, 129070, 148694, 147414, 153991, 191211, 165732, 99151, 56027, 153541, 81082, 79227, 134029, 184178, 272858, 184744, 4304, 50342, 30203, -54088, -75568, 16949, -22006, -12059, 30571, 75722, 151234, 183080, 207808, 61205, 935, 49181, 174029, 192728, 105453, 138743, 232115, 193435, 178954, 127689, 27904, -37873, 60717]
2495F0717M1123p7642J4421l1378k9951N4639m0031k5708Q8610q2196P0149N760
2483D8513N835M1570k1731L0181N05l7190P155K3438j02556N8526Q7931L5094
2471A77271o5702M718K4458n4827p5880L971J00298L172l2762k7184k2151O7034
2459A02416L3315k6319J24952o9932k1092j02275j4316M331Q503L0657p7175N0981
2447D4046L2113p7925L3442o3689J08175m0881p8272j5348J46883M8897j9897
2436A17544j8930l0407p9742j61986R5071Q6502M9038m3989O2365j2123j0331
2425E3012J35601o2107l0108N5202n5537K6134r4717j0808M2226R8784k0424r3059
2413D4199j15259l5132J97367L1517r3591L3256R3838p9673n7768O1292J8674
$$ y = [60717, 101840, 24198, 38619, 7241, -22710, 31929, -8102, -33810, 54800, -27396, 42753, 48513, 54348, 95918, 74187, 104368, 104873, 67683, 74838, 98276, -4280, 54246, 142177, 177271, 111569, 116287, 140745, 85918, 10038, 14009, 114307, 117479, 84717, 57533, 35382, 102416, 135731, 109412, 234364, 164432, 143340, 41065, 26749, 31080, 39583, 70240, -6935, 44046, 76159, -1766, 31676, -32013, 76162, 35281, -42991, -58339, 88544, 137441, 117544, 98614, 68207, -11535, -173521, -78450, 8052, 57090, 13101, 75466, 63343, 53012, 188613, 126506, 96398, 151600, 96063, 122197, 27480, 16672, 58898, 157682, 137258, 44199, -71060, -106192, 91175, 122692, 29101, 62357, 156195, 76522, 18754, 80046, 98720]
2402I8720n2161l9076P9056L8913k7625j6822O8719J5827j1358J5575p2052R1418
2390A89134N6483o9711j03305q505M9334K9772l2240K0229k9521N0741J9421l8577
2378A33255L3319o4153l455m5365k8332K5439O5635R807M2327r617L7432n5376
2366A40916J6163p2446j5246k3764J1248N9391q7210o6769J02405J5091r76O4159
2354A42962j6057n1443Q1469m1997L1637R8069j08924m412m7494M292M0950l1712
2342I7340j2461l0650k8313M5581P0728p463j20076n2222p2376J83442J14663
2331A88193K122m174j05388j00528N4433M393J084J4155J35806l5307K651O7477
2319B24917j12104m3637m7893j613j7098M3756j460l2060q485N8952p7457q766
$$ y = [98720, 46559, 7483, 86539, 125452, 97827, 81005, 149724, 165551, 154193, 169768, 97716, 189134, 245617, 175906, 72601, 64096, 113430, 143202, 110962, 131191, 101670, 152411, 171832, 133255, 166574, 102421, 98966, 53601, 25269, 50708, 116343, 126150, 168477, 158860, 196292, 140916, 157079, 84633, 69387, 45623, 56871, 116262, 29052, -37717, 64688, 79779, 78803, 142962, 126905, 75462, 156931, 114934, 146571, 244640, 135716, 131304, 83810, 88102, 129052, 97340, 84879, 54229, 25916, 71497, 142225, 134762, 14686, -37536, -109912, 73530, 188193, 190315, 186141, 80753, -19775, 34658, 39051, 40135, 54290, 190096, 154789, 157440, 224917, 112813, 69176, 21283, 19670, 2572, 46328, 44868, 12808, 4323, 63275, -14182, -22948]
2307b2948n805N0465N4896Q6527L7592j985m8791l0204O562j25897l9928Q4925
2295D5409O5082n4012n4322K4029O8938L5500n2443q989m955N5776j5039K5651
2283A30625k8682m7949J8111m5668o7677L3701Q4747n6734k5251J6006M062k155
2271A3136R9706r154l7628k338r161k2375J20231p6443m5033l8623Q1686P2794
2259A46798o6048M9988q590L5764m6051r5633M0150k8648R4143l2062R297R066
2247A08174j34661n882J3035M2236J04888N8230n7930m689j2227l532j06183L8067
2235C9526J10440p5794J7872J01945l9135o3841q470Q3235J079k2649n3775k4284
2223F6149J2280J03317N3404n7786p0177P8297k3927r2014k6785P0097J38O72
$$ y = [-22948, -28753, 21712, 76608, 163135, 200727, 198742, 149951, 119747, 126309, 412, -39516, 45409, 110491, 56479, 2157, 26186, 95124, 130624, 78181, 69192, 64237, 120013, 104974, 130625, 101943, 53994, 72105, 26437, -41240, -7539, 77208, 20474, -4777, 11229, 15291, 13136, 112842, 103688, 66060, 63722, 54561, 32186, 152417, 75974, 30941, -7682, 74004, 146798, 80750, 130738, 122148, 157912, 111861, 16228, 56378, 27730, 121873, 89811, 99108, 108174, -26487, -32369, -19334, 22902, 127790, 186020, 128090, 123401, 111174, 107642, 1459, 39526, 149966, 74172, 92044, 193989, 154854, 91013, 82543, 165778, 166857, 144208, 90433, 66149, 78429, 181746, 235150, 177364, 107187, 185484, 161557, 69543, 42758, 112855, 112993, 113665]
2211A13665K2016r3911n6202K5578M2751r11M6829L4053M4089N4027p2245p0759
2199H8980Q6001k3242l0091J8048M842l169N4886p9612K092L2585L6033L146J4135
2186B04634L4838K3858l524J7589n3859l1160K2862O679p369n5021M7546m3937
2174A63136Q645Q0211M012P6167n6592n5534K2226k1986j1853L7975j1349n5477
2162A79581k7901J0691j0906P0517R29O1671q4673N064N0079K6212M9412k1275
2150C09401J7860o962M3704Q2639l57m0555j347l3461J01339J5554P0420j4613
2138E43622p5058J12568o2269q8805M5817Q8778j5239n397J44827m2640J3586
2127F59790J18385n4972m1314N8246r575j14907n6064O2777N8356N1091k7307
$$ y = [113665, 135681, 41770, -14432, 11146, 53897, 52986, 99815, 133868, 177957, 231984, 159739, 88980, 174981, 151739, 121648, 139696, 144538, 141369, 196255, 116643, 118735, 151320, 187353, 190499, 204634, 239472, 263330, 259806, 277395, 223536, 192376, 215238, 221917, 214548, 159527, 207073, 163136, 171781, 251992, 256004, 332171, 275579, 220045, 242271, 220285, 208432, 246407, 235058, 179581, 151680, 162371, 151465, 221982, 222911, 284582, 199909, 204973, 255052, 281264, 330676, 309401, 327261, 320299, 364003, 446642, 446285, 405730, 404383, 370922, 472261, 487815, 558235, 543622, 468564, 581132, 518863, 430058, 475875, 564653, 549414, 544017, 688844, 646204, 659790, 778175, 723203, 681889, 740135, 730560, 615653, 559589, 622366, 680722, 731813, 704506]
2116G04506R5055R2021J23838Q1185J28864M6742J13163O7907J15903J00682J57541
2105A827407K31782M5456J84947J78191J25732K57186J3879J83996K15739L08448
2095C572763K88827N41661Q79725J027879J541430J898086J813120K108965K556772
2086A6229228L247486J280227j209819k358498k591779k556104k462233j771748
2078G806760j339065p84249o98615m81470l96438l27842k92071k28410j39974
2069C118626k97173l52615j15604k91687j51547j68339j27538j45073j5937k7788
2059A425325o1516j30719j1517j2606J5481r4955n6411q5685l6562p9972j03043
2048G67820p799J6526q1574j9141l904n9851j35182O8072K3802m2556l1830o0571
$$ y = [704506, 799561, 891582, 1015420, 1096605, 1225469, 1272211, 1385374, 1453281, 1569184, 1669866, 1827407, 2059189, 2104645, 2289592, 2467783, 2593515, 2850701, 2864580, 3048576, 3264315, 3572763, 3861590, 4403251, 5282976, 6310855, 7852285, 9750371, 11563491, 13672456, 16229228, 19476714, 20756941, 19547122, 17188624, 14596845, 12040741, 9578508, 7806760, 6467695, 5683446, 4984831, 4503361, 4106923, 3779081, 3487010, 3258600, 3118626, 2821453, 2468838, 2353234, 2061547, 1910000, 1741661, 1614123, 1469050, 1453113, 1425325, 1363809, 1233090, 1221573, 1208967, 1224448, 1129493, 1073082, 987397, 950835, 870863, 767820, 760021, 776547, 694973, 675832, 671928, 612077, 476895, 544967, 568769, 526213, 494383, 433812]
2036D33812K4634Q2819l487K737l5106l7475o2651Q480j6416k6540J7378o3281
2024C24904k3908K831o694P3578O1744n0686L4361j1303n4143m2042K5359N63
2012C34564J0010k9356m1085l8391L5443m4824N0902r6695O1716k0441L6406j9309
2000B38940K8826N3759l9256m4157p0706Q7496l6935J2174M6122o5384m9160M2913
1988B04632J4672k8395k9513l0233o1575J4225l8462O0721M442k5009N2253m1581
1976I6177O0050O3384n0882n6308o1303m6700J6537k0636Q8687Q00J00784j01302
1964H9288K7067N809L2908J6414j07679l1493M9751n6069n1191J28325p1457L1040
1952F2713P3520l3775o9981K8499j1169j3774R6146r525r1790L4186j357n8177
$$ y = [433812, 458446, 541265, 537778, 540515, 505409, 467934, 405283, 413763, 397347, 370807, 388185, 324904, 300996, 303827, 297133, 370711, 432455, 381769, 416130, 404827, 350684, 308642, 334001, 334564, 344574, 315218, 274133, 235742, 271185, 226361, 277263, 180568, 242284, 221843, 258249, 238940, 267766, 321525, 282269, 238112, 167406, 254902, 217967, 230141, 276263, 210879, 161719, 204632, 219304, 190909, 161396, 131163, 69588, 83813, 45351, 106072, 110514, 85505, 137758, 96177, 156227, 219611, 168729, 112421, 51118, 4418, 20955, 319, 89006, 89806, 190590, 89288, 116355, 122164, 155072, 171486, 63807, 32314, 82065, 25996, -25195, 103130, 31673, 62713, 136233, 102458, 32477, 60976, 49807, 36033, 132179, 122654, 30864, 65050, 63693, 5516]
1940E516j65535O0817J15325k20l8507L7622L5279J1035j058j8549n9715P0219
1928E2229M6369K4121o0019l4490l924R0525k4736j5674J3337r7637O5728q467
1916D7362O079j49377O2310J15956J4457j19944m6870L4611K8985n924j0123P434
1904a5044K5227R6850J3427m5573p0611m5764Q8828J10019K8638l1903k2892j2464
1892A18738q2882o0661J3426O295K5170M7344k7278p1692N0777J26529q9543p7417
1880b1194n7172L7633J29988q833L990o2321O0333m1543K9529J7547R7859m2170
1868A43646j77897J6667M8455N3205j0900q2014o9605R2689M6632m8554j7428
1857e104R7780K378m9468M9269J31588r2049m2609N5869q2539n8104k9036N6945
$$ y = [5516, -160019, -99202, 16123, 15903, -22604, 15018, 50297, 61332, 60274, 41725, -17990, 52229, 98598, 122719, 62700, 28210, 24286, 114811, 90075, 74401, 87738, -9899, 55829, 47362, 53441, -95936, -33626, 82330, 96787, -23157, -70027, -35416, -6431, -12355, -22478, -15044, 10183, 107033, 120460, 74887, 4276, -41488, 47340, 157359, 185997, 154094, 131202, 118738, 35856, -24805, -11379, -5084, 20086, 67430, 40152, -31540, 19237, 145766, 56223, -21194, -78366, -40733, 89255, 80422, 84412, 22091, 82424, 40881, 70410, 87957, 185816, 143646, -34251, -17584, 30871, 84076, 73176, -8838, -78443, 14246, 60878, 12324, -5104, 92676, 95054, 45586, 94855, 226443, 134394, 91785, 147654, 65115, 7011, -22025, 34920]
1845C4920J7077n2700K1612L3771l5522o7956L8598N5120J7321J7436L8209k2984
1833I4902m7580J86M647n8460J3718K6160j5760M1462j4609M6366Q3377o1621
1821A12788J6317o5113j2041j5609K4940J14875K1658k1620K4393J00j63543k3176
1809A3969o0973J3556J07542j13757o401j6744Q7018P0380L1216q9921j1836O141
1797C0190q481O7711o4684n6569k786J7432J10308l6143m8392M6162P4205p5096
1785E3857l4198Q0905m813j3640j4341M9389M19K6794n4219j312p5270J7975K9778
1772F1324j7576j9206p7924m850L4581J14427m0666k0483j5791l8550K4369m505
1760d850L5996K7277L3696r2519L1604l6347M4161K0960m5101n3869k6935M6165
$$ y = [34920, 51997, -703, 20909, 54680, 19158, -48798, -10200, 44920, 62241, 79677, 117886, 94902, 47322, 47508, 52155, -6305, 7413, 33573, 17813, 59275, 44666, 91032, 174409, 112788, 129105, 63992, 51951, 36342, 61282, 176157, 197815, 176195, 200588, 200688, 37145, 13969, -47004, -33448, 74094, -39663, -46064, -62808, 24210, 94590, 125806, 35885, 24049, 30190, 21709, 89420, 24736, -31833, -34619, -17187, 93121, 56978, 8586, 54748, 128953, 53857, 19659, 100564, 95751, 82111, 67770, 117159, 117578, 144372, 90153, 88841, 13571, 31546, 61324, 43748, 24542, -53382, -58232, -23651, 90776, 50110, 29627, 13836, -24714, -345, -4850, 31146, 58423, 92119, -400, 31204, -5143, 39018, 59978, 14877, -38992, -65927, -19762]
1748a9762M9620o005L4907l8239j15358N7910Q5023j5590N234L2021l3877r3844
1736e7960O3220O4642k5145o5889K6912j04190R038R4527O8732N3715n1896j0255
1724F5451K6600n5042j6161l6393j163n0967K5253O0984n0938J2610l1930R7281
1712D5585N3033J13656p1872j33374j08385K5304K5658N6749L9858l8989L0075
1701C7298J4637k4512m1906J00090L8220n6860J4706n3889j09348J624J32824
1690E2884N4654k6444o9629K9337l564K682K4842n996l2366k2118m8063O3015
1678A9234M9995M5780j46800m7806R6011j4723J31047j22440q4930L0939O8423
1667B4730l5668K6046m4502j4064m8714Q3143L4212l1148l3146l4845R9871q3599
$$ y = [-19762, 29858, 23853, 58760, 20521, -94837, -36927, 48096, 32506, 37740, 69761, 35884, -57960, 5260, 69902, 44757, -21132, 5780, -98410, -89372, 5155, 73887, 127602, 75706, 65451, 92051, 37009, 20848, -15545, -16708, -67675, -42422, 18562, -32376, -19766, -51696, 45585, 98618, 212274, 140402, 7028, -101357, -76053, -50395, 6354, 46212, 7223, 37298, 51935, 27423, -14483, 85607, 123827, 66967, 81673, 27784, -81564, -79940, 52884, 107538, 81094, 11465, 40802, 37238, 39920, 64762, 58766, 26400, 4282, -43781, 19234, 69229, 115009, -31791, -79597, 16414, 1691, 132738, 10298, -74632, -43693, 24730, -10938, 15108, -29394, -43458, -92172, -9029, 25183, -5965, -39111, -73956, 25915, -57684]
1655e7684O3681J06869O2863r6692k1472J8002n1829q0911j5619M9151L8251q938
1643E672Q519J6757J0625n5241M7857r687j8909k9214Q6247Q3650j32775k4453
1631a0952J1838M6729m1011K7952l8827M0544j5311J945L5784o553O840l0721
1619B8257p874m086k3289k0600O1673J029n3106K0523R013n7378R4401K4312m4660
1606B8215q7088L2895L4481J04180j2590q4312j04015J8516N4243k4481J24832
1595H4876m542l2631O3497l5244m5226L4176l227j00169q0273M6172J3609K4478
1583c4504R9015N4405k4004n183n0225M9841n5822o4289P761R822O0014L4730
1571H1561n8507l1165Q2121j15111j5685J36929n1676m7000m5131R1746L4239
$$ y = [-57684, 5997, 112866, 175729, 79037, 57565, 75567, 23738, -57173, -72792, -23641, 14610, 5672, 14191, 30948, 41573, -13668, 34189, 24502, 5593, -23621, 62626, 146276, 13501, -10952, 886, 47615, 6604, 34556, -4271, 36273, 20962, 22907, 58691, 52138, 58978, 28257, 20383, 16297, -6992, -27592, 34081, 35110, -17996, 2527, 11540, -45838, 48563, 72875, 28215, -58873, -25978, 8503, 112683, 100093, 15781, -88234, -69718, -15475, -39956, 84876, 80334, 47703, 111200, 75956, 30730, 64906, 61679, -38490, -118763, -72591, -58982, -34504, 64511, 118916, 94912, 89729, 39504, 89345, 33523, -30766, -23005, -13183, 46831, 81561, 23054, -8111, 74010, -41101, -56786, 80143, 28467, -18533, -63664, 28082, 62321]
1560F2321M043j3671k2078N7809j41881K7121J06562O52m8105j00294R306L5936
1548b2279J6517k2308R3209K0484j9683j5906m186k7330J0073J2070n0324o5853
1536g5516N3908P9257m0535o0500O4591J8393J0577l9566l3072r805k7566Q390
1524e1444L2748J32205r7532J0496J884j42760m874O3130M1406o8004L2484O3893
1512A3632l0772K3700j3743k3588O7592R327m2189p2815J807k8360R6806P3672
1500G5069j0296m6026l4139l78N5386O1631l4516K0898J5728k9063k1690K0314
1488G2918p483m7115q1919J09003p6977o8460J03884L9931j37962O1326J46666
1477A13812m3197r6286r0591J12589L926k7919N5348j1889L06p4311J1829L9787
$$ y = [62321, 66364, 52693, 30615, 88424, -53457, -26336, 80226, 80878, 32773, -67521, -58215, -22279, -5762, -28070, 65139, 85623, 65940, 50034, 45848, 18518, 28591, 40661, -9663, -75516, -21608, 57649, 17114, -43386, 21205, 39598, 50175, 10609, -22463, -32268, -59834, -51444, -18696, 113509, 15977, 26473, 28357, -114403, -119277, -56147, -14741, -82745, -50261, 13632, -17140, 6560, -7183, -30771, 36821, 46148, 3959, -68856, -67049, -95409, 1397, 75069, 64773, 18747, -15392, -15770, 39616, 101247, 66731, 87629, 103357, 74294, 52604, 72918, 65435, 18320, -63599, 45404, -31573, -100033, 3851, 43782, -94180, -32854, 113812, 70615, -25671, -116262, -3673, 253, -27666, 27682, 15793, 16099, -58212, -46383, -6596]
1465f596j5308K0500j0508k7117N2268M972M0496m191j10239K877R4340J2836
1453E4330M0225m8958j4107J7980j4715J503Q477l1600L112l9312j1997L9994
1441D932l245O2023j4411j0373K4689j09118q4030J22173j2803l8643K4037l5714
1429g0483q357k5653J10771L2926p339j15027J5294M9012J7474R8146q7576p2246
1417f3058J54960M2326r5211o5618P6060P9q1906N8809l4330M488j22449J05698
1405b0152J23223m9893j6598O315p1579O385L277J8544j5751N5399p2298l6K516
1392c0648o3551K2479Q8922n2636P091O1997m8373j1063n6196m5380R6394P0135
1380C9171P3970m199m5531j33047o7727M3297l9272P4955J7484l1968P8214l163
$$ y = [-6596, -21904, -1404, -11912, -39029, 13239, 18211, 58707, 54516, -55723, -52846, 41494, 54330, 94555, 45597, 31490, 49470, 34755, 36258, 44735, 13135, 16247, -23065, -35062, 4932, 1687, 63710, 49299, 38926, 63615, -45503, -129533, -7360, -20163, -58806, -34769, -70483, -78840, -104493, 6278, 39204, 31865, -83162, -67868, -18856, -1382, 96764, 9188, -63058, 91902, 134228, 39017, -26601, 49459, 49538, -32368, 26441, -7889, -3401, -125850, -20152, 103071, 53178, 36580, 42895, -28684, -22299, -19022, -478, -16229, 39170, -33128, -33164, -30648, -94199, -71720, 17202, -35434, -28343, 33654, -14719, -25782, -81978, -127358, -30964, 39171, 113141, 108942, 63411, -69636, -137363, -94066, -133338, -58383, -40899, -72867, 5347, 2184]
1368B184j05229O4254q4019O9674K4201r5289L3448Q0944J8254J03321n6977m2477
1356A2289j37678N9193J8974l8804J08776o4768q0280J30520J07198o0352j7945
1345C7123J4169j28223M30Q4376L7808m6431m9333L7220K4314K1682o7889M4280
1333I526o136j987m6539N6997M4048K6643l6640O1125m4577j16726r4246J03179
1321d5333l6808M9901P8113j19110m7855N9936J00884K2262j2548p809m0574q3222
1309h2163O1222J15715o3631K2997P6268r4057m3022L6983m0904r8394K5742k3736
1297a06980O9497J47308o8006o2355Q843L440k4600p8432N2548M9365j6401m0097
1285f5870J7313R6355N1303o7373q6131p01P3592m9647m9999K1419l373q538J58797
$$ y = [2184, -103045, -38791, -122810, -53136, -28935, -124224, -90776, -9832, 8422, 111743, 54766, 12289, -125389, -66196, -47222, -86026, 22750, -42018, -122298, 8222, 115420, 55068, 37123, 51292, -76931, -76501, 7875, 45683, -748, -50081, -12861, 11453, 33135, -34754, 9526, 3390, 1403, -45136, 11861, 55909, 82552, 45912, 107037, 62460, -54266, -148512, -45333, -82141, -32240, 45873, -73237, -121092, -61156, 39728, 61990, 49442, 41633, 1059, -82163, -20941, 94774, 31143, 54140, 130408, 36351, -6671, 30312, -10592, -108986, -83244, -106980, -37483, 109825, 41819, -20536, -11693, -8253, -32853, -111285, -58737, -9372, -25773, -65870, -48557, 47798, 99101, 31728, -54403, -55104, 18488, -31159, -81158, -59739, -63112, -71650, 87147]
1272H7147r7476L937j01611J4073N3308r535Q1610k3930N3371L2973O5336j21564
1260C7639k9423M7009M3010q9210N924M8258K8965l3506l6442k4993L3378r5440
1248f4831K0900N6711M9684l0094j74730M674L3655k7061J24925k3867J3247J9068
1236B281q770k4979j1896K0409j03389L1383k8420N3361k9215N4246j5289L0423
1224b9855O694N6126m9703J831j7667p479m9084P9339Q273o4873J1279L2455K9194
1211F530p0069J6757N4206n3323r0986L0640Q0547k5033K8837P7832n4789j8523
1199a7374K3016n689n8982q4232O338R1153n7568j2386M4191J8843J986p9883
1187a30587J3951J13472k623l2347j443j0129M711K8048Q6098k2347o2242l6292
$$ y = [87147, -10329, -6392, -108003, -93930, -40622, -50157, 31453, 7523, 60894, 93867, 159203, 37639, 8216, 55225, 98235, 9025, 14949, 63207, 92172, 58666, 22224, -2769, 30609, -64831, -43931, 12780, 62464, 32370, -142360, -137686, -104031, -131092, -6167, -30034, -16787, 2281, -6489, -31468, -43364, -22955, -126344, -94961, -123381, -70020, -99235, -44989, -60278, -29855, -23161, 32965, -16738, -14907, -32574, -40053, -89137, -9798, -1525, -66398, -55119, -22664, 6530, -63539, -46782, 7424, -45899, -136885, -106245, -25698, -50731, -21894, 55938, 1149, -17374, 5642, -47, -59029, -143261, -136923, -45770, -103338, -115724, -71533, -52690, -50704, -130587, -116636, -3164, -5787, -38134, -39577, -49706, -44995, -16947, 69151, 46804, -15438, -51730]
1175e1730J06393R3638j24051K6512n1138o8635m1549M0459q748O4248K9327q4032
1163f9306M3183m3727J2541P1805m5342M6346N5424o6428J3855p718m1205p2778
1151a03350L6226Q6694n5199K6438L6338K302P068J6840n0718O405Q9814p3411
1139B5447m1945M0339k9767K8786P91m2493n9525k6497R3555R0758n6590j9770
1127C089m9936n2762N3546K062j3674K2319L9068r551q9054J38722r3406o393
1115e5970Q1856L2063j60033j2481N3591J0341N7240R270l3300q1896N6354j9855
1103f2820J04843J3998k3337r0166L5694N8316N988k615j04376N014M3224K4965
1091H728j2121k7236q8920p965O6987O485P1278P2995o9447o286k4278N3116p6002
$$ y = [-51730, 54663, 148301, 24250, 50762, -376, -69011, -110560, -70101, -78849, -14601, 14726, -69306, -26123, -69850, -57309, 14496, -30846, 15500, 70924, 4496, 18351, 10633, -30572, -103350, -67124, 19570, -35629, -9191, 27147, 29449, 36517, 53357, 2639, 9044, 98858, 25447, -16498, 23841, -5926, 22860, 23651, -18842, -78367, -104864, -11309, 79449, 22859, 3089, -46847, -99609, -46063, -44001, -57675, -35356, 3712, -5839, -94893, 43829, -49577, -55970, 25886, 57949, -102084, -114565, -60974, -50633, 6607, 15877, -17423, -99319, -42965, -62820, 42023, 56021, 32684, -57482, -21788, 36528, 42516, 39901, -64475, -59461, -16237, 8728, -3393, -30629, -119549, -127514, -60527, -54042, 17236, 90231, 20784, 14498, -9780, 43336, -32666]
1078c2666q9422N6182m7012m1618j4188J24623K4660m1619m8583J6716L9413P4176
1066B0662N3103k1194m8765p0093l3540R4847k8814p266L624O5823N6551K8999
1054A13937n0897q8276K0748K6207l6969n7325j3575M9460M1268L5190j6019K0804
1042D4553n8702k631L0600K2471N8282r722L0002p5898p009J28065o9829n7012
1030C3170j00543M5323P3593o8824L8651R1196n7135l2759j30779K4152J46300
1019F2345j22603J7687l1967k9562J2761j1609j9687Q3100N9080j02464K3237
1008e9682O2226o9723L4755p8864m9541K646L1007Q0061M4124M4876J4700l4764
996B1821q6239K593j0180M518N164P0658L763j01416l9879L7203J9684J5374J03205
$$ y = [-32666, -122088, -65906, -112918, -154536, -168724, -44101, -19441, -61060, -109643, -92927, -53514, 20662, 73765, 52571, 3806, -66287, -99827, -4980, -33794, -41060, -37436, 28387, 84938, 113937, 63040, -25236, -4488, 21719, -15250, -72575, -86150, -36690, 4578, 39768, 23749, 44553, -14149, -16780, 13820, 36291, 94573, 84851, 114853, 38955, 31946, 160011, 90182, 33170, -67373, -22050, 51543, -17281, 21370, 112566, 55431, 22672, -108107, -83955, 62345, -60258, -42571, -74538, -104100, -91339, -102948, -122635, -39535, 19545, -82919, -59682, 2544, -67179, -32424, -111288, -160829, -158183, -127176, -47115, -2991, 41885, 56585, 21821, -64418, -61825, -72005, -67487, -62323, 8335, 12098, -89318, -129197, -91994, -72310, -56936, 46269]
983D6269k0013m3722L3557Q6889N7655k3876n8371r2013k8224m9479k4582N2803
971f3107j7837O6395P2453K350j23748j5025m684Q2057j5735m7123O6714l4341
959c1631n2144K4522J3492K3429j9564j0440O3772n1041j1636k4466R6648n4475
947c3534Q6150O2085O233n3768k428J5903p3975j4093M4964l6888j19540M955
$$ y = [46269, 26256, -17466, 16091, 102980, 160635, 136759, 78388, -13625, -41849, -91328, -115910, -63107, -80944, -14549, 57904, 60254, -63494, -78519, -83203, -1146, -16881, -64004, 2710, -31631, -83775, -59253, -45761, -22332, -41896, -52336, 11436, -39605, -51241, -75707, 20941, -33534, 52616, 114701, 120934, 67166, 64738, 80641, 6666, -7427, 37537, 649, -118891, -113936]
$$ [...]
##END NTUPLES=NMR SPECTRUM
##END=
