##TITLE=1H_TG-2341-A21
 CDCl3
 8 sc, 
 29.08.2022
##JCAMPDX= 6.0         $$ Bruker NMR JCAMP-DX V2.0
##DATA TYPE= NMR SPECTRUM
##DATA CLASS= NTUPLES
##ORIGIN= UXNMR, Bruker Analytische Messtechnik GmbH
##OWNER= root
$$ XWIN-NMR		Version 3.5
$$ Mon Aug 29 10:05:35 2022 Russian Standard Time (UT+4h)  she@DPX200
##.OBSERVE FREQUENCY= 200.1313499994
##.OBSERVE NUCLEUS= ^1H
##.ACQUISITION MODE= SIMULTANEOUS
##.ACQUISITION SCHEME= undefined
##.AVERAGES= 8
##.DIGITISER RES= 18
##SPECTROMETER/DATA SYSTEM= spect
##.PULSE SEQUENCE= zg30
##.SOLVENT NAME= DMSO
##.SHIFT REFERENCE= (INTERNAL, DMSO, 0, 15.7568)
##AUDIT TRAIL= $$ (NUMBER, WHEN, WHO, WHERE, WHAT)
$$ ##TITLE= Audit trail, XWIN-NMR		Version 3.5
$$ ##JCAMPDX= 5.01
$$ ##ORIGIN= Bruker BioSpin GmbH
$$ ##OWNER= she
$$ F:/spectra/data/she/nmr/H-F/1/pdata/1/auditp.txt
$$ ##AUDIT TRAIL=  $$ (NUMBER, WHEN, WHO, WHERE, WHAT)
(   1,<2022-08-29 10:01:18.32 +0400>,<she>,<DPX200>,
      <created by zg, POWCHK disabled, PULCHK disabled
       configuration hash MD5:
       00 E9 B6 7A A2 85 ED C7 34 08 36 98 17 FE 4E 26
       data hash MD5: 16K
       FA 7B 77 5A 56 B1 CF 8F D8 0E DE 4D 31 AC 37 CE>)
(   2,<2022-08-29 10:01:20.85 +0400>,<she>,<DPX200>,
      <Start of raw data processing
       efp BC_mod = 2 LB = 0.24 FT_mod = 6 PKNL = 1 PHC0 = -18042.64 PHC1 = 17.00069 SI = 16K 
       data hash MD5: 16K
       0E 9B 63 6D 51 7C E4 4C 09 FC 00 A3 C3 25 68 DA>)
(   3,<2022-08-29 10:01:44.84 +0400>,<she>,<DPX200>,
      <pk PHC0 = 7.760971 PHC1 = -9.4 
       data hash MD5: 16K
       97 5B 91 1D B0 F3 9C 95 62 E1 A7 AC 9A 25 21 DD>)
(   4,<2022-08-29 10:01:48.42 +0400>,<she>,<DPX200>,
      <abs ABSG = 5 
       data hash MD5: 16K
       E2 7F 3F 61 95 14 5B 0E 4A AB 59 FC 80 D7 8C A9>)
$$ ##END=
$$ 
$$ hash MD5
$$ 8C 36 65 24 A7 E3 F8 72 00 3F B6 A4 3F 3A 60 22
##$RELAX= 
##$RELAX= 
##$RELAX= 
##$RELAX= 
##$RELAX= 
##$RELAX= 
$$ Bruker specific parameters
$$ --------------------------
##$DU= <F:/spectra>
##$EXPNO= 1
##$NAME= <H-F>
##$PROCNO= 1
##$TYPE= <nmr>
##$USER= <she>
##$AMP= (0..31)
100 100 100 100 100 100 100 100 100 100 100 100 100 100 100 100 100 100 
100 100 100 100 100 100 100 100 100 100 100 100 100 100 
##$AQSEQ= 0
##$AQ_mod= 1
##$AUNM= <au_zg>
##$AUTOPOS= <>
##$BF1= 200.13
##$BF2= 200.13
##$BF3= 200.13
##$BF4= 200.13
##$BF5= 200.13
##$BF6= 200.13
##$BF7= 200.13
##$BF8= 200.13
##$BYTORDA= 1
##$CFDGTYP= 0
##$CFRGTYP= 5
##$CHEMSTR= <none>
##$CNST= (0..31)
1 1 145 1 1 1 1 1 1 1 1 1 1 1 1 1 1 1 1 1 1 1 1 1 1 1 1 1 1 1 1 1 
##$CPDPRG= <>
##$CPDPRG1= <>
##$CPDPRG2= <>
##$CPDPRG3= <>
##$CPDPRG4= <mlev>
##$CPDPRG5= <mlev>
##$CPDPRG6= <mlev>
##$CPDPRG7= <mlev>
##$CPDPRG8= <mlev>
##$CPDPRGB= <>
##$CPDPRGT= <>
##$D= (0..31)
0 1.2 0 0 0 0 0 0 0 0.06 0 0.03 0 0 0 0 0.0002 0 0 0 0 0 0 0 0 0 0 0 0 
0 0 0 
##$DATE= 1661752877
##$DBL= (0..7)
120 120 120 120 120 120 120 120 
##$DBP= (0..7)
150 150 150 150 150 150 150 150 
##$DBP07= 0
##$DBPNAM0= <>
##$DBPNAM1= <>
##$DBPNAM2= <>
##$DBPNAM3= <>
##$DBPNAM4= <>
$$ [...]
##$SUBNAM3= <"">
##$SUBNAM4= <"">
##$SUBNAM5= <"">
##$SUBNAM6= <"">
##$SUBNAM7= <"">
##$SUBNAM8= <"">
##$SUBNAM9= <"">
##$SW= 18.0517283424941
##$SWIBOX= (0..15)
0 0 2 0 0 0 0 0 0 0 0 0 0 0 0 0 
##$SW_h= 3612.71676300578
##$TD= 16384
##$TD0= 1
##$TE= 0
##$TE2= 300
##$TE3= 300
##$TEG= 300
##$TL= (0..7)
0 120 120 120 120 120 120 120 
##$TP= (0..7)
150 150 150 150 150 150 150 150 
##$TP07= 0
##$TPNAME0= <>
##$TPNAME1= <>
##$TPNAME2= <>
##$TPNAME3= <>
##$TPNAME4= <>
##$TPNAME5= <>
##$TPNAME6= <>
##$TPNAME7= <>
##$TPOAL= (0..7)
0.5 0.5 0.5 0.5 0.5 0.5 0.5 0.5 
##$TPOFFS= (0..7)
0 0 0 0 0 0 0 0 
##$TUNHIN= 0
##$TUNHOUT= 0
##$TUNXOUT= 0
##$USERA1= <user>
##$USERA2= <user>
##$USERA3= <user>
##$USERA4= <user>
##$USERA5= <user>
##$V9= 5
##$VALIST= <valist>
##$VCLIST= <CCCCCCCCCCCCCCC>
##$VD= 0
##$VDLIST= <DDDDDDDDDDDDDDD>
##$VPLIST= <PPPPPPPPPPPPPPP>
##$VTLIST= <TTTTTTTTTTTTTTT>
##$WBST= 1024
##$WBSW= 4
##$XGAIN= (0..3)
0 0 0 0 
##$XL= 0
##$YL= 0
##$YMAX_a= 406392
##$YMIN_a= -721067
##$ZGOPTNS= <>
##$ZL1= 120
##$ZL2= 120
##$ZL3= 120
##$ZL4= 120
##$ABSF1= 15.73697
##$ABSF2= -2.314879
##$ABSG= 5
##$ABSL= 3
##$ALPHA= 0
##$AQORDER= 0
##$ASSFAC= 0
##$ASSFACI= 0
##$ASSFACX= 0
##$ASSWID= 0
##$AUNMP= <proc_1d>
##$AZFE= 0.1
##$AZFW= 0.1
##$BCFW= 0
##$BC_mod= 2
##$BYTORDP= 0
##$COROFFS= 0
##$CY= -3
##$DATMOD= 1
##$DC= 0
##$DFILT= <>
##$DTYPP= 0
##$F1P= 0
##$F2P= 0
##$FCOR= 1
##$FTSIZE= 16384
##$FT_mod= 6
##$GAMMA= 0
##$GB= 0
##$INTBC= 1
##$INTSCL= 1.705223e-09
##$ISEN= 128
##$LB= 0.24
##$LEV0= 0
##$LPBIN= 0
##$MAXI= 10000
##$MC2= 0
##$MEAN= 0
##$ME_mod= 0
##$MI= 1.114404
##$NCOEF= 0
##$NC_proc= -6
##$NLEV= 6
##$NOISF1= 3.799351
##$NOISF2= 2.8
##$NSP= 0
##$NTH_PI= 0
##$NZP= 0
##$OFFSET= 15.75681
##$PC= 1
##$PHC0= -18034.88
##$PHC1= 7.600691
##$PH_mod= 1
##$PKNL= yes
##$PPARMOD= 0
##$PSCAL= 0
##$PSIGN= 0
##$REVERSE= no
##$SF= 200.130002947268
##$SI= 16384
##$SIGF1= 3
##$SIGF2= 2
##$SINO= 5.538805
##$SIOLD= 16384
##$SREGLST= <1H.CDCl3>
##$SSB= 0
##$STSI= 16384
##$STSR= 0
##$SW_p= 3612.71676300578
##$SYMM= 0
##$S_DEV= 0
##$TDeff= 16384
##$TDoff= 0
##$TI= <>
##$TILT= no
##$TM1= 0
##$TM2= 0
##$TOPLEV= 0
##$USERP1= <user>
##$USERP2= <user>
##$USERP3= <user>
##$USERP4= <user>
##$USERP5= <user>
##$WDW= 1
##$XDIM= 16384
##$YMAX_p= 318008725
##$YMIN_p= -314857
$$ End of Bruker specific parameters
$$ ---------------------------------
##NTUPLES= NMR SPECTRUM
##VAR_NAME=  FREQUENCY,     SPECTRUM/REAL,   SPECTRUM/IMAG
##SYMBOL=    X,             R,               I
##VAR_TYPE=  INDEPENDENT,   DEPENDENT,       DEPENDENT
##VAR_FORM=  AFFN,          ASDF,            ASDF
##VAR_DIM=   16384,         16384,           16384
##UNITS=     HZ,            ARBITRARY UNITS, ARBITRARY UNITS
##FACTOR=    0.220516191357247, 1,           1
##FIRST=     3153.41046942271, 0,            0
##LAST=      -459.306293583068, 0,           0
##MIN=       -459.306293583068, -314857,     0
##MAX=       3153.41046942271, 318008725,    0
$$ Real data points
##PAGE= N=1
##DATA TABLE= (X++(R..R)), XYDATA
$$ [...]
9106 31035920 32315216 33791975 35489098 37357851 39476216 41995403 44480569 46233512
9098 46233512 47000296 47128550 46856552 46456219 45992714 45701689 46014061 46869047 47633803
9089 47633803 47850755 47725034 47184205 46538120 45948163 45469563 45115583 44855366 44567757
9080 44567757 44274011 44143352 44165283 44385599 44684038 45116336 45860323 46591704 47464187 48554364
9070 48554364 50028797 51629095 53230796 54629887 55816815 57138970 58778327 60571984
9062 60571984 62868395 65826496 69201382 72394214 74690470 75492269 75060751 74454173 73887253
9053 73887253 73451803 72978976 72921015 73603230 74708299 75878234 76819020 77719057 78331109
9044 78331109 78189913 77494831 76441915 74920785 73608447 72867046 72351635 71823420 71482966
9035 71482966 71264216 70746797 70199201 69832719 69827019 70240198 71257426 72635806 74155740
9026 74155740 75931330 78675677 81924065 86096713 90844793 94794173 97044302 97834871
9018 97834871 97379534 96181596 95190123 95011179 95577849 95950085 95954940 95179793 93688682
9009 93688682 91942227 90195488 88884986 87983652 87600441 87364758 86676645 84970218 82647793
9000 82647793 80246318 78070780 76603416 75432568 74409126 73528564 72749434 72439846 72698198
8991 72698198 73170180 73755665 74235130 74543093 74982526 75676770 76776653 78716409 81611247
8982 81611247 85436970 89291274 92082490 92937060 91210389 87875487 84084953 80595601
8974 80595601 77728137 75872186 74271940 71889306 68942140 65903064 62981461 60091382
8966 60091382 57418696 54609601 51774478 49291949 47424992 45830685 44494499 43174125
8958 43174125 41704543 40143722 38535156 36933796 35465153 34155063 33083911 31965901
8950 31965901 30860802 29701453 28582785 27674921 26668909 25836506 24946814 24085927 23353732
8941 23353732 22659274 21919317 21229824 20734672 20200227 19834378 19422127 19018150 18731924
8932 18731924 18426451 18058688 17795413 17608011 17360290 17166304 17059799 16995229 16818483 16658829
8922 16658829 16506772 16355956 16287238 16305588 16380730 16209474 16072717 15886742 15677335 15518034
8912 15518034 15389397 15229060 14949975 14704586 14509120 14282573 14110561 13882209 13658662
8903 13658662 13554602 13334292 13129609 12884313 12664054 12427089 12235540 11968738 11840501
8894 11840501 11722243 11570734 11430483 11314672 11212015 11063631 10936970 10824637 10751487 10746836
8884 10746836 10584382 10484175 10446830 10484951 10478274 10340662 10279502 10287468 10184777 10130637 10144183
8873 10144183 10130794 9977170 9859387 9857211 9757626 9689555 9690270 9616325 9577700 9469525 9422157
8862 9422157 9464445 9349502 9303589 9309866 9324806 9289489 9170934 9112179 9147773 9128853 9177179
8851 9177179 9213735 9286436 9261537 9294230 9235970 9245019 9377446 9394218 9456568 9495886 9547101
8840 9547101 9691616 9722537 9859761 10038174 10065997 10186429 10301266 10252815 10405767 10528930
8830 10528930 10755087 10775164 10831646 11067428 11170631 11250656 11357620 11424347 11631004 11773759
8820 11773759 11967723 11996126 11932809 12101309 12214175 12387106 12410732 12645671 12732414 12835545
8810 12835545 12869398 13000549 13188251 13265340 13502747 13762524 13827297 14021501 14329672 14606158
8800 14606158 15000002 15277886 15555129 15887121 16352006 16707872 17061075 17446441 17768949
8791 17768949 18193265 18649695 19312715 19731455 20106537 20495772 20801638 21023905 21083829 21230521
8781 21230521 21350368 21557780 21675422 21796342 21974133 21984484 22007542 21998589 22009641 22029433
8771 22029433 22061971 22118098 22133206 22158003 22305576 22495227 22710857 22890575 23128153 23484166
8761 23484166 23928635 24258527 24821218 25387790 26015496 26641625 27245185 27929677 28643959
8752 28643959 29396356 30267962 31343742 32541126 33683136 34791597 35776137 36355427 36788413
8743 36788413 37032918 37065820 37080209 37206491 37457417 37667215 37922854 38132509 38133669 38178297
8733 38178297 38082137 38040688 38112633 38010129 38069572 38349507 38470727 38830584 39136682 39598348
8723 39598348 40176018 40925790 41783073 42645789 43583906 44752833 45977144 47181409 48250315
8714 48250315 49439332 50865106 52277159 53665167 55118055 56812232 58507376 60520820
8706 60520820 63087656 66859253 71541879 75154380 77104702 77355442 74169660 69358172
8698 69358172 65887850 63778924 62498462 61490061 60851124 60592291 60550236 60628214 60784508
8689 60784508 60987900 61316630 61564395 61767498 61968960 62333446 62630841 62880417 63342262
8680 63342262 64004487 64484909 65045906 65846706 66538009 67373296 68345538 69320062 70423987
8671 70423987 71715061 73104935 74698412 76363174 78168156 79963945 82012298 84076431
8663 84076431 86164086 88260531 90378293 92536249 94687246 97008881 99472262 101997018
8655 101997018 104586002 107253703 110287475 113293215 116445618 119631325 122872713 126217717
8647 126217717 129350739 132266118 134571385 136467798 138248284 139393162 139880285 139904915
8639 139904915 139966597 139944290 139426912 138797009 138122363 137708208 137382095 137078002 136805950 136885821
8629 136885821 137261735 137859322 138727056 139848163 141291431 142959811 144277401 145656047
8621 145656047 147157926 148528084 149500899 150091477 150628319 151248404 151636106 151641918 151569087
8612 151569087 151628846 151706145 151533498 151112180 150554585 149976379 149177600 148212881 146733300
8603 146733300 144739835 142569666 140260082 137673753 134632210 131643662 128856473 125878759
8595 125878759 122801167 120046189 117514879 115215819 113031677 110835559 109114658 107502720
8587 107502720 105913717 104610441 103492080 102455662 101355160 100134101 98693038 97172131
8579 97172131 95529212 93920831 91697678 89087075 86811728 84438753 81773749 78873628
8571 78873628 76065614 73457891 70940710 68244955 65478627 62827287 60241531 57772987
8563 57772987 55190025 52848090 50560286 48240043 46285198 44332679 42576718 40976969
8555 40976969 39361390 37851961 36556880 35310930 34128562 32973623 31790432 30776278
8547 30776278 29815161 28782059 27841073 26983357 26147116 25350209 24632561 23910023 23213440
8538 23213440 22552385 21946589 21486316 20898312 20314744 19900912 19396712 18816831 18391658
8529 18391658 18070737 17553607 16979591 16573230 16170034 15725236 15378839 15043227 14670312
8520 14670312 14269928 13859356 13434913 13088006 12805178 12529454 12167113 11851878 11641826
8511 11641826 11267014 10876974 10687224 10452445 10210941 9956602 9700511 9460953 9344163
8502 9344163 9128251 8913075 8697088 8484146 8221650 8135127 8026118 7809843 7579560 7491224
8492 7491224 7441765 7256578 7105093 6936128 6725578 6647853 6628771 6570627 6384693 6413563
8482 6413563 6227930 5908027 5747639 5692338 5764587 5552359 5347342 5353538 5299835 5192118
8472 5192118 5174190 5120709 5002857 4971131 4923808 4828700 4739652 4661328 4659669 4471812 4460855
8461 4460855 4456327 4403123 4239826 4143904 4091868 4033692 3964913 4006908 3893233 3801849 3867544
8450 3867544 3831839 3789355 3731870 3704110 3646106 3688812 3529635 3387731 3404293 3315796 3413154
8439 3413154 3496809 3365688 3168018 3160833 3137148 3213315 3117738 2970917 2979064 2960574 2840969
8428 2840969 2871975 2815847 2828322 2697965 2711116 2634656 2543167 2560079 2602979 2563613 2448987
8417 2448987 2287566 2238644 2333725 2401062 2374187 2261013 2258969 2244658 2175711 2113114 2054522
8406 2054522 2067855 2124239 2040615 2015728 1999277 1918890 1844294 1800015 1866172 1785746 1859964
8395 1859964 1914796 1923129 1920632 1780853 1651498 1615211 1689253 1626213 1711321 1628274 1575756
8384 1575756 1630543 1539006 1514468 1624846 1601083 1475467 1480825 1467857 1529884 1520105 1366809
8373 1366809 1457525 1377951 1398469 1407109 1465754 1426905 1468388 1352930 1306385 1321208 1380886
8362 1380886 1364336 1323602 1283851 1322427 1404772 1405925 1349774 1319017 1250014 1256544 1228216 1314710
8350 1314710 1359206 1394905 1306494 1238052 1315608 1273210 1257981 1293821 1340350 1388219 1357505
8339 1357505 1333351 1296426 1207405 1258751 1205121 1197489 1190078 1228473 1150808 1247564 1243070 1091079
8327 1091079 1111093 1113511 1192319 1195474 1218962 1236163 1180863 1224471 1167421 1170394 1155471 1121473
8315 1121473 1144674 1120463 1233809 1186908 1034554 1085001 1077397 1076119 1052570 1061124 1183191
8304 1183191 1213933 1170460 1169103 1201237 1183488 1137335 1203470 1307659 1301199 1279176 1156491
8293 1156491 1142794 1301647 1170263 1175771 1121525 1176409 1233365 1224549 1325872 1247035 1152394
8282 1152394 1214043 1287245 1352703 1393873 1375498 1400819 1388143 1344683 1331247 1238462 1253433
8271 1253433 1318778 1325665 1386637 1373631 1411759 1379187 1332976 1407720 1515222 1455632 1412639
8260 1412639 1392411 1328273 1367250 1414988 1476372 1400606 1370847 1384547 1402958 1485510 1461902
8249 1461902 1367413 1351508 1315701 1353796 1445903 1381139 1375772 1470857 1415680 1429493 1487014 1457941
8237 1457941 1360076 1373416 1340503 1374363 1418762 1362219 1358146 1321790 1274991 1288745 1298271 1289224
8225 1289224 1362860 1318340 1334697 1239182 1176775 1170921 1133071 1070996 1099059 1065331 1036243 1092952
8213 1092952 1128121 1003886 951072 974249 989670 957693 948045 1031623 1018115 996015 913030
8202 913030 833737 764080 831947 828105 810490 729592 716535 707562 726391 749373 948683 783599
8190 783599 676148 735560 625189 589974 557590 578399 539546 504607 576265 511372 569100
8179 569100 573562 387587 321457 437303 428522 411269 460351 494829 463710 336422 359689
8168 359689 361194 381265 446280 402924 313457 444515 424909 450599 451273 532884 399865 381621
8156 381621 350054 326821 360688 355314 354873 420025 369841 318970 274233 172481 203487 269248
8144 269248 285935 343951 313910 346192 372269 302293 288562 186263 248307 256546 238630 235053
8132 235053 197361 270462 271256 200064 286219 261137 160813 239233 253840 228864 233010 218864
8120 218864 272247 200488 242078 206116 249785 338597 264945 179017 123269 125127 135844 210894
8108 210894 233106 270842 316530 226986 76453 136979 208601 246937 303098 211753 135353
8097 135353 161939 221997 190738 188978 166515 175808 192310 265014 339682 253889 137553 125537
8085 125537 169160 157043 170326 103539 102745 182424 198699 186568 177703 114457 104891 158773
8073 158773 154650 138964 152282 180302 223770 190468 138428 143558 193467 233516 142872 60747
8061 60747 113958 153016 183341 195034 194431 96088 108619 185140 191589 157321 197706 168004
8049 168004 18646 97270 132136 166733 116062 138252 111475 99260 96098 18402 68869 167285
8037 167285 147769 75920 108198 66163 16765 72832 185519 62979 -19802 75861 84246
8026 84246 123794 188835 182083 118917 136717 87995 74193 184421 148917 80962 94440 99235
8014 99235 67989 114786 109652 116503 98671 42846 -61315 -63230 18297 -42388 2739 -56342
8002 -56342 -65295 8533 81942 105096 139139 173076 96744 65526 57691 126172 133289 167846
7990 167846 174705 82334 56306 128749 135901 47837 37584 -61205 -16217 30274 72147 56160
7978 56160 74566 73274 -51370 30220 95084 72986 67516 -102355 -100440 29188 -14975 -35103
7966 -35103 -100080 -141786 -54669 48815 7681 -6483 92918 66767 67772 89235 158010 103145
7954 103145 58961 52018 16836 6626 -37343 14414 70394 70092 74506 90105 65845 57327 49644
7941 49644 65034 -15523 18872 71942 30436 32840 -70300 -50263 54339 89449 57497 -7905
7929 -7905 2347 -109535 -128540 -25734 82918 25312 76882 42220 -12374 4491 19236
7918 19236 37349 39539 14859 65655 50715 -129793 -121866 -88206 -74060 22953 -61820 -24931
7906 -24931 12795 -70588 -12692 -29147 2848 -5911 23719 91322 141186 99098 120238 62629
7894 62629 56021 33737 67961 139374 84071 122968 -11256 55899 147084 125360 155008 48660
7882 48660 112075 110670 31496 40762 28269 119301 133049 88823 1105 -40504 4310 -33368
7870 -33368 -1690 153246 112683 30069 87321 58464 80814 81765 -206 52932 71421 14504
7858 14504 -56017 -46653 57589 188008 158051 133877 227772 132393 185593 198574 71430
7847 71430 209929 191924 29572 52943 111676 117550 84853 162518 198924 172441 110288 144239
7835 144239 134544 174909 209657 99200 74414 114728 151256 110080 141338 74238 101255 109372
7823 109372 78079 113967 141271 171517 81592 56874 98247 87626 71293 112664 73281 20331
7811 20331 79866 39537 -5554 -11177 2824 -66859 -109070 -84100 -5289 58247 55284 -7121
7799 -7121 -63945 -149435 -196684 -35095 -43353 -91744 -30471 -19136 -12404 -38280 61361 106123
7787 106123 64534 89436 90175 37860 1774 -12878 -7795 22605 -45554 29072 53504 -65623
7775 -65623 11143 42148 67566 80575 31931 37897 47207 66795 70563 42424 24787 11901
7763 11901 26656 -31679 -44640 33531 73142 119692 105948 135613 97700 96860 38720 65963
7751 65963 70077 77273 1939 103805 47043 -7809 81674 79900 -16784 -15227 33240 122557
7739 122557 133447 95653 31049 -5149 55127 -18407 -54584 2745 25545 -25122 33682 -49832
7727 -49832 -111745 -43940 77928 135954 120777 17775 73655 6274 17194 121196 27006
7716 27006 47359 60793 136283 38282 45520 130492 134343 129077 51704 3463 2618 136292 61329
7703 61329 -2858 22637 38441 67572 137995 148447 97268 72010 73938 -10398 -10355 112945
7691 112945 111646 -1581 89433 58085 -39170 -45636 9832 -16109 28301 87469 84635 135639
7679 135639 105619 129681 112824 168005 59090 147022 132930 87604 102908 61849 52011 120045
7667 120045 229600 176706 129667 15163 22629 38763 115483 179858 206617 161330 168048 116586
7655 116586 161358 197096 154239 35233 103637 125733 113143 105721 51572 49923 56751 63620
7643 63620 16966 83895 104886 80222 77305 47423 38653 61274 131142 85848 -18940 20716
7631 20716 4419 46364 113936 158924 139791 217684 105626 109353 133327 160087 166184 166785
7619 166785 121751 155320 108479 154225 125750 209622 222073 80768 59383 29806 133907
7608 133907 160207 134662 113285 152685 179805 276612 187725 176963 190593 237452 304048 275316
7596 275316 214308 273189 248331 193842 211810 214366 267831 174788 219766 240389 114964 121190
7584 121190 161206 266698 187230 324629 310944 246112 232933 254370 247918 262629 194088
7573 194088 189450 272757 383589 407811 306142 234729 322898 342726 285169 311778 313695 251722
7561 251722 217289 199829 257166 330408 366469 460579 520816 514857 344533 300334 370655 363750
7549 363750 310758 361612 319005 286322 319182 427556 396321 437442 374642 441227 431299 347158
7537 347158 380836 463725 423310 507533 569987 630183 739510 660122 497217 454953 408510
7526 408510 560600 536963 637859 633377 620107 709463 629492 692779 771210 830161 828570 848948
7514 848948 924901 960181 1100574 1195066 1193505 1241324 1244233 1295037 1352866 1307437 1271753 1270156
7502 1270156 1205382 1255309 1277722 1225296 1236357 1291826 1246638 1320368 1229094 1162631 1224410
7491 1224410 1222238 1261504 1315084 1366994 1379783 1410375 1436048 1498946 1458681 1442476 1635346
7480 1635346 1713614 1742496 1715226 1699981 1645932 1625072 1681344 1669063 1656672 1659138 1580022 1514619
7468 1514619 1497181 1567606 1602593 1515914 1403754 1440191 1331740 1389062 1387720 1419793 1370565
7457 1370565 1248177 1363919 1311055 1292268 1295441 1356749 1526264 1459627 1275719 1256344 1263317
7446 1263317 1167086 1061454 1129633 1129811 1132727 1068231 1002205 1077235 1077860 1007884 953118 903372
7434 903372 974020 1005929 857986 952649 1020097 1000499 974051 998929 974510 886120 973972
7423 973972 971299 882521 877783 877541 887672 890937 834209 875143 953634 920665 894073 827971 814630
7410 814630 814405 889311 879843 828655 778753 670303 661939 831158 846718 864513 753370 735826
7398 735826 758897 812315 764175 764171 879568 868477 884600 847251 874662 848074 818123 834808
7386 834808 834754 832278 889496 833836 868013 901105 928276 815286 863970 852426 850615 903910
7374 903910 858790 877436 907732 805509 754002 859296 852590 773526 781627 847811 894751 842635
7362 842635 770539 708247 710780 861657 869785 830321 843016 814489 811876 768166 748520 828434
7350 828434 837203 708275 723602 788892 876496 767785 742772 694771 671531 610292 623572
7339 623572 644265 704567 701691 699399 633679 609665 633569 671135 606296 501620 543710 592030
7327 592030 605906 596508 672239 689913 604281 547230 516006 512506 640516 579833 624645 641136
7315 641136 667565 558852 671876 647289 627058 658612 657968 683393 779107 779059 664876 566952
7303 566952 619307 624584 594420 760338 729583 691308 714648 681915 631685 616935 732741
7292 732741 650180 642850 763359 810206 817615 806752 693143 694076 791807 629840 651128 660678
7280 660678 726951 676604 719606 731296 781877 779657 736531 692021 793677 827507 777964 874385
7268 874385 906386 824146 730745 759578 693158 754079 853739 886089 901516 841513 794973 797667
7256 797667 858632 830527 842863 902871 774541 794557 754330 841692 885344 938147 1032380
7245 1032380 1010596 997815 968787 969207 908278 895058 973571 1105551 1120458 1125342 1076124 1054490
7233 1054490 1053472 1091850 1071623 1006511 1039626 1048704 1028344 1085249 1159923 1131142 1133594 1154476
7221 1154476 1143206 1073978 1103873 1139817 1148957 1216032 1286296 1288412 1263351 1250323 1177943 1210238
7209 1210238 1251769 1334131 1362443 1317124 1292756 1415021 1418435 1417026 1436968 1450613 1556350
7198 1556350 1556030 1530231 1398100 1434448 1474174 1559216 1584480 1726835 1761500 1673113 1681099 1751489
7186 1751489 1721705 1756782 1808684 1828745 1792059 1800084 1808175 1938266 1883150 1877221 1929031 2005574
7174 2005574 2112661 2067449 2157165 2346759 2567483 2615986 2526291 2537890 2630598 2641791 2758355
7163 2758355 2839867 2853285 2885272 2945994 3011014 3020598 2958632 2961131 2965987 2985148 2995399 2979846
7151 2979846 2972305 2961771 2918336 2934410 2913058 2892890 2917916 2912627 2877948 2947436 2918988 2877666
7139 2877666 2796792 2783903 2817607 2838923 2935100 2894043 2924571 2966805 2876362 2925277 2957112
7128 2957112 2935023 2945503 3017511 3058882 3072348 3050420 3165180 3208367 3248423 3282275 3321908
7117 3321908 3480909 3575932 3609778 3700674 3679886 3778370 3909146 4017307 4120300 4247566
7107 4247566 4441368 4567910 4599931 4717936 4784338 4852000 5044378 5159644 5336941 5510565
7097 5510565 5756186 5979687 6237876 6500088 6832869 7310625 7690618 8175853 8542756 8931053
7087 8931053 9369864 9727841 9971643 10299027 10774046 11340861 12051066 12771387 13364420 13628935
7077 13628935 13847375 13829183 13845880 13790529 13672728 13490481 13409930 13414943 13416591 13702584 14057560
7066 14057560 14376853 14543853 14611374 14755985 14718994 14783650 14876590 14927158 14901949 14931271 14938497
7055 14938497 14946924 14921354 14779590 14734620 14828413 15079424 15328511 15581094 16001862 16478563
7045 16478563 17032947 17557805 18091179 18660229 19252164 19974054 20787647 22004722 23328874
7036 23328874 24824897 26765003 28496541 29772600 30511124 30677170 30733085 30608659 30460189
7027 30460189 30217143 29746362 29101181 28579721 28340423 28316371 28205407 28127300 27833461 27201353
7017 27201353 26525173 25828918 25367372 24947507 24512772 24106353 23707710 23254782 22696732
7008 22696732 21950263 21153973 20470728 20093435 19710357 19480493 19450467 19279504 19275690 19326547
6998 19326547 19398376 19626014 19979991 20332083 20725657 20997952 21245165 21686281 21995240 22332740
6988 22332740 22582975 22814394 23154027 23583789 24080223 24683084 25473561 26460267 27570197
6979 27570197 28804018 30164681 31485205 32775365 34030212 35586996 37452327 39591871
6971 39591871 42459501 45890739 49823343 53740985 56795044 58359013 58241496 57144844
6963 57144844 55755060 54089638 52036535 49742995 47756793 46420564 45805639 45804622 45510827
6954 45510827 44681004 43230656 41393105 39471396 37506100 35652537 33952924 32291052
6946 32291052 30662098 28904729 26829121 24779404 22821700 21037658 19530296 18342906
6938 18342906 17304556 16336603 15573449 14808565 14195184 13516792 12974308 12534365 12059187
6929 12059187 11670221 11344097 11106163 10879687 10405048 10090013 9815253 9627304 9405179
6920 9405179 9140990 8995703 8727620 8522331 8345379 8313443 8141367 8105639 7907147 7705748
6910 7705748 7581886 7444560 7333232 7144366 7097857 7108627 7022493 6948829 6863335 6811983 6753705
6899 6753705 6768318 6705592 6704481 6791686 6838225 6761394 6734407 6712987 6694269 6681496 6491427
6888 6491427 6569266 6719944 6667696 6698584 6744869 6822801 6868623 6871992 7022490 7099336 7147670
6877 7147670 7185519 7267445 7278258 7298690 7224661 7245783 7226664 7255735 7121531 7194257 7181451
6866 7181451 6984030 6975437 6961448 6933452 6867896 6863262 6795339 6683156 6598869 6431841 6348287
6855 6348287 6129268 6104710 6095552 6000130 6055448 5882843 5747169 5714209 5751558 5679649 5675227
6844 5675227 5630338 5657877 5660490 5600248 5589680 5630491 5573412 5463852 5391900 5266186 5316110
6833 5316110 5551269 5455779 5336380 5301880 5245858 5212094 5166543 5179487 5090967 5071803 5018954
6822 5018954 4930877 4968062 4934856 4908433 4907064 4793310 4675643 4674948 4655720 4540322 4525443
6811 4525443 4583471 4497952 4408433 4378107 4391509 4458084 4428186 4421487 4350000 4350658 4423869 4290464
6799 4290464 4356476 4337711 4240658 4254665 4262127 4283445 4163895 4215756 4142170 4212462 4333318
6788 4333318 4254670 4260212 4216207 4214939 4155510 4192537 4195294 4148921 4182101 4172020 4232015 4157449
6776 4157449 4057735 4070002 4146033 4124016 4006542 4012464 4011419 3939340 4001647 4015272 4023944 4013637
6764 4013637 4081845 4152535 4006747 3941567 3945920 4055042 3982208 4028872 4036561 4011561 4002061 3981000
6752 3981000 3939629 3963211 4026506 3979002 4041568 4144135 4178839 4177328 4146979 4221691 4120580
6741 4120580 4146566 4158962 4149812 4166372 4140957 4324751 4460861 4411102 4357736 4475123 4534898
6730 4534898 4678581 4745968 4872944 5031703 5163376 5297321 5315692 5384867 5481163 5529242
6720 5529242 5590883 5583511 5777291 5846560 5824499 5881263 6020105 6221174 6358636 6310490 6182048
6709 6182048 6219760 6355869 6244103 6238355 6267670 6288235 6300435 6175395 6183320 6072116 6019163
6698 6019163 6005120 5911575 5846146 5802185 5721222 5583566 5542366 5509270 5478820 5469713 5304871
6687 5304871 5246239 5355740 5427551 5424515 5444080 5463346 5429288 5319246 5314623 5291648 5273557
6676 5273557 5432538 5391840 5378761 5404552 5420969 5408900 5270087 5355007 5347191 5325167 5337755
6665 5337755 5312875 5334110 5357649 5342049 5374833 5390974 5356643 5376073 5400202 5441481 5582631
6654 5582631 5554994 5502728 5500396 5539499 5574557 5564111 5684289 5744163 5803099 5813951 5789324
6643 5789324 5810800 5919302 5873862 5933260 5926867 5951691 5964855 6028295 6034151 6068182 6129739 6149311
6631 6149311 6237047 6165378 6192340 6178220 6270572 6462721 6462107 6529421 6554255 6581340 6509363 6497117
6619 6497117 6629469 6571554 6563299 6573953 6673662 6837535 6872172 6887919 7015581 7022690 7069049
6608 7069049 7141053 7240772 7080497 6972917 7033847 7094025 7125185 7146920 7207638 7362248 7454189
6597 7454189 7467925 7529547 7469854 7527546 7481348 7391376 7488357 7462046 7490681 7488815 7452204 7524517
6585 7524517 7591315 7576784 7599368 7663786 7632799 7666334 7727627 7691530 7592974 7582004 7668802
6574 7668802 7722141 7689037 7784307 7779922 7757178 7710694 7689665 7596148 7600113 7780991 7840545 7802555
6562 7802555 7769243 7733273 7764047 7884420 7965528 7965706 7848273 7918392 8004224 7957862 7866937
6551 7866937 7816671 7701164 7708006 7637400 7577844 7581418 7498443 7524213 7509240 7483336 7407441 7337091
6539 7337091 7311849 7392275 7548148 7650218 7745031 7769710 7793214 7946012 8029920 8227647 8305889
6528 8305889 8397460 8562550 8462120 8363471 8218312 8207290 8282113 8286176 8274161 8162531 8121893
6517 8121893 8132982 8119069 8101193 7927661 7755405 7920049 7973143 8031125 8012934 7986602 8063325
6506 8063325 8166869 8362867 8561672 8716274 8995771 9195781 9215341 9188241 9187036 9187391 9139754
6495 9139754 9186541 9058573 9157358 9082238 8952838 8874264 8755952 8616394 8709937 8680548 8500631
6484 8500631 8371344 8311683 8246568 8322791 8395914 8392047 8315891 8373675 8543909 8613886 8817354
6473 8817354 8987200 9138454 9072759 9000070 9011458 8968968 8912175 8967153 8909894 8870901 8811074
6462 8811074 8789959 8676487 8611368 8516956 8437074 8312640 8271218 8148917 8143376 8122485 8019871
6451 8019871 8000910 7964644 8036670 8095783 7959873 7950644 8026149 8123759 8273330 8107141 8175889
6440 8175889 8093467 7892889 7893571 7936379 7991140 7978425 8014555 7983847 7959404 7887411 7847294 7856109
6428 7856109 7802048 7840505 7775592 7706043 7662903 7674426 7621552 7523461 7454874 7469566 7487696
6417 7487696 7457577 7354045 7417098 7411966 7408716 7394390 7357396 7279197 7203821 7213877 7235149 7137213
6405 7137213 7148850 7166581 7147124 7237568 7153538 7069266 7000309 7002117 7039732 7010981 7004602 6981446
6393 6981446 7045716 6923889 6863576 6991892 6901633 6906700 6885740 6872528 6816199 6770192 6773472
6382 6773472 6749566 6626913 6590839 6541632 6602446 6567075 6576673 6500259 6414944 6390272 6442420
6371 6442420 6325874 6341162 6248652 6161066 6198697 6113660 6170007 6204279 6207644 6212218 6224648 6149159
6359 6149159 6114984 6182577 6161012 6083964 6203873 6150980 6065345 5996712 5856296 5849918 5886017
6348 5886017 5927567 5886179 5969060 5955116 5823622 5936937 5906957 5947410 5845126 5863602 5900983
6337 5900983 5904871 5871117 5911240 5946385 5842184 5859173 5750592 5735241 5733985 5698562 5752194
6326 5752194 5834018 5814362 5696314 5718470 5873087 5848841 5768894 5831059 5850125 5893094 5847616
6315 5847616 5881993 5957579 5941084 5923224 5978824 5985865 5939462 5950051 5952255 5853605 5904529 5896297
6303 5896297 5978726 5959287 5944960 5997347 5967635 5950406 5915558 5970458 5984914 5942512 5849301
6292 5849301 5992299 6078196 6232812 6262757 6174988 6221768 6099748 6104181 6176688 6118680 6177863
6281 6177863 6233912 6314400 6326408 6289585 6402377 6313595 6355008 6411039 6367865 6335509 6394406
6270 6394406 6521162 6561071 6578892 6563666 6589971 6564892 6501298 6590566 6711393 6696217 6741045
6259 6741045 6792256 6822268 6824774 6895496 6944002 6849775 6945195 7078756 7052342 7145017 7255103
6248 7255103 7355429 7427693 7417702 7444090 7558708 7642585 7785826 7887350 7897080 7871967 7835831
6237 7835831 7851170 7970972 8001771 8090392 8092232 7921675 7905124 7959394 7888296 8016864 8086449
6226 8086449 8133788 8125901 8170453 8246615 8233677 8333213 8465446 8531162 8639835 8632643 8686497
6215 8686497 8681459 8842549 9084590 9027674 9109697 9101495 9138165 9290548 9330586 9467417 9740994
6204 9740994 9933194 10153697 10370709 10452171 10306611 10213279 10088038 10121101 10214786 10171178
6194 10171178 10153849 10015503 9881528 9850591 9891301 10030999 10089028 10140812 10243162 10249087 10259593
6183 10259593 10295854 10124256 10081497 10065743 10068907 10071735 10190481 10304020 10391749 10234839 10372158
6172 10372158 10465480 10454334 10548535 10534562 10471871 10544972 10675712 10662669 10789030 10887513 10906252
6161 10906252 10753711 10875041 10893560 10971898 11003674 10915783 10921750 10872092 10816922 10829457 10789359
6150 10789359 10806514 10803242 10871683 11032409 11080041 11041848 11070971 11122327 11060309 11096715 11049853
6139 11049853 10973480 10999716 10917313 10831263 10782125 10805082 10894127 10868359 10876908 10903014 10868099
6128 10868099 10800989 10773613 10753378 10846777 10918121 10921558 11002816 11054687 10920354 10756633 10786411
6117 10786411 10876758 10924539 10944999 10908052 10830305 10873287 10912677 10832316 10817001 10872456 10839188
6106 10839188 10878473 10901822 10891787 10760878 10848876 10925877 11000742 11037425 11020302 11130712 11183052
6095 11183052 11144989 11275437 11418967 11405127 11430603 11481068 11502813 11588056 11824320 11963918
6085 11963918 11951471 12098281 12238697 12114269 12236892 12284965 12332502 12456165 12583526 12705111
6075 12705111 12746911 12826265 13008795 12991451 13076058 13205960 13298118 13356260 13476057 13637665
6065 13637665 13751956 13798041 13826341 13696550 13725318 13671191 13556322 13536425 13484741 13652249
6055 13652249 13641610 13700820 13837219 13899015 13953392 14055961 14094642 14224588 14318252 14392694 14555958
6044 14555958 14773265 14953262 15198713 15505004 15693420 15818908 15882731 16055991 16199765 16193817
6034 16193817 16235323 16389990 16587334 16492321 16657239 16913190 17012208 17093823 17202459 17412216
6024 17412216 17441801 17440820 17512718 17508585 17630411 17701750 17644763 17698276 17776703 17797061 17807323 17799962
6012 17799962 17842734 17878470 17929833 18074146 18151565 18189835 18329122 18529131 18613817 18779097
6002 18779097 19004294 19230179 19439197 19633674 19884244 19997469 20084584 20275909 20553247 20685764
5992 20685764 20846177 21184557 21463878 21759303 22091212 22542029 22787070 22961299 23241351
5983 23241351 23680217 24079321 24453252 24704109 24863515 24991172 25243404 25355648 25410326 25709804
5973 25709804 25941986 26173970 26427826 26648025 26891486 27268297 27535184 27804132 27889710 28018114
5963 28018114 28124593 28273914 28439595 28434513 28456749 28492105 28634062 28933962 29126201 29207043
5953 29207043 29356220 29457994 29568953 29622178 29745421 29820736 29753430 29851059 29973484 30083195
5943 30083195 30230201 30426965 30430669 30532819 30712773 30770645 30861466 30857385 30959911 30970387 30909569
5932 30909569 30905286 30958757 30992756 31067465 31187927 31255433 31386685 31411177 31505337 31709124 31803769
5921 31803769 31992381 32162718 32451151 32757135 32950250 33254063 33624446 33943354 34362476
5912 34362476 34858432 35393721 35828862 36219772 36665345 37181377 37727525 38159065 38709654
5903 38709654 39357693 39893486 40420640 41032148 41610086 42187191 42716775 43239768 43707608
5894 43707608 44218238 44659306 45072338 45439771 45840563 46261470 46517660 46911497 47237319
5885 47237319 47592388 47894937 48332083 48762480 49128450 49658864 50196915 50561740 51029032
5876 51029032 51547213 52038551 52683315 53307535 53848705 54234369 54597552 55086259 55648306
5867 55648306 56144941 56635683 56998071 57425166 57873038 58283064 58843993 59401856 59850050
5858 59850050 60448301 61065181 61505419 61898977 62293107 62740351 63210789 63639287 64141527
5849 64141527 64646557 65057024 65534101 65951828 66366552 66705893 67011824 67441186 67759748
5840 67759748 68187572 68576078 69109099 69633753 70103644 70708859 71377905 72081158 72893899
5831 72893899 73624495 74443225 75306873 76252160 77347084 78577949 79886787 81445429 83161201
5822 83161201 85114141 87053982 89028026 91297823 93633405 96134516 98657877 101398049
5814 101398049 104352907 107417817 110559540 113669155 116614473 119257746 121314671 122627910
5806 122627910 123181869 123453032 123528382 123290065 123026139 122794652 122472540 122476370 122718798 123006913
5796 123006913 123281738 123527518 123690088 123690285 123742539 123756077 123705394 123676665 123622018 123527873 123320595
5785 123320595 122842772 121737287 120021552 117931393 115745553 113305536 110871178 108372869
5777 108372869 105953922 103666578 101548247 99567083 97773767 96099333 94394635 92644785
5769 92644785 90788179 88672050 86182402 83717899 81275240 78833775 76595639 74390138
5761 74390138 72370135 70408000 68444697 66463022 64344753 62336898 60497022 58594093
5753 58594093 56979913 55443085 53766491 52281076 50851850 49600584 48429857 47330606
5745 47330606 46265806 45309746 44359527 43373874 42554278 41951268 41166622 40482148 39798242
5736 39798242 39001936 38236563 37579257 36880537 36170120 35582268 35055322 34535938 33967286
5727 33967286 33335885 32865121 32344723 31744321 31088417 30713694 30308561 29781681 29492072
5718 29492072 28999520 28578915 28087854 27726350 27281473 26991140 26640742 26352343 26054786
5709 26054786 25562613 25273481 25038679 24867915 24495978 24215549 23883641 23594142 23401083
5700 23401083 23106934 22882482 22724525 22552927 22378628 22123120 21975370 21833980 21594587
5691 21594587 21423710 21253136 20996455 20802973 20770210 20507073 20302660 20127016 20040775 19962498
5681 19962498 19831938 19805514 19625653 19501833 19435616 19292399 19067426 18944552 18946986 18917521
5671 18917521 18873929 18751841 18578270 18533628 18490653 18481255 18465550 18507761 18474062 18402811 18494904
5660 18494904 18569308 18529088 18528251 18648296 18706573 18702171 18713152 18742409 18769217 18814060 18911587 18856585
5648 18856585 18913374 18858122 19038420 19091806 19233764 19339282 19435845 19574994 19755833 19915557
5638 19915557 19933303 20064437 20150317 20318428 20484695 20678721 20953082 21121019 21308646 21486822
5628 21486822 21498969 21805995 22023623 22150210 22285805 22437544 22518576 22549085 22643594 22828260
5618 22828260 23021471 23133369 23249105 23366646 23476805 23655131 23828764 24049329 24241032
5609 24241032 24520697 24733344 25071507 25336413 25629274 25817745 25907541 26057573 26024107 26117930
5599 26117930 26195693 26059936 26000465 25921426 25847047 25926151 25997258 25969984 25966856 25759881 25559229
5588 25559229 25508198 25400187 25138465 24916207 24781142 24639556 24565454 24464014 24296266 24242324
5578 24242324 24234185 24103261 23876739 23778098 23785706 23650430 23482911 23428544 23429413 23368200 23239967
5567 23239967 23204119 23209859 23160528 23126867 23134237 23095353 23062257 22944624 22963916 22952617 22949712 23022949
5555 23022949 23024270 22970683 22873318 23050964 22995299 22870744 22928224 23042446 23074049 23034468 23061630
5544 23061630 23160583 23351730 23395609 23576869 23736017 23842473 24086673 24322407 24582281 24795677
5534 24795677 25010682 25290222 25506635 25613401 25681580 25701805 25701141 25743082 25725154 25869148 25973729
5523 25973729 25998867 26121667 26304197 26410810 26435681 26508041 26597188 26658941 26796078 26906896
5513 26906896 26832371 26908631 27084515 27230908 27593901 28039624 28493327 28871369 28820534 28565726
5503 28565726 28230294 28042802 27865193 27451898 26934788 26721086 26491136 26536735 26537186 26579584
5493 26579584 26461825 26272614 26052462 25761791 25561276 25384544 25148068 24923774 24735777
5484 24735777 24645588 24601935 24397195 24149968 23929615 23769592 23594991 23148374 22902414 22682447
5474 22682447 22414041 22209723 21968821 21804218 21801233 21723128 21515129 21394172 21151182 20986719
5464 20986719 20908937 20841339 20604474 20364599 20218683 19997372 19972351 19904528 19819517 19673948
5454 19673948 19526578 19397733 19263532 19210569 19124136 19151636 19088891 18979099 18778304 18692728
5444 18692728 18602822 18608169 18633767 18661695 18546543 18460603 18474198 18458054 18372339 18398161 18418816
5433 18418816 18333768 18363418 18353553 18410435 18493155 18569444 18582170 18599815 18614672 18702406 18691471
5422 18691471 18570628 18596525 18582736 18641640 18678675 18795744 18582766 18479941 18515506 18545958
5412 18545958 18580537 18555217 18480321 18460693 18558751 18552207 18516389 18467690 18455674 18459422 18483781 18555007
5400 18555007 18526270 18612119 18582312 18665391 18676857 18728557 18778270 18802229 18714642 18688287 18804422
5389 18804422 18694256 18770777 18873260 18797307 18801704 18826125 18785898 18800045 18811589 18724221 18709445
5378 18709445 18765759 18797877 18739330 18695552 18616325 18511559 18473130 18491878 18395132 18292445 18249627
5367 18249627 18143179 18049094 17854383 17851148 17764066 17669530 17576427 17463290 17439974 17365239 17359319
5356 17359319 17380726 17394631 17413210 17294246 17313819 17133072 17014179 16921392 16957303 16946998 16833000
5345 16833000 16771096 16787856 16757558 16708429 16722868 16685394 16553549 16652346 16646227 16599466 16493415
5334 16493415 16415781 16391808 16327660 16364192 16209431 16223450 16288204 16284413 16239060 16284033 16233289
5323 16233289 16096103 16051474 16057051 16019110 16001524 16025541 16049697 15974609 15987012 15888743 15964753
5312 15964753 16010166 15939907 15960935 16028112 16063494 16015960 16078588 16005269 16010474 16065638 16091986
5301 16091986 16114117 16077811 16012795 15951109 15943357 16062789 16131891 16047289 15990137 15982238 15913892
5290 15913892 15967528 15930946 15917548 15944476 15996834 15976574 16077332 16170572 16187958 16273964 16387370
5279 16387370 16429780 16518648 16673769 16785038 16774732 16914209 17167554 17251527 17339072 17403490
5269 17403490 17429218 17546617 17795276 18013907 18167859 18275377 18385071 18409304 18562414 18606754
5259 18606754 18560491 18511275 18534496 18514702 18466988 18579576 18635079 18540244 18592535 18676587 18650298
5248 18650298 18774170 18917740 18816566 18786020 18830045 18779159 18738956 18659375 18615357 18536984 18533163
5237 18533163 18413577 18405315 18439640 18576979 18741856 18733805 18631437 18390556 18267657 18109908
5227 18109908 17899975 17691692 17524167 17421284 17328205 17230484 17147392 16959251 16801726 16559880
5217 16559880 16409352 16310365 16295975 16157944 15876967 15829018 15785490 15666401 15400602 15304115
5207 15304115 15193712 15167699 15162441 15065132 15046448 14979522 15023936 15025617 15129389 15191510 15141172
5196 15141172 15212771 15319424 15556090 15735679 15846185 16080872 16215868 16359494 16216262 16074966
5186 16074966 16028448 15964207 15739725 15603883 15532239 15516807 15441023 15416342 15369749 15247891 15125930
5175 15125930 14969285 14975168 15037293 14933503 14846145 14844638 14723925 14524987 14539447 14549224 14543548
5164 14543548 14597088 14470693 14383066 14410114 14485432 14416057 14295719 14245263 14150590 14088461 14066667
5153 14066667 13978221 13951284 13843565 13818397 13679280 13617436 13684098 13511866 13552474 13503145 13338852
5142 13338852 13260811 13158270 13249895 13114577 13015428 12981942 12868607 12807395 12786607 12746581 12786339
5131 12786339 12527593 12448909 12466706 12524898 12452936 12351591 12298215 12302386 12213758 12175368 12278669
5120 12278669 12356149 12349463 12263246 12159773 12182426 12250877 12273074 12265609 12138758 12126027 12123196
5109 12123196 12177912 12096568 12028327 12132209 12168837 12048718 12054363 11937390 11970556 11898461 11899190
5098 11899190 11799151 11830354 11881861 11807570 11798598 11775444 11796728 11873677 11915562 11893202 11748282
5087 11748282 11671244 11730257 11682468 11684080 11663783 11608875 11508419 11505570 11510310 11703419 11748012
5076 11748012 11674811 11657220 11735856 11663927 11758887 11852051 11977599 12073101 12085981 12275818 12500033
5065 12500033 12640328 12753969 12784053 12878947 13043466 13223377 13444816 13697571 13958282 14219334
5055 14219334 14417495 14720313 15082842 15475997 15832814 16252568 16776009 17300720 17876128
5046 17876128 18511553 19305019 19897809 20358143 20677005 20927965 21104977 21336670 21537962
5037 21537962 21725288 21929243 22197820 22561389 22972239 23407753 23949132 24658737 25275392
5028 25275392 25789138 26144011 26356540 26504445 26513979 26615787 26702934 26912132 27119482 27267639
5018 27267639 27306776 27309043 27244568 27029184 26817648 26628617 26227340 25977193 25605446 25278371
5008 25278371 25058160 24854871 24850782 25046431 25089755 25068601 24897104 24397403 23816550 23292407
4998 23292407 22863992 22229272 21619106 20976500 20473179 20020410 19535675 19194237 18796907
4989 18796907 18396335 17999636 17698907 17305624 16896739 16438248 16058829 15702404 15331973
4980 15331973 15087403 14726402 14419467 14234720 13886589 13457429 13119886 12734168 12440188
4971 12440188 12179003 11881057 11705410 11529537 11304480 11151296 10970366 10757192 10659760 10526284
4961 10526284 10304987 10275042 10182470 10146322 10093865 9986810 9891216 9761170 9716849 9491774
4951 9491774 9315348 9350200 9134024 9019920 8846321 8709921 8566770 8589585 8583663 8421259
4941 8421259 8398095 8322309 8195061 8065077 7975050 7977920 7948947 7882607 7719171 7674662 7579300
4930 7579300 7453697 7361265 7343882 7320069 7287747 7210381 7152025 7092074 6946692 6915183 6892403
4919 6892403 6860953 6911592 6864480 6761156 6650045 6617131 6630547 6567626 6504411 6576493 6601136
4908 6601136 6490248 6437285 6452632 6422193 6353697 6347794 6296963 6280018 6280678 6260358 6185286 6267328
4896 6267328 6193870 6077496 6046181 6050181 6101110 5950939 6009778 6045208 5960338 5961041 5903490 5814824
4884 5814824 5843925 5940802 5819525 5872505 5802461 5806612 5754699 5653806 5522184 5606274 5609383
4873 5609383 5611973 5586892 5577334 5549515 5497958 5501995 5495526 5432034 5248450 5221419 5252087 5257903
4861 5257903 5300297 5255901 5322720 5330450 5295421 5258347 5183440 5129032 4997761 5063799 5028410
4850 5028410 4993815 4985186 5015399 5056152 5058595 4963396 4985209 4913618 4873986 4858061 4886707 5007360
4838 5007360 5006928 5045112 5034666 4939749 4843671 4843062 4765238 4742770 4786376 4833680 4846368 4805693
4826 4805693 4890892 4908925 4787688 4829987 4859751 4880427 4902828 4849510 4830323 4784144 4886770
4815 4886770 4914692 4845043 4853159 4842697 4840337 4933348 4875183 4975972 5093909 5058644 5033520
4804 5033520 5056677 4999360 5040945 5044604 5111078 5164142 5182842 5163814 5196607 5239463 5263603 5291684
4792 5291684 5329932 5310830 5335380 5427302 5393235 5373302 5421045 5469881 5547469 5645710 5616885
4781 5616885 5573988 5539411 5667760 5653205 5635387 5645449 5685935 5743912 5787021 5764569 5810656
4770 5810656 5812476 5707519 5798988 5831213 5937836 5950653 5962432 5972357 5944357 5956152 5941765
4759 5941765 5976092 6047686 6069798 6149859 6238557 6227400 6319543 6283224 6302159 6451058 6405887
4748 6405887 6439314 6537532 6527596 6518052 6609949 6604115 6656466 6697995 6679761 6825058 6889303 6942512
4736 6942512 6991656 7052884 7148089 7197575 7260163 7389455 7429290 7388412 7448319 7519780 7496703
4725 7496703 7518353 7583700 7618836 7545758 7742613 7962226 7933961 8004460 8228127 8200716 8328695
4714 8328695 8453325 8505166 8650511 8834929 8991647 9151570 9167758 9292996 9344659 9370325
4704 9370325 9390162 9515646 9643999 9817800 10023602 10184994 10314601 10479362 10580933 10681496
4694 10681496 10872891 11219591 11432655 11464701 11664298 11789918 11931475 12037995 12141065 12198922
4684 12198922 12318652 12376069 12399483 12519966 12760480 12863392 13026770 13131298 13278016 13396870
4674 13396870 13477409 13520899 13594929 13753786 13867671 13889793 13993823 13980783 14066703 14182168
4664 14182168 14152200 14225908 14314999 14379201 14433633 14417363 14429135 14416179 14399586 14242625 14278850
4653 14278850 14326519 14280345 14269685 14305716 14414588 14362232 14324263 14309163 14135141 14047119 14004770
4642 14004770 13872043 13800306 13758065 13775787 13728878 13648172 13556079 13538076 13432751 13480109 13454673
4631 13454673 13369876 13436321 13323221 13273380 13230472 13118154 13139758 13112717 12859606 12781343 12649778
4620 12649778 12565539 12535088 12582256 12503742 12480372 12520443 12414153 12389705 12383660 12422431 12368020
4609 12368020 12318939 12304441 12262075 12322242 12297168 12253667 12173909 12148575 12306595 12390485 12458274
4598 12458274 12532564 12577250 12678200 12811416 12830353 13009067 13151915 13238159 13262032 13311327
4588 13311327 13467537 13722624 13843291 14010578 14078372 14225857 14407150 14511717 14646888 14901202
4578 14901202 15104566 15218176 15420023 15690707 16007492 16121037 16211645 16233916 16432110 16556304
4568 16556304 16698400 16905553 16927697 17003849 17124922 17241235 17285913 17434463 17525824 17610558
4558 17610558 17720785 17805600 17836410 17776195 17822693 17843296 17707140 17679160 17765052 17792539 17698016
4547 17698016 17616040 17491609 17327343 17363447 17367996 17336609 17363132 17396759 17412235 17328654 17247937
4536 17247937 17244595 17251339 17273742 17390627 17545179 17574326 17735836 17892041 17975354 18078861 18204604
4525 18204604 18466606 18656054 18850396 19146191 19466330 19913873 20196896 20361835 20578644
4516 20578644 20730471 20902271 21125129 21494074 21814155 22202141 22673509 23100750 23534975
4507 23534975 23925106 24280737 24736211 25067432 25608124 26066638 26483171 26902377 27181725
4498 27181725 27507693 27662246 27687693 27756322 27787135 27798087 27958740 28006441 28220848 28356602
4488 28356602 28404805 28340186 28274184 28137890 27899109 27723766 27579853 27449998 27272045 26890990
4478 26890990 26488585 26059727 25735400 25291741 24902771 24551735 24231195 23952912 23606307
4469 23606307 23260272 22912841 22531089 22135108 21972350 21679887 21306345 20942927 20604475
4460 20604475 20315729 20117625 19820719 19464365 19157445 18961674 18806751 18659360 18385627
4451 18385627 18177844 18089578 17892013 17782438 17706185 17602956 17605458 17428355 17294047 17132475
4441 17132475 17187860 17129417 17045073 17097299 17038208 16996815 16946850 16861429 16961781 16984163 16813554
4430 16813554 16795640 16632146 16595507 16593467 16606879 16567891 16465324 16398714 16363730 16341129 16212183
4419 16212183 16241636 16152634 16123549 16084106 16078371 16105162 16094091 16100956 16024403 16032360 15978609 16019752
4407 16019752 15964625 16159386 16231168 16076153 16041559 16057989 16139333 16232925 16208383 16236200 16216987
4396 16216987 16318131 16503043 16468032 16481711 16702901 16844096 16991547 17122170 17195370 17485652
4386 17485652 17677648 17808324 17929264 17899268 18048699 18166647 18217390 18180848 18187859 18207298
4376 18207298 18330689 18493999 18673993 18876348 19099218 19204123 19310208 19422282 19426575 19545444
4366 19545444 19675890 19875784 19963574 19987885 20074640 20186916 20286860 20352048 20426102 20561306
4356 20561306 20610538 20819611 20958794 21289784 21679738 21977115 22377161 22771901 23188399 23574504
4346 23574504 24095087 24568939 24919147 25250885 25630745 26092963 26418238 26713303 27086111
4337 27086111 27304438 27434264 27653450 27851374 27993924 28158454 28239580 28205934 28219033 28360105
4327 28360105 28324695 28331274 28491182 28507991 28596673 28592594 28616083 28527280 28458900 28399603 28194227
4316 28194227 27965579 27703090 27418347 27186269 26874597 26632866 26381466 25982568 25626044
4307 25626044 25301472 24980793 24638114 24305701 23897903 23497617 23199456 23003912 22661053
4298 22661053 22317596 22137257 21946267 21729801 21511954 21408494 21291313 21242760 21171069 21078317
4288 21078317 21058351 21014482 21057865 21040810 21149537 21320124 21513075 21651574 21689864 21859077
4278 21859077 21919665 22105165 22197555 22411964 22662155 22861655 23014847 23184589 23491722 23827378
4268 23827378 24182972 24514018 24909372 25255557 25593767 26044228 26381110 26572732 26779114
4259 26779114 26891811 27009740 26991945 27136562 27138233 27246814 27322193 27292014 27148127 26993630
4249 26993630 26932831 26763405 26682732 26562733 26519992 26316257 26133369 26176982 26124903 26109204
4239 26109204 26127036 26076036 26084689 26202496 26257455 26355877 26603078 26745391 26878518 27228809
4229 27228809 27493771 27700667 28086207 28356280 28673053 28800708 28821722 28916114 28927369 28959729
4219 28959729 29190582 29406549 29591091 29950658 30344769 30734953 30954607 31152662 31390866
4210 31390866 31527585 31647963 31790435 32155527 32542607 32785726 32958366 33195320 33231544 33257586
4200 33257586 33276010 33314919 33499106 33649246 33898510 34146489 34533185 34921729 35145013 35380884
4190 35380884 35640359 35899857 36289161 36508568 36722703 36965856 37087178 37285181 37569920
4181 37569920 37618162 37960034 38265518 38579257 38800847 38933502 39181185 39514410 39782971 40043292
4171 40043292 40334881 40561639 41038456 41534329 41837770 42323322 42930801 43495373 44218085
4162 44218085 44892533 45534403 46231371 47100009 47993014 48994036 50046074 51286428 52569839
4153 52569839 54006895 55812217 57717425 59462904 61139811 62541411 63824204 64957526
4145 64957526 65547049 65700057 65718584 65897506 66230115 66702218 67207771 67681605 68254186 69061303
4135 69061303 69745598 70367256 70986684 71657485 72396321 73178250 74090978 75301262 76646983
4126 76646983 78220410 79973038 82031742 84374000 86987587 89899056 93291816 97089592
4118 97089592 101653634 106873633 112630496 118687135 124559122 130327774 136080998 142502300
4110 142502300 149453981 156703956 164657628 173779177 184307855 196564672 210121195 224880750
4102 224880750 239826211 253534342 265373028 275775997 285686965 295548788 304952213
4095 304952213 312929713 317786164 318008725 313682483 306347768 296958102 286757221 277345156
4087 277345156 269457461 262047905 253576564 243244629 231696076 219821182 208293991
4080 208293991 197276379 186775761 176474030 166534983 157343291 149087918 141858672 135569889
4072 135569889 130259569 125727930 121685085 117893948 113971253 109873537 106092317 102639837
4064 102639837 99353697 95960393 92794031 90090798 87785052 85620175 83668023 81901986
4056 81901986 80159957 78468089 76876460 75471259 74409613 73435598 72391288 71190896
4048 71190896 69938308 68591547 67184946 65898336 64522774 63052939 61469244 60011554
4040 60011554 58825902 57800959 56922877 56048310 55196977 54342641 53423593 52663254 51959185
4031 51959185 51317235 50722674 50154998 49742571 49431526 49267273 49051772 48815576 48656785
4022 48656785 48546513 48720820 48896374 49116686 49497305 49841145 50280137 50895296 51826848
4013 51826848 52952058 54208587 55745943 57506828 59537517 62037664 64371662 66746480
4005 66746480 69090566 71430156 74205773 77457074 81271737 85800981 91168501 97471887
3997 97471887 104081176 109157654 111251340 110430045 108276580 106162436 104238520 101603584
3989 101603584 97924186 94301720 91645785 90509402 90426241 90381101 89628091 87973692 85338397
3980 85338397 82377816 79293062 76258812 73361556 70719738 68169360 65840843 63528493
3972 63528493 60735094 57359348 54079339 51278028 48856979 46782274 44881350 43260250
3964 43260250 41858512 40522043 39248010 38176417 37044508 36119225 35235207 34408389 33647346
3955 33647346 32896698 32241505 31687196 31176890 30681584 30206951 29929366 29600049 29322908
3946 29322908 29108395 28860701 28635384 28482172 28241960 28190309 28248738 28258255 28130703 27995359
3936 27995359 27626832 27178178 26774746 26168777 25658768 25124721 24648774 24113202 23601109
3927 23601109 23151473 22792835 22502381 22138276 21828672 21509470 21050690 20664345 20322522
3918 20322522 19972839 19687489 19332197 19070621 18741054 18482771 18153721 17781356 17380816
3909 17380816 16953613 16523268 16123374 15817801 15561734 15283394 14969775 14765436 14505800
3900 14505800 14389390 14258719 14111762 13920530 13791967 13775815 13819639 13646466 13395820 13210589
3890 13210589 12923654 12683191 12531730 12257377 12020687 11734458 11545527 11462401 11301857 11108438
3880 11108438 10878214 10821657 10661195 10555074 10519834 10310148 10207106 10190709 10135250 10121212
3870 10121212 10016535 9905936 9808791 9665180 9527077 9476754 9430432 9478470 9365203 9249362
3860 9249362 9242618 9186211 9150644 9074886 9004203 9039380 9035921 9135165 9150317 9241214 9418652 9517611
3848 9517611 9593931 9589898 9693471 9872138 10043832 10279260 10479779 10671408 10929374 11060579
3838 11060579 11125149 11314253 11321629 11352405 11551716 11838740 12083485 12179925 12452584 12763164
3828 12763164 12984163 13283435 13570067 14020971 14592073 15144661 15720512 16409320 17171284
3819 17171284 18048275 19125860 20133239 20871470 21629402 22504308 23340653 24444899 25559644
3810 25559644 26723595 27960175 29383934 31070959 33279243 35591914 37320557 38073029
3802 38073029 37613536 36455367 35502521 34809329 34490107 34067874 33166089 32094278 31095630
3793 31095630 30292254 29768652 29797619 29963416 30135348 30127674 30100444 29878873 29517886 28886861
3783 28886861 27986810 27030915 26109249 25376735 24795382 24265112 23595408 23278015 22906047
3774 22906047 22686868 22535682 22253162 21585926 20512759 19393127 18456160 17544699 16669470
3765 16669470 15920548 15257750 14774552 14355604 13849588 13408942 13038562 12705978 12310224
3756 12310224 12028057 11785212 11570456 11358270 11085798 10839811 10674056 10641878 10388992 10202901
3746 10202901 9988882 9666694 9375354 9258186 9154021 8948771 8792182 8578508 8408893
3737 8408893 8163261 7914833 7656078 7411967 7297890 7101066 6954798 6828773 6745825 6604841
3727 6604841 6353555 6226050 6110057 6019062 5875860 5713472 5627594 5487775 5382983 5307637
3717 5307637 5285933 5153999 5062983 4958557 4887313 4837321 4655755 4539468 4485999 4429973 4324477
3706 4324477 4227865 4243823 4088348 4113118 4051123 4010527 3931382 3874088 3829412 3670053 3659306
3695 3659306 3628434 3649891 3594549 3503684 3532388 3293508 3176624 3096221 3025354 2958959 2916439
3684 2916439 2930002 2802882 2646500 2669953 2649622 2573453 2687332 2545813 2458159 2439386 2422057
3673 2422057 2486538 2379651 2259419 2335619 2354337 2362700 2269894 2225086 2158455 2175826 2102508
3662 2102508 2134977 2098345 2127757 2103991 2066588 2028514 2021532 2083111 2133946 2157271 2160743 2137801
3650 2137801 2059302 2098957 2190063 2202286 2107086 2076117 2151916 2131647 2215268 2353014 2220638
3639 2220638 2272446 2385983 2425106 2459666 2476526 2324347 2378887 2340582 2309257 2377936 2402172
3628 2402172 2356986 2381094 2377979 2455549 2463752 2529892 2503553 2508926 2438262 2456061 2461134 2433204
3616 2433204 2509020 2445135 2465390 2441429 2382643 2414140 2373435 2318472 2356355 2359895 2322522 2281753
3604 2281753 2256761 2355613 2469953 2378319 2348807 2457127 2424064 2379768 2343123 2381396 2511171
3593 2511171 2468507 2475198 2334061 2316341 2354300 2410121 2441539 2372477 2378870 2339889 2239739
3582 2239739 2316370 2308878 2167588 2305416 2291702 2251959 2273533 2136218 2188790 2182837 2254864
3571 2254864 2232556 2143255 2075859 2041348 1935352 1880373 1916457 2001413 1922407 1903800 1816036
3560 1816036 1823648 1830752 1821180 1921731 1961044 1940970 1943515 1950481 2010285 1961512 1868505 1941922
3548 1941922 1978210 1914176 1857167 1874618 1895589 1883383 1819390 1840779 1850366 1853946 1868545 1833468
3536 1833468 1742523 1673612 1650173 1738831 1681958 1643523 1633052 1704668 1739522 1681396 1633762
3525 1633762 1591495 1590252 1624203 1698874 1652397 1627839 1590349 1562806 1629511 1648087 1644818 1567359
3513 1567359 1602926 1593635 1627866 1689732 1547143 1581814 1589225 1651118 1700447 1642462 1665385 1648692
3501 1648692 1651537 1663742 1648510 1657702 1609817 1567599 1615075 1629452 1587757 1585474 1557432 1596926
3489 1596926 1594952 1543203 1616257 1671157 1646201 1619716 1499957 1484722 1593295 1630605 1633768
3478 1633768 1504369 1535503 1472157 1517231 1514174 1499194 1558567 1464413 1478228 1471947 1527364 1439819
3466 1439819 1456076 1512295 1436541 1440619 1501137 1499613 1519219 1598990 1562065 1493813 1414575 1398126
3454 1398126 1442077 1571724 1592210 1462178 1361976 1518947 1529488 1496094 1462314 1479844 1526647
3443 1526647 1543195 1511191 1502721 1457025 1448307 1402372 1445218 1541305 1521113 1462118 1541329 1536076
3431 1536076 1480574 1469931 1529404 1546700 1521063 1575687 1604819 1535403 1499901 1577177 1623757
3420 1623757 1620150 1600107 1689967 1611143 1427622 1470524 1542309 1603716 1602148 1578092 1532969 1521715
3408 1521715 1601646 1619817 1655345 1653071 1672987 1747779 1725102 1733749 1779832 1723457 1779115 1805257
3396 1805257 1790264 1745938 1751712 1685350 1671998 1795152 1888831 1890974 1877173 1900216 1859237 1858383
3384 1858383 1922303 1950904 1988539 2057865 2072284 2057189 2118937 2086567 2094387 2132300 2097380 2077635
3372 2077635 2202257 2132327 2192655 2185670 2163667 2227428 2272724 2279991 2289777 2261133 2247204 2258896
3360 2258896 2339018 2366248 2342798 2385711 2448029 2476052 2467643 2555820 2569427 2499089 2558089 2663273
3348 2663273 2717226 2650973 2731569 2865253 2921759 2916471 2927824 2962087 3066137 3082010 3157412
3337 3157412 3221702 3212380 3196379 3217060 3380913 3388799 3364188 3457495 3495093 3691252 3814317
3326 3814317 3881157 3929569 3964187 4058539 4155268 4233249 4333253 4415520 4481150 4680926 4773627
3315 4773627 4933290 5005617 5119251 5243352 5433542 5600444 5690480 5843637 6016629 6268978
3305 6268978 6408739 6421096 6558307 6725276 6960380 7052986 7132966 7432118 7619005 7731163
3295 7731163 8022912 8198817 8376544 8664023 9017580 9329499 9843245 10194230 10572394 11071095
3285 11071095 11575294 12066581 12664225 13291780 13977428 14727336 15554663 16307730 17081904
3276 17081904 17788363 18664341 19616108 20693750 22087797 23496358 24862913 26201531 27613023
3267 27613023 29396404 31594165 34093636 36706733 38924526 39936300 39803968 39399378
3259 39399378 38702010 37673814 37037653 37069957 37371818 37623984 37484196 37172814 36807962
3250 36807962 36344686 35988033 35795902 35731004 35528376 35373170 35518573 35879729 36580419 37443468
3240 37443468 38197943 39298838 40740212 42529217 44692450 46566213 47496004 47251207 46426376
3231 46426376 45201995 43681949 42223899 41247414 40721238 40100599 39255299 38137344 36763533
3222 36763533 35554351 34457419 33551710 32595505 31583539 30431826 29448220 28566338 27789042
3213 27789042 27082642 26627719 26061556 25483342 25142976 24911625 24568729 24137584 23792667
3204 23792667 23461307 23153151 22810747 22532596 22242629 22023757 21867217 21681455 21680427 21489850
3194 21489850 21213026 20997694 20864183 20736028 20620324 20489635 20403400 20391700 20323273 20335024
3184 20335024 20298804 20142360 19899418 19605954 19319440 19150451 18941249 18640368 18380657 18236984
3174 18236984 18111933 18041810 17804033 17681258 17478182 17390778 17445962 17298890 17150530 16767926
3164 16767926 16458184 16154795 15808520 15638347 15365497 15255780 15089128 14944585 14822762
3155 14822762 14659266 14696028 14658526 14577668 14377249 14002076 13653211 13493963 13289627 13027811
3145 13027811 12771543 12455022 12437508 12385778 12287615 12244357 12184274 12119107 12036774 12068648 11945766
3134 11945766 11882201 11742465 11521195 11584117 11603655 11639073 11683664 11752573 11870359 12100974
3124 12100974 12153965 12048337 11988384 11951477 11707779 11373952 11156718 10885504 10776391 10621185
3114 10621185 10336985 10036531 9911359 9760333 9660216 9633644 9561676 9414633 9206386 8945519
3104 8945519 8851662 8803108 8638639 8526312 8542033 8667383 8660441 8756231 8565033 8359700 8132203
3093 8132203 7849076 7587744 7263702 7088641 6876677 6836939 6681896 6299774 6111401 5982995
3083 5982995 5726801 5406686 5338834 5140394 4948050 4692130 4435220 4245119 4073017 3856809
3073 3856809 3754547 3667487 3494357 3557386 3494367 3338815 3308412 3185844 3098824 3058617 2975404
3062 2975404 2899591 2789685 2629789 2593615 2653870 2586517 2555355 2494326 2424110 2402787 2346006
3051 2346006 2304584 2349976 2364789 2253547 2268813 2288584 2159283 2091458 2047492 2021656 2016583
3040 2016583 2033073 1944846 1964754 1934458 1944140 1866340 1815488 1851587 1929122 1805976 1804509 1828363
3028 1828363 1739234 1730899 1699375 1673579 1745326 1643008 1610044 1640357 1705001 1669663 1576433
3017 1576433 1552548 1635230 1577184 1565633 1608597 1625635 1545739 1527422 1539819 1567024 1605051
3006 1605051 1546313 1534636 1494848 1491349 1397081 1356772 1385068 1423943 1486333 1464674 1420967 1406589
2994 1406589 1459836 1519691 1480418 1477923 1415589 1500823 1340960 1403291 1343977 1267516 1223949
2983 1223949 1329842 1336138 1284390 1374403 1355370 1464562 1428172 1382958 1349643 1192723 1228672
2972 1228672 1317305 1406699 1303304 1365809 1366628 1315019 1320381 1195102 1230722 1298588 1198918 1203941
2960 1203941 1244669 1335585 1299892 1220879 1161023 1048216 1111864 1102871 1134116 1178932 1204629
2949 1204629 1168950 1108017 1114458 1200467 1126289 1175372 1206187 1139865 1125683 1124180 1178605 1183630
2937 1183630 1105412 1037096 993173 960231 960405 1003416 961935 909826 940879 1018401 981874 939202
2925 939202 972247 901325 969550 1091422 1033661 991730 943436 1019421 1057299 929488 911072
2914 911072 1010909 1047001 965532 894751 921459 1013651 1061470 1022484 974670 983409 954486 983736
2902 983736 954675 907378 881242 918434 941059 885775 851045 890054 895599 875827 994981 966469
2890 966469 885389 950916 1016892 992268 1054018 1110836 1095584 1076511 1012126 975050 1112839
2879 1112839 1065182 1057766 1131537 1105089 1097476 1059850 1062182 1149017 1021747 994831 1045221 991699
2867 991699 897217 916512 836305 848654 886251 914433 912210 844072 788518 770969 868257 825329
2855 825329 849884 869377 863253 856737 835412 928311 932135 839514 883440 917128 903104 870290
2843 870290 876593 878477 821061 738717 750309 722260 798044 815354 715883 675776 555660 599830
2831 599830 670997 586891 610282 568586 510267 437750 406476 359875 353371 406627 477527 563966
2819 563966 649631 533501 488095 516573 445765 374088 396803 410316 473011 424567 303069
2808 303069 295241 311724 295024 350242 445864 421987 363105 329654 340429 327517 255249 283903
2796 283903 268847 104588 41158 91531 170983 114297 45858 143148 201792 162601 204569
2785 204569 217977 147199 194113 184509 104895 135254 132195 94368 168019 208996 115883 144912
2773 144912 182776 165281 205642 104110 99476 159933 142914 167104 179146 232702 157203 127534
2761 127534 68905 50578 -69171 13048 52494 -283 -20447 83385 172494 100987 118004
2750 118004 -13757 26784 56014 10330 28324 -11194 82985 30159 -55333 -44392 -89017
2739 -89017 -1735 19681 -77823 -112253 -103456 -58225 -1047 29676 57770 42172 10787 10390
2727 10390 47451 10274 -135107 -25525 -52082 49119 23793 61008 105772 88358 133715
2716 133715 74445 124297 50024 105347 34161 -64055 -96327 26416 82726 100213 10672
2705 10672 -12877 25243 -28999 -149036 -122056 -89614 -123864 -30202 -33668 -47130 30649 90778
2693 90778 51747 25377 -11551 -79409 -101525 -41871 10046 -86096 -39406 12125 -100074 -107807
2681 -107807 -122133 -133905 -19948 -22321 -75409 -90660 -100095 -87360 -10671 -38021 -1571 -104447
2669 -104447 -141329 -135748 -163896 -139612 -93723 -43701 -26832 -70173 -158785 -113190 -103491 -138184
2657 -138184 -115244 -74572 -96540 -130801 -160879 -171378 -157303 -70529 -128146 -75411 -96681 -54977
2645 -54977 -101473 -129591 -111586 -139841 -90360 -140979 -96926 54579 5461 -128265 -168453
2634 -168453 -81773 -142263 -82062 -21106 -98546 -72131 -206119 -180667 -88932 -85197 -5094 -42225
2622 -42225 -21645 -5913 -105661 -33308 -55077 -88725 -51511 3564 -44493 -148382 -249374
2611 -249374 -157526 -190053 -221933 -166968 -123030 -94611 -79315 -78479 -60218 -9054 -61075 -167979
2599 -167979 -167022 -189369 -172919 -93934 -84956 -29566 -139642 -69576 -125653 -116891 -126662 -113141
2587 -113141 -62598 -115688 -191796 -196030 -125625 -134157 -179931 -149979 -131897 -126191 -59025 -81681
2575 -81681 -187725 -92579 -88630 -138527 -142614 -5930 -47887 -114806 -6068 -67007 -137856 -108839
2563 -108839 -74207 -151356 -97829 -211835 -204466 -167667 -199377 -179247 -144096 -52049 -84835 -54947
2551 -54947 -94824 -69167 -10778 -119673 -128800 -138645 -160144 -178842 -140849 -88431 -17673 -135204
2539 -135204 -216638 -273372 -208901 -97267 -83930 -7603 -72181 -187872 -175368 -168726 -62061
2528 -62061 -47203 -192830 -172687 -178881 -156641 -65134 -86895 -70373 -108248 -158782 -136306 -97956
2516 -97956 -160936 -140995 -81341 -121726 -145825 -125587 -182480 -183352 -145836 -280240 -255484 -205547
2504 -205547 -176010 -140163 -146779 -53715 -133866 -236475 -186072 -90661 -143129 -95871 -222921
2493 -222921 -247708 -150126 -96350 -164255 -108363 -116738 -217744 -153350 -77823 -91854 -64528 -50602
2481 -50602 -200510 -198235 -254775 -296721 -177416 -128003 -133289 -90260 -98837 -49679 -102485 -208932
2469 -208932 -215957 -188064 -240282 -154354 -71473 -133933 -268909 -131354 -83517 -11347 -108961
2458 -108961 -140838 -126062 -182844 -85247 -22265 -41617 -102422 -250534 -243780 -304354 -294360 -189909
2446 -189909 -183672 -314857 -277556 -130422 -110527 -131713 -147391 -168445 -74284 -136480 -120787
2435 -120787 -130231 -148318 -71546 -195414 -276181 -304423 -252234 -91316 -33079 -200162 -206155
2424 -206155 -109924 -66308 -132728 -155909 -166329 -82336 -83739 -81752 -91849 -192165 -174762 -110151
2412 -110151 -178992 -94671 -4779 -70603 -122654 -223302 -211658 -196156 -150612 -130382 -91582
2401 -91582 -187618 -201407 -110341 -112562 -43348 7854 -23404 -146716 -97962 -73885 -113733 -140259
2389 -140259 -110153 -126009 -35694 -95509 -123227 -185613 -186156 -125052 -62592 -157788 -181418 -132602
2377 -132602 -190677 -222392 -125624 -68886 -168813 -185372 -154521 -111047 -66120 -73247 -19276 -107978
2365 -107978 -123167 -53823 -19474 -68678 -135385 -70556 -48380 -37870 -68960 -100844 -46680 15150
2353 15150 36695 16746 22901 88244 93005 30874 -33160 18707 73270 -35346 -70132 -45352
2341 -45352 -22191 9794 -43549 -38580 44414 -26031 -72519 -74282 -119334 -179305 -222858 -181197
2329 -181197 -162791 -156411 -108866 -160822 -130167 -18904 -108807 -101652 -113347 -91274 -73399 -46036
2317 -46036 -89726 -68348 -112021 -76311 -40276 -75579 -87736 -17943 -14277 -2308 -167369 -129571
2305 -129571 -45157 -18039 -13011 -26929 -11252 -947 -61188 -73610 -98182 -47580 -82839 -51162
2293 -51162 -13459 9107 33944 -24767 -1349 -335 -36451 1958 18591 6733 31383 -53303
2281 -53303 -43987 -101913 -84512 -47759 -100593 -54285 -93225 -68901 -104667 -140537 -63847 -111867
2269 -111867 -228619 -188375 -69446 57834 -30038 -52413 19887 -147282 -202281 -142206 -118587
2258 -118587 -60212 -36281 -111500 -55207 -41406 -53218 -131108 -61310 -174982 -138181 -95139
2247 -95139 -61620 -92283 -173061 -205628 -98821 -135766 -86575 -112737 -153460 -95053 -32071 -50181
2235 -50181 -36512 5975 146066 111461 84472 14957 37702 61977 59945 25399 41978 -21587
2223 -21587 -143161 -130771 -148451 -131666 -52022 39426 10828 -28832 12816 46262 -27775 -14513
2211 -14513 -52815 70875 53019 -25082 37719 39522 -35 29558 -8165 -19314 48431 -44338
2199 -44338 -28808 48489 21207 110191 12222 -5149 12555 -53602 -25508 57700 71953 99042
2187 99042 -8873 43146 37224 -21503 48308 72092 38423 18989 -7708 60633 -2514 -12032
2175 -12032 73658 140812 77317 87965 168791 171539 195149 174279 115840 111025 97197 111830
2163 111830 176123 240519 126069 26828 114786 263965 323215 345710 265114 227094 264654
2152 264654 236324 293519 258005 235375 204388 260166 330675 322622 430107 476197 528721 523784
2140 523784 460565 536067 555154 503275 489598 525260 555466 561194 646737 634182 654822 723989
2128 723989 645240 606806 559896 625520 719555 807019 802493 817349 868949 920540 1037924 1041497
2116 1041497 1060531 1225824 1367225 1464891 1416033 1492020 1655535 1777729 1905443 2078140
2106 2078140 2115033 2344070 2520865 2661753 2905175 3168047 3459873 3700790 3952724 4294134
2096 4294134 4631332 5038002 5635872 6276618 7024726 7988674 9449067 10973959 12429143
2087 12429143 14370888 16739895 19773663 22782630 22149850 19902760 17758052 16142164
2079 16142164 15604107 14233103 12210242 10531799 9088711 7582032 6471772 5649347
2071 5649347 4944715 4489901 4126474 3800624 3512646 3210036 2847041 2637495 2507656 2324150
2061 2324150 2261273 2040184 1903556 1789063 1583887 1499396 1466721 1451921 1413409 1252793
2051 1252793 1238122 1126620 1191665 1071088 1065712 1068203 982398 911293 802076 668902 718516
2040 718516 661682 606514 667718 711740 600812 687762 687702 595653 553165 548020 663990 498541
2028 498541 390056 498995 471359 391509 361926 303009 294387 285739 366375 375851 299194 296001
2016 296001 187720 204653 241311 221719 251749 293494 234925 222297 219012 174360 127647 80289
2004 80289 106277 127493 210814 200545 170735 95365 114132 56866 231562 250762 181312 -11380
1992 -11380 47671 94130 153117 139173 105116 74213 50775 10165 55966 167051 90101 -5251
1980 -5251 64630 -30688 -5 96990 -8952 -37379 -2656 58463 -3707 329 41583 -20999
1968 -20999 -78509 -54128 -34735 76924 98297 53873 -86624 -54944 15060 17911 2568 -58048
1956 -58048 -15793 39882 22666 69776 -44770 -71680 -1588 3305 18436 -50883 -97809 -65582
1944 -65582 -54876 -62022 -74530 -153524 -115403 76435 121864 -24967 -21802 -51853 22988 19405
1932 19405 81430 68388 52491 -134376 -155415 -7102 88133 67269 53736 72730 168725
1921 168725 50249 -41569 10145 3422 9027 42532 58022 21414 140565 68535 -97037
1910 -97037 -118004 -67630 -92001 -42209 -98106 -66899 -97183 -75572 -70786 28649 -105378 -93556
1898 -93556 -28459 7871 -50484 -63988 -145977 -113054 -91403 -11672 89834 31015 50536 -36441
1886 -36441 -121506 -58983 -37373 -73175 -124849 -141204 -189336 -59710 92185 58183 7507
1875 7507 84605 47073 -73962 -47423 -46621 -51607 48507 49526 74710 114427 51445 -91750
1863 -91750 -138976 -26163 -49397 -87498 -154419 -104769 -2981 72756 -29840 -66036 -94550
1852 -94550 -62610 -155045 -183995 -112919 30113 55879 -66552 -123270 -170917 -181872 -25341
1841 -25341 3085 -44635 -11 78630 43508 10925 38008 18144 20510 -74781 -98021 -50298
1829 -50298 23624 129068 70944 -4356 15021 -9960 -19562 51456 42928 22174 -48411 -40454
1817 -40454 16796 57376 32432 54951 123648 96751 91923 -5536 63086 25164 -21620 64078
1805 64078 59768 48428 10182 40415 12974 -47245 7252 -45198 -24238 -71240 -42891 -8520
1793 -8520 -62661 -15912 -2137 20888 21946 -3964 11026 15085 -89707 -90230 -57719 2971 27271
1780 27271 -60402 -54245 -138532 -160815 -78634 2465 18640 -24309 -70353 -90129 -25866 -11406
1768 -11406 -86707 -17078 -5604 -46431 55088 -45959 -28952 7052 -67528 -100984 -61842
1757 -61842 -113224 -115030 -95797 -155349 -81739 -55981 -56235 -39775 -41007 -26432 32924 -44920 -63488
1744 -63488 -43544 22138 67631 -15673 -11787 -26735 44849 -36402 -36920 946 27405 -25622
1732 -25622 -68521 -21336 10626 -59647 -77922 -41216 -78615 -86009 -47942 61254 13892 66253
1720 66253 24819 -62679 -61648 -148321 -83709 -21114 -14152 -37300 -119698 -91702 -95210 -23669
1708 -23669 22903 6563 -13430 87931 -25583 -45014 -75384 45337 19753 -77914 19227
1697 19227 19065 17308 -12230 -21671 -100878 -106858 -39690 44425 24838 54730 90067 -65987 -74768
1684 -74768 -39063 -34043 -60270 -71313 -23717 -30089 -80954 -146084 -2660 -81463 -15706 -64253
1672 -64253 -106678 -64638 -63388 -64234 -43897 -99206 -36744 -98889 -160592 -150453 -92813 -74841
1660 -74841 55952 -56406 -96268 -53651 -120032 -58547 -6657 -11322 -18094 4639 -22311 -8994
1648 -8994 -67853 -71300 -118153 -7924 5699 -8340 -87542 -131008 -18181 1697 -144624 -73870
1636 -73870 -49980 -130468 -111281 -33179 -12832 40598 29894 -73205 -29772 -47893 -96589 -46937
1624 -46937 -94434 -24965 -1455 33610 -56693 -67978 34019 13723 -49836 -43732 -118709 -91052
1612 -91052 -96859 -104374 -66097 -52221 -30350 43696 39915 41018 9912 -65060 716 -97591 -129914
1599 -129914 -61954 -3772 -33868 -105647 -10282 -2706 -27077 -42790 3141 -815 26612 64532
1587 64532 59307 58958 -22987 -82660 -29834 -66141 -61255 -31240 -43999 44531 -34653 44692 11649
1574 11649 -57888 -4499 -91561 -142766 -109310 -55710 13868 36079 68802 -3039 7470 43267
1562 43267 11935 -63280 -72732 -39736 7751 36270 -51873 10337 49907 28906 72948 89550
1550 89550 53423 -23725 -20868 -18425 -44766 -119759 -70035 4409 -47906 -69815 62 -15949
1538 -15949 -44195 -116101 -114858 -52411 -20767 91047 86149 -287 -17457 -32442 19270 -32208
1526 -32208 -1839 6787 45541 103887 35226 -56169 -16121 -79156 280 -10791 -13021 15508
1514 15508 -23779 -13113 20858 -66291 -77718 -24016 8958 70921 50424 45140 26008 58432
1502 58432 112839 117032 110718 86598 25629 7560 -55323 -19289 2054 -6245 185 34354 8099
1489 8099 -7792 -40363 2835 112557 66300 49641 134281 61083 -905 -46102 25863 13876
1477 13876 2124 -18275 39331 21947 -112528 -43346 38598 33570 88141 25922 -87993 -67479
1465 -67479 -23437 49833 32311 -30249 -75158 -72650 1582 8846 87081 -5110 -65405 -38795
1453 -38795 24424 83564 -115955 -130433 -397 -58772 -26975 -44422 -1063 -46358 1901
1442 1901 130701 50090 47536 -24245 6663 4816 -25168 -52787 64803 43819 -829 47685
1430 47685 -7556 -22454 5729 -22685 -50099 -19994 47 36523 86123 33469 43173 30340
1418 30340 -110697 -35585 43361 -53052 -187496 -92622 -24796 15795 -89612 -35943 22263
1407 22263 74520 70060 13586 -44651 21586 84427 25222 10304 12357 -46858 -83476 -77977
1395 -77977 -67867 -19228 21292 49548 -6564 64558 6534 -112071 -56489 -7870 -32490 -29054
1383 -29054 25397 -56751 -59008 21106 101024 72409 -35131 32015 -41498 -58215 -26788 -53655
1371 -53655 3018 -18075 -15413 -68523 -109085 -23835 -82044 -15101 -103346 -20191 6520 -16243
1359 -16243 72639 60769 56326 48117 -36032 71615 37201 21812 69879 40450 -14653 48053
1347 48053 45185 -28610 3531 2160 -33729 -57816 -32052 -3989 75092 47185 134727 133725
1335 133725 5282 10107 104002 145205 66351 69287 78540 -54040 -60046 21279 31793 87351
1323 87351 96432 97342 -61233 -94910 -13653 75896 23393 32368 123982 -12491 -38243 -10053
1311 -10053 46798 79669 61551 59754 22434 33915 -13980 -11812 -70986 -121068 -29470 37116
1299 37116 15140 43229 24595 -61777 -21405 22424 -16777 -88207 -85932 -123172 -41195 20064
1287 20064 23500 3901 43558 40689 84127 68293 48071 110122 73690 22652 -11027 -106019
1275 -106019 -35642 24381 13518 18426 22372 -58601 -60634 46484 76973 26508 -6288 -83134
1263 -83134 -53415 -110069 -95411 -60081 71329 45266 13206 -29788 -75582 -61375 -29798 -26376
1251 -26376 -45795 -36921 -42720 -15076 38136 39441 7509 4152 -78750 -60047 -47000 -83489 -67584
1238 -67584 -6851 15998 54528 83793 92611 -32334 4018 -53177 12916 83193 45801 -5630
1226 -5630 -31633 16313 30758 75902 91946 39682 91665 105330 36322 -20498 -82872 -76689
1214 -76689 -138720 -44209 31915 -85092 -62501 -45519 17160 -20004 -25584 331 -28284 -40385
1202 -40385 8333 41361 -18669 -112646 -8119 22063 -42743 -17669 -30772 -65930 -68924 30911
1190 30911 -8203 59566 68230 -61996 -107772 -56884 -22600 -47730 -4550 44117 -69525 -57185
1178 -57185 -85974 -15844 -69905 -163749 -77177 8954 -38386 -96123 71448 80697 37212 -33947
1166 -33947 -19575 -37060 10254 16829 -1874 44906 64551 16825 -23426 -42812 -64156 -87539
1154 -87539 -44898 -120921 -46180 4194 9309 26030 -900 -21668 -48132 -12880 4136 -99704
1142 -99704 -43615 97516 14457 31747 75912 -37654 -32064 -63677 -63753 -22228 -84367 13475
1130 13475 51700 33262 -88802 -29129 37370 21406 -19179 -38358 -9524 7424 -3276 32170
1118 32170 42250 34966 -712 1059 -21006 19135 76363 70590 71185 72691 28338 44238 -57045
1105 -57045 -18901 36119 52105 60688 32552 -10560 -6612 65116 -60712 -98722 45290 44080
1093 44080 -35663 24310 62205 37381 196918 201230 84976 62222 24684 194 -19654 26514
1081 26514 51339 105453 112500 88032 48680 11013 -39267 21463 -9551 53768 66073 -29568
1069 -29568 13254 18014 56713 94048 80291 119123 -5281 -55651 -40261 -47134 8578 53507
1057 53507 73299 111424 15206 -57555 -109931 -9327 -31862 -23345 41700 -30443 -33216 4006
1045 4006 4230 -58279 -75591 26381 122078 51336 79894 27098 13611 22155 6734 120952
1033 120952 73508 22476 2780 19520 58004 11926 100948 155908 159169 145108 66853 41445
1021 41445 41536 57332 48295 46688 90523 118940 141024 129220 33468 -37640 6918 -109446 -71972
1008 -71972 -1372 80000 108821 17256 26740 78235 65082 44025 -18626 40673 51624 4144
996 4144 -55538 9750 56829 50560 102442 68032 38010 -36700 -15382 14463 -14553 -88908
984 -88908 -63796 -35648 -14913 8841 58337 91401 -30285 -87955 37661 61134 -31646 -85857
972 -85857 -16183 -28740 -5489 -8487 221 147681 141579 75926 1955 -37956 49183 68976
960 68976 -11423 90840 51347 -10535 9675 20941 23770 60266 -15281 -105758 -80040 -30074
948 -30074 41898 49110 30275 -55373 99838 71220 -21349 18422 88892 23201 -18933 44282
936 44282 58758 -14775 -18190 35001 35746 35545 -124744 -68879 -32887 24893 13791 25388 39586
923 39586 69500 55760 -61453 49086 99941 3233 -40121 22823 41166 -5334 -78546 -61247
911 -61247 -50867 110054 68812 93297 163159 85526 3131 -16487 20594 -87009 -42478 -19322
899 -19322 -52214 24141 46316 -83809 -127433 -42695 -19274 20708 -44336 -27826 2981 -66777
887 -66777 -3837 -56515 59312 110811 -33009 -38685 2235 -48263 71300 67486 98975 47776
875 47776 -17540 -13427 -19702 87170 16601 14097 65225 36387 43901 46898 48882 39348 91501
862 91501 204556 175499 57808 -27375 -85173 -125194 -60581 -34045 -61194 -22589 72732 -20781
850 -20781 -45937 22417 118838 -456 -29407 -342 5758 -18008 -41550 -28628 -22916 20575
838 20575 68961 102754 113929 -5423 -47439 69373 152225 161610 118123 70595 39967 81183
826 81183 73870 84915 74931 7164 64690 99249 -11645 109985 95648 93253 166005 115655
814 115655 16597 4310 7030 19328 -63894 20900 95459 55533 48454 80201 19640 32313
802 32313 -3844 13936 93901 134229 169923 107575 84861 128719 47383 -55416 -52152 -28003
790 -28003 -22846 32301 97271 42804 190 -35939 90341 97702 10048 -24437 60439 149382
778 149382 93799 22552 51784 78427 79719 37402 -53018 -21936 72464 85809 22391 29450
766 29450 -9608 -94682 -8552 17330 79945 82690 12507 -22424 56147 113495 154673 255693
754 255693 265574 198605 166626 80647 89775 11685 -24703 24130 -2113 -40822 -11824 -22750
742 -22750 -84940 -150852 -19668 8463 81175 85923 22531 26235 55282 109747 33577 -11680
730 -11680 -76831 -88255 -10472 32438 -32777 59470 123418 94779 131782 64121 20680 60331
718 60331 -80932 -69831 51843 -10415 -20106 -9867 108807 164443 94513 75919 42006 195475
706 195475 222469 102471 66485 41276 -27873 468 68519 129839 111978 208886 81799
695 81799 2163 -44326 -47439 -27226 -40957 10407 95196 42653 22836 52682 53925 8518
683 8518 46271 36683 39148 37396 -42337 -27162 -72449 -27988 51259 75517 28901 115001 117608
670 117608 -4077 86159 121719 96136 59767 -12305 -16509 36021 -51888 -84730 -15642 -14235
658 -14235 67970 103963 7742 -59556 -4610 -57981 35044 20543 39055 121737 81887 61882
646 61882 10041 32355 69757 24793 -78033 -43716 -1291 83671 73731 43543 55660 58132
634 58132 73544 32279 6232 -14656 -49283 -79684 16959 44498 73250 -110043 -92912 -34323
622 -34323 -17488 -23033 98612 42834 -9857 -61656 -67656 32203 111745 117573 -41069 -59713
610 -59713 -33326 -76252 -142461 -85567 44233 113191 145880 107221 58256 6562 -34436 16247
598 16247 -65683 -43056 -65943 -79412 -27631 21098 -22094 49733 79246 -71733 -73667 1934
586 1934 100375 133623 102777 15901 -17559 32668 15151 6393 11298 -76197 -111936 -120219 -43076
573 -43076 -85852 -99075 -38759 -23244 74104 24297 53086 40481 49932 85914 149507 140612
561 140612 74404 11601 23365 99823 20776 -68658 36253 -5799 -50032 -25663 -47452 -68641
549 -68641 -11665 59779 6610 -30707 -7457 1762 -14475 -98496 -144031 -90606 -38555 -8004
537 -8004 116515 162443 127411 19139 -100939 -81752 39114 72647 -48081 -8594 18969
526 18969 -6540 53303 1590 -37775 -70688 -77753 -107106 -109738 -9029 -27433 11589 8790
514 8790 75876 51251 -55534 -145089 -34534 28588 138797 5662 45181 60029 35567
503 35567 -5986 -72581 -14507 60974 103601 51540 36392 43877 117841 58892 48190 21220
491 21220 22048 44572 105395 98917 92600 -22757 -14557 -80946 62983 178852 178271 164573 65580
478 65580 41377 96293 43183 -2221 89952 58171 55228 35581 49482 53693 -15565 -2833
466 -2833 -27138 -8493 42031 30338 -3641 18788 55575 111137 35966 34786 -20215 126098
454 126098 93686 84102 59821 -64184 -117386 -111029 -295 -108852 -134471 37952 64561
443 64561 -15601 -36075 -42783 53130 -19162 54625 59934 26014 -6636 -92805 -64104 29639
431 29639 -21341 35682 6659 -78586 -48283 30847 54765 109890 128306 78851 12774 15280
419 15280 114088 76435 -50483 -76610 -93333 -72662 -107085 -96571 -101610 -88736 -31189 16632
407 16632 -27887 56026 128803 148651 72302 16906 -82231 -127325 -104816 -42818 19059 61058
395 61058 -17138 -52825 16925 -36836 -484 -32535 12057 -58900 -47389 19264 14210 -24921
383 -24921 -2492 84122 191017 103032 108165 135444 174590 198422 86424 -18426 -35074 21467
371 21467 46538 70732 9908 3598 1740 29350 67426 67115 -15467 -62483 -34472 -32036 44434
358 44434 141448 202771 54913 2179 39149 28948 28633 -93635 47787 146857 25949 11302
346 11302 90748 53872 -26570 45548 82934 73719 -14509 -2734 -9217 29029 55467 -8597
334 -8597 -48089 -50037 -21805 -25889 23234 14168 -35691 -88274 -21647 9332 54336 72160 35872
321 35872 4113 45093 -412 -24282 66229 -481 104604 34542 5894 14948 -18393 -20095
309 -20095 28658 20497 -6694 37445 -13406 -20983 -91112 -95285 -77247 -94349 9927 -7513
297 -7513 -19534 -55575 -69258 -60078 44518 -8138 -38567 95767 13098 -11047 -40120 -72687
285 -72687 -57932 4705 65181 12663 61705 122744 34280 -8635 17405 -21707 64012 90196
273 90196 164241 175589 49753 -37060 -71852 -28509 17521 101531 38394 -458 85007 52371
261 52371 11161 -46699 -53177 -33545 15784 -20161 -70582 59827 43254 38891 7912 4460
249 4460 -6169 -31671 6291 25075 7668 31908 34543 86998 -4743 310 44875 28991 13612
236 13612 56301 65460 44065 80931 83583 -5118 3282 -48127 -79296 -34881 -13610 1029 -1069
223 -1069 -38590 -50366 -40729 -32139 -135285 -95066 -92306 -63926 6720 17411 1044 -25782 3402
210 3402 -30350 26302 -17888 19085 55571 13893 60371 33577 -7086 -24038 -85010 2807
198 2807 121906 82866 52538 42103 38176 55021 38380 72746 60023 -44441 -56434 78160
186 78160 83379 68989 51226 83152 110361 62972 90855 22345 -20170 -27496 -16874 -30825
174 -30825 -59010 32749 1482 52152 57043 28354 -43378 -63394 -74034 -137788 -100072 28706
162 28706 91340 74747 14358 -29447 -110865 9694 26497 78330 103380 35032 96185 7083
150 7083 -11752 -89821 -26846 14037 -24637 -36977 42372 -21595 -77110 -31527 -20260 -20507 -45963
137 -45963 29570 -9070 -36894 6411 -31459 -71963 -50779 -83803 -28863 -46537 -71499 -102463
125 -102463 -162505 -69805 -18707 3753 2472 40828 108388 52507 7618 -23681 37236 -20594
113 -20594 35111 55464 -13091 48320 -43585 -63240 -22218 34204 103358 102065 113147 56839
101 56839 67353 21164 -1095 36533 14563 13659 -22933 -10211 -24705 39329 32057 -11454 23811
88 23811 -24102 -137905 -68459 -17272 -53893 -63426 -70719 -2434 -20026 -7942 -2194 32977 47666
75 47666 -26318 68416 52258 22151 -21833 -15849 9806 -1238 3456 -49699 -57128 -29466 -8051
62 -8051 27898 -21959 -15742 34618 -23777 -42010 18665 1906 -19877 -3918 -14626 -84254 5137
49 5137 -67928 -20892 -41620 -58254 28189 10894 48251 -10082 32179 29028 -34532 -45048 40893
36 40893 -2572 16258 23825 2833 77794 56926 -32308 -77438 -20673 14907 21039 4814 -27801
23 -27801 -93278 -98334 -94049 -73043 42299 -10886 18418 -23656 42137 3119 -45741 -35627
11 -35627 -8571 18504 -13978 22495 38992 -26968 -44715 4964 11178 41167 -32382
0 -32382
$$ Imaginary data points
##PAGE= N=2
##DATA TABLE= (X++(I..I)), XYDATA
16383 -1417648 -1435688 -1420647 -1368092 -1291504 -1273698 -1250934 -1266160 -1216082 -1166338 -1106038 -1080832
16372 -1080832 -1033595 -1014749 -1011341 -967416 -952521 -858516 -797181 -761878 -670520 -694288 -698885 -637921
16360 -637921 -654161 -639599 -549889 -540963 -491768 -433620 -435495 -360096 -379759 -354732 -300393 -247026
16348 -247026 -184220 -191543 -81745 -59708 -123815 -45883 10468 85613 109269 145538 210205
16337 210205 208686 217474 194985 258237 277565 272805 324100 361037 435526 412724 512499 578300
16325 578300 600801 652507 717226 747405 753986 755831 761071 800903 873973 850147 865049 924713
16313 924713 944929 952046 1038950 1041396 1025626 1028748 1136019 1160228 1157192 1202765 1115685 1235253
16301 1235253 1194355 1242301 1302171 1375245 1438559 1472708 1412018 1402226 1469736 1551816 1498973
16290 1498973 1551845 1594230 1627986 1675847 1711944 1694607 1771472 1812310 1810054 1896918 1899175 1902584
16278 1902584 1974445 1926669 1947605 2013959 2033080 2015531 2071397 2157478 2159365 2146612 2150398 2206570
16266 2206570 2247212 2343403 2359475 2336723 2231750 2289014 2392970 2426596 2381317 2419512 2458575
16255 2458575 2525318 2506361 2569738 2571781 2577673 2639127 2639069 2645224 2620593 2681707 2669453 2669504 2695601
16242 2695601 2735277 2709446 2710031 2821870 2925044 2950260 2934656 2926330 2913464 2916770 2951276 2980821
16230 2980821 2937172 2991888 2987541 3024925 3092119 3075731 3052160 3133084 3165489 3157519 3169416 3196940
16218 3196940 3146485 3269676 3299230 3263781 3321959 3274331 3271922 3323581 3311474 3315565 3280502
16207 3280502 3291957 3407422 3444778 3425258 3356590 3353586 3390949 3467916 3452884 3498732 3441814
16196 3441814 3345718 3418376 3479815 3462995 3465877 3495545 3550822 3570362 3587524 3566057 3492552
16185 3492552 3541901 3571634 3629075 3528246 3647892 3698257 3631910 3676614 3698063 3787392 3893802
16174 3893802 3863949 3812165 3760040 3697528 3782469 3708761 3752740 3804320 3769052 3867588 3859325
16163 3859325 3798396 3859226 3868976 3831458 3741673 3759776 3747297 3795110 3824757 3872676 3821321
16152 3821321 3917858 3895106 3850839 3947684 3978240 3930778 3926119 4029306 4038579 3984983 3961285
16141 3961285 3905734 3997297 4026731 3940689 3932596 3984363 4087827 4082901 4024392 4041182 4028682
16130 4028682 4012043 4050534 4092057 4122853 4105523 4137395 4131138 4078959 3956445 4002725 3973705
16119 3973705 3989669 4090148 4089663 4058015 4087932 4077566 4042976 3986587 4018603 4029905 4095680
16108 4095680 4179906 4081939 4074760 4095429 4054757 4020758 4144584 4166070 4198482 4200058 4169834
16097 4169834 4172043 4109223 4161201 4200094 4145195 4175369 4203536 4236383 4219878 4231317 4239822 4220344
16085 4220344 4217660 4174493 4197271 4177751 4265892 4180555 4227070 4227560 4213382 4247938 4268119 4208146
16073 4208146 4156635 4187062 4163163 4238039 4319876 4359804 4234082 4189358 4215744 4187624 4190413
16062 4190413 4203504 4264182 4311085 4281480 4315772 4324403 4248038 4189004 4311166 4202708 4143269
16051 4143269 4220677 4335384 4342192 4220638 4284986 4274563 4230187 4281057 4315366 4264021 4331100
16040 4331100 4288489 4290430 4230717 4203246 4246440 4308584 4415168 4363499 4363105 4318557 4290596 4263017
16028 4263017 4240843 4234166 4314954 4326505 4300352 4237698 4323005 4336635 4361851 4325994 4339035
16017 4339035 4374382 4281778 4321655 4269799 4279994 4253632 4367968 4364964 4263177 4273563 4295563
16006 4295563 4261298 4200185 4222203 4211250 4201102 4250619 4285078 4313002 4299805 4304133 4285224
15995 4285224 4337583 4299515 4250867 4272775 4180640 4207664 4264608 4273545 4303322 4294035 4373859 4313836
15983 4313836 4338343 4256786 4235180 4293058 4279505 4332534 4317765 4221136 4236522 4267671 4236051
15972 4236051 4248450 4292676 4337091 4251225 4261946 4314982 4353989 4333178 4316868 4355649 4416277
15961 4416277 4320963 4227283 4255968 4293479 4293664 4315898 4368742 4384808 4258808 4254508 4244591 4297398
15949 4297398 4216739 4245553 4261049 4315762 4362886 4307954 4338031 4303927 4232191 4192965 4322750
15938 4322750 4373184 4285345 4305899 4386693 4267554 4175399 4126421 4262256 4251907 4333119 4287041
15927 4287041 4138994 4284596 4379272 4380629 4456406 4271509 4286168 4344306 4247106 4337701 4355665
15916 4355665 4329839 4447036 4392474 4419235 4539605 4345174 4263428 4237339 4185275 4142490 4332463
15905 4332463 4430071 4452053 4436345 4450995 4397145 4374033 4349944 4417287 4397383 4308983 4322600
15894 4322600 4355384 4341215 4355522 4308318 4303376 4301410 4249875 4281169 4307517 4316161 4326632 4192528
15882 4192528 4201604 4229273 4271658 4338705 4345755 4296697 4273254 4315265 4331385 4396179 4346738 4416414
15870 4416414 4346823 4278152 4372644 4349072 4218382 4267525 4339939 4463035 4374836 4343442 4383626
15859 4383626 4372831 4258937 4272526 4319579 4288333 4352731 4375792 4365146 4283013 4259998 4219829
15848 4219829 4224537 4236381 4303616 4389512 4369246 4359732 4258689 4243760 4284344 4366130 4410482
15837 4410482 4386364 4395247 4389814 4397271 4378545 4341198 4266991 4269254 4335928 4269324 4199143 4207435
15825 4207435 4401476 4436389 4415253 4383608 4302816 4349053 4389106 4390910 4368140 4350202 4307028
15814 4307028 4263507 4223526 4279083 4385323 4429473 4410496 4300287 4320687 4413403 4464421 4370657
15803 4370657 4392840 4445498 4381084 4429012 4293974 4361742 4367724 4289007 4315098 4205180 4179898
15792 4179898 4258058 4292496 4347776 4311485 4253974 4263057 4325375 4358004 4353393 4360063 4343104 4412441
15780 4412441 4422238 4425954 4383192 4364402 4466870 4443026 4366043 4363208 4383655 4415412 4398662 4441471
15768 4441471 4435847 4443258 4455704 4406272 4397748 4304297 4358961 4442919 4418263 4402188 4424124 4411890
15756 4411890 4409828 4426027 4512492 4410531 4355588 4386421 4360435 4315530 4274697 4414777 4421016
15745 4421016 4369524 4415226 4420140 4393671 4358188 4318896 4319586 4433384 4519258 4584451 4446198
15734 4446198 4367603 4334788 4367525 4475150 4430740 4516834 4583465 4496437 4417607 4416476 4430666
15723 4430666 4355696 4434990 4425515 4525186 4606646 4556480 4563350 4613339 4448382 4421037 4560049
15712 4560049 4644937 4473834 4367023 4507509 4449413 4425961 4408685 4384412 4420244 4589314
15702 4589314 4505783 4464717 4365658 4380968 4370634 4431402 4442383 4465936 4458572 4475230 4498701
15691 4498701 4429147 4431940 4452674 4424534 4377219 4278628 4224807 4225889 4364869 4444943 4353369
15680 4353369 4430936 4455968 4461139 4509799 4463485 4452502 4471137 4474716 4493030 4494752 4549571 4501865
15668 4501865 4422738 4409598 4497786 4488411 4485245 4444035 4458322 4445497 4420041 4476823 4418732 4468696
15656 4468696 4425170 4441873 4433831 4493630 4489461 4452475 4447400 4505954 4490005 4443235 4491815 4497747
15644 4497747 4440188 4420584 4454748 4473039 4389966 4374439 4492193 4394764 4503765 4466468 4374722
15633 4374722 4410421 4399737 4448107 4527237 4509482 4511009 4402690 4506567 4553091 4536868 4579331
15622 4579331 4487501 4448709 4529686 4601605 4556781 4434475 4454824 4355335 4308410 4396014 4381188
15611 4381188 4395681 4362467 4369396 4361921 4426095 4419018 4412742 4424148 4462056 4518662 4553758 4497933
15599 4497933 4515021 4466307 4477843 4418355 4451308 4557114 4543026 4531910 4493666 4421112 4310108
15588 4310108 4343095 4461258 4519473 4510280 4473508 4391048 4379919 4354711 4274862 4316735 4330890
15577 4330890 4340316 4473139 4430589 4402789 4448815 4333392 4413239 4499060 4541577 4547825 4391682
15566 4391682 4379931 4378979 4456012 4385290 4403838 4545190 4520840 4435165 4381966 4449973 4547990
15555 4547990 4546410 4426218 4388224 4482006 4461213 4411765 4487709 4505339 4505812 4560770 4512617 4511053
15543 4511053 4472796 4544541 4526327 4368495 4471213 4535336 4552944 4594456 4564847 4593587 4537098
15532 4537098 4522854 4500351 4565585 4558736 4455366 4496449 4496564 4452331 4466173 4538196 4653833
15521 4653833 4596743 4539337 4530092 4504040 4458570 4427765 4360973 4421672 4567792 4512571 4417383
15510 4417383 4463433 4512821 4594815 4591913 4496084 4542009 4506932 4477335 4475306 4509413 4554823 4500128
15498 4500128 4430639 4494105 4513569 4527326 4522765 4514555 4541673 4587927 4535299 4474452 4511976 4558700
15486 4558700 4639938 4633652 4518046 4586686 4484420 4487955 4496459 4563975 4611117 4764358 4767785
15475 4767785 4687672 4711259 4669007 4587617 4611815 4552378 4471892 4456434 4493291 4618743 4517136
15464 4517136 4542419 4608125 4620070 4598599 4620130 4650175 4580974 4583961 4551295 4638003 4601870
15453 4601870 4598685 4581610 4508087 4500082 4562918 4664368 4534223 4557225 4611186 4572051 4485083
15442 4485083 4589569 4670749 4619194 4697233 4838454 4733178 4657997 4545452 4445151 4507574
15432 4507574 4648401 4646376 4660915 4610265 4528500 4560622 4548104 4533375 4557074 4576230 4547114
15421 4547114 4533090 4445842 4534655 4643784 4607120 4577591 4605047 4536155 4647226 4659093 4684314
15410 4684314 4598425 4566485 4691173 4688212 4652535 4620758 4633362 4581837 4473201 4513109 4555253
15399 4555253 4511451 4616464 4562022 4571608 4574322 4700213 4711127 4665846 4645669 4599554 4620853
15388 4620853 4638086 4621852 4629902 4640245 4682119 4510191 4515644 4625205 4631757 4638999 4636805 4568706
15376 4568706 4594012 4616266 4694452 4673615 4616841 4694783 4675601 4581614 4586302 4651905 4655756 4609764
15364 4609764 4549523 4559580 4630199 4580143 4552384 4548422 4571378 4605728 4628340 4567694 4568538 4616846
15352 4616846 4635296 4608235 4473615 4540405 4619781 4628142 4585632 4542052 4497457 4588096 4603887
15341 4603887 4587205 4582761 4616828 4705326 4658123 4593408 4615149 4569228 4560170 4557647 4645404 4560884
15329 4560884 4594050 4608195 4553106 4645948 4690503 4632410 4611162 4681590 4643234 4609884 4661504
15318 4661504 4732840 4729607 4688449 4633421 4594413 4565302 4484965 4541946 4639250 4664296 4685882
15307 4685882 4705517 4617884 4637874 4548415 4607400 4562707 4529047 4613131 4635843 4628957 4653770
15296 4653770 4605324 4575045 4594104 4493898 4493492 4627174 4627197 4513702 4705892 4672395 4589497
15285 4589497 4606735 4594000 4583684 4640595 4744280 4662019 4723537 4664450 4591509 4670827 4605594
15274 4605594 4555824 4551001 4690187 4736123 4609743 4671406 4711476 4582443 4593272 4663775 4654526
15263 4654526 4635559 4691300 4770743 4738135 4614112 4664429 4628512 4709714 4746720 4693378 4653173
15252 4653173 4739641 4790836 4678419 4713018 4680910 4658361 4688599 4682123 4758574 4765124 4676258
15241 4676258 4644492 4606103 4671986 4618232 4661877 4666519 4640263 4717229 4778531 4740693 4745423 4794163
15229 4794163 4647885 4682936 4689488 4740898 4708585 4604868 4636709 4722028 4765850 4863898 4745789
15218 4745789 4728461 4763599 4712862 4786214 4758334 4758276 4762553 4762445 4759637 4696696 4674677 4754383 4693000
15205 4693000 4671059 4671998 4687092 4605364 4646943 4685361 4673893 4751679 4741036 4685346 4674733 4750580
15193 4750580 4764385 4721501 4696713 4685115 4644936 4702583 4723963 4721970 4709568 4761161 4863475
15182 4863475 4848387 4855205 4797649 4680993 4694902 4770216 4733202 4628582 4668562 4712301 4750009
15171 4750009 4621677 4625590 4596398 4686137 4774090 4785515 4729145 4616854 4680012 4696342 4738751
15160 4738751 4849125 4877477 4663438 4696479 4716860 4755649 4834857 4808616 4792996 4749898 4817800
15149 4817800 4762174 4808707 4694099 4655325 4745540 4735620 4769235 4698494 4676354 4724321 4636088
15138 4636088 4649323 4695271 4760948 4799393 4740910 4747863 4735818 4821352 4682906 4664560 4716913
15127 4716913 4752642 4731283 4721554 4693490 4791676 4766680 4657224 4655708 4770982 4787549 4670700
15116 4670700 4664988 4663892 4694680 4620453 4622096 4695498 4667887 4777490 4698009 4612343 4699747 4769911
15104 4769911 4665446 4728453 4806735 4750740 4724254 4718334 4659991 4645289 4704086 4824109 4843383
15093 4843383 4738698 4787757 4710731 4696216 4620296 4603195 4767179 4774208 4767774 4698386 4662292
$$ [...]
##END NTUPLES=NMR SPECTRUM
##END=
