##TITLE=1H_TG-2353
 CDCl3
 8 sc, 
 12.05.2022
##JCAMPDX= 6.0         $$ Bruker NMR JCAMP-DX V2.0
##DATA TYPE= NMR SPECTRUM
##DATA CLASS= NTUPLES
##ORIGIN= UXNMR, Bruker Analytische Messtechnik GmbH
##OWNER= root
$$ XWIN-NMR		Version 3.5
$$ Thu May 12 11:19:54 2022 Russian Standard Time (UT+4h)  she@DPX200
##.OBSERVE FREQUENCY= 200.1313499996
##.OBSERVE NUCLEUS= ^1H
##.ACQUISITION MODE= SIMULTANEOUS
##.ACQUISITION SCHEME= undefined
##.AVERAGES= 8
##.DIGITISER RES= 18
##SPECTROMETER/DATA SYSTEM= spect
##.PULSE SEQUENCE= zg30
##.SOLVENT NAME= Pyr
##.SHIFT REFERENCE= (INTERNAL, Pyr, 0, 15.7238)
##AUDIT TRAIL= $$ (NUMBER, WHEN, WHO, WHERE, WHAT)
$$ ##TITLE= Audit trail, XWIN-NMR		Version 3.5
$$ ##JCAMPDX= 5.01
$$ ##ORIGIN= Bruker BioSpin GmbH
$$ ##OWNER= she
$$ F:/spectra/data/she/nmr/H-F/1/pdata/1/auditp.txt
$$ ##AUDIT TRAIL=  $$ (NUMBER, WHEN, WHO, WHERE, WHAT)
(   1,<2022-05-12 11:18:58.75 +0400>,<she>,<DPX200>,
      <created by zg, POWCHK disabled, PULCHK disabled
       configuration hash MD5:
       00 E9 B6 7A A2 85 ED C7 34 08 36 98 17 FE 4E 26
       data hash MD5: 16K
       0A 38 02 AB F8 12 0E AD A1 20 0B 49 34 C0 33 AD>)
(   2,<2022-05-12 11:19:01.25 +0400>,<she>,<DPX200>,
      <Start of raw data processing
       efp BC_mod = 2 LB = 0.24 FT_mod = 6 PKNL = 1 PHC0 = -17676.75 PHC1 = 20.40075 SI = 16K 
       data hash MD5: 16K
       A4 30 20 0D 3E 39 56 A4 BC 4E BB 63 85 06 05 73>)
(   3,<2022-05-12 11:19:14.45 +0400>,<she>,<DPX200>,
      <pk PHC0 = 2.959467 PHC1 = -2 
       data hash MD5: 16K
       DD 3B B9 26 5A 45 09 31 FF E3 13 A1 50 EC FC 6F>)
(   4,<2022-05-12 11:19:17.51 +0400>,<she>,<DPX200>,
      <abs ABSG = 5 
       data hash MD5: 16K
       C3 E9 F4 16 B6 B6 5B D0 66 81 84 DF 69 43 91 BD>)
$$ ##END=
$$ 
$$ hash MD5
$$ 16 AB 31 B4 77 B7 5C 39 D6 02 CD 38 55 8D 31 9B
##$RELAX= 
##$RELAX= 
##$RELAX= 
##$RELAX= 
##$RELAX= 
##$RELAX= 
$$ Bruker specific parameters
$$ --------------------------
##$DU= <F:/spectra>
##$EXPNO= 1
##$NAME= <H-F>
##$PROCNO= 1
##$TYPE= <nmr>
##$USER= <she>
##$AMP= (0..31)
100 100 100 100 100 100 100 100 100 100 100 100 100 100 100 100 100 100 
100 100 100 100 100 100 100 100 100 100 100 100 100 100 
##$AQSEQ= 0
##$AQ_mod= 1
##$AUNM= <au_zg>
##$AUTOPOS= <>
##$BF1= 200.13
##$BF2= 200.13
##$BF3= 200.13
##$BF4= 200.13
##$BF5= 200.13
##$BF6= 200.13
##$BF7= 200.13
##$BF8= 200.13
##$BYTORDA= 1
##$CFDGTYP= 0
##$CFRGTYP= 5
##$CHEMSTR= <none>
##$CNST= (0..31)
1 1 145 1 1 1 1 1 1 1 1 1 1 1 1 1 1 1 1 1 1 1 1 1 1 1 1 1 1 1 1 1 
##$CPDPRG= <>
##$CPDPRG1= <>
##$CPDPRG2= <>
##$CPDPRG3= <>
##$CPDPRG4= <mlev>
##$CPDPRG5= <mlev>
##$CPDPRG6= <mlev>
##$CPDPRG7= <mlev>
##$CPDPRG8= <mlev>
##$CPDPRGB= <>
##$CPDPRGT= <>
##$D= (0..31)
0 1.2 0 0 0 0 0 0 0 0.06 0 0.03 0 0 0 0 0.0002 0 0 0 0 0 0 0 0 0 0 0 0 
0 0 0 
##$DATE= 1652339938
##$DBL= (0..7)
120 120 120 120 120 120 120 120 
##$DBP= (0..7)
150 150 150 150 150 150 150 150 
##$DBP07= 0
##$DBPNAM0= <>
##$DBPNAM1= <>
##$DBPNAM2= <>
##$DBPNAM3= <>
##$DBPNAM4= <>
$$ [...]
##$SUBNAM2= <"">
##$SUBNAM3= <"">
##$SUBNAM4= <"">
##$SUBNAM5= <"">
##$SUBNAM6= <"">
##$SUBNAM7= <"">
##$SUBNAM8= <"">
##$SUBNAM9= <"">
##$SW= 18.0517283424761
##$SWIBOX= (0..15)
0 0 2 0 0 0 0 0 0 0 0 0 0 0 0 0 
##$SW_h= 3612.71676300578
##$TD= 16384
##$TD0= 1
##$TE= 0
##$TE2= 300
##$TE3= 300
##$TEG= 300
##$TL= (0..7)
0 120 120 120 120 120 120 120 
##$TP= (0..7)
150 150 150 150 150 150 150 150 
##$TP07= 0
##$TPNAME0= <>
##$TPNAME1= <>
##$TPNAME2= <>
##$TPNAME3= <>
##$TPNAME4= <>
##$TPNAME5= <>
##$TPNAME6= <>
##$TPNAME7= <>
##$TPOAL= (0..7)
0.5 0.5 0.5 0.5 0.5 0.5 0.5 0.5 
##$TPOFFS= (0..7)
0 0 0 0 0 0 0 0 
##$TUNHIN= 0
##$TUNHOUT= 0
##$TUNXOUT= 0
##$USERA1= <user>
##$USERA2= <user>
##$USERA3= <user>
##$USERA4= <user>
##$USERA5= <user>
##$V9= 5
##$VALIST= <valist>
##$VCLIST= <CCCCCCCCCCCCCCC>
##$VD= 0
##$VDLIST= <DDDDDDDDDDDDDDD>
##$VPLIST= <PPPPPPPPPPPPPPP>
##$VTLIST= <TTTTTTTTTTTTTTT>
##$WBST= 1024
##$WBSW= 4
##$XGAIN= (0..3)
0 0 0 0 
##$XL= 0
##$YL= 0
##$YMAX_a= 237984
##$YMIN_a= -338621
##$ZGOPTNS= <>
##$ZL1= 120
##$ZL2= 120
##$ZL3= 120
##$ZL4= 120
##$ABSF1= 15.73477
##$ABSF2= -2.31708
##$ABSG= 5
##$ABSL= 3
##$ALPHA= 0
##$AQORDER= 0
##$ASSFAC= 0
##$ASSFACI= 0
##$ASSFACX= 0
##$ASSWID= 0
##$AUNMP= <proc_1d>
##$AZFE= 0.1
##$AZFW= 0.1
##$BCFW= 0
##$BC_mod= 2
##$BYTORDP= 0
##$COROFFS= 0
##$CY= -3
##$DATMOD= 1
##$DC= 0
##$DFILT= <>
##$DTYPP= 0
##$F1P= 0
##$F2P= 0
##$FCOR= 1
##$FTSIZE= 16384
##$FT_mod= 6
##$GAMMA= 0
##$GB= 0
##$INTBC= 1
##$INTSCL= 0
##$ISEN= 128
##$LB= 0.24
##$LEV0= 0
##$LPBIN= 0
##$MAXI= 10000
##$MC2= 0
##$MEAN= 0
##$ME_mod= 0
##$MI= 1.114404
##$NCOEF= 0
##$NC_proc= -8
##$NLEV= 6
##$NOISF1= 3.799351
##$NOISF2= 2.8
##$NSP= 0
##$NTH_PI= 0
##$NZP= 0
##$OFFSET= 15.72375
##$PC= 1
##$PHC0= -17673.79
##$PHC1= 18.40075
##$PH_mod= 1
##$PKNL= yes
##$PPARMOD= 0
##$PSCAL= 0
##$PSIGN= 0
##$REVERSE= no
##$SF= 200.130009564303
##$SI= 16384
##$SIGF1= 3
##$SIGF2= 2
##$SINO= 5.538805
##$SIOLD= 16384
##$SREGLST= <1H.CDCl3>
##$SSB= 0
##$STSI= 16384
##$STSR= 0
##$SW_p= 3612.71676300578
##$SYMM= 0
##$S_DEV= 0
##$TDeff= 16384
##$TDoff= 0
##$TI= <>
##$TILT= no
##$TM1= 0
##$TM2= 0
##$TOPLEV= 0
##$USERP1= <user>
##$USERP2= <user>
##$USERP3= <user>
##$USERP4= <user>
##$USERP5= <user>
##$WDW= 1
##$XDIM= 16384
##$YMAX_p= 523624662
##$YMIN_p= -1178138
$$ End of Bruker specific parameters
$$ ---------------------------------
##NTUPLES= NMR SPECTRUM
##VAR_NAME=  FREQUENCY,     SPECTRUM/REAL,   SPECTRUM/IMAG
##SYMBOL=    X,             R,               I
##VAR_TYPE=  INDEPENDENT,   DEPENDENT,       DEPENDENT
##VAR_FORM=  AFFN,          ASDF,            ASDF
##VAR_DIM=   16384,         16384,           16384
##UNITS=     HZ,            ARBITRARY UNITS, ARBITRARY UNITS
##FACTOR=    0.220516191357247, 1,           1
##FIRST=     3146.79426078977, 0,            0
##LAST=      -465.922502216009, 0,           0
##MIN=       -465.922502216009, -1178138,    0
##MAX=       3146.79426078977, 523624662,    0
$$ Real data points
##PAGE= N=1
##DATA TABLE= (X++(R..R)), XYDATA
$$ [...]
$$ plain form
7454 -58681 22679 -387743 -619107 -485132 -36216 -304977 -172518 245114 -301614 -792837
7444 -792837 -136849 -48591 -178020 -456849 -594881 -175187 -44360 -94464 -647977 -646798
7434 -646798 -404971 -584906 -512126 -783641 -944485 -654585 -482417 -636063 -456022 -599841
7424 -599841 -742321 -591653 -525962 47768 301110 182991 199143 -197422 -550553 -309449
7414 -309449 -161552 -125543 -87000 -86359 -60660 -600207 -734866 -438738 -456368 -725991 -882107
7403 -882107 -790767 -558682 -652468 -684685 -408628 -390821 -349052 -324505 -331001 -473670 -384685
7392 -384685 -234471 5970 -95676 -366593 -438772 -505977 -686129 -722045 -350489 -121460
7382 -121460 -58896 -382014 -463052 -630420 -268510 -336655 -625392 -621626 -1041317 -800774 -653141
$$ packed form
7454e8681Q1360m10422k31364J33975M48916k68761J32459M17632n46728m91223
7444g92837O55988Q8258j29429k78829j38032M19694J30827n0104n53513J179
7434f46798K41827j79935P2780k71515j60844K89900J72168j53646J80041j43819
7424e99841j42480J50668O5691N73730K53342j18119J6152l96565l53131K41104
7414c09449J47897L6009L8543O41K5699n39547j34659K96128j7630k69623j56116
7403h82107R1340K32085r3786l2217K76057J7807M1769K4547o496j42669Q8985
7392c84685J50214K40441j01646k70917p2179o7205j80152l5916L71556K29029
7382a21460O2564l23118q1038j67368L61910o8145k88737L766m19691K40543J47633
$$ plain form
7371 -653141 -678502 -717482 -434843 -287074 -39244 -309984 -489466 -390229 -692356 -789386
7361 -789386 -914359 -686989 -251442 1641 -237930 -217534 -152676 -145734 -122900 -233977 -364237
7350 -364237 -382290 -319307 -515132 -211122 -166575 -210941 -409220 -573518 -47072 -225322
7340 -225322 42897 -324612 -376977 -390331 -289932 -370898 -540785 -596383 -791382 -639792
7330 -639792 -941304 -622543 -15255 -66469 -268030 -306331 -130085 -10685 -161582 -233408
7320 -233408 -532923 -320130 -290588 -399961 -556845 -583774 -545540 -450211 -491338 -266809 -526099
7309 -526099 -383133 -673682 -599590 -325189 -277326 -478428 -760625 -872933 -895077 -333206
7299 -333206 -229890 -2087 -148481 -124055 -310785 -72328 -251342 -471047 -386158 -199378
$$ packed form
7371f53141k5361l8980K82639J47769K47830k70740j79482R9237l02127r7030
7361g89386j24973K27370M35547K53083k39571K0396O4858O942K2834j11077j30260
7350c64237j8053O2983j95825L04010M4547m4366j98279j64298N26446j78250
7340b25322K68219l67509n2365j3354J00399q0966j69887n5598j94999J51590
7330f39792l01512L18761O07288n1214k01561l8301J76246J19400j50897p1826
7320b33408k99515K12793K9542j09373j56884k6929L8234R5329m1127K24529k59290
7309e26099J42966k90549P4092K74401M7863k01102k82197j12308k2144N61871
7299c33206J03316K27803j46394K4426j86730K38457j79014k19705Q4889J86780
$$ plain form
7289 -199378 -401759 -643662 -207361 53886 -344833 -403018 -399594 -443131 -198809 -32427
7279 -32427 135389 -155653 -130318 -352132 -665734 -675942 -479166 -133901 -142564 -269176 -468570
7268 -468570 -465631 -219552 -390130 -212111 -238376 -440597 -621312 -428252 -326680 -302010
7258 -302010 -156947 -487174 -59505 7108 -247407 38572 134424 -13894 -260336 -486797
7248 -486797 -152540 -90988 -543355 -79087 91100 -56329 237247 432021 262902 -213926
7238 -213926 -192253 -259267 -119178 -224720 -317380 -356348 -631973 -394520 -122863 -646671
7228 -646671 -684481 -324004 145899 119354 -74997 117447 -413444 -589473 -265895 -143182
7218 -143182 -66126 -123216 84142 522413 -87068 -335791 -488105 -489302 -588679 -402412 -281351
$$ packed form
7289a99378k02381k41903M36301K61247l98719n8185L424m3537K44322J66382
7279c2427J67816k91042K5335k21814l13602j0208J96776L45265q663j26612j99394
7268d68570K939K46079j70578J78019k6265k02221j80715J93060J01572K4670
7258c02010J45063l30227M27669O6613k54515K85979R5852j48318k46442k26461
7248d86797L34257O1552m52367M64268J70187j47429K93576J94774j69119m76828
7238b13926K1673o7014J40089j05542r2660l8968k75625K37453K71657n23808
7228f46671l7810L60477M69903k6545j94351J92444n30891j76029L23578J22713
7218a43182P7056n7090K07358M38271o09481k48723j52314j197r9377J86267J21061
$$ plain form
7207 -281351 -225867 -388488 -852120 -1001042 -786712 -265768 -265425 -494567 -534181 -611275 -695568
7196 -695568 -307045 -291306 -254834 -490318 -899158 -491051 144793 -146533 -567045 -333083
7186 -333083 -642936 -486128 -184952 -321662 -77273 183300 -14469 -412195 -625263 -518610
7176 -518610 -432886 -351214 -480650 -636445 -325826 -397522 -314146 -425376 -260109 -322981 -134221
7165 -134221 -133011 -239807 -398172 -682885 -637419 -669004 -423298 -306924 -553831 -420236
7155 -420236 -195596 -269415 -355592 -771475 -556048 -205952 -299681 -43552 -161551 -37681
7145 -37681 65522 72293 26986 -382155 -358636 -92532 105836 -293832 -402518 -527658 -402618
7134 -402618 -23100 -327592 -367229 -281321 -67783 21969 10646 -265644 -355309 92188 -11760
$$ packed form
7207b81351N5484j62621m63632j48922K14330N20944L43k29142l9614p7094q4293
7196f95568L88523J5739L6472k35484m08840M08107O35844k91326m20512K33962
7186c33083l09853J56808L01176j36710K44389K60573j97769l97726k13068J06653
7176e18610Q5724Q1672j29436j55795L10619p1696Q3376j11230J65267o2872J88760
7165a34221J210j06796j58365k84713M5466l1585K45706J16374k46907J33595
7155d20236K24640p3819q6177m15883K15427L50096r3729K56129j17999J23870
7145c7681J03203O771m5307m09141K3519K66104J98368l99668j08686j25140J25040
7134d02618L79518l04492l9637Q5908K13538Q9752j1323k76290q9665M47497j03948
$$ plain form
7123 -11760 82079 236262 160693 97511 -14531 -26630 99776 -247112 -41217 -191919 -200121
7112 -200121 -317221 -273298 -357008 -411485 -304455 -121378 110155 -285348 -224821 -557233
7102 -557233 -404346 -364262 -502736 -538567 -296960 -11683 -119681 -239217 -358498 -445130
7092 -445130 -511619 -202546 -240983 -264036 -477259 -365879 -56262 -111835 -280156 -154962
7082 -154962 -27881 -284957 -466445 -408842 -35108 99863 -97626 -186632 -181999 206943
7072 206943 240306 -53165 -433905 -435448 -344733 -327722 -61982 -366438 -385202 -56161 243499
7061 243499 -61249 27218 5014 -151627 97432 -190076 -258446 151017 78565 319200
7051 319200 56084 266293 527601 91908 312209 412409 364848 -249540 -222721 -9640
$$ packed form
7123a1760R3839J54183p5569o3182j12042j2099J26406l46888K05895j50702q202
7112b00121j17100M3923q3710n4477J07030J83077K31533l95503O0527l32412
7102e57233J52887M0084j38474l5831K41607K85277j07998j19536j19281q6632
7092d45130o6489L09073l8437k3053k13223J11380L09617n5573j68321J25194
7082a54962J27081k57076j81488N7603L73734J34971j97489q9006M633L88942
7072B06943L3363k93471l80740j543R0715J7011K65740l04456j8764L29041K99660
7061B43499l04748Q8467k2204j56641K49059k87508o8370M09463p2452K40635
7051C19200k63116K10209K61308m35693K20301J00200m7561o14388K6819K13081
$$ plain form
7041 -9640 -13219 115182 210209 46573 -49747 -280689 177624 197776 -171542 -186425 -255576
7030 -255576 235294 121233 -148982 -66334 127875 -163741 -233208 -461573 -389434 -276846
7020 -276846 53962 44731 -214821 -449781 -229870 -152873 214191 12915 273481 93698
7010 93698 -92808 -37085 -109022 25412 -245002 -258186 -295924 -423732 43078 -97505 -110273
6999 -110273 -48960 -221774 -55431 -267531 -130268 6805 181255 156318 -15105 -416162
6989 -416162 -85675 -100921 -296093 32147 146037 -457794 137600 135744 -158916 -83756
6979 -83756 625786 485979 -35560 25768 149996 360958 234264 -59116 351580 381291
6969 381291 551847 410179 14160 -119559 483127 525698 284395 -22000 -124964 43744
$$ packed form
7041i640l579J28401R5027j63636r6320k30942M58313K0152l69318j4883o9151
7030b55576M90870j14061k70215Q2648J94209k91616o9467k28365P2139J12588
7020b76846L30808r231k59552k34960K19911P6997L67064k01276K60566j79783
7010I3698j86506N5723p1937J34434k70414j3184l7738j27808M66810j40583j2768
6999a10273O1313j72814J66343k12100J37263J37073J74450k4937j71423m01057
6989d16162L30487j5246j95172L28240J13890o03831N95394j856k94660P5160
6979h3756P09542j39807n21539O1328J24228K10962j26694k93380M10696K9711
6969C81291J70556j41668l96019j33719O02686M2571k41303l06395j02964J68708
$$ plain form
6959 43744 233040 277895 410339 266263 297433 468102 454895 524044 -27049 -41181 5635
6948 5635 121786 167845 247235 182782 13066 128752 793299 222599 567265 490099 403381
6937 403381 298600 555077 520152 560972 867389 880531 767293 655712 698107 1009541
6927 1009541 1235388 1123669 754543 989039 1129903 1174178 1896598 1903972 1823038 1850491
6917 1850491 2292381 2411847 2592087 2580980 2940340 3156872 3953629 4392472 4332818 4282891
6907 4282891 4709220 4759544 4323626 3870227 3139718 2676787 2732052 2496904 2298687 2333874
6897 2333874 2257760 2256082 2084046 1859712 1585141 1927592 1445426 1335999 1697908 1669343
6887 1669343 1575949 1641807 1913504 1807988 1680816 1477953 1061696 1182062 1216968 1117211
$$ packed form
6959D3744J89296M4855J32444j44076L1170J70669j3207O9149n51093j4132M6816
6948E635J16151M6059P9390o4453j69716J15686O64547n70700L44666p7166q6718
6937D03381j04781K56477l4925M0820L06417J3142j13238j11581M2395L11434
6927A009541K25847j11719l69126K34496J40864M4275P22420P374q0934K7453
6917A850491M41890J19466J80240j1107L59360K16532P96757M38843n9654m9927
6907D282891M26329N0324m35918m53399p30509m62931N5265k35148j98217L5187
6897B333874p6114j678j72036k24334k74571L42451m82166j09427L61909k8565
6887A669343r3394O5858K71697j05516j27172k02863m16257J20366L4906r9757
$$ plain form
6877 1117211 935576 478019 382759 702337 668795 735948 724645 568053 982096 628729
6867 628729 450140 831669 1036114 1503126 1131071 1271875 1256028 1215772 1419054 1554944
6857 1554944 1097518 947986 1059881 1229663 1433745 1282486 1486164 1592236 1262706 1049199
6847 1049199 1164689 910175 529360 606677 804410 496175 249191 356020 792578 1023992
6837 1023992 635911 798678 1069379 896604 764465 668413 424983 211405 -33694 106259
6827 106259 159076 -223080 -277921 -89650 -205540 -300792 161250 6035 -375 -187340 142534
6816 142534 285303 53151 -216328 -145020 15768 330121 282415 463428 205321 -215374
6806 -215374 127971 -151484 -426559 -188091 20103 253144 -172251 -213952 161440 190384
$$ packed form
6877A117211j81635m57557r5260L19578l3542O7153j1303j56592M14043l53367
6867F28729j78589L81529K04445M67012l72055J40804j5847m0256K03282J35890
6857A554944m57426j49532J11895J69782K04082j51259K03678J06072l29530k13507
6847A049199J15490k54514l80815P7317J97733l08235k46984J06829M36558K31414
6837A023992l88081J62767K70701j72775j32139r6052k43430k13578k45099J39953
6827A06259N2817l82156n4841J88271j15890r5252M62042j55215o410j86965L29874
6816A42534J42769k32152k69479P1308J60788L14353m7706J81013k58107m20695
6806b15374L43345k79455k75075K38468K08194K33041m25395m1701L75392K8944
$$ plain form
6796 190384 52056 289786 333485 117015 -133753 -2491 215909 414433 527526 39674
6786 39674 163361 -127025 -319391 88613 323994 163940 224488 236017 2035 -102673
6776 -102673 -364142 55000 33835 -79293 149097 312904 500404 45564 -344716 -162411
6766 -162411 119297 -84274 -118528 -202559 -10453 6513 47891 60381 504901 588729 297727
6755 297727 89139 -308845 -307494 149614 300995 -119766 -189741 143641 526831 544306
6745 544306 25343 -205269 -37001 126723 104690 6597 101540 240923 58103 48782 119335
6734 119335 47997 118747 474629 824679 451268 145306 -118488 -170642 39384 44125 63243
6723 63243 52943 117286 185500 116613 20212 -576079 17889 -81451 -538339 -222944 -28928
$$ packed form
6796A90384j38328K37730M3699k16470k50768J31262K18400J98524J13093m87852
6786C9674J23687k90386j92366M08004K35381j60054O0548J1529k33982j04708
6776a02673k61469M19142k1165j13128K28390J63807J87500m54840l90280J82305
6766a62411K81708k03571l4254q4031J92106J6966M1378J2490M44520Q3828k91002
6755B97727k08588l97984J351M57108J51381m20761o9975L33382L83190J7475
6745E44306n18963k30612J68268J63724k2033r8093R4943J39383j82820r321P0553
6734A19335p1338P0750L55882L50050l73411l05962k63794n2154K10026M741J9118
6723F3243j0300O4343O8214o8887r6401n96291N93968r9340m56888L15395J94016
$$ plain form
6712 -28928 -21559 -142755 245611 -121907 -213581 135638 191662 -403199 -315893 -388215 -23834
6701 -23834 207185 228971 110435 -393811 102557 260538 49365 -210392 -132524 258523
6691 258523 138042 -62340 182967 14759 -38110 -231897 -334587 -61607 304205 206805
6681 206805 -21247 237182 442782 345771 174132 225255 216372 696863 913223 399769
6671 399769 363848 500252 133582 28468 -6722 122523 -54942 -237103 309145 681190
6661 681190 232660 134508 273066 415951 310936 12699 -267547 263344 -92018 -377191
6651 -377191 -197138 197850 493181 352982 65678 980 115054 106271 326192 113466
6641 113466 135787 322784 380189 122614 355162 146712 114050 330577 66752 -37519
$$ packed form
6712b8928P369j21196L88366l67518r1674L49219N6024n94861Q7306p2322L64381
6701b3834K31019K1786j18536n04246M96368J57981k11173k59757P7868L91047
6691B58523j20481k00382K45307j68208n2869j93787j02690K72980L65812r7400
6681B06805k28052K58429K05600r7011j71639N1123q883M80491K16360n13454
6671C99769l5921J36404l66670j05114l5190J29245j77465j82161N46248L72045
6661F81190m48530r8152J38558J42885j05015k98237k80246N30891l55362k85173
6651c77191J80053L94988K95331j40199k87304o4698J14074q783K19921k12726
6641A13466K2321J86997N7405k57575K32548k08450l2662K16527k63825j04271
$$ plain form
6631 -37519 67778 113245 70537 -192609 104405 246888 -38783 239687 193106 119650 35649
6620 35649 -54582 119808 35557 294476 -14400 -39835 7714 147049 83326 -40975 -260176
6609 -260176 135302 311504 301313 214008 255677 505798 704839 236970 -141691 212671
6599 212671 382077 504363 558882 158226 261681 147047 -165028 -247571 -423075 -453516
6589 -453516 -623008 -601376 -385188 -41812 -154045 -89721 -106787 74476 289331 99942
6579 99942 -113234 -124612 -259516 -83066 296046 132034 432309 273689 -297672 -90239
6569 -90239 96474 162354 -12676 -444605 28943 9734 -405418 -340989 36754 184716
6559 184716 311438 18716 -278372 -33928 55631 338324 533538 401769 427083 422383
$$ packed form
6631c7519J05297M5467m2708k63146K97014J42483k85671K78470m6581p3456q4001
6620C5649r0231J74390q4251K58919l08876k5435M7549J39335o3723j24301k19201
6609b60176L95478J76202j0191q7305M1669K50121J99041m67869l78661L54362
6599B12671J69406J22286N4519m00656J03455j14634l12075q2543j75504l0441
6589d53516j69492K1632K16188L43376j12233O4324j7066J81263K14855j89389
6579I9942k13176j1378j34904J76450L79112j64012L00275j58620n71361K07433
6569i0239J86713O5880j75030m31929M73548j9209m15152O4429L77743J47962
6559A84716J26722k92722k97088K44444Q9559K82693J95214j31769K5314m700
$$ plain form
6549 422383 340675 660330 189355 482254 -105079 21609 280767 368029 203342 -217200
6539 -217200 130755 311933 352437 363721 251897 586840 865243 488033 99047 -336189
6529 -336189 -579518 -267963 -23236 -156245 -315845 -113600 77189 111263 -35537 170120
6519 170120 -113032 200369 312310 113306 -345741 -423140 -139296 195627 -189521 169232
6509 169232 218007 -196838 31465 221672 430294 28478 -39375 -66902 578283 317410
6499 317410 564444 404598 700855 534469 546739 373803 159498 226642 513 -114729
6489 -114729 -237565 300834 240819 -162587 -71007 -111379 -36851 -40235 -341652 181684 481497
6478 481497 287085 466647 35864 -24212 73316 -347284 -538465 -210841 -73503 80856
$$ packed form
6549D22383q1708L19655m70975K92899n87333J26688K59158Q7262j64687m20542
6539b17200L47955J81178M0504J1284j11824L34943K78403l77210l88986m35236
6529c36189k43329L11555K44727j33009j59600K02245J90789L4074j46800K05657
6519A70120k83152L13401J11941j99004m59047p7399K83844L34923l85148L58753
6509A69232M8775m14845K28303J90207K08622m01816o7853k7527O45185k60873
6499C17410K47034j59846K96257j66386J2270j72936k14305O7144k26129j15242
6489a14729j22836N38399o0015m03406R1580m0372P4528l384l01417N23336K99813
6478D81497j94412J79562m30783o0076R7528m20600j91181L27624J37338J54359
$$ plain form
6468 80856 -120433 -52335 -83246 35768 308080 453750 473026 509944 233811 -32069 524262
6457 524262 -4814 300456 501780 74318 231507 75523 -335781 -139730 -379832 -530511
6447 -530511 -373959 63587 362967 541066 105595 -24687 374670 614721 589967 350143
6437 350143 180120 -189222 170427 -18684 304208 688897 287869 260377 504175 425554
6427 425554 429624 414439 90010 71640 148509 241443 22257 180499 246964 432478 366723
6416 366723 394819 360873 -65555 102147 95981 448850 507135 499207 263682 17954 233802
6405 233802 739409 660738 580453 487977 423560 102960 420206 272354 10601 46982 229382
6394 229382 840193 826623 732814 827658 508131 275429 507741 649988 316922 -225148
$$ packed form
6468H0856k01289O8098l0911J19014K72312J45670J9276L6918k76133k65880N56331
6457E24262n29076L05270K01324m27462J57189j55984m11304J96051k40102j50679
6447e30511J56552M37546K99380J78099m35471j30282L99357K40051k4754k39824
6437C50143j70023l69342L59649j89111L22892L84689m01028k7492K43798p8621
6427D25554M070j5185l24429j8370P6869R2934k19186J58242O6465J85514o5755
6416C66723K8096l3946m26428J67702o166L52869N8285p928k35525k45728K15848
6405B33802N05607p8671q0285r2476o4417l20600L17246j47852k61753L6381J82400
6394B29382O10811j3570r3809R4844l19527k32702K32312J42247l33066n42070
$$ plain form
6384 -225148 350376 268055 247638 184305 368404 410618 749140 649786 112149 271622 -110095
6373 -110095 -189184 313743 334529 233911 77359 236588 481099 669665 802787 752115
6363 752115 856579 665590 878364 908263 633238 879239 675665 485839 750541 771541
6353 771541 578523 979146 769152 303205 576560 760140 602317 525365 760641 411871
6343 411871 748511 718995 599328 482240 179469 581106 548310 586250 683290 532937
6333 532937 243951 325508 589777 665903 561727 322365 365135 415796 447852 224743 277426
6322 277426 480277 484379 909422 1175103 926110 741253 1055706 1112939 1031341 1180235
6312 1180235 936640 505390 1076857 918293 913826 806894 855455 1074950 971840 1443927
$$ packed form
6384b25148N75524q2321k0417o3333J84099M2214L38522r9354n37637J59473l81717
6373a10095p9089N02927K0786j00618j56552J59229K44511J88566J33122n0672
6363G52115J04464j90989K12774K9899k75025K46001k03574j89826K64702K1000
6353G71541j93018M00623k09994m65947K73355J83580j57823p6952K35276l48770
6343D11871L36640k9516j19667j17088l02771M01637l2796L7940R7040j50353
6333E32937k88986Q1557K64269P6126j04176k39362M2770N0661L2056k23109N2683
6322B77426K02851M102M25043K65681k48993j84857L14453N7233q1598J48894
6312A180235k43595m31250N71467j58564m467j06932M8561K19495j03110M72087
$$ plain form
6302 1443927 1406313 1274375 1196096 1226009 1411211 1573513 1418652 1911498 2047821 2287164
6292 2287164 1999040 1616365 1447714 1542624 2015029 1537049 1106601 1310711 1624488 1588136
6282 1588136 1639015 1632598 1536101 1445108 1470485 2223030 2177166 2068017 2089723 1990265 1872450
6271 1872450 1709366 1719534 1627670 1640683 1455297 1196947 1275453 1303734 1409199 1602496
6261 1602496 1111566 1025371 1158506 1117227 882687 940900 1053213 1190423 1035018 404163
6251 404163 955412 1505017 1202848 1117350 921461 918180 1117970 1237909 671640 448935
6241 448935 947800 1208475 797162 714481 841477 536100 388116 961295 948165 527874
6231 527874 503107 752195 770630 1052060 1235396 968767 684660 699405 1126949 1203683
$$ packed form
6302A443927l7614j31938p8279K9913J85202J62302j54861M92846J36323K39343
6292B287164k88124l82675j68651R4910M72405m77980m30448K04110L13777l6352
6282A588136N0879o417r6497r0993K5377P52545m5864j09149K1706r9458j17815
6271A872450j63084J0168r1864J3013j85386k58350P8506K8281J05465J93297
6261A602496m90930q6195J33135m1279k34540N8213J12313J37210j55405o30855
6251D04163N51249N49605l02169q5498j95889l281J99790J19939n66269k22705
6241D48935M98865K60675m11313q2681J26996l05377j47984N73179j3130m20291
6231E27874k4767K49088J8435K81430J83336k66629k84107J4745M27544P6734
$$ plain form
6221 1203683 969041 1163656 1193323 978447 604454 729266 799378 1077185 1062358 844918
6211 844918 1113701 1111524 1065785 938937 652246 265666 1049062 1516310 1724798 931256
6201 931256 744662 1158824 1920109 1641531 1205137 1135332 1225327 1548412 1629532 1371436
6191 1371436 1157484 1045486 1032091 1397396 1363383 1472975 1383092 939842 794693 728881
6181 728881 1127713 1343394 1433393 1876282 1710743 1713781 1808219 1841628 2094267 2162855 2068345
6170 2068345 1831448 2372418 2406951 2566406 2775488 3055274 3300565 3152282 2877615 2683923
6160 2683923 2770765 3010757 3014244 2652769 2161596 2319004 2787720 3137113 3017119 2702611
6150 2702611 2848632 2715972 3204341 3163978 3104787 2887688 2808585 3225856 3410926 3146744
$$ packed form
6221A203683k34642J94615K9667k14876l73993J24812P0112K77807j4827k17440
6211H44918K68783k177m5739j26848k86691l86580P83396M67248K08488p93542
6201I31256j86594M14162P61285k78578m36394o9805Q9995L23085Q1120k58096
6191A371436k13952j11998j3395L65305l4013J09592q9883m43250j45149o5812
6181G28881L98832K15681Q9999M42889j65539L038R4438L3409K52639O8588r4510
6170B068345k36897N40970L4533J59455K09082K79786K45291j48283k74667j93692
6160B683923Q6842K39992L487l61475m91173J57408M68716L49393j19994l14508
6150B702611J46021j32660M88369m0363n9191k17099p9103M17271J85070k64182
$$ plain form
6140 3146744 2991951 2751086 3010543 2847201 2532385 2812872 3032415 2675737 2543589 2662778
6130 2662778 2748252 3034931 3538189 3179387 3258516 3454219 3426611 3485518 3897998 3723151
6120 3723151 3687804 3644964 3690886 4044462 4365024 4815926 5421777 5362733 5418102 5624819
6110 5624819 6124924 6678823 6424245 6668918 6826488 7178200 7326908 7368224 7643949 7820122
6100 7820122 8112704 8476469 7963754 7923790 8172416 8270234 8423158 8745620 9162266 9652936
6090 9652936 10168478 10715350 10849367 11539555 12179656 12963066 13853081 14466837 15651937
6081 15651937 16262306 16585972 17487950 18126061 18094035 18029445 17891203 17246948 16922764 16656098
6071 16656098 16099159 15874256 15922283 15599352 15630416 15854292 15717148 16160478 16550319 16701975
$$ packed form
6140C146744j54793k40865K59457j63342l14816K80487K19543l56678j32148J19189
6130B662778Q5474K86679N03258l58802P9129J95703k7608N8907M12480j74847
6120C723151l5347m2840M5922L53576L20562M50902O05851n9044N5369K06717
6110E624819N00105N53899k54578K44673J57570L51712J48708M1316K75725J76173
6100G820122K92582L63765n12715l9964K48626R7818J52924L22462M16646M90670
6090I652936N15542N46872J34017O90188O40101P83410Q90015O13756J185100
6081A5651937O10369L23666R01978O38111l2026o4590j38242o44255l24184k66666
6071A6656098n56939k24903M8027l22931L1064K23876j37144M43330L89841J51656
$$ plain form
6061 16701975 17093749 17746302 18791470 19761884 20343800 20897820 21583586 22804526 23944357
6052 23944357 24366420 24637960 24823196 24580358 24146792 23486939 22318201 21352399 20868498
6043 20868498 19911476 18852774 18423053 17689815 17192716 16793142 16474267 16320924 16130884
6034 16130884 16388575 16842930 16999058 17369736 17733581 17928500 18284798 18675781 19079725
6025 19079725 19026543 19142582 19019472 18552787 17854067 17489579 16626275 15551053 15017082
6016 15017082 14048245 13093678 12330302 11678460 11202036 11163007 10524377 10055706 9954395 9658198
6006 9658198 9602182 9038046 9143918 9785536 9413077 9383725 9362202 9214429 9089785 9069671
5996 9069671 9086002 9039485 8794631 8666057 8466162 8096556 7894107 7626904 7044559 6900362
$$ packed form
6061A6701975L91774O52553J045168R70414N81916N54020O85766J220940J139831
6052B3944357M22063K71540J85236k42838m33566o59853j168738r65802m83901
6043B0868498r57022j058702m29721p33238m97099l99574l18875j53343j90040
6034A6130884K57691M54355J56128L70678L63845J94919L56298L90983M03944
6025A9079725n3182J16039j23110m66685o98720l64488q63304j075222n33971
6016A5017082r68837r54567p63376o51842m76424l9029o38630m68671j01311k96197
6006I658198n6016n64136J05872O41618l72459k9352k1523j47773j24644k0114
5996I069671J6331m6517k44854j28574j99895l69606k02449k67203n82345j44197
$$ plain form
5986 6900362 6830337 7018688 6954967 6579070 6585912 6723221 6255840 6335959 6491156 6671791
5976 6671791 6549220 6192309 6477101 6659418 6186696 5584644 5446205 5315096 5295756 5169547
5966 5169547 5384901 4786837 4562346 4722391 4719210 4745949 4795977 4307064 4218680 4458554
5956 4458554 4102676 3865175 3891240 4132949 4293032 4097589 4068324 3658048 4138670 4137174
5946 4137174 3930023 4131604 4064332 3781701 3523697 3311335 3368073 3500178 3541972 3627212
5936 3627212 3363002 3186929 3013487 3532610 3605043 3308566 3691416 3451159 3521756 3464695
5926 3464695 3491528 3722459 3694083 3494229 3593102 3797297 4100934 3833315 3728834 3434683
5916 3434683 3397102 3947521 3859840 3561618 3717661 3969950 3491692 3686667 3817787 3851798
$$ packed form
5986F900362p0025J88351o3721l75897O842J37309m67381Q0119J55197J80635
5976F671791j22571l56911K84792J82317m72722o02052j38439j31109j9340j26209
5966E169547K15354n98064k24491J60045l181K6739N0028m88913q8384K39874
5956D458554l55878k37501K6065K41709J60083j95443k9265m10276M80622j496
5946D137174k07151K01581o7272k82631k58004k12362N6738J32105M1794Q5240
5936C627212k64210j76073j73442N19123P2433k96477L82850k40257P0597n7061
5926C464695K6833K30931k8376j99854R8873K04195L03637k67619j04481k94151
5916C434683l7581N50419q7681k98222J56043K52289m78258J94975J31120L4011
$$ plain form
5906 3851798 3629588 3912362 3371609 3252161 3646303 3172424 3046261 3226787 3603597 3823194
5896 3823194 3947565 3787124 3912853 3882182 3667088 3936465 3687752 3431087 3427897 3565024
5886 3565024 3562646 3406920 3527429 3558756 3465166 3625839 3514733 3233290 3639887 4053340
5876 4053340 3644877 3642751 3459272 3333529 3132002 3256728 3226514 3490168 3157976 3316083
5866 3316083 3533907 3469559 3446565 3471495 4002595 3689502 3766527 3555788 3631429 4026391
5856 4026391 4094793 3916810 3924795 3751750 3856330 4121791 4124360 4024116 3920115 3882003 3968770
5845 3968770 3921188 4165196 4423547 4694529 4471847 4381742 4183995 4146569 4449714 4273455
5835 4273455 4263838 4863834 4957168 4697076 4583944 4762108 5187487 5094077 5264484 5058084
$$ packed form
5906C851798k22210K82774n40753j19448L94142m73879j26163J80526L76810K19597
5896C823194J24371j60441J25729l0671k15094K69377k48713k56665l190J37127
5886C565024k378j55726J20509L1327r3590J60673j11106k81443M06597M13453
5876D053340m08463k126j83479j25743k01527J24726l0214K63654l32192J58107
5866C316083K17824o4348k2994K4930N31100l13093P7025k10739P5641L94962
5856D026391O8402j77983P985j73045J04580K65461K569j00244j04001l8112Q6767
5845C968770m7582K44008K58351K70982k22682r0105j97747l7426L03145j76259
5835D273455r617N99996R3334k60092j13132J78164M25379r3410J70407k06400
$$ plain form
5825 5058084 5199841 5821889 5900112 5833635 5966298 5934157 6105532 6360145 6703763 7266911
5815 7266911 7411515 7640136 8036707 8700398 9294595 10296721 11668878 12509438 12555940
5806 12555940 12114460 11197964 10507708 9577413 9453889 9222018 8964523 9063726 9089964 9307447
5796 9307447 9536191 10134198 10382799 10739314 10681343 10951560 11057537 11254328 11825356 12295604
5786 12295604 12347806 12551879 12779725 13279613 13603491 13740826 13489555 13477012 13981106 13798071
5776 13798071 13868720 14508442 14664789 14859212 15365231 15490112 16117553 16643360 16920596 17740527
5766 17740527 18226379 18962752 19633014 20451889 20794739 21461984 21464842 21158600 20854551 20447493
5756 20447493 19749606 19034808 18704464 17905295 16875089 16529271 16400077 16133473 15420120
$$ packed form
5825E058084J41757O22048P8223o6477J32663l2141J71375K54613L43618N63148
5815G266911J44604K28621L96571O63691N94197J002126J372157Q40560M6502
5806A2555940m41480r16496o90256r30295j23524k31871k57495R9203K6238K17483
5796I307447K28744N98007K48601L56515n7971K70217J05977J96791N71028M70248
5786A2295604N2202K04073K27846M99888L23878J37335k51271j2543N04094j83035
5776A3798071P0649O39722J56347J94423N06019J24881O27441N25807K77236Q19931
5766A7740527M85852P36373O70262Q18875L42850O67245K858l06242l04049m07058
5756B0447493o97887p14798l30344p99169j030206l45818j29194k66604p13353
$$ plain form
5747 15420120 15079334 14741208 14790629 14711769 14208414 14050649 13789710 13959549 13488794 13178783
5737 13178783 13084589 13148044 13108471 12674564 12180851 11786278 11406116 11099530 11014950 11100424
5727 11100424 10516492 10110076 10152198 10301834 9734693 9870286 9574620 8947721 8957586 9029012
5717 9029012 8696226 8777316 8195447 8186270 7714235 7543537 7579794 7081403 6884758 6923254
5707 6923254 6968347 6940956 6975061 6619391 6209649 6757172 6726668 6622024 6676501 6478660
5697 6478660 6244812 6256014 6103796 5581446 5660538 5651663 5434056 5530402 5618273 5974529 6084262
5686 6084262 6234689 6010088 5355666 5468517 5431454 5795228 5800169 5729478 5586809 5769086
5676 5769086 6203167 5872791 5539838 5500218 5453062 5379136 5364722 5501513 5364392 5626504
$$ packed form
5747A5420120l40786l38126M9421p8860n03355j57765k60939J69839m70755l10011
5737A3178783r4194O3455l9573m33907m93713l94573l80162l06586q4580Q5474
5727A1100424n83932m06416M2122J49636n67141J35593k95666o26899R865P1426
5717I029012l32786Q1090n81869r177m72035j70698L6257m98391j96645L8496
5707F923254M5093k7391L4105l55670m09742N47523l0504j04644N4477j97841
5697F478660k33848J1202j52218n22350P9092q875k17607R6346Q7871L56256J09733
5686F084262J50427k24601o54422J12851l7063L63774M941p0691j42669J82277
5676E769086M34081l30376l32953l9620m7156p3926j4414J36791j37121K62112
$$ plain form
5666 5626504 5743850 5993991 6342067 6330994 5952091 5814707 5959320 6031135 5519648 5267862
5656 5267862 5382280 5549377 5775867 5905147 5536635 5924212 5799958 6098139 6225921 5745861
5646 5745861 5881007 6161479 6055036 6626766 6909340 6929729 6675459 7084954 7276655 6672497
5636 6672497 6259529 6298839 6431190 6609248 6565683 6210423 6205522 6011696 6043602 5976055 6366458
5625 6366458 6187047 6489783 6559814 6276069 6557360 6478660 6484326 6753658 6826921 6896644 6687149
5614 6687149 6657164 6843675 6860185 7000765 7023324 7057053 7192856 7405961 7656928 7480175
5604 7480175 7753004 7821081 7764122 7771864 7814308 7891957 7963652 8094035 8630173 8746091 8726074
5593 8726074 8914270 8801072 8501274 8830743 8830871 8786631 9184582 9206914 8868984 8966086 9369903
$$ packed form
5666E626504J17346K50141L48076j1073l78903j37384J44613P1815n11487k51786
5656E267862J14418J67097K26490J29280l68512L87577j24254K98181J27782m80060
5646E745861J35146K80472j06443N71730K82574K0389k54270M09495J91701o04158
5636F672497m12968L9310J32351J78058m3565l55260m901j93826L1906o7547L90403
5625F366458j79411L02736P0031k83745K81291p8700N666K69332P3263O9723k09495
5614F687149k9985J86511J6510J40580K2559L3729J35803K13105K50967j76753
5604G480175K72829O8077n6959P742M2444P7649P1695J30383N36138J15918k0017
5593H726074J88196j13198k99798L29469J28m4240L97951K2332l37930R7102M03817
$$ plain form
5582 9369903 9521240 9735354 9917783 10177605 10671490 10468017 10996990 11275728 11511661 11837244
5572 11837244 11840795 12694136 13110392 13560527 13885386 14429002 14749244 15853367 16655709 17971571
5562 17971571 19398393 20134808 19928503 19399626 18271197 17718147 17619144 17512206 17663799
5553 17663799 17804404 18257457 18884978 19264493 19318688 19953822 20356973 21442058 22471119
5544 22471119 23331493 24272298 25555190 26439376 27274736 27993218 28186500 28828239 29833780
5535 29833780 30743534 31710498 32989312 34464663 35866312 37274689 39238557 41101195
5527 41101195 43125153 45329606 48184841 51271009 54151145 57295640 60826280 64859348
5519 64859348 68565777 72918275 76907930 80202774 80706582 77894737 72748914 67493755
$$ packed form
5582I369903J51337K14114J82429K59822M93885k03473N28973K78738K35933L25583
5572A1837244L551Q53341M16256M50135L24859N43616L20242J104123Q02342J315862
5562A7971571J426822P36415k06305n28877j128429n53050r9003j06938J51593
5553A7663799J40605M53053O27521L79515N4195O35134M03151J085085J029061
5544B2471119Q60374R40805J282892Q84186Q35360P18482J93282O41739J005541
5535B9833780R09754R66964J278814J475351J401649J408377J963868J862638
5527D1101195K023958K204453K855235L086168K880136L144495L530640M033068
5519F4859348L706429M352498L989655L294844N03808k811845n145823n255159
$$ plain form
5511 67493755 63141223 59621961 57452144 56042776 55480859 55614023 56156559 57126161 58496299
5502 58496299 59993602 61791196 62999642 63489960 63079013 62918414 61998830 60315377 59619371
5493 59619371 58314168 57025356 56281046 55555567 54809418 54238829 53815508 53599261 53629119
5484 53629119 53742568 54121730 54510357 55069830 55222836 54696414 52659584 51284703 50330960
5475 50330960 50117020 50372272 50317668 50024085 50044853 50213473 49858918 49757574 50353265 50580842
5465 50580842 50558956 50806429 51323565 52095268 52210817 52070256 52221677 52180120 52071738 51697054
5455 51697054 50740542 50518690 50042687 49875752 49613124 49575290 49960059 51012796 51914120
5446 51914120 53501796 55144095 56823558 59292431 61586366 64117041 66679761 69336731
$$ packed form
5511F7493755m352532l519262k169817j409368n61917J33164N42536R69602J370138
5502E8496299J497303J797594J208446M90318m10947j60599r19584j683453o96006
5493E9619371j305203j288812p44310p25479p46149n70589m23321k16247K9858
5484E3629119J13449L79162L88627N59473J53006n26422k036830j374881r53743
5475E0330960k13940K55252n4604k93583K0768J68620l54555j01344N95691K27577
5465E0580842k1886K47473N17136P71703J15549j40561J51421m1557j08382l74684
5455E1697054r56512k21852m76003j66935k62628l7834L84769J052737R01324
5446E1914120J587676J642299J679463K468873K293935K530675K562720K656970
$$ plain form
5438 69336731 72462117 75042608 77049853 78575864 80653486 82987559 86210844 90044502
5430 90044502 94303398 100822986 108156464 115946622 125323205 136242584 148140772 160853157
5422 160853157 174268166 187775853 201493823 215012461 228647510 241614401 251629196
5415 251629196 256345983 253447166 243587013 229488523 214281558 198947588 184391434
5408 184391434 170715076 157246435 144574094 132919514 122875093 113499400 105802330
5401 105802330 99182303 92862437 87534809 82785619 78621916 74979575 71291573 67848376
5393 67848376 65025794 61790380 59188961 56893791 55186374 53109822 51297900 49467331
5385 49467331 48296019 46861951 45416824 43997464 43162947 42195996 41092384 40607169 40165013
$$ packed form
5438F9336731L125386K580491K007245J526011K077622K334073L223285L833658
5430I0044502M258896O519588P333478P790158R376583J0919379J1898188J2712385
5422A60853157J3415009J3507687J3717970J3518638J3635049J2966891J0014795
5415B51629196M716787k898817r860153j4098490j5206965j5333970j4556154
5408A84391434j3676358j3468641j2672341j1654580j0044421r375693p697070
5401A05802330o620027o319866n327628m749190m163703l642341l688002l443197
5393F7848376k822582l235414k601419k295170j707417k076552j811922j830569
5385D9467331j171312j434068j445127j419360q34517r66951j103612m85215m42156
$$ plain form
5376 40165013 39677897 39679221 38928129 37987796 37689213 36812528 36553175 35923871 35580275 35328758
5366 35328758 35265988 35216419 35276207 34915617 34391965 34506101 34134528 33825802 33290819 33525641
5356 33525641 33848092 34300687 34538924 35013555 35189652 35563464 35785982 35981540 36258896
5347 36258896 36924949 37714825 38318630 38820556 39787367 41421660 42813673 43940647 45607070
5338 45607070 47879404 50094459 52602852 55238040 58500653 62509238 67586777 73319183
5330 73319183 80573852 89030465 98825939 110828660 124422597 136275893 143588914 142494046
5322 142494046 133117360 119717426 105932814 94580126 85746343 78996442 74111522 70377241
5314 70377241 67710332 65850681 65425141 65393097 66128096 67123648 69167945 71935110 75750416
$$ packed form
5376D0165013m87116J324p51092r40333k98583q76685k59353o29304l43596k51517
5366C5328758o2770m9569N9788l60590n23652J14136l71573l08726n34983K34822
5356C3525641L22451M52595K38237M74631J76097L73812K22518J95558K77356
5347C6258896O66053P89876O03805N01926R66811J634293J392013J126974J666423
5338D5607070K272334K215055K508393K635188L262613M008585N077539N732406
5330G3319183P254669Q456613R795474J2002721J3593937J1853296P313021j094868
5322A42494046r376686j3399934j3784612j1352688q833783o749901m884920l734281
5314G0377241k666909j859651m25540l2044P34999R95552K044297K767165L815306
$$ plain form
5305 75750416 80326097 86174050 92749969 98486557 102179407 103004829 102722550 100929951
5297 100929951 97455967 92493179 85419188 77249435 69443620 63300942 58277187 54576798
5289 54576798 51345746 48264958 45936043 44045488 42328755 40838899 39973506 39530481
5281 39530481 38609293 37983055 37504843 37282886 37311594 37447249 37367664 37661486 37480606 37583549
5271 37583549 37706066 37626026 38360379 38349745 38562215 38369072 37879828 36488893 35297465
5262 35297465 34492496 34050440 33212932 32964465 32390392 32394787 32595545 32814413 32821636 32621699
5252 32621699 32885579 32406991 32554049 33110179 33652016 33918030 33871669 33922216 34427055 34573297
5242 34573297 34848170 34247821 34435060 35044015 35761454 36411513 36868444 37967618 39768504
$$ packed form
5305G5750416M575681N847953O575919N736588L692850Q25422k82279j792599
5297A00929951l473984m962788p073991q169753p805815o142678n023755l700389
5289E4576798l231052l080788k328915j890555j716733j489856q65393m43025
5281C9530481r21188o26238m78212k21957K8708J35655p9585K93822j80880J02943
5271C7583549J22517q0040P34353j0634K12470j93143m89244j390935j191428
5262C5297465q04969m42056q37508k48467n74073M395K00758K18868P223j99937
5252C2621699K63880m78588J47058N56130N41837K66014m6361N0547N04839J46242
5242C4573297K74873o00349J87239O08955P17439O50059M56931J099174J800886
$$ plain form
5233 39768504 41537390 43049025 44444809 45866990 47680106 49041293 50273524 51418143
5225 51418143 52242192 52231759 53266006 53993382 54291379 53946985 53063728 51742697 50338173
5216 50338173 48864139 47496885 46622396 46211085 46004003 46403085 46638217 46799135 47266195
5207 47266195 48068165 49320517 51337695 53481150 55373083 57135218 58881930 60948788
5199 60948788 63357013 64905697 65923946 66442308 66661168 66607661 66501694 66764027 66396641
5190 66396641 65586933 64695159 63317499 61568241 59529934 56975468 54755298 52767650
5182 52767650 50826175 49248658 47907319 46563540 45865524 44831507 44500980 45122739 45234066
5173 45234066 45241380 45924791 46460249 46748320 47215393 47816100 47849849 47478767 47669568 48125526
$$ packed form
5233C9768504J768886J511635J395784J422181J813116J361187J232231J144619
5225E1418143Q24049j0433J034247P27376K97997l44394q83257j321031j404524
5216E0338173j474034j367254q74489m11311k07082L99082K35132J60918M67060
5207D7266195Q01970J252352K017178K143455J891933J762135J746712K066858
5199F0948788K408225J548684J018249N18362K18860n3507j05967K62333l67386
5190F6396641q09708q91774j377660j749258k038307k554466k220170j987648
5182E2767650j941475j577517j341339j343779o98016j034017l30527O21759J11327
5173D5234066P314O83411N35458K88071M67073O00707L3749l71082J90801M55958
$$ plain form
5163 48125526 48314065 48169865 47435589 46238105 44663159 43107862 41312515 39488683 37777105
5154 37777105 36332763 34833951 33100794 31933977 30825262 29784303 28925906 28044521
5146 28044521 27910177 27553153 27274764 26670442 26630339 26393805 26436534 26500451 26036097 25832473
5136 25832473 25474132 24689747 24645524 24593238 24698144 24785762 24351304 24409764 24557901 25061258
5126 25061258 25502881 25874400 25915247 26146447 26145281 26376697 26504099 26724804 27031184 27458459
5116 27458459 28181993 28951491 29760706 30862028 31763819 32982251 34332462 35956014 36844184
5107 36844184 37115963 36514023 34662801 33382306 32298490 31139840 30295963 29440904 28656437
5098 28656437 27571146 26711902 25631081 24710041 24309622 23621980 22864879 22097604 21720242
$$ packed form
5163D8125526J88539j44200p34276j197484j574946j555297j795347j823832j711578
5154C7777105j444342j498812j733157j166817j108715j040959q58397q81385
5146B8044521j34344l57024k78389o04322m0103k36534M2729O3917m64354k03624
5136B5832473l58341p84385m4223n2286J04906Q7618m34458N8460J48137N03357
5126B5061258M41623L71519M0847K31200j166K31416J27402K20705L06380M27275
5116B7458459P23534P69498Q09215J101322R01791J218432J350211J623552Q88170
5107C6844184K71779o01940j851222j280495j083816j158650q43877q55059p84467
5098B8656437j085291q59244j080821r21040m00419o87642p57101p67275l77362
$$ plain form
5089 21720242 20926503 20479778 20428990 20288340 20163053 19942383 20015089 19725092 19896260 19627687
5079 19627687 19470182 19639423 19300988 19165874 19272138 19481346 19470361 19802073 19536920 19536140
5069 19536140 19714293 19965182 19937345 19578097 19596552 19351952 19475873 19365630 19138139 19451163
5059 19451163 19610106 19495050 19702365 20131503 20331144 20634625 20892652 21216009 21312789 21198483
5049 21198483 21191478 21201064 21363405 21775735 21917677 22459603 22736556 22436874 22491932 22435458
5039 22435458 22740782 23583314 23762959 23580007 23647206 23627143 22889753 22873821 22547447 22512013
5029 22512013 22188339 21825723 21417087 20938240 20641177 20572972 20419267 19931429 19738944 19310488
5019 19310488 18785767 18559521 18588430 18362581 18463211 18067703 18130482 18208509 18134623 17995393
$$ packed form
5089B1720242p93739m46725n0788j40650j25287k20670P2706k89997J71168k68573
5079A9627687j57505J69241l38435j35114J06264K09208j0985L31712k65153p80
5069A9536140J78153K50889k7837l59248J8455k44600J23921j10243k27491L13024
5059A9451163J58943j15056K07315M29138J99641L03481K58027L23357R6780j14306
5049B1198483p005R586J62341M12330J41942N41926K76953k99682N5058n6474
5039B2435458L05324Q42532J79645j82952O7199k0063p37390j5932l26374l5434
5029B2512013l23674l62616m08636m78847k97063o8205j53705m87838j92485m28456
5019A9310488n24721k26246K8909k25849J00630l95508O2779P8027p3886j39230
$$ plain form
5009 17995393 18193405 18429831 18401425 18212689 18241140 18325926 18772598 19081055 19688564 20489308
4999 20489308 21177068 21430919 21458507 21684825 22341717 22024436 21898789 21865352 21708430 21316355
4989 21316355 21212174 21403189 21245307 21420170 21221238 21528234 21315028 21976417 22081709
4980 22081709 22227254 22313824 22559548 22473475 22719199 24020752 24210536 24759146 25214906 26067048
4970 26067048 26959105 27498044 28146545 29235527 31075105 32515220 33985143 35861941 37320924
4961 37320924 39397235 41472237 43450467 45757497 47367749 48350695 48889944 49599404 49015846
4952 49015846 48487251 48237991 48251045 47994887 47415030 46670809 46336780 46308991 45768898 45465693
4942 45465693 45490243 45523014 45570106 46573912 47446198 48742243 50369374 51825053 53578791
$$ packed form
5009A7995393J98012K36426k8406j88736K8451Q4786M46672L08457O07509Q00744
4999B0489308O87760K53851K7588K26318O56892l17281j25647l3437j56922l92075
4989B1316355j04181J91015j57882J74863j98932L06996k13206O61389J05292
4980B2081709J45545Q6570K45724q6073K45724J301553J89784N48610M55760Q52142
4970B6067048Q92057N38939O48501J088982J839578J440115J469923J876798J458983
4961C7320924K076311K075002J978230K307030J610252R82946N39249P09460n83558
4952D9015846n28595k49260J3054k56158n79857p44221l34029k7789n40093l03205
4942D5465693K4550L2771M7092J003806Q72286J296045J627131J455679J753738
$$ plain form
4933 53578791 55426545 57324027 59310784 60409950 61849141 62569297 62512150 62700858 62630474
4924 62630474 62505888 61902656 61020968 59745884 58807459 58034290 56430616 54978304 53279761
4915 53279761 51444155 49187551 47036409 45196754 43444320 41968000 41119696 40243052
4907 40243052 38937006 38493490 38671882 38443806 38019268 38748589 39038915 39066746 38954850
4898 38954850 38875827 39236624 39428527 39437921 39294153 39202537 38846555 38088745 36591162 34843827
4888 34843827 33096424 31299813 29326001 27828235 26436030 25577426 24285167 23057157
4880 23057157 22239801 22111929 21592118 21065366 20493442 19717292 19439441 19278730 18781703
4871 18781703 18533087 18093686 17929473 18145744 18135980 18017312 17713255 18194201 17746135 17297975
$$ packed form
4933E3578791J847754J897482J986757J099166J439191P20156n7147J88708p0384
4924F2630474j24586o03232q81688j275084r38425p73169j603674j452312j698543
4915E3279761j835606k256604k151142j839655j752434j476320q48304q76644
4907D0243052j306046m43516J78392k28076m24538P29321K90326K7831j11896
4898C8954850p9023L60797J91903R394j43768r1616l55982p57810j497583j747335
4888C4843827j747403j796611j973812j497766j392205q58604j292259j228010
4880B3057157q17356j27872n19811n26752n71924p76150k77851j60711m97027
4871A8781703k48616m39401j64213K16271r764j18668l04057M80946m48066m48160
$$ plain form
4861 17297975 17121502 16803406 15945032 15573073 15268246 14979297 14821798 14714678 14306840
4852 14306840 14231393 14297443 13696385 12931142 12927909 12982327 13396470 12858655 12644107 12410982
4842 12410982 12373499 12314539 12279426 12255221 12231034 12015922 12036546 12339839 12143062 12036772
4832 12036772 11994560 11960789 11824874 11789791 11522844 11471011 11784514 11669503 11385936 11637954
4822 11637954 11197236 11555114 11600893 11630508 11866296 12007665 11966766 11783672 11533557 11611874
4812 11611874 11346469 10860028 11253739 11310234 11205263 11611217 11676966 11384516 11242302 11014381
4802 11014381 11540306 11901342 11742064 11801084 11714665 11965237 12180432 11816056 11840868 11730252
4792 11730252 11801209 11799969 12119308 12653133 12872344 12752977 12484013 12762501 12991371 13520642
$$ packed form
4861A7297975j76473l18096q58374l71959l04827k88949j57499j07120m07838
4852A4306840p5447O6050o01058p65243l233N4418M14143n37815k14548k33125
4842A2410982l7483n8960l5113k4205k4187k15112K0624L03293j96777j06290
4832A2036772m2212l3771j35915l5083k66947n1833L13503j15011k83567K52018
4822A1637954m40718L57878M5779K9615K35788J41369m0899j83094k50115P8317
4812A1611874k65405m86441L93711N6495j04971M05954O5749k92450j42214k27921
4802A1014381N25925L61036j59278N9020q6419K50572K15195l64376K4812j10616
4792A1730252P0957j240L19339N33825K19211j19367k68964K78488K28870N29271
$$ plain form
4782 13520642 13800201 13877506 13986928 14536674 14767936 15149061 15204205 15089663 14493998 14263754
4772 14263754 14207892 14553992 14321437 14016034 14232437 14270484 14674194 14344386 14421601 14396482
4762 14396482 14210655 14515126 15286105 15057257 14991296 15297814 15619932 16237466 16257212 15765599
4752 15765599 16028733 16358871 16216965 16422949 16061314 16152842 16807370 16974756 17089182 17335734
4742 17335734 17517319 17418020 17231882 17507490 17853448 17935481 18504881 19105321 19517709 19650502
4732 19650502 20227222 20413863 20450802 20818703 21304447 21535970 22223384 22756152 23273843 23829607
4722 23829607 24406107 25394256 26226099 27205119 28089320 28636757 29363793 30226947 30292666 30947095
4712 30947095 31423943 32441951 33586798 34540762 35344014 36916862 38418183 39996136 41741636
$$ packed form
4782A3520642K79559P7305J09422N49746K31262L81125N5144j14542n95665k30244
4772A4263754n5862L46100k32555l05403K16403L8047M03710l29808P7215k5119
4762A4396482j85827L04471P70979k28848o5961L06518L22118O17534J9746m91613
4752A5765599K63134L30138j41906K05984l61635R1528O54528J67386J14426K46552
4742A7335734J81585r9299j86138K75608L45958Q2033N69400O00440M12388J32793
4732A9650502N76720J86641L6939L67901M85744K31523O87414N32768N17691N55764
4722B3829607N76500R88149Q31843R79020Q84201N47437P27036Q63154O5719O54429
4712C0947095M76848J018008J144847R53964Q03252J572848J501321J577953J745500
$$ plain form
4703 41741636 43582854 46121155 48879246 51789313 54343514 55953841 56038087 55111945 54182832
4694 54182832 53314979 52966401 53334501 53369134 54058195 54814489 56364462 57490490 59185115
4685 59185115 61656928 64233313 67624139 70382928 73837415 76324436 77863482 78027247
4677 78027247 77666232 77366607 77574846 78139665 79164354 80967078 83301421 85480179 88430991
4668 88430991 91488416 95053068 98865778 102615042 107504713 112820310 119210384 126000973
4660 126000973 133087979 141045215 150232106 160696053 172899407 187018397 203233320
4653 203233320 221182005 241652356 266241240 293984072 325069742 359302830 395936752
4646 395936752 433624354 469127876 499045425 518141943 523624662 515045355 495212804
$$ packed form
4703D1741636J841218K538301K758091K910067K554201J610327Q4246r26142r29113
4694E4182832q67853l48578L68100L4633O89061P56294J549973J126028J694625
4685E9185115K471813K576385L390826K758789L454487K487021J539046J63765
4677G8027247l61015k99625K08239N64819J024689J802724K334343K178758K950812
4668H8430991L057425L564652L812710L749264M889671N315597O390074O790589
4660A26000973P087006P957236R186891J0463947J2203354J4118990J6214923
4653B03233320J7948685K0470351K4588884K7742832L1085670L4233088L6633922
4646C95936752L7687602L5503522K9917549J9096518N482719q579307j9832551
$$ plain form
4639 495212804 467664563 435750001 401433214 367804248 335502393 306568201 280635944
4632 280635944 258583509 239895933 223870535 210450007 199420202 190776442 183793782
4625 183793782 177301602 169058539 160229718 150990866 142227297 134768658 128451282 123603420
4617 123603420 118800715 114936484 111763668 108936178 107131036 105431583 103919311 102895432
4609 102895432 102247426 101538351 101462250 101373140 101038139 100883056 99848289 98510332 97245423
4600 97245423 95454468 93438243 91475147 89081297 87353513 85576278 83753191 81538478
4592 81538478 79116272 76949053 75493202 74216746 72799934 71642795 70462488 69571686
4584 69571686 68693451 68073447 66915334 65852526 64414616 63508772 62208635 61006941 59990748
$$ packed form
4639D95212804k7548241l1914562l4316787l3628966l2301855k8934192k5932257
4632B80635944k2052435j8687576j6025398j3420528j1029805q643760o982660
4625A83793782o492180q243063q828821r238852q763569p458639o317376m847862
4617A23603420m802705l864231l172816k827490j805142j699453j512272j023879
4609A02895432o48006p09075p6101q9110l35001j55083j034767j337957j264909
4600I7245423j790955k016225j963096k393850j727784j777235j823087k214713
4592H1538478k422206k167219j455851j276456j416812j157139j180307q90802
4584F9571686q78235o20004j158113j062808j437910r05844j300137j201694j016193
$$ plain form
4575 59990748 59072268 58376907 57435206 56606973 56164377 54769093 54221027 54025342 53345731
4566 53345731 52812461 51642122 50766624 50211386 49989187 49590902 49161746 48604034 48307861
4557 48307861 47985669 47927846 47899559 47070585 46865383 46368591 45927874 46403076 46383042 45779704
4547 45779704 45503416 45670400 45375490 45651041 45409858 45040515 45223620 44949385 44619869
4538 44619869 44258612 44181232 44073044 43880104 43470132 43905951 44270690 44436711 44758932 45313003
4528 45313003 45349535 45967025 47286752 48498179 50538322 52993092 55514318 58729221 61615310
4519 61615310 63535535 64291107 62691975 59533763 55677500 51601618 48723228 46848487
4511 46848487 44670272 43031614 41647782 40306605 39622977 38935165 38236446 38105865 38025957
$$ packed form
4575E9990748r18480o95361r41701q28233m42596j395284n48066j95685o79611
4566E3345731n33270j170339q75498n55238k22199l98285m29156n57712k96173
4557D8307861l22192n7823k8287q28974k05202m96792m40717M75202k0034o03338
4547D5779704k76288J66984k94910K75551k41183l69343J83105k74235l29516
4538D4619869l61257p7380j08188j92940m09972M35819L64739J66021L22221N54071
4528D5313003L6532O17490J319727J211427K040143K454770K521226L214903K886089
4519F1615310J920225P55572j599132l158212l856263m075882k878390j874741
4511D6848487k178215j638658j383832j341177o83628o87812o98719j30581p9908
$$ plain form
4502 38025957 37850181 38187405 38166801 38361038 38785154 39150650 40230707 41026117 42271788
4493 42271788 43474931 44744627 46488011 48303861 50953042 53892108 56851931 59660643
4485 59660643 62782343 64674930 64097665 61964660 58531791 55000948 52487322 50823827
4477 50823827 49537386 48769704 48413010 48304600 48151297 48707321 49475970 50220390 51178621
4468 51178621 52771985 54435689 56527558 58761270 60353508 61368708 60588392 58900828
4460 58900828 57396600 56212433 54884387 54570071 54966612 55379128 55934749 56682705 58391802
4451 58391802 59275017 60258536 61247074 62879539 65127075 67290203 68906246 70553200 73303133
4442 73303133 76171672 78537749 81748902 85345099 89052954 93645031 98508326 104213888
$$ packed form
4502C8025957j75776L37224k0604J94237M24116L65496J080057P95410J245671
4493D2271788J203143J269696J743384J815850K649181K939066K959823K808712
4485E9660643L121700J892587n77265k133005l432869l530843k513626j663495
4477E0823827j286441p67682l56694j08410j53303N56024P68649P44420R58231
4468E1178621J593364J663704K091869K233712J592238J015200p80316j687564
4460E8900828j504228j184167j328046l14316L96541M12516N55621P47956J709097
4451E8391802Q83215R83519R88538J632465K247536K163128J616043J646954K749933
4442G3303133K868539K366077L211153L596197L707855M592077M863295N705562
$$ plain form
4434 104213888 110621572 118089949 126443926 136148751 146442586 157257704 168243960 179331219
4426 179331219 192018899 207406603 226959999 251744052 281906934 318657253 362577862
4419 362577862 413941936 466157630 503552015 506918443 471061885 412673076 353150832
4412 353150832 302461043 262656213 231705066 207205511 188385224 173426917 161999404
4405 161999404 152724117 144719671 137961908 132620551 127717582 124318392 122114975 120443936
4397 120443936 119579697 118223789 116894260 114870140 111640025 107963693 103698864 99607038
4389 99607038 95111490 91020609 87139463 84183493 81808294 79334663 77560786 76243658
4381 76243658 75428988 74211441 73249993 72326167 71806525 72143165 72285112 72810456 73802766
$$ packed form
4434A04213888O407684P468377Q353977R704825J0293835J0815118J0986256J1087259
4426A79331219J2687680J5387704J9553396K4784053L0162882L6750319M3920609
4419C62577862N1364074N2215694L7394385L366428l5856558n8388809n9522244
4412C53150832n0689789l9804830l0951147k4499555j8820287j4958307j1427513
4405A61999404r275287q004446o757763n341357m902969l399190k203417j671039
4397A20443936q64239j355908j329529k024120l230115l676332m264829m091826
4389I9607038m495548m090881l881146k955970k375199k473631j773877j317128
4381G6243658q14670j217547r61448r23826n19642L36640J41947N25344R92310
$$ plain form
4372 73802766 74816585 76575461 78759831 80277813 81486247 81586066 80953541 80011687 78413847
4363 78413847 76322367 74827694 73348732 71539448 70237333 69733392 68620886 67211855
4355 67211855 66451206 65512814 64955597 64872562 64592614 64662694 65169125 65700775 66013660 66771340
4345 66771340 67773889 68755001 69953231 71101893 72412473 73733994 75596028 77494404
4337 77494404 79546224 81513340 83306929 85472345 88277731 90635731 93710422 97157398
4329 97157398 100701337 104959033 110041095 115412041 121658908 129250007 137704841 147193758
4321 147193758 157898582 169725520 183619054 200684259 220773052 245708327 276810508
4314 276810508 314594274 359805518 407444834 449485351 479466355 494498646 491392617
$$ packed form
4372G3802766J013819J758876K184370J517982J208434R9819o32525r41854j597840
4363G8413847k091480j494673j478962j809284j302115n03941j112506j409031
4355F7211855p60649r38392n57217q3035k79948P0080N06431N31650L12885P57680
4345F6771340J002549R81112J198230J148662J310580J321521J862034J898376
4337G7494404K051820J967116J793589K165416K805386K358000L074691L446976
4329I7157398L543939M257696N082062N370946O246867P591099Q454834R488917
4321A47193758J0704824J1826938J3893534J7065205K0088793K4935275L1102181
4314B76810508L7783766M5211244M7639316M2040517K9981004J5032291l106029
$$ plain form
4307 491392617 469605089 433134319 386644554 336851382 290633389 252662649 223718343
4300 223718343 201393546 183972553 170103983 158552486 148888995 140705210 133093785
4293 133093785 126642123 120857466 115741860 111686783 108171367 105023816 102192869 99495709
4285 99495709 97434403 96491608 95892507 95651772 95904493 96792750 97867396 99323361 99577805
4276 99577805 98724169 96556330 93994550 91979759 89433279 87663876 86372756 85320464
4268 85320464 84389152 83264915 81693359 79966844 78245892 76497040 75199457 73782704
4260 73782704 72152738 70407288 69006623 67575608 66959392 66554500 65821124 65855609 66694553
4251 66694553 66853194 67667552 68959870 70147336 71233498 71449119 71189213 70009588 68800186
$$ packed form
4307D91392617k1787528l6470770m6489765m9793172m6217993l7970740k8944306
4300B23718343k2324797j7420993j3868570j1551497r663491q183785p611425
4293A33093785o451662n784657n115606m055077l515416l147551k830947k697160
4285I9495709k061306r42795n99101k40735K52721Q88257J074646J455965K54444
4276I9577805q53636k167839k561780k014791k546480j769403j291120j052292
4268H5320464r31312j124237j571556j726515j720952j748852j297583j416753
4260G3782704j629966j745450j400665j431015o16216m04892p33376L4485Q38944
4251F6694553J58641Q14358J292318J187466J086162K15621k59906j179625j209402
$$ plain form
4242 68800186 66605684 64145402 62138748 60344340 59007249 58047609 56991650 55994232
4234 55994232 55538841 54691403 54633217 54159860 53373222 52245990 51091401 50007587 48715638
4225 48715638 47300210 46554543 45345522 44139424 43547894 42718667 41875362 41055111 40643824
4216 40643824 40427370 39967700 40004293 39996127 39689904 39741408 39524233 38525258 36957284 36043857
4206 36043857 34834405 33791829 33199593 32240242 31326833 30545376 30001247 29442455 29141300
4197 29141300 28643024 28114290 27565067 27166724 27122719 26465406 26637780 26203490 25957680 25791189
4187 25791189 26179550 25829395 25580802 25692932 25441308 25798091 25816598 25323257 25605363 25881202
4177 25881202 25044109 24522614 24721855 24869471 24913335 25273707 24941410 24954858 25613612 26268454
$$ packed form
4242F8800186k194502k460282k006654j794408j337091r59640j055959r97418
4234E5994232m55391q47438n8186m73357p86638j127232j154589j083814j291949
4225D8715638j415428p45667j209021j206098n91530q29227q43305q20251m11287
4216D0643824k16454m59670L6593q166l06223N1504k17175r98975j567974r13427
4206C6043857j209452j042576n92236r59351r13409p81457n44129n58792l01155
4197B9141300m98276n28734n49223l98343m4005o57313J72374m34290k45810j66491
4187B5791189L88361l50155k48593J12130k51624L56783J8507m93341K82106K75839
4177B5881202q37093n21495J99241J47616M3864L60372l32297J3448O58754O54842
$$ plain form
4167 26268454 26807885 27554977 28193190 28543923 29084008 28790385 28330244 27764651 26788895
4158 26788895 25677074 24649551 23686000 22850065 22412732 22610810 22073959 21659831 21352160
4149 21352160 21408967 20761872 20897184 21133861 20676120 21226458 21077493 20896702 20525333 20723553
4139 20723553 20693292 20637848 20614499 20859283 21459127 21523905 21212177 20931353 21060625 21735554
4129 21735554 21602748 21664902 21982323 22225527 23155340 23639628 23698080 23917883 23738570 23417555
4119 23417555 22896568 22331581 22036509 22320864 22488672 22593635 22371074 22458427 22468311 22682713
4109 22682713 22469221 22730010 23061045 23335115 23686987 24003916 24640625 24749491 24915825
4100 24915825 25286597 25344688 24897392 24356164 24141691 24350747 24564309 25177444 25736336 26462996
$$ packed form
4167B6268454N39431P47092O38213L50733N40085k93623m60141n65593r75756
4158B6788895j111821j027523r63551q35935m37333J98078n36851m14128l07671
4149B1352160N6807o47095J35312K36677m57741N50338j48965j80791l71369J98220
4139B0723553l0261n5444k3349K44784N99844O4778l11728k80824J29272O74929
4129B1735554j32806O2154L17421K43204R29813M84288N8452K19803j79313l21015
4119B3417555n20987n64987k95072K84355J67808J04963k22561Q7353R884K14402
4109B2682713k13492K60789L31035K74070L51872L16929O36709J08866J66334
4100B4915825L70772N8091m47296n41228k14473K09056K13562O13135N58892P26660
$$ plain form
4090 26462996 27011937 27582773 28451425 29353635 30284521 32115917 34747940 37735670 42282507
4081 42282507 47629205 52576853 52813608 48002448 42944438 39330197 37021189 35369840
4073 35369840 33558078 32035099 30887937 29786686 29490702 28959821 28782826 28931534 28862734
4064 28862734 28498823 28840652 29525205 30002086 30406743 30680971 30967371 31133876 31125995 31558092
4054 31558092 31644239 31810191 31499781 31513154 31466228 31126150 31785135 31723143 31558982 31674679
4044 31674679 31978191 32455309 32727861 33232181 33832525 34751979 35495477 36316983 37477456
4035 37477456 38523269 40069981 41687058 43181149 44946881 46345993 48152264 50538468
4027 50538468 52617742 54726139 56997351 59745063 63143677 65934142 68274840 71534823
$$ packed form
4090B6462996N48941N70836Q68652R02210R30886J831396K632023K987730M546837
4081D2282507N346698M947648K36755m811160n058010l614241k309008j651349
4073C5369840j811762j522979j147162j101251k95984n30881j76995J48708o8800
4064B8862734l63911L41829O84553M76881M04657K74228K86400J66505p881M32097
4054C1558092Q6147J65952l10410J3373m6926l40078O58985o1992j64161J15697
4044C1674679L03512M77118K72552N04320O00344R19454P43498Q21506J160473
4035C7477456J045813J546712J617077J494091J765732J399112J806271K386204
4027E0538468K079274K108397K271212K747712L398614K790465K340698L259983
$$ plain form
4019 71534823 74531754 77837431 81277971 84908393 88644595 92348131 97200196 101013835
4011 101013835 105076742 109394701 114239539 119558631 124188561 128830653 134052460 139649733
4003 139649733 144652451 149857597 154899423 159606130 164106681 169002749 173143308 176810310
3995 176810310 180948755 184643923 188308171 191376210 194558607 197247124 199139806 201556613
3987 201556613 203634439 204950527 205304057 205325624 205419338 204794030 203828995 202503683 200797539
3978 200797539 198734038 196445202 193519136 190503348 188007839 185029417 181344142 177113664
3970 177113664 172786306 168151332 163710380 158820881 153916433 148939826 143600548 138106844
3962 138106844 132802859 128158785 123337037 118220119 113578541 108691068 103875990 98987726
$$ packed form
4019G1534823K996931L305677L440540L630422L736202L703536M852065L813639
4011A01013835M062907M317959M844838N319092M629930M642092N221807N597273
4003A39649733N002718N205146N041826M706707M500551M896068M140559L667002
3995A76810310M138445L695168L664248L068039L182397K688517J892682K416807
3987B01556613K077826J316088L53530K1567R3714o25308r65035j325312j706144
3978B00797539k063501k288836k926066l015788k495509k978422l685275m230478
3970A77113664m327358m634974m440952m889499m904448m976607n339278n493704
3962A38106844n303985m644074m821748n116918m641578m887473m815078m888264
$$ plain form
3954 98987726 94488404 89507991 85225185 81123375 76972139 73547265 69997576 66620895
3946 66620895 63243837 60185427 57441612 54539611 51794255 49821917 47188515 44910743
3938 44910743 43487145 41929790 40058812 38393666 37110188 35584136 33965412 32540918
3930 32540918 31435557 30311691 29030357 27927928 27279888 26319880 25324264 24765037 24154682
3921 24154682 23739533 23145265 22608576 21910961 21309193 20723414 20684795 20282571 19609526 18867441
3911 18867441 18506037 18207204 17819907 17894566 17343908 17188683 16892651 16519665 16843303 16257036
3901 16257036 15529870 14956144 15099113 15178927 14917900 14671419 13979189 13951848 14272349 13892663
3891 13892663 13856313 14037774 13873335 14150686 14160705 13805853 13459161 13480281 13020762 13125010
$$ packed form
3954I8987726m499322m980413m282806m101810m151236l424874l549689l376681
3946F6620895l377058l058410k743815k902001k745356j972338k633402k277772
3938D4910743j423598j557355j870978j665146j283478j526052j618724j424494
3930C2540918j105361j123866j281334j102429o48040r60008r95616n59227o10355
3921B4154682m15149n94268n36689o97615o01768n85779l8619m02224o73045p42085
3911A8867441l61404k98833l87297P4659n50658j55225k96032l72986L23638n86267
3901A6257036p27166n73726J42969P9814k61027k46481o92230k7341L20501l79686
3891A3892663l6350J81461j64439K77351J0019l54852l46692K1120m59519J04248
$$ plain form
3881 13125010 13314465 13024741 12729407 12840676 12747703 12493655 12489136 13015793 13068940 12326426
3871 12326426 12284518 12293873 12160146 12141635 12125229 11645616 11524533 11729127 11778528 11743803 11716040
3860 11716040 11642114 11559162 11900331 12017126 12028005 11947766 11698966 11586155 11629540 11304438
3850 11304438 11259031 11164799 10715006 11096331 11016685 10993382 11132779 11050334 11453841 11290674
3840 11290674 11134983 10945770 10737553 10660218 10288437 10344011 10675275 10927996 10611742 10827216
3830 10827216 10958104 10787394 10941872 11225774 11343913 11453371 11782733 12143620 12270768
3821 12270768 12148435 12200000 11954230 11840051 11804545 11734931 11232978 10771146 10099578 9736123
3811 9736123 9386400 9092076 9063899 9156227 8794457 8488545 8601297 8317512 8441699 8224476
$$ packed form
3881A3125010J89455k89724k95334J11269r2973k54048m519N26657N3147p42514
3871A2326426m1908R355j33727j8511j6406m79613j21083K04594M9401l4725k7763
3860A1716040p3926q2952L41169J16795J0879q0239k48800j12811M3385l25102
3850A1304438m5407r4232m49793L81325p9646k3303J39397q2445M03507j63167
3840A1290674j55691j89213k08217p7335l71781N5574L31264K52721l16254K15474
3830A0827216J30888j70710J54478K83902J18139J09458L29362L60887J27148
3821A2270768j22333N1565k45770j14179l5506o9614n01953m61832o71568l63455
3811I736123l49723k94324k8177R2328l61770l05912J12752k83785J24187k17223
$$ plain form
3801 8224476 7928280 8167617 8230662 8225931 8091093 7639020 7697764 7514322 7421753 7632895
3791 7632895 7445648 7642831 7577225 7410087 7766577 8001375 8187816 8314726 7981084 8040409
3781 8040409 8499427 7891554 8016430 8141080 8338394 8244305 8748042 8909632 9152379 9195934
3771 9195934 9237952 9542515 9284032 8968527 9219053 9367510 9384277 9634820 9331664 9384516
3761 9384516 9472612 9284214 9499671 9489818 9618162 9470441 9429743 9929843 9973384 9652443
3751 9652443 9479116 9571428 9634543 9846011 9767975 10268413 10175918 10236952 9980330 9814554
3741 9814554 9558831 9426107 9582142 9914834 10204436 10380933 10186681 10557614 10700187 10512026
3731 10512026 10822396 11239283 11117605 11403223 11374119 11559490 11729067 11867389 11967177 11931829
$$ packed form
3801H224476k96196K39337O3045m731j34838m52073N8744j83442r2569K11142
3791G632895j87247J97183o5606j67138L56490K34798J86441J26910l33642N9325
3781H040409M59018o07873J24876J24650J97314r4089N03737J61590K42747M3555
3771I195934M2018L04563k58483l15505K50526J48457J6767K50543l03156N2852
3761I384516Q8096j88398K15457r853J28344j47721m0698N00100M3541l20941
3751I652443j73327R2312O3115K11468p8036N00438r2495O1034k56622j65776
3741I814554k55723j32724J56035L32692K89602J76497j94252L70933J42573j88161
3731A0512026L10370M16887j21678K85618k9104J85371J69577J38322R9788l5348
$$ plain form
3721 11931829 12361062 12852562 12993108 13201685 13911183 14026262 14197920 14919184 14902746 15166305
3711 15166305 15586947 15999537 16149663 16316125 16629472 17059253 17544097 17798976 18629003
3702 18629003 19121730 19312275 19355020 19774037 20565652 21363606 21916340 22548823 22820013 23378705
3692 23378705 24137353 25394886 26265593 26695639 27271928 28322671 29700170 30520950 31667769
3683 31667769 33554714 35092150 37074218 38267099 39796946 41567709 43172959 44179263
3675 44179263 46183706 48532870 49973070 51431215 53290980 55599431 57552286 59260356
3667 59260356 61002399 63044786 65180517 67217637 69529123 71859814 74104441 76323010
3659 76323010 79008078 81277450 83944387 86486653 87932073 88556137 88070449 88195916 88533556
$$ packed form
3721A1931829M29233M91500J40546K08577P09498J15079J71658P21264j6438K63559
3711A5166305M20642M12590J50126J66462L13347M29781M84844K54879Q30027
3702A8629003M92727J90545M2745M19017P91615P97954N52734O32483K71190N58692
3692B3378705P58648J257533Q70707M30046N76289J050743J377499Q20780J146819
3683C1667769J886945J537436J982068J192881J529847J770763J605250J006304
3675D4179263K004443K349164J440200J458145J859765K308451J952855J708070
3667E9260356J742043K042387K135731K037120K311486K330691K244627K218569
3659G6323010K685068K269372K666937K542266J445420O24064m85688J25467L37640
$$ plain form
3650 88533556 89339052 90277245 91018186 91966728 92697481 93556291 94537749 95371812 96393407
3641 96393407 97055522 97989359 99354052 100321119 100870792 101893211 103031147 104372696 105886927
3632 105886927 107725802 109838132 112663729 115526108 118829404 122321361 126071603 130377889
3624 130377889 134773261 139325798 144421364 149240731 154331429 159522335 164410830 169487111
3616 169487111 174765894 180364356 186152122 191665497 197228268 203498232 209656260 215503689
3608 215503689 221959812 228078341 234046374 239792510 245422872 250610299 255799399 260903155
3600 260903155 265642669 270641970 275650122 280289364 285083636 290157839 295025285 300161421
3592 300161421 305260052 310458487 315270291 319881632 324609547 329023399 332667614 335814056
$$ packed form
3650H8533556Q05496R38193P40941R48542P30753Q58810R81458Q34063J021595
3641I6393407O62115R33837J364693R67067N49673J022419J137936J341549J514231
3632A05886927J838875K112330K825597K862379L303296L491957L750242M306286
3624A30377889M395372M552537N095566M819367N090698N190906M888495N076281
3616A69487111N278783N598462N787766N513375N562771O269964O158028N847429
3608B15503689O456123O118529N968033N746136N630362N187427N189100N103756
3600B60903155M739514M999301N008152M639242M794272N074203M867446N136136
3592C00161421N098631N198435M811804M611341M727915M413852L644215L146442
$$ plain form
3584 335814056 339269298 342790687 346122199 350218028 354551820 359363151 364485174 370635856
3576 370635856 376981900 383806136 391258882 399440103 408166796 417816733 427760253 438263671
3568 438263671 448901910 458597563 467196492 474572784 479948766 484158799 487166834 488394363
3560 488394363 487825199 486472739 484139098 480651326 476813103 473042850 468861662 463910192
3552 463910192 458349933 451921179 443938826 433643564 422222911 409294985 395483358
3545 395483358 380674200 365838433 351308672 337094641 323163431 310190998 298375889
3538 298375889 287909373 278455708 269246114 260730851 252774687 245050615 237179455 230131949
3530 230131949 223287767 216105957 209873442 204272187 198816109 193999538 190021804 186086943
$$ packed form
3584C35814056L455242L521389L331512M095829M333792M811331N122023O150682
3576C70635856O346044O824236P452746Q181221Q726693R649937R943520J0503418
3568D38263671J0638239R695653Q598929P376292N375982M210033L008035J227529
3560D88394363n69164j352460k333641l487772l838223l770253m181188m951470
3552D63910192n560259o428754p982353j0295262j1420653j2927926j3811627
3545C95483358j4809158j4835767j4529761j4214031j3931210j2972433j1815109
3538B98375889j0466516r453665r209594q515263p956164p724072p871160p047506
3530B30131949o844182p181810o232515n601255n456078m816571l977734l934861
$$ plain form
3522 186086943 182497538 178521219 174875008 171339076 167576079 163762372 160615699 157607866
3514 157607866 154291536 151599659 149212228 146507122 144351384 142640126 142091596 141398369
3506 141398369 140879589 141113335 141524078 142520235 143761273 145220420 147155196 149662827 152146900
3497 152146900 155041798 159005781 163385244 168443027 174697527 181419430 189290467 198513816
3489 198513816 208626066 219156560 231037374 243184368 255408765 266552767 276050622
3482 276050622 284381470 290771600 294393295 296093557 295862742 294038619 292286054 290270831
3474 290270831 287567132 284799801 282168110 279808056 276888858 272986457 267883428 261015610
3466 261015610 252162253 241093930 228688542 215132840 200995796 187018717 172858416
$$ packed form
3522A86086943l589405l976319l646211l535932l762997l813707l146673l007833
3514A57607866l316330k691877k387431k705106k155738j711258n48530o93227
3506A41398369n18780K33746M10743R96157J241038J459147J934776K507631K484073
3497A52146900K894898L963983M379463N057783O254500O721903P871037R223349
3489A98513816J0112250J0530494J1880814J2146994J2224397J1144002R497855
3482B76050622Q330848O390130L621695J700262k30815j824123j752565k015223
3474B90270831k703699k767331k631691k360054k919198l902401n103029o867818
3466B61015610q853357j1068323j2405388j3555702j4137044j3977079j4160301
$$ plain form
3459 172858416 159355819 147417060 136904471 126993038 118370026 110825828 104136580 98088447
3451 98088447 92306893 87086753 82611609 78334067 75454077 71753798 68722146 66094874
3443 66094874 63382527 60914397 58492889 56673529 54473536 52649265 50958923 49831623
3435 49831623 48319874 46650806 45276639 43958903 42306523 41523797 40682116 39758431 38948949
3426 38948949 38089421 37135782 36260577 34826188 34211192 33948231 33042149 32261849 31338048
3417 31338048 30886714 30311980 29384550 29097881 28792144 28367879 27667971 27170199 26899308
3408 26899308 26237153 25848530 25389849 24824453 24363214 23777553 23865616 23404954 22801323 22629678
3398 22629678 21913359 21496016 21271312 20907516 20722442 20269120 20108328 20182220 19920449 19268976
$$ packed form
3459A72858416j3502597j1938759j0512589r911433q623012p544198o689248o048133
3451I8088447n781554n220140m475144m277542k879990l700279l031652k627272
3443F6094874k712347k468130k421508j819360k199993j824271j690342j127300
3435D9831623j511749j669068j374167j317736j652380p82726q41681r23685q09482
3426C8948949q59528r53639q75205j434389o14996k62961r06082p80300r23801
3417C1338048m51334n74734r27430k86669l05737m24265o99908m97772k70891
3408B6899308o62155l88623m58681n65396m61239n85661Q8063m60662o03631j71645
3398B2629678p16319m17343k24704l63796j85074m53322j60792P3892k61771o51473
$$ plain form
3388 19268976 18739829 18625181 18732847 18488341 18072988 17745420 17473766 16821816 16453820
3379 16453820 16626796 16113813 15721959 15800052 15531613 15512231 15385618 15236485 15000381 15022383
3369 15022383 14963281 14634649 14267751 14067938 14257096 13867570 13721504 13638726 13534366 13265282
3359 13265282 13296336 12976725 12523032 12714137 12730471 12682776 12861652 12711720 12539712 12563746
3349 12563746 12496815 12417017 12081651 11871176 11664694 11301154 11277629 11771445 11933189 11747519
3339 11747519 11924307 11994460 12142380 11974647 11986373 11780085 11740310 11914573 11816029 11815943 11917266
3328 11917266 11314504 11317039 11229033 11452885 11610195 11417674 11464166 11505812 11709595 11864665
3318 11864665 11744961 11437524 11720868 11698510 11970623 11975064 11946351 11802520 11779323 11871839
$$ packed form
3388A9268976n29147j14648J07666k44506m15353l27568k71654o51950l67996
3379A6453820J72976n12983l91854P8093k68439j9382j26613j49133k36104K2002
3369A5022383n9102l28632l66898j99813J89158l89526j46066q2778j04360k69084
3359A3265282L1054l19611m53693J91105J6334m7695J78876j49932j72008K4034
3349A2563746o6931p9798l35366k10475k06482l63540k3525M93816J61744j85670
3339A1747519J76788P0153J47920j67733J1726k06288l9775J74263r8544q6J01323
3328A1917266o02762K535q8006K23852J57310j92521M6492M1646K03783J55070
3318A1864665j19704l07437K83344k2358K72113M441k8713j43831k3197R2516
$$ plain form
3308 11871839 11589982 11463062 11730645 11814418 11930970 12135324 11974091 12471970 12401863 12244057
3298 12244057 12284601 12748542 12273964 11739284 11964146 12316336 12354908 12256368 12484317 12928789
3288 12928789 12801012 13269544 13854696 13724438 13519031 13478617 13790871 14265854 14318902 14179982
3278 14179982 14301564 14255068 14326387 14065932 14738525 14942476 15142811 15224017 15832583 15650002
3268 15650002 15806242 16084359 16546935 17497110 17336470 17433186 17540533 17929298 18673118 19584138
3258 19584138 20097312 20743201 21626702 22216571 22975652 23493657 24292878 24649051 24952050
3249 24952050 25250360 24829592 24446310 24124323 23138704 22052135 21344997 20123042 19670579
3240 19670579 19035180 17813337 17330658 16337591 15678018 15372438 14412930 13628314 12920100
$$ packed form
3308A1871839k81857j26920K67583Q3773J16552K04354j61233M97879p0107j57806
3298A2244057M0544M63941m74578n34680K24862L52190L8572r8540K27949M44472
3288A2928789j27777M68532N85152j30258k05407m0414L12254M74983N3048j38920
3278A4179982J21582m6496P1319k60455O72593K03951K00335Q1206O08566j82581
3268A5650002J56240K78117M62576R50175j60640R6716J07347L88765P43820R11020
3258A9584138N13174O45889Q83501N89869P59081N18005P99221L56173L02999
3249B4952050K98310m20768l83282l21987r85619j086569p07138j221955m52463
3240A9670579o35399j221843m82679r93067o59573l05580r59508p84616p08214
$$ plain form
3231 12920100 12343127 11978201 11805785 11589792 11510164 11355670 10997430 11121276 11130095 11023356
3221 11023356 10893077 11247486 11424777 11568040 11799862 12275207 12306439 12322688 12552910 11648067
3211 11648067 10543829 9862844 9901253 9355546 9093013 8981058 8595142 8481826 8152527
3202 8152527 8298753 8009931 7734528 7910535 8040922 8059188 8255801 8507318 8372226 8500380
3192 8500380 7994939 7907939 8192638 7958711 8243114 8438609 8859649 8630488 8689708 9093020
3182 9093020 9030690 8724900 8634261 8119987 7491416 7204612 7080021 6857400 6946605 6850540
3172 6850540 6141559 5928405 5788318 6136594 5786022 6228710 5996449 5907793 5495459 5478039
3162 5478039 5460128 5332361 5094204 4959149 5088231 5184373 5363478 5155766 5133313 5133892 5048424
$$ packed form
3231A2920100n76973l64926j72416k15993p9628j54494l58240J23846Q819j06739
3221A1023356j30279L54409J77291J43263K31822M75345L1232J6249K30222r04843
3211A1648067j104238o80985L8409n45707k62533j11955l85916j13316l29299
3202H152527J46226k88822k75403J76007J30387J8266J96613K51517j35092J28154
3192H500380n05441q7000K84699k33927K84403J95495M21040k29161N9220M03312
3182I093020o2330l05790r0639n14274o28571k86804j24591k22621Q9205r6065
3172F850540p08981k13154j40087L48276l50572M42688k32261q8656m12334j7420
3162E478039j7911j27767k38157j35055J29082R6142J79105k07712k2453N79q5468
$$ plain form
3151 5048424 4907208 4970426 4523481 4457369 3988565 3826311 4084131 4312397 4423887 4165457
3141 4165457 3703258 4197264 4365876 3904157 4141675 4408883 4348222 4274542 4151671 4136790
3131 4136790 4068844 3921010 3922151 3819451 4145797 3861713 3390050 3073279 3046732 3937816
3121 3937816 4434190 4262814 3890196 3336964 2907892 3285077 3416788 3625980 3685138 3493169
3111 3493169 3477816 3801269 3628198 3373732 3049310 3458709 3905594 3722730 3720047 3489566
3101 3489566 4063960 4131604 3876206 3949010 3945960 3522296 3680250 3304877 3375236 3577529
3091 3577529 3606009 3778229 3710019 3970543 3770335 3809805 3674735 3705977 4040484 3843939
3081 3843939 3765345 3393456 3261219 3423116 3468655 3462258 3496624 3700847 3586391 3604178 3441782
$$ packed form
3151E048424j41216O3218m46945o6112m68804j62254K57820K28266J11490k58430
3141D165457m62199M94006J68612m61719K37518K67208o0661p3680j22871j4881
3131D136790o7946j47834J141j02700L26346k84084m71663l16771k6547Q91084
3121C937816M96374j71376l72618n53232m29072L77185J31711K09192N9158j91969
3111C493169j5353L23453j73071k54466l24422M09399M46885j82864k683k30481
3101C489566N74394O7644k55398P2804l050m23664J57954l75373P0359K02293
3091C577529K8480J72220o8210K60524k00208L9470j35070L1242L34507j96545
3081C843939p8594l71889j32237J61897M5539o397L4366K04223j14456J7787j62396
$$ plain form
3070 3441782 3333743 3310686 3804378 3748510 3247585 3510490 3584509 3278140 3351145 3684568
3060 3684568 3865967 3873892 3850477 3640564 3649026 3674424 3807421 4184506 3929668 3963748 4028924
3049 4028924 4207265 3779543 3780386 4097876 3989207 4449175 4155089 4061046 4297604 4562511
3039 4562511 4674348 4795613 5012629 4667519 4823213 5077868 4986860 5568944 5322858 5325414
3029 5325414 5629748 5782433 6068429 6181979 6118526 6067263 6538004 6732842 7304532 8186300
3019 8186300 8727392 8713903 8909074 9181089 9844921 10714019 11318980 11318479 11642608 12323828
3009 12323828 12643007 12787763 12278113 12411624 12603404 12268766 11956867 11478562 11532095 11532809
2999 11532809 11547040 10953596 10664110 10767465 10845527 10540528 10356967 10590125 10484816 10806421
$$ packed form
3070C441782j08039k3057M93692n5868n00925K62905P4019l06369P3005L33423
3060C684568J81399P925k3415k09913Q462K5398J32997L77085k54838L4080O5176
3049D028924J78341m27722Q43L17490j08669M59968k94086r4043K36558K64907
3039D562511J11837J21265K17016l45110J55694K54655r1008N82084k46086K556
3029E325414L04334J52685K85996J13550o3453n1263M70741J94838N71690Q81768
3019H186300N41092j3489J95171K72015O63832Q69098O04961n01L24129O81220
3009A2323828L19179J44756n09650J33511J91780l34638l11899m78305N3533P14
2999A1532809J4231n93444k89486J03355P8062l04999j83561K33158j05309L21605
$$ plain form
2989 10806421 10754803 11285850 11666222 12378895 13057877 13627889 14163963 15209643 15965006
2980 15965006 17069654 18442075 19576816 20913473 21784504 22691236 23433906 24015083 23745033
2971 23745033 22878350 21809434 20856127 20307102 19686794 19011101 18474310 17962374 16743622
2962 16743622 15525434 14582593 13110019 12555071 12118385 11504840 11377747 11305708 11378590
2953 11378590 11135818 11153957 11437750 11693617 11987419 12007498 12556808 13060374 13290714 13473584
2943 13473584 14408585 14567284 15265333 16097868 16160200 16664612 16714625 16116962 15695174 15241852
2933 15241852 14474023 14198546 14009678 13437682 12552558 12030766 11475878 10993739 10138004
2924 10138004 9385208 8820123 8433713 8076675 7591996 7712179 7389516 7164977 7113836 7320032
$$ packed form
2989A0806421n1618N31047L80372P12673O78982N70012N36074J045680P55363
2980A5965006J104648J372421J134741J336657Q71031R06732P42670N81177k70050
2971B3745033q66683j068916r53307n49025o20308o75693n36791n11936j218752
2962A6743622j218188r42841j472574n54948m36686o13545j27093p2039P2882
2953A1378590k42772J8139K83793K55867K93802K0079N49310N03566K30340J82870
2943A3473584R35001J58699O98049Q32535O2332N04412N0013n97663m21788m53322
2933A5241852p67829k75477j88868n71996q85124n21792n54888m82139q55735
2924A0138004p52796n65085l86410l57038m84679J20183l22663k24539n1141K06196
$$ plain form
2914 7320032 7524263 7560676 7467313 7040688 7204608 7031938 6584483 6519191 6453497 6124965
2904 6124965 5887441 5819653 5238334 4840358 5304735 5401104 5011453 5106486 4824799 4983785
2894 4983785 5173513 4949769 4813317 4649552 4706477 5105861 4999116 4945701 5152298 5382659
2884 5382659 5506266 4826153 4821899 4842283 4731095 4497935 4514515 4390418 4346759 4111908
2874 4111908 3896973 4080467 4303538 3822956 3509044 3581884 3596571 3698716 3433215 3646499
2864 3646499 3603249 3608555 3608286 3097369 2946088 3134903 3437732 3455355 3159775 3275085 2900691
2853 2900691 2472540 2511711 2418279 2810041 2841115 2888186 2571011 2502356 2884685 2941234 2588266
2842 2588266 2335247 1723192 1746815 2182239 2248252 2539086 2727515 2387240 2608182 2935369
$$ packed form
2914G320032K04231L6413r3363m26625J63920j72670m47455o5292o5694l28532
2904F124965k37524o7788n81319l97976M64377R6369l89651R5033k81687J58986
2894D983785J89728k23744j36452j63765N6925L99384j06745n3415K06597K30361
2884E382659J23607o80113m254K0384j11188k33160J6580j24097m3659k34851
2874D111908k14935J83494K23071m80582l13912P2840J4687J02145k65501K13284
2864C646499m3250N306k69n10917j51281J88815L02829J7623k95580J15310l74394
2853B900691m28151L9171r3432L91762L1074M7071l17175o8655L82329N6549l52968
2842B588266k53019o12055K3623M35424O6013K90834J88429l40275K20942L27187
$$ plain form
2832 2935369 2493118 2213514 2398986 2335351 2152826 1955889 1820409 2039075 2021823 1987313
2822 1987313 1878588 1685841 1404547 1720822 1681522 1943234 1895208 2233827 2216744 2251403
2812 2251403 2127779 1984459 1704316 2132059 1974928 1848642 2027481 1966890 1866731 1935180
2802 1935180 1981455 1795409 1284064 1048140 1260440 1238430 1442241 1380040 1836449 1845706
2792 1845706 1864072 1727054 1567930 1896206 1964497 1712631 1647628 1446862 1577942 1568104
2782 1568104 1513693 1477745 1363548 1569607 1343050 715751 912408 1167008 1381285 1064509
2772 1064509 780739 929042 950556 1399684 1799061 1415125 1004462 723358 907829 913479
2762 913479 1353256 1880435 1836602 1392763 1155802 1360722 1292509 1469575 1546269 1525830
$$ packed form
2832B935369m42251k79604J85472o3635j82525j96937j35480K18666j7252l4510
2822A987313j08725j92747k81294L16275l9300K61712m8026L38619j7083L4659
2812B251403j23624j43320k80143M27743j57131j26286J78839o0591j00159O8449
2802A935180M6275j86046n11345k35924K12300k2010K03811o2201M56409R257
2792A845706J8366j37018j59124L28276O8291k51866o5003k00766J31080r838
2782A568104n4411l5948j14197K06059k26557o27299J96657K54600K14277l16776
2772A064509k83770J48303K1514M49128L99377l83936m10663k81104J84471N650
2762I13479M39777N27179m3833m43839k36961K04920o8213J77066P6694k0439
$$ plain form
2752 1525830 1609923 1883737 1709959 1620227 1572644 979092 1203784 1738955 1602381 1421755
2742 1421755 1543899 1613825 1371096 1123269 1187887 1644499 1783677 1746402 1460892 1397703
2732 1397703 1082187 1299316 1555069 1246302 1455891 1452945 1452159 1495699 1297268 1060337 1270267
2721 1270267 1258688 1220421 1724782 1185332 1191310 1398331 1379289 1389743 1371992 1548955 1345191
2710 1345191 1778415 1952228 1411691 1530564 1409837 1164724 1528763 1547835 1601943 1344766
2700 1344766 1456902 1831421 1962751 1862919 1779129 1817556 1633678 1562135 1959757 1904310
2690 1904310 1629005 1695668 1611542 1667311 1669530 2003135 2331304 2114021 1849726 1888416 2186543
2679 2186543 1912299 2162202 1962945 1913977 2002111 2007453 2390196 2322788 2686097 3012577
$$ packed form
2752A525830Q4093K73814j73778q9732m7583n93552K24692N35171j36574j80626
2742A421755J22144O9926k42729k47827O4618M56612J39178l7275k85510o3189
2732A397703l15516K17129K55753l08767K09589k946p86M3540j98431k36931K09930
2721A270267j1579l8267N04361n39450N978K07021j9042J0454j7751J76963k03764
2710A345191M33224J73813n40537J18873j20727k45113L64039J9072N4108k57177
2700A344766J12136L74519J31330r9832q3790L8427j83878p1543L97622n5447
2690A904310k75305O6663q4126N5769K219L33605L28169k17283k64295L8690K98127
2679B186543k74244K49903j99257m8968Q8134N342L82743o7408L63309L26480
$$ plain form
2669 3012577 2897823 2868443 2813058 2780740 2849470 3085511 3026505 3395307 3939455 4348563
2659 4348563 4612174 4167705 4036178 4084092 3899110 4194996 4282102 4328187 4318447 4128262
2649 4128262 3969374 4000588 4396370 4456236 4438880 5197172 5120088 4924829 5171239 5291563
2639 5291563 5344837 5181597 5474777 5642263 5740806 6132872 6373258 6598459 6660319 6794302
2629 6794302 6912567 6933497 6920050 7118994 7241740 7138412 7748079 7987640 7945762 7731084
2619 7731084 7204276 7326626 7276053 7081154 7558523 7205628 7941782 8091697 7553290 7458084
2609 7458084 7844028 8071374 7973101 8036901 8340179 8476096 8585360 8525027 8576759 8889246
2599 8889246 9262094 9857671 10161401 10141502 10203654 10042673 9713780 9469233 9096745 8805306
$$ packed form
2669C012577j14754k9380n5385l2318O8730K36041n9006L68802N44148M09108
2659D348563K63611m44469j31527M7914j84982K95886Q7106M6085r740j90185
2649D128262j58888L1214L95782N9866j7356P58292p7084j95259K46410J20324
2639E291563N3274j63240K93180J67486R8543L92066K40386K25201O1860J33983
2629F794302J18265K0930j3447J98944J22746j03328O09667K39561m1878k14678
2619G731084n26808J22350n0573j94899M77369l52895P36154J49915n38407r5206
2609G458084L85944K27346r8273O3800L03278J35917J09264o0333N1732L12487
2599H889246L72848N95577L03730j9899O2152j60981l28893k44547l72488k91439
$$ plain form
2589 8805306 8891664 8705292 8573508 8606608 8681328 8340163 7717015 7530980 7361803 7119798
2579 7119798 7497825 7773542 7455897 7199751 7566544 7026385 6974160 6819796 6687859 6802713
2569 6802713 6879219 6838464 7124526 7638240 7346351 7362057 7609248 7781880 7876647 7808579
2559 7808579 7740429 7477005 7176225 6994463 6511290 6330418 5615065 5146998 4728548 4721841
2549 4721841 5039797 4624511 4415480 4724937 4737314 4679766 4526289 4469278 4586306 4507362
2539 4507362 3902643 4030036 3477549 3569900 3825070 3718140 3137548 3120988 3094858 2997760
2529 2997760 3198458 3254730 3230910 3155973 3163596 3115375 2872811 2703778 2987985 2940523 2660284
2518 2660284 2383281 2371488 2246792 2062701 1842759 1841509 2037601 1815968 1552502 1686851
$$ packed form
2589H805306Q6358j86372j31784L3100P4720l41165o23148j86035j69177k42005
2579G119798L78027K75717l17645k56146L66793n40159n2225j54364j31937J14854
2569F802713P6506m0755K86062N13714k91889J5706K47191J72632R4767o8068
2559G808579o8150k63424l00780j81762m83173j80872p15353m68067m18450o707
2549D721841L17956m15286k09031L09457J2377n7548j53477n7011J17028p8944
2539D507362o04719J27393n52487R2351K55170j06930n80592j6560k6130r7098
2529B997760K00698N6272k3820p4937P623m8221k42564j69033K84207m7462k80239
2518B660284k77003j1793j24696j84091k19942j250J96092k21633k63466J34349
$$ plain form
2508 1686851 1939641 1698472 1856228 2165778 1876643 1746781 1938285 1870553 1716866 1192494
2498 1192494 1280568 1299373 1002155 970109 1229994 1071901 1231832 1236634 1359716 1105848
2488 1105848 863641 1193917 735295 847784 1258699 1119331 946023 1125394 1114008 1029211
2478 1029211 664077 585773 734138 1106690 1052848 919344 1214498 1222568 1087240 1499170
2468 1499170 1336174 1254784 1070882 535674 1024210 1443378 1144698 843628 426110 933700
2458 933700 1194931 1143466 1822368 1428341 875646 1025026 951707 960280 1043137 635543 408405
2447 408405 602571 726445 1102371 1261793 680528 696839 708535 945957 641291 538467
2437 538467 733031 578675 734959 522103 753917 199487 634358 921320 728938 829144
$$ packed form
2508A686851K52790k41169J57756L09550k89135j29862J91504o7732j53687n24372
2498A192494Q8074J8805k97218l2046K59885j58093J59931M802J23082k53868
2488A105848k42207L30276m58622J12489M10915j39368j73308J79371j1386q4797
2478A029211l65134p8304J48365L72552n3842j33504K95154Q070j35328M11930
2468A499170j62996q1390j83902n35208M88536M19168k98680l01070m17518N07590
2458I33700K61231n1465O78902l94027n52695J49380p3319Q573Q2857m07594k27138
2447D08405J94166J23874L75926J59422n81265J6311J1696K37422l04666j02824
2437E38467J94564j54356J56284k12856K31814n54430M34871K86962j92382J00206
$$ plain form
2427 829144 809034 447568 463184 694183 549767 255372 129565 235753 400178 685693
2417 685693 1010404 789229 864195 847297 849527 538116 250791 187212 668734 840135 915274
2406 915274 1273486 1097840 1182208 811275 744668 815427 753684 840093 643302 559094 623616
2395 623616 611493 698205 629323 493121 422787 497567 360723 546095 540752 630460 1154202
2384 1154202 794873 1559281 2245937 1698563 1646113 1440173 1366469 1201695 1181880 1276642
2374 1276642 724320 560185 661744 506002 932239 1050899 793958 658685 333822 542812
2364 542812 477171 357732 391482 521963 810098 490076 312597 597276 674807 707824
2354 707824 988243 929478 537411 637106 689318 348463 150420 217657 865688 814176 703439
$$ packed form
2427H29144k0110l61466J5616K30999j44416k94395j25807J06188J64425K85515
2417F85693L24711k21175P4966j6898K230l11411k87325o3579M81522J71401P5139
2406I15274L58212j75646Q4368l70933o6607P0759o1743Q6409j96791q4208O4522
2395F23616j2123Q6712o8882j36202p0334P4780j36844J85372n343Q9708N23742
2384A154202l59329P64408O86656n47374n2450k05940p3704j64774j9815R4762
2374A276642n52322j64135J01559j55742M26237J18660k56941j35273l24863K08990
2364E42812o5641j19439L3750J30481K88135l20022j77479K84679P7531L3017
2354G07824K80419n8765l92067R9695N2212l40855j98043O7237O48031n1512j10737
$$ plain form
2343 703439 479251 184832 282222 208732 182391 842230 704767 564841 667468 713485
2333 713485 685182 562910 343578 665067 859323 788252 669605 372244 395354 280799
2323 280799 661560 713727 589390 840473 579269 409445 508304 314978 378085 81376
2313 81376 149847 373639 369060 960627 736855 726912 463528 981614 524356 218488 371999
2302 371999 342628 617074 427946 216801 132030 434290 898293 954723 922324 676002
2292 676002 553192 1005141 855770 530858 294176 664953 527582 621192 283396 531897
2282 531897 609265 765738 858328 469481 492115 520536 749945 730401 887587 878250 718658
2271 718658 316090 500405 469696 177737 767705 712087 629289 222403 268247 403625
$$ packed form
2343G03439k24188k94419R7390p3490k6341O59839j37463j39926J02627M6017
2333G13485k8303j22272k19332L21489J94256p1071j18647k97361K3110j14555
2323B80799L80761N2167j24337K51083k61204j69824R8859j93326O3107k96709
2313H1376O8471K23792m579N91567k23772r943k63384N18086m57258l05868J53511
2302C71999k9371K74446j89128k11145q4771L02260M64003N6430l2399k46322
2292F76002j22810M51949j49371l24912k36682L70777j37371R3610l37796K48501
2282E31897P7368J56473R2590l88847K2634K8421K29409j9544J57186r337j59592
2271G18658m02568J84315l0709k91959N89968n5618q2798m06886M5844J35378
$$ plain form
2261 403625 482563 528871 490318 658580 869362 988007 655823 483943 589346 710588
2251 710588 805467 512676 390324 678107 958308 969367 917659 878980 641434 590341 706235
2240 706235 873245 646226 618230 262696 185304 910162 1050302 993041 1182282 1010843
2230 1010843 992329 1175580 1320999 1399616 1300563 1380494 1337782 1770969 1999358 1880480
2220 1880480 1579850 1509654 1571293 1598608 1659440 1204986 875837 1031291 1698999 1777784
2210 1777784 1980764 1811461 1572436 1807757 2065536 2330663 2177517 2170083 1860156 1803578
2200 1803578 2049354 2292138 1698011 1823496 2038525 2029271 2416817 2046807 2173372 2669237
2190 2669237 2607999 2430420 2326748 2701297 3268786 3642168 3333058 3267585 3405378 3497740
$$ packed form
2261D03625P8938M6308l8553J68262K10782J18645l32184j71880J05403J21242
2251G10588R4879k92791j22352K87783K80201J1059n1708l8679k37546n1093J15894
2240G06235J67010k27019k7996l55534p7392P24858J40140n7261J89241j71439
2230A010843j8514J83251J45419P8617r9053P9931m2712M33187K28389j18878
2220A880480l00630p0196O1639K7315O0832m54454l29149J55454O67708P8785
2210A777784K02980j69303k39025K35321K57779K65127j53146p434l09927n6578
2200A803578K45776K42784n94127J25485K15029r254L87546l70010J26565M95865
2190B669237o1238j77579j03672L74549N67489L73382l09110o5473J37793R2362
$$ plain form
2180 3497740 3598690 4057016 4377149 4478478 4585620 4371085 4398157 4439926 4967583 4655814
2170 4655814 5287219 5271119 5221297 5311118 5295187 5627651 6061968 6512641 6533166 6151654
2160 6151654 6370080 6793331 6945417 7214315 7383528 7622344 8075934 8227393 8371526 8764837
2150 8764837 9064417 9806928 10224187 10896069 11657174 12097076 12260995 12664337 13519237 13986800
2140 13986800 14612028 15237641 16120487 17413688 18555093 19329481 20376653 21846087 23579807
2131 23579807 26052028 28362366 31193130 33798616 35862763 38100374 41023097 44188162
2123 44188162 48567842 53837554 60715277 69549951 80491484 94240845 111331900 134462939
2115 134462939 168346450 210367789 233772764 209417556 160752266 123417795 100040072
$$ packed form
2180C497740J00950M58326L20133J01329J07142k14535K7072M1769N27657l11769
2170D655814O31405j6100m9822Q9821j5931L32464M34317M50673K0525l81512
2160F151654K18426M23251J52086K68898J69213K38816M53590J51459J44133L93311
2150H764837K99580P42511M17259O71882P61105M39902J63919M03342Q54900M67563
2140A3986800O25228O25613Q82846J293201J141405P74388J047172J469434J733720
2131B3579807K472221K310338K830764K605486K064147K237611K922723L165065
2123D4188162M379680N269712O877723Q834674J0941533J3749361J7091055K3131039
2115A34462939L3883511M2021339K3404975k4355208m8665290l7334471k3377723
$$ plain form
2108 100040072 83313107 70107162 60381616 52812513 46963186 42415228 38809636 36199346
2100 36199346 34276137 32815428 31816394 29299184 27008124 25038270 23115055 21393610
2092 21393610 20043997 18862657 18015616 17181883 16553784 15599872 14949125 13886556 13367939
2083 13367939 13041013 12340789 11940763 11480581 11204920 10160542 9676334 9719733 9204453
2074 9204453 8828254 8554160 8466311 8190857 7710897 7708286 7220123 7424675 7196101 6907148
2064 6907148 6941286 6727199 6566108 6141963 5980652 5914666 5324153 5034399 5034756 4936959 5219170
2053 5219170 5167727 4880416 4831730 4873403 4974780 4890697 4169035 4093671 4406685 4619197
2043 4619197 4219969 3591805 3516906 3691107 3780055 3501027 3661747 3462458 3734801 3626733
$$ packed form
2108A00040072j6726965j3205945r725546p569103n849327m547958l605592k610290
2100C6199346j923209j460709r99034k517210k291060j969854j923215j721445
2092B1393610j349613j181340q47041q33733o28099r53912o50747j062569n18617
2083A3367939l26926p00224m00026m60182k75661j044378m84208M3399n15280
2074I204453l76199k74094q7849k75454m79960k611m88163K04552k28574k88953
2064F907148L4138k14087j61091m24145j61311o5986n90513k89754L57r7797K82211
2053E219170n1443k87311m8686M1673J01377q4083p21662p5364L13014K12512
2043D619197l99228o28164p4899J74201Q8948k79028J60720j99289K72343j08068
$$ plain form
2033 3626733 3433674 3192088 2900620 2999517 3078041 2956442 2907719 3101430 3211069 3067296
2023 3067296 2745668 2470804 2881149 3051965 2793519 2458274 2027565 1866438 2034130 2285169
2013 2285169 2497533 2033850 1377211 1476184 1990120 2179386 2119068 2140896 1816052 1737301
2003 1737301 1407569 1837167 1610459 1359670 1369166 1442745 1382670 1307638 970390 966642 1137912
1992 1137912 1282792 1344636 1405201 1416398 1635449 1418634 1232248 1329368 1668446 1668153 1854098
1981 1854098 1508942 1312620 1471845 1123372 1103998 1281384 1443916 1768201 1896293 1434996
1971 1434996 1244743 586531 481054 736922 658833 544429 902494 1030342 943358 917832
1961 917832 941199 932602 1262715 955408 783232 1038978 1180142 1197964 1108683 1024010 1150202
$$ packed form
2033C626733j93059k41586k91468R8897P8524j21599m8723J93711J09639j43773
2023C067296l21628k74864M10345J70816k58446l35245m30709j61127J67692K51039
2013B285169K12364m63683o56639R8973N13936J89266o0318K1828l24844p8751
2003A737301l29732M29598k26708k50789R496P3579o0075p5032l37248l748J71270
1992A137912J44880O1844O0565J1197K19051k16815j86386R7120L39078k93J85945
1981A854098l45156j96322J59225l48473j9374J77386J62532L24285J28092m61297
1971A434996j90253o58212j05477K55868p8089j14404L58065J27848q6984k5526
1961I17832K3367q597L30113l07307j72176K55746J41164J7822q9281q4673J26192
$$ plain form
1950 1150202 1201244 1159624 1073025 1021988 1023978 1216164 987300 1053087 1086404 1285905 1225679
$$ packed form
1950A150202N1042m1620q6599n1037J990J92186k28864O5787L3317J99501o0226
$$ [...]
##END NTUPLES=NMR SPECTRUM
##END=
